##TITLE=31Pdec_SR112_2
 CDCl3, 24 sc
 18.3.2022
##JCAMPDX= 6.0         $$ Bruker NMR JCAMP-DX V2.0
##DATA TYPE= NMR SPECTRUM
##DATA CLASS= NTUPLES
##ORIGIN= UXNMR, Bruker Analytische Messtechnik GmbH
##OWNER= root
$$ XWIN-NMR		Version 3.5
$$ Fri Mar 18 12:41:02 2022 Russian Standard Time (UT+4h)  she@DPX200
##.OBSERVE FREQUENCY= 81.013821
##.OBSERVE NUCLEUS= ^31P
##.ACQUISITION MODE= SIMULTANEOUS
##.ACQUISITION SCHEME= undefined
##.AVERAGES= 24
##.DIGITISER RES= 16
##SPECTROMETER/DATA SYSTEM= spect
##.PULSE SEQUENCE= zgpg30
##.SOLVENT NAME= CDCl3
##.SHIFT REFERENCE= (INTERNAL, CDCl3, 0, 248.564)
##AUDIT TRAIL= $$ (NUMBER, WHEN, WHO, WHERE, WHAT)
$$ ##TITLE= Audit trail, XWIN-NMR		Version 3.5
$$ ##JCAMPDX= 5.01
$$ ##ORIGIN= Bruker BioSpin GmbH
$$ ##OWNER= she
$$ F:/spectra/data/she/nmr/P31/1/pdata/1/auditp.txt
$$ ##AUDIT TRAIL=  $$ (NUMBER, WHEN, WHO, WHERE, WHAT)
(   1,<2022-03-18 12:39:38.15 +0400>,<she>,<DPX200>,
      <created by zg, POWCHK disabled, PULCHK disabled
       configuration hash MD5:
       00 E9 B6 7A A2 85 ED C7 34 08 36 98 17 FE 4E 26
       data hash MD5: 32K
       49 78 0A BA 55 41 BA 86 B1 AB E1 02 7E BD AD 6F>)
(   2,<2022-03-18 12:39:41.53 +0400>,<she>,<DPX200>,
      <Start of raw data processing
       efp BC_mod = 2 LB = 1 FT_mod = 6 PKNL = 1 PHC0 = -9157.635 PHC1 = 54.2756 SI = 64K 
       data hash MD5: 64K
       F8 C0 94 E9 45 73 4C E7 04 5C CB 6E 5F 2C EC E2>)
(   3,<2022-03-18 12:39:53.76 +0400>,<she>,<DPX200>,
      <pk PHC0 = -133.3313 PHC1 = 0 
       data hash MD5: 64K
       F8 C1 46 D9 CD 4F 15 7F 83 86 BD 29 51 FD 42 44>)
$$ ##END=
$$ 
$$ hash MD5
$$ 48 0E 49 54 E2 99 41 8B 42 E7 53 B0 EE DF A4 6D
##$RELAX= 
##$RELAX= 
##$RELAX= 
##$RELAX= 
##$RELAX= 
##$RELAX= 
##$RELAX= 
##$RELAX= 
$$ Bruker specific parameters
$$ --------------------------
##$DU= <F:/spectra>
##$EXPNO= 1
##$NAME= <P31>
##$PROCNO= 1
##$TYPE= <nmr>
##$USER= <she>
##$AMP= (0..31)
100 100 100 100 100 100 100 100 100 100 100 100 100 100 100 100 100 100 
100 100 100 100 100 100 100 100 100 100 100 100 100 100 
##$AQSEQ= 0
##$AQ_mod= 1
##$AUNM= <au_zg>
##$AUTOPOS= <>
##$BF1= 81.014009
##$BF2= 200.13
##$BF3= 200.13
##$BF4= 200.13
##$BF5= 200.13
##$BF6= 200.13
##$BF7= 200.13
##$BF8= 200.13
##$BYTORDA= 1
##$CFDGTYP= 0
##$CFRGTYP= 5
##$CHEMSTR= <none>
##$CNST= (0..31)
1 1 145 1 1 1 1 1 1 1 1 1 1 1 1 1 1 1 1 1 1 1 1 1 1 1 1 1 1 1 1 1 
##$CPDPRG= <waltz16>
##$CPDPRG1= <>
##$CPDPRG2= <waltz16>
##$CPDPRG3= <>
##$CPDPRG4= <mlev>
##$CPDPRG5= <mlev>
##$CPDPRG6= <mlev>
##$CPDPRG7= <mlev>
##$CPDPRG8= <mlev>
##$CPDPRGB= <>
##$CPDPRGT= <>
##$D= (0..31)
0 1 0 0 0 0 0 0 0 0 0 0.03 2e-05 3e-06 0 0 0 0 0 0 0 0 0 0 0 0 0 0 0 0 
0 0 
##$DATE= 1647592777
##$DBL= (0..7)
120 120 120 11 120 120 24 19 
##$DBP= (0..7)
150 150 150 150 150 150 150 150 
##$DBP07= 0
##$DBPNAM0= <>
##$DBPNAM1= <>
##$DBPNAM2= <>
##$DBPNAM3= <>
##$DBPNAM4= <>
##$DBPNAM5= <>
##$DBPNAM6= <>
##$DBPNAM7= <>
##$DBPOAL= (0..7)
0.5 0.5 0.5 0.5 0.5 0.5 0.5 0.5 
##$DBPOFFS= (0..7)
0 0 0 0 0 0 0 0 
$$ [...]
##$SUBNAM2= <"">
##$SUBNAM3= <"">
##$SUBNAM4= <"">
##$SUBNAM5= <"">
##$SUBNAM6= <"">
##$SUBNAM7= <"">
##$SUBNAM8= <"">
##$SUBNAM9= <"">
##$SW= 501.771253377433
##$SWIBOX= (0..15)
0 1 3 0 0 0 0 0 0 0 0 0 0 0 0 0 
##$SW_h= 40650.406504065
##$TD= 32768
##$TD0= 1
##$TE= 0
##$TE2= 300
##$TE3= 300
##$TEG= 300
##$TL= (0..7)
0 120 53 12 22 120 120 120 
##$TP= (0..7)
150 150 150 150 150 150 150 150 
##$TP07= 0
##$TPNAME0= <>
##$TPNAME1= <>
##$TPNAME2= <>
##$TPNAME3= <>
##$TPNAME4= <>
##$TPNAME5= <>
##$TPNAME6= <>
##$TPNAME7= <>
##$TPOAL= (0..7)
0.5 0.5 0.5 0.5 0.5 0.5 0.5 0.5 
##$TPOFFS= (0..7)
0 0 0 0 0 0 0 0 
##$TUNHIN= 0
##$TUNHOUT= 0
##$TUNXOUT= 0
##$USERA1= <user>
##$USERA2= <user>
##$USERA3= <user>
##$USERA4= <user>
##$USERA5= <user>
##$V9= 5
##$VALIST= <valist>
##$VCLIST= <CCCCCCCCCCCCCCC>
##$VD= 0
##$VDLIST= <DDDDDDDDDDDDDDD>
##$VPLIST= <PPPPPPPPPPPPPPP>
##$VTLIST= <TTTTTTTTTTTTTTT>
##$WBST= 1024
##$WBSW= 4
##$XGAIN= (0..3)
0 0 0 0 
##$XL= 0
##$YL= 0
##$YMAX_a= 1975
##$YMIN_a= -2073
##$ZGOPTNS= <>
##$ZL1= 120
##$ZL2= 120
##$ZL3= 120
##$ZL4= 120
##$ABSF1= 0
##$ABSF2= 0
##$ABSG= 0
##$ABSL= 0
##$ALPHA= 0
##$AQORDER= 0
##$ASSFAC= 0
##$ASSFACI= 0
##$ASSFACX= 0
##$ASSWID= 0
##$AUNMP= <proc_1d>
##$AZFE= 0.1
##$AZFW= 0.5
##$BCFW= 0
##$BC_mod= 2
##$BYTORDP= 0
##$COROFFS= 0
##$CY= -3
##$DATMOD= 1
##$DC= 0
##$DFILT= <>
##$DTYPP= 0
##$F1P= 0
##$F2P= 0
##$FCOR= 1
##$FTSIZE= 65536
##$FT_mod= 6
##$GAMMA= 0
##$GB= 0
##$INTBC= 1
##$INTSCL= 5.30512e-09
##$ISEN= 30
##$LB= 1
##$LEV0= 0
##$LPBIN= 0
##$MAXI= 10000
##$MC2= 0
##$MEAN= 0
##$ME_mod= 0
##$MI= 50
##$NCOEF= 0
##$NC_proc= -7
##$NLEV= 6
##$NOISF1= 182.463
##$NOISF2= 159.3651
##$NSP= 0
##$NTH_PI= 0
##$NZP= 0
##$OFFSET= 248.5645
##$PC= 4
##$PHC0= -9290.966
##$PHC1= 54.2756
##$PH_mod= 1
##$PKNL= yes
##$PPARMOD= 0
##$PSCAL= 0
##$PSIGN= 0
##$REVERSE= no
##$SF= 81.014009
##$SI= 65536
##$SIGF1= 159.3651
##$SIGF2= -187.1042
##$SINO= 113.3802
##$SIOLD= 16384
##$SREGLST= <1H.CDCl3>
##$SSB= 0
##$STSI= 65536
##$STSR= 0
##$SW_p= 40650.406504065
##$SYMM= 0
##$S_DEV= 0
##$TDeff= 32768
##$TDoff= 0
##$TI= <>
##$TILT= no
##$TM1= 0
##$TM2= 0
##$TOPLEV= 0
##$USERP1= <user>
##$USERP2= <user>
##$USERP3= <user>
##$USERP4= <user>
##$USERP5= <user>
##$WDW= 1
##$XDIM= 65536
##$YMAX_p= 453506703
##$YMIN_p= -24222648
$$ End of Bruker specific parameters
$$ ---------------------------------
##NTUPLES= NMR SPECTRUM
##VAR_NAME=  FREQUENCY,     SPECTRUM/REAL,   SPECTRUM/IMAG
##SYMBOL=    X,             R,               I
##VAR_TYPE=  INDEPENDENT,   DEPENDENT,       DEPENDENT
##VAR_FORM=  AFFN,          ASDF,            ASDF
##VAR_DIM=   65536,         65536,           65536
##UNITS=     HZ,            ARBITRARY UNITS, ARBITRARY UNITS
##FACTOR=    0.620285442955139, 1,           1
##FIRST=     20137.2065510759, 0,            0
##LAST=      -20513.1999529892, 0,           0
##MIN=       -20513.1999529892, -24222648,   0
##MAX=       20137.2065510759, 453506703,    0
$$ Real data points
##PAGE= N=1
##DATA TABLE= (X++(R..R)), XYDATA
$$ [...]
##PAGE= N=2
##DATA TABLE= (X++(I..I)), XYDATA
$$ plain form
13167 -960438 -2320621 -3643635 -2588428 -15467 1130450 292140 -107531 1308014 2962196
13158 2962196 3144778 2258733 1145842 -579004 -2964176 -4322923 -3287992 -1076119
13150 -1076119 89159 -44175 -100572 235147 -206147 -1820051 -3198487 -2857588 -973455
13141 -973455 1078023 2228963 2340175 1765592 806430 -315485 -1100408 -808239 658519
13132 658519 2114878 2167788 1049685 443036 1124801 1848550 1286483 55462 -322124
13123 -322124 243128 458012 -282028 -1215063 -1614734 -1618065 -1372761 -493986 1021148 2165317
13113 2165317 2018316 1089053 802787 1684554 2664881 2440496 1130684 93892 155380
13104 155380 610987 344998 -557712 -1029992 -658214 -229178 -477325 -1077856 -1282949 -932001
$$ packed form
13167i60438j360183j323014J055207K572961J145917q38310l99671J415545J654182
13158B962196J82582q86045j112891j724846k385172j358747J034931K211873
13150a076119J165278j33334n6397L35719m41294j613904j378436L40899J884133
13141i73455K051478J150940J11212n74583r59162j121915p84923K92169J466758
13132F58519J456359N2910j118103o06649O81765P23749n62067j231021l77586
13123c22124N65252K14884p40040r33035l99671l331K45304Q78775J515134J144169
13113B165317j47001r29263k86266Q81767R80327k24385j309812j036792O1488
13104A55380M55607k65989r02710m72280L71778M29036k48147o00531k05093L50948
$$ plain form
13094 -932001 -338626 344773 1103917 1694707 1793269 1431220 1009362 899157 1044371 885473
13084 885473 -56110 -1261029 -1408175 -119253 1114091 787786 -430372 -847664 -564778
13075 -564778 -1065269 -2050737 -1283631 1600549 3686143 2739585 411593 -448831 192221
13066 192221 476564 10401 -300665 -658198 -1850500 -2962832 -2368732 -761395 -477178
13057 -477178 -1686712 -1929937 -1997 2125473 2223006 739553 -212905 528220 2302414
13048 2302414 3346647 2210517 -439971 -1759215 -43847 2447464 2268537 -73770
13040 -73770 -824682 1012066 2058833 235767 -1632446 -341276 2570600 3424515 2032276
13031 2032276 1207996 1810398 1760183 -246051 -3048428 -5238132 -6505795 -6432814 -4322175
$$ packed form
13094i32001N93375O83399P59144N90790R8562l62049m21858j10205J45214j58898
13084H85473r41583j204919j47146J288922J233344l26305j218158m17292K82886
13075e64778n00491r85468P67106K884180K085594r46558k327992q60424O41052
13066A92221K84343m66163l11066l57533j192302j112332N94100J607337K84217
13057d77178j209534k43225J927940K127470R7533j483453r52458P41125J774194
13048B302414J044233j136130k650488j319244J715368K491311j78927k342307
13040g3770p50912J836748J046767j823066j868213J291170K911876Q53915j392239
13031B032276q24280O02402n0215k006234k802377k189704j267663P2981K110639
$$ plain form
13022 -4322175 -966916 1356099 1531943 768681 450406 336426 -241232 -773825 -390449
13013 -390449 597227 1200128 1369495 1963953 3114415 3607877 2405455 306795 -619237
13004 -619237 599566 2624113 3454068 2835649 2159688 2212581 2303730 1864503 1482123 1545590
12994 1545590 1167505 -288528 -1601805 -1171122 487140 1365333 862827 389431 936092
12985 936092 1657751 1439770 555885 -28511 -24470 343258 1073243 1986337 2088201 450008
12975 450008 -2224767 -3785367 -2832529 -369711 1169726 484937 -1344871 -2292251 -1718358
12966 -1718358 -824723 -854880 -1517718 -1617717 -792728 95568 260135 -33969 -123348 -73381
12956 -73381 -524996 -1526673 -2230076 -2071925 -1670823 -1891469 -2432798 -2342826 -1798781 -2013239
$$ packed form
13022d322175L355259K323015J75844p63262l18275j13980n77658n32593L83376
13013c90449R87676O02901J69367N94458J150462M93462j202422k098660r26032
13004f19237J218803K024547Q29955o18419o75961N2893R1149m39227l82380O3467
12994A545590l78085j456033j313277M30683J658262Q78193n02506m73396N46661
12985I36092P21659k17981q83885n84396M041L67728P29985R13094J01864j638193
12975D50008k674775j560600R52838K462818J539437o84789j829808r47380N73893
12966a718358Q93635l0157o62838r9999Q24989Q88296J64567k94104q9379M9967
12956g3381m51615j001677p03403J58151M01102k20646n41329Q9972N44045k14458
$$ plain form
12946 -2013239 -2964985 -2740085 -262114 2544728 2935803 960957 -829236 -856968 163759
12937 163759 1227864 2305527 3222054 3131073 1856549 367833 -644592 -1332477 -1490328
12928 -1490328 -455137 1254504 1987565 1406621 1048858 1552354 1400210 -224311 -1443880
12919 -1443880 -480705 1326398 1573870 478002 -781 249923 -511175 -2642631 -4463916
12910 -4463916 -4999130 -5122603 -5516394 -5455325 -4375613 -3132865 -2814932 -3247007 -3342446
12901 -3342446 -2380747 -652356 722487 652491 -767273 -2154166 -2312495 -1361352 -8168
12892 -8168 1411131 2448667 2195776 598534 -785379 -672212 90626 -85005 -1072402
12883 -1072402 -1453782 -690978 626100 1969877 2794345 2152168 147620 -1119853 -43411
$$ packed form
12946b013239r51746K24900K477971K806842L91075j974846j790193k7732J020727
12937A63759J064105J077663R16527r0981j274524j488716j012425o87885j57851
12928a490328J035191J709641P33061n80944l57763N03496j52144j624521j219569
12919a443880R63175J807103K47472j095868m78783K50704p61098k131456j821285
12910d463916n35214j23473l93791O1069J079712J242748L17933m32075r5439
12901c342446R61699J728391J374843o9996j419764j386893j58329R51143J353184
12892h168J419299J037536k52891j597242j383913J13167P62838j75631r87397
12883a072402l81380P62804J317078J343777Q24468o42177k004548j267473J076442
$$ plain form
12874 -43411 1881087 2044420 463577 -829821 -1240312 -1633917 -1622940 -108625 1712357
12865 1712357 1412143 -388786 -505300 1369737 1633762 -1355045 -4189143 -3486313 -813446
12856 -813446 213954 -852929 -1924428 -2170094 -2172943 -1755498 -506214 574329 495945
12847 495945 375276 1676958 3323013 3144249 1517792 892911 1960338 2782519 1836689
12838 1836689 -140898 -1489843 -1154083 933098 3346376 3516844 529117 -2873860
12830 -2873860 -3290056 -1296809 -489406 -1941172 -2718985 -732952 2015962 2781173 2127794
12821 2127794 2274111 3173899 3007395 1676418 1002353 1444634 1149233 -982971 -3280212
12812 -3280212 -3610165 -2351840 -1538529 -1744853 -1468206 359300 2649688 3536135 2563791
$$ packed form
12874d3411J924498J63333j580843j293398m10491l93605J0977J514315J820982
12865A712357l00214j800929j16514J875037K64025k988807k834098P02830K672867
12856h13446J027400j066883j071499k45666k849M17445J249284J080543p8384
12847D95945j20669J301682J646055j78764j626457o24881J067427Q22181r45830
12838A836689j977587j348945L35760K087181K413278J70468k987727l402977
12830b873860m16196J993247Q07403j451766p77813J986033K748914P65211o53379
12821B127794J46317Q99788j66504j330977o74065M42281k95401k132204k297241
12812c280212l29953J258325Q13311k06324K76647J827506K290388Q86447r72344
$$ plain form
12803 2563791 797235 -622149 -1223577 -983592 -359010 -397857 -1758963 -3442150 -3515187
12794 -3515187 -1593852 304868 186675 -1299688 -1758936 -355804 1024964 402488 -1505507
12785 -1505507 -2229758 -1009367 73027 -971161 -3114286 -3726422 -2384900 -1410503 -2322735
12776 -2322735 -3718735 -3745147 -2897416 -2597632 -2372212 -792967 1485403 2213078 1027695
12767 1027695 -68747 -108792 -490118 -1955516 -2687684 -1098733 1318002 1913323 494605
12758 494605 -893080 -1064358 -779141 -1060655 -1951967 -2895572 -3235589 -2425682 -611089
12749 -611089 1164230 2016022 2126179 1971338 1311160 -113176 -1474347 -1665394 -950195
12740 -950195 -650786 -1218257 -1652339 -1002852 401997 1537184 1912752 1861428 1870054 1973146
$$ packed form
12803B563791j766556j419384o01428K39985O24582l8847j361106j683187p3037
12794c515187J921335J898720j18193j486363m59248J403132J380768o22476j907995
12785a505507p24251J220391J082394j044188k143125o12136J341522R74397r12232
12776b322735j396000k6412Q47731K99784K25420J579245K278370P27675j185383
12767A027695j096442m0045l81326j465398p32168J588951K416735N95321j418718
12758D94605j387685j71278K85217k81514q91312r43605l40017Q09907J814593
12749f11089J775319Q51792J10157j54841o60178j424336j361171j91047P15199
12740i50195K99409n67471m34082O49487J404849J135187L75568n1324Q626J03092
$$ plain form
12730 1973146 1914897 1747471 1804534 1867994 1042544 -822530 -2246419 -1818185 -300624
12721 -300624 434727 189774 269899 693338 -23956 -1860612 -2682353 -1709787 -1012611 -1951814
12711 -1951814 -2655266 -1237431 722622 653293 -861793 -1467449 -1210183 -1973263 -3535276
12702 -3535276 -3692899 -2170431 -1055039 -1059479 -574281 918029 1613327 643999 -296024
12693 -296024 37010 410662 -250021 -594984 741194 2381925 2134419 373031 -671151
12684 -671151 -158074 754939 970381 403664 -691785 -1806833 -1873803 -271862 1971806
12675 1971806 3038508 2211694 188826 -1914251 -2969749 -2039382 511923 2621461
12667 2621461 2623899 1408187 1160479 2307204 3223585 2819524 1755827 931923 404684
$$ packed form
12730A973146n8249j67426N7063O3460q25450j865074j423889M28234J517561
12721c00624P35351k44953Q0125M23439p17294j836656q21741R72566O97176r39203
12711a951814p03452J417835J960053o9329j515086o05656K57266p63080j562013
12702c535276j57623J522468J115392m440M85198J492310O95298r69328r40023
12693b96024L33034L73652o60683l44963J336178J640731k47506j761388j044182
12684f71151N13077R13013K15442n66717j095449j115048o6970J601941K243668
12675A971806J066702q26814k022868k103077j055498R30367K551305K109538
12667B621461K438j215712k47708J146725R16381m04061j063697q23904n27239
$$ plain form
12658 404684 259868 1012044 2400551 3096668 2464259 1513374 1290798 1467158 1472802 1788845
12648 1788845 2720313 2931089 1033808 -1834101 -2892663 -1204000 1333716 2620627
12640 2620627 2418298 1517091 507292 -12948 470299 1304385 1093898 35568 273067
12631 273067 2751477 5253474 5158863 2879809 734715 -478998 -1637137 -2805124 -3043077
12622 -3043077 -2516362 -2530889 -3302720 -3670835 -3165132 -2415827 -1449715 239413 1723976
12613 1723976 1180544 -1045042 -2357526 -1688309 -830968 -990928 -791036 652378 1418631
12604 1418631 -107837 -2083561 -1856675 -1132 1106318 1260020 1921193 2809959 2285758
12595 2285758 694782 136616 811394 597106 -1230135 -2575215 -1695390 441431 1891797
$$ packed form
12658D04684j44816P52176J388507O96117o32409r50885k22576J76360N644L16043
12648A788845R31468K10776j897281k867909j058562J688663K537716J286911
12640B620627k02329r01207j009799n20240M83247Q34086k10487j058330K37499
12631B73067K478410K501997r4611k279054k145094j213713j158139j167987k37953
12622c043077N26715j4527p71831l68115N05703P49305R66112J689128J484563
12613A723976n43432k225586j312484O69217Q57341j59960J99892J443414P66253
12604A418631j526468j975724K26886J855543J107450J53702O61173Q88766n24201
12595B285758j590976n58166O74778k14288j827241j345080Q79825K136821J450366
$$ plain form
12586 1891797 1956700 876619 -875646 -2114651 -1417306 936782 2866680 3155286 2863383
12577 2863383 3275431 3854752 3343877 1799642 387300 -134739 163499 864995 1406176
12568 1406176 1347065 958049 986618 1529459 1849493 1588958 1321336 1567134 2137389 2787440
12558 2787440 3552528 4018577 3316438 1487472 -53642 -155622 657445 1031644 414301
12549 414301 -680124 -1389651 -1022556 450242 1956329 2114160 939991 -41611 110351
12540 110351 548647 288038 -22803 729654 1888407 1588867 -453689 -2199189 -1864884
12531 -1864884 -191701 680767 -37392 -1125402 -1255628 -585499 -137371 -323239 -704795
12522 -704795 -816298 -553576 17440 549009 331837 -825683 -1801005 -1314178 99944
$$ packed form
12586A891797O4903j080081j752265j239005O97345K354088J929898K88606k91903
12577B863383M12048N79321n10875j544235j412342n22039K98238P01496N41181
12568A406176n9111l89016K8569N42841L20034k60535k67622K45798N70255O50051
12558B787440P65088M66049p02139j828966j541114j01980Q13067L74199o17343
12549D14301j094425p09527L67095J472798J506087J57831j174169r81602J51962
12540A10351M38296k60609l10841P52457J158753k99540k042556j745500L34305
12531a864884J673183Q72468p18159j088010j30226O70129M48128j85868l81556
12522g04795j11503K62722N71016N31569k17172j157520r75322M86827J414122
$$ plain form
12513 99944 509881 -807501 -2537336 -3466956 -3849408 -3924369 -2881376 -585502 1271489
12504 1271489 1382392 848317 1252329 2025832 1768017 985488 1115448 1727275 1343614
12495 1343614 460487 896912 2344291 2566839 1305710 970252 2651603 4247523 3759506
12486 3759506 2046165 946139 751909 891847 1195236 1142537 -266827 -2482361 -3063213
12477 -3063213 -939641 1665433 2240526 1341266 1121370 1903614 2254130 1524518 391078
12468 391078 -518808 -932852 -484546 627743 1244151 833630 578946 1430482 2159674
12459 2159674 1216317 -375515 -211809 1806651 3248546 2679175 1333889 858638 1195322
12450 1195322 1375650 953038 -75734 -1577008 -2804634 -2655662 -1149869 173274 60196
$$ packed form
12513I9944M09937j317382j729835r29620l82452p4961J042993K295874J856991
12504A271489J10903n34075M04012P73503k57815p82529J29960O11827l83661
12495A343614q83127M36425J447379K22548j261129l35458J681351J595920m88017
12486C759506j713341j100026j94230J39938L03389n2699j409364k215534n80852
12477c063213K123572K605074N75093q99260k19896P82244L50516p29612j133440
12468C91078r09886m14044M48306J112289O16408m10521k54684Q51536P29192
12459B159674r43357j591832J63706K018460J441895n69371j345286m75251L36684
12450A195322J80328m22612j028772j501274j227626J48972J505793J323143j13078
$$ plain form
12441 60196 -934238 -1442920 -1214701 -1194994 -1971212 -2992090 -3411501 -3068323 -2346899 -1493981
12431 -1493981 -518345 397599 901381 1006942 1213692 1849322 2636933 3157856 3300047
12422 3300047 2911430 1655539 -75223 -688436 1064143 4246074 6478495 6489008 4981496
12413 4981496 3159357 1693917 1260207 2549426 4973711 6439674 5374804 2481906
12405 2481906 -117748 -1063394 -687199 -211270 -377776 -710352 -215803 985793 1394163
12396 1394163 225944 -1075501 -784566 368905 271700 -1167107 -1949165 -1409907 -1252592
12387 -1252592 -2505344 -3785935 -3661878 -2640630 -1590896 -196173 1599729 2538827
12379 2538827 2112630 1950109 3338705 4935921 4890850 3792380 3364640 3476497 2803043
$$ packed form
12441F0196r94434n08682K28219J9707p76218j020878m19411L43178P21424Q52918
12431a493981R75636R15944N03782J05561K06750O35630P87611N20923J42191
12422C300047l88617j255891j730762o13213J752579L181931K232421J0513j507512
12413D981496j822139j465440m33710J289219K424285J465963j064870k892898
12405B481906k599654r45646L76195M75929j66506l32576M94549J201596M08370
12396A394163j168219j301445K90935J153471r7205j438807p82058N39258J57315
12387a252592j252752j280591J24057J021248J049734J394723J795902R39098
12379B538827m26197j62521J388596J597216m5071j098470m27740J11857o73454
$$ plain form
12370 2803043 1566777 1185032 1662863 1637340 849461 496131 1107281 1893917 2272269
12361 2272269 2428977 2365121 1897730 1583089 2160791 3109669 3183132 2320167 1604808 1416760
12351 1416760 1102755 439994 -102235 -583697 -1488860 -2249828 -1533737 512641 1760361
12342 1760361 553932 -2341771 -4788001 -5434194 -4502131 -3262846 -3050299 -4065500 -4987714
12333 -4987714 -4460753 -2907221 -1993399 -2411628 -3304008 -3880687 -4293045 -4585354 -4080873
12324 -4080873 -2505292 -780067 46895 22151 -178441 -391301 -992534 -2067041 -3068820
12315 -3068820 -3277317 -2428604 -995689 163510 616618 706448 856564 798882 -835
12306 -835 -1270455 -1900117 -1171664 331919 1268481 896587 -204574 -840861 -641225 -495990
$$ packed form
12370B803043j236266l81745M77831k5523p87879l53330O11150P86636L78352
12361B272269J56708o3856m67391l14641N77702R48878P3463q62965p15359j88048
12351A416760l14005o62761n42229m81462r05163p60968P16091K046378J247720
12342A760361j206429k895703k446230o46193R32063J239285K12547j015201r22214
12333d987714N26961J553532R13822m18229q92380n76679m12358k92309N04481
12324d080873J575581J725225Q26962k4744k00592k12860o01233j074507j001779
12315c068820k08497Q48713J432915J159199M53108Q9830J50116n7682p99717
12306h35j269620o29662P28453J503583R36562l71894j101161o36287J99636J45235
$$ plain form
12296 -495990 -1251465 -2364043 -2564356 -1626817 -552101 -61075 28282 -129071 -735935
12287 -735935 -1496724 -1660575 -1256760 -1029562 -858868 224348 2032087 3047669 2962668
12278 2962668 3338561 4610541 4622830 1912415 -1493892 -2756489 -2128518 -1802664 -2175401
12269 -2175401 -1942702 -1055225 -764226 -1027694 -490457 909445 1671205 1290007 988156
12260 988156 1593427 2560625 3372520 4136779 4519478 3826505 2535913 2179750 3243132
12251 3243132 4449150 4422926 2987438 833754 -931496 -1110236 394278 1900192 1746458
12242 1746458 412077 -530053 -998994 -2212339 -4329881 -6154611 -6973641 -6992485 -6271392
12233 -6271392 -4936292 -3912811 -3614119 -2690653 -242858 1777912 1202450 -311543 525369
$$ packed form
12296d95990p55475j112578k00313R37539J074716M91026Q9357j57353o06864
12287g35935p60789j63851M03815K27198J70694J083216J807739J015582q5001
12278B962668L75893J271980J2289k710415l406307j262597O27971L25854l72737
12269b175401K32699Q87477K90999k63468N37237J399902P61760l81198l01851
12260I88156O05271R67198Q11895P64259L82699o92973j290592l56163J063382
12251C243132J206018k6224j435488k153684j765250j78740J504514J505914j53734
12242A746458j334381r42130m68941j213345k117542j824730q19030j8844P21093
12233f271392J335100J023481K98692R23466K447795K020770n75462j513993Q36912
$$ plain form
12224 525369 2894813 2636322 -777586 -2584762 294847 4715411 6127122 4487521
12216 4487521 2569739 1306285 44690 -681996 55230 1269511 1341980 724704 1016748
12207 1016748 2210425 3024444 3196349 3416751 3638732 3266130 2447942 1710577 1058805
12198 1058805 686922 1404688 2949981 3332570 1611484 -183122 4812 877582 -102469
12189 -102469 -2424060 -3299301 -2080825 -885263 -926361 -1138566 -756722 -544158 -801730
12180 -801730 -592248 223542 403719 -288538 -267257 1134218 2155669 1384798 241924
12171 241924 767441 2303482 2650699 1769448 1839138 3551347 4695990 3368487 779855
12162 779855 -588127 -447894 -529996 -1448259 -1749359 -468582 1128069 1398987 675739
$$ packed form
12224E25369K369444k58491l413908j807176K879609M420564J411711j639601
12216D487521j917782j263454j261595p26686P37226J214281P2469o17276K92044
12207A016748J193677Q14019J71905K20402K21981l72602q18188p37365o51772
12198A058805l71883P17766J545293L82589j721086j794606J87934Q72770r80051
12189a02469k321591q75241J218476J195562m1098k12205L81844K12564k57572
12180h01730K09482Q15790J80177o92257K1281J401475J021451p70871j142874
12171B41924N25517J536041L47217q81251O9690J712209J144643j327503k588632
12162G79855j367982J40233q2102r18263l01100J280777J596651K70918p23248
$$ plain form
12153 675739 434291 940036 1181315 725093 194848 32344 79211 323394 821835 971354
12143 971354 150614 -1037674 -1582369 -1890716 -3000813 -4097332 -3162532 -557086 618908
12134 618908 -1095795 -3184803 -2852677 -862371 470400 1169337 2679412 4296406 3701286
12125 3701286 882206 -1335308 -1170991 18029 294195 -178668 -112769 669292 1208662
12116 1208662 840458 -280356 -1569413 -2260311 -1739006 -295233 734282 168878 -1680232
12107 -1680232 -3224619 -3209362 -1914083 -637820 -155160 -70980 183663 335901 -80779
12098 -80779 -519786 9534 1155615 1236607 -497236 -2618142 -3155293 -1708118 564091
12089 564091 2232297 2361880 905360 -978583 -1755362 -1235388 -670127 -751197 -730627
$$ packed form
12153F75739k41448N05745K41279m56222n30245j62504M6867K44183M98441J49519
12143I71354q20740j188288n44695l08347j110097j096519R34800K605446J175994
12134F18908j714703k089008L32126J990306J332771O98937J510075J616994n95120
12125C701286k819080k217514J64317J189020K76166m72863O5899P82061N39370
12116A208662l68204j120814j289057o90898N21305J443773J029515n65404j849110
12107a680232j544387J5257J295279J276263M82660Q4180K54643J52238m16680
12098h0779m39007N29320J146081Q0992j733843k120906n37151J447175K272209
12089E64091J668206J29583j456520j883943p76779N19974N65261q1070K0570
$$ plain form
12080 -730627 -146100 132594 -258054 148585 2348623 4417905 3582266 229977 -2334687
12071 -2334687 -2110157 -341567 956153 1332948 1044039 -205878 -2267035 -3561105 -2737123
12062 -2737123 -776678 84183 -506832 -427687 1799644 4527821 4916912 2844246 1238607
12053 1238607 2145476 4044093 4213412 2493132 933983 468060 129408 -479463 -318041
12044 -318041 761650 914962 -1106561 -3721747 -4346055 -2570926 -326965 464230 -510903
12035 -510903 -2076530 -2607624 -1595707 -491200 -1015874 -2554395 -2808113 -1296612 -40487
12026 -40487 5753 626294 2868327 4431956 2973149 39656 -1136218 -373546 -83324
12017 -83324 -1020807 -1598189 -1040646 -251667 481373 1880837 3499417 3701912 2332681
$$ packed form
12080g30627N84527K78694l90648M06639K200038K069282q35639l352289k564664
12071b334687K24530J768590J297720L76795k88909j249917k061157j294070Q23982
12062b737123J960445Q60861n91015P9145K227331K728177L89091k072666j605639
12053A238607R06869J898617J69319j720280j559149m65923l38652o08871J61422
12044c18041J079691J53312k021523k615186o24308J775129K243961P91195r75133
12035e10903j565627n31094J011917J104507n24674j538521k53718J511501J256125
12026d0487M6240O20541K242033J563629j458807k933493j175874P62672K90222
12017h3324r37483n77382N57543P88979P33040J399464J618580K02495j369231
$$ plain form
12008 2332681 1138207 988081 816294 -37341 -506643 271636 1396937 1514815 462533
11999 462533 -998374 -2020579 -2002100 -1227208 -1133747 -2584097 -4112104 -3606947 -1488393
11990 -1488393 -101397 -51892 339570 1633779 2115686 976186 -21283 501121 1282589
11981 1282589 883757 297615 1014440 2165466 1910922 540131 -87257 503396 1134277
11972 1134277 1297928 1752105 2748019 3308828 2589089 845305 -1101688 -2488860 -2737053
11963 -2737053 -1890138 -981501 -1136028 -2175849 -2758092 -1992364 -377453 969850 1548333
11954 1548333 1718498 1941095 2047332 1503955 446078 -56317 677873 1726949 1556173
11945 1556173 86837 -1215124 -1332286 -677381 80821 934321 1815353 2124126 1651855
$$ packed form
12008B332681j194474j50126j71787q53635m69302P78279J125301J17878j052282
11999D62533j460907j022205J8479P74892R3461j450350j528007N05157K118554
11990a488393J386996M9505L91462J294209M81907j139500r97469N22404P81468
11981A282589l98832n86142P16825J151026k54544j370791o27388N90653O30881
11972A134277J63651M54177R95914N60809p19739j743784j946993j387172k48193
11963b737053Q46915R08637j54527j039821n82243P65728J614911J347303N78483
11954A548333J70165K22597J06237n43377j057877n02395P34190J049076j70776
11945A556173j469336j301961j17162O54905P58202Q53500Q81032L08773m72271
$$ plain form
11936 1651855 1016995 567991 -125641 -997907 -881156 731966 2277486 1837332 -250795
11927 -250795 -1819717 -1686983 -798779 -466327 -549048 62574 1643302 2903719 2311301
11918 2311301 136734 -1277509 54711 3227307 5237243 4412910 2023224 195713
11910 195713 -483073 -531576 -15476 1168680 2105451 1479790 -583977 -2365671 -2418073
11901 -2418073 -944527 669490 1083125 -145457 -2219164 -3545491 -3105041 -1510910
11893 -1510910 -298134 -154582 -348269 -6750 583361 398093 -783082 -1797256 -1410412
11884 -1410412 6936 750930 -36459 -1125167 -787934 878400 2203528 2273616 1798791
11875 1798791 1498841 902531 -552658 -2140968 -2503109 -1321045 332532 1186831 983930
$$ packed form
11936A651855o34860m49004o93632q72266J16751J613122J545520m40154k088127
11927b50795j568922J32734Q88204L32452q2721O11622J580728J260417n92418
11918B311301k174567j414243J332220L172596K009936q24333k389686j827511
11910A95713o78786m8503N16100J184156R36771o25661k063767j781694n2402
11901b418073J473546J614017M13635j228582k073707j326327M40450J594131
11893a510910J212776J43552j93687L41519N90111j85268j181175j014174L86844
11884a410412J417348P43994p87389j088708L37233J666334J325128P0088m74825
11875A798791k99950n96310j455189j588310l62141J182064J653577Q54299k02901
$$ plain form
11866 983930 646205 1290432 2794605 3560832 2368567 263015 -439348 906938 2511705
11857 2511705 2639819 1599271 629040 56374 -451839 -768497 -577739 -173056 -29898
11848 -29898 -82459 -179819 -563679 -1036833 -517507 1345423 2816502 1919580 -579713 -1654374
11838 -1654374 236237 3227654 4445780 3256485 1341731 280030 82524 6209 -103842
11829 -103842 202364 979435 1522817 1252435 541505 183874 260857 135706 -504501 -1290440
11819 -1290440 -1932465 -2613205 -3343692 -3574053 -2895495 -1768905 -1213313 -1891933 -3442667
11810 -3442667 -4451377 -3457152 -623019 1957976 2477966 1532676 942498 1012835 638878
11801 638878 -184618 -204796 420508 -286265 -2849260 -4861674 -4231758 -2018735 -417958
$$ packed form
11866I83930l37725O44227J504173P66227j192265k105552p02363J346286J604767
11857B511705J28114j040548r70231n72666n08213l16658J90758M04683J43158
11848b9898n2561r7360l83860m73154N19326J862930J471079q96922k499293j074661
11838a654374J890611K991417J218126j189295j914754j061701j97506p6315j10051
11829a03842L06206P77071N43382k70382p10930l57631P6983j25151o40207p85939
11819a290440o42025o80740p30487k30361O78558J126590N55592o78620j550734
11810c442667j008710R94225K834133K580995N19990r45290n90178P0337l73957
11801F38878q23496k0178O25304p06773k562995k012414O29916K213023J600777
$$ plain form
11792 -417958 309030 1038365 1568008 1360252 1154755 1577787 1341558 -711781 -2826120
11783 -2826120 -2390115 -121909 774170 -588625 -1848738 -1457597 -590635 -283197 362538
11774 362538 1802594 2487497 1410765 174123 629704 2016313 2302291 1184394 -63926
11765 -63926 -820962 -1375486 -1507667 -561281 1144083 2358767 2516575 2326493 2588704
11756 2588704 3143861 3204198 2292030 699766 -771952 -1458705 -1247762 -431963 515849
11747 515849 878184 59317 -1380848 -1746171 -236812 1648317 1995846 1166779 948438
11738 948438 1500242 1352203 460500 671728 2332214 2967844 934732 -1641526 -1600359
11729 -1600359 922919 2918349 2430650 279190 -1602512 -1997121 -948901 292019
$$ packed form
11792d17958P26988P29335N29643k07756k05497M23032k36229k053339k114339
11783b826120M36005K268206Q96079j362795j260113L91141Q66962L07438O45735
11774C62538J440056O84903j076732j236642M55581J386609K85978j117897j248320
11765f3926p57036n54524j32181R46386J705364J214684J57808j90082K62211
11756B588704N55157O0337r12168j592264j471718o86753K10943Q15799R47812
11747E15849L62335q18867j440165l65323J509359J885129L47529q29067k18341
11738I48438N51804j48039q91703K11228J660486O35630k033112k576258M1167
11729a600359K523278J995430m87699k151460j881702l94609J048220J240920
$$ plain form
11721 292019 271042 -844929 -1235899 -121162 764807 -219321 -1825233 -1654642 253876
11712 253876 1770267 2025830 2062952 2257063 1480722 -671252 -2796736 -3568224 -3221267
11703 -3221267 -2552602 -1750365 -827871 -98573 344150 741940 964591 569853 -299188
11694 -299188 -1025949 -1539272 -2162165 -2540196 -2019672 -1091814 -1021331 -1888025 -2455218 -2197557
11684 -2197557 -1943827 -2218628 -2523700 -2622805 -2869313 -2822740 -1404105 868121 1724467
11675 1724467 247831 -1684742 -2262599 -2245134 -3100102 -4280276 -4191453 -2680618 -806625
11666 -806625 847887 1979282 1763818 116775 -1151773 -386578 1428548 2185105 1932391
11657 1932391 2401275 3657182 3731328 1868254 -73579 -190987 1134430 2163534 1773554
$$ packed form
11721B92019k0977j115971l90970J114737Q85969r84128j605912J70591J908518
11712B53876J516391K55563L7122J94111p76341k151974k125484p71488L46957
11703c221267O68665Q02237R22494P29298M42723L97790K22651l94738q69041
11694b99188p26761n13323o22893l78031N20524R27858P0483q66694n67193K57661
11684b197557K53730k74801l05072r9105k46508M6573J418635K272226Q56346
11675A724467j476636j932573n77857J7465q54968j180174Q8823J510835J873993
11666h06625J654512J131395k15464j647043j268548P65195J815126P56557k52714
11657A932391M68884J255907P4146j863074j941833j17408J325417J029104l89980
$$ plain form
11648 1773554 12506 -2127633 -3076604 -1953572 128645 1006404 -27248 -1574773
11640 -1574773 -2047461 -1195455 241627 1244066 894327 -733533 -2154433 -2215894 -1925694
11631 -1925694 -2860883 -4162506 -3507496 -1176106 -306220 -2154462 -3913711 -2956113 -763654
11622 -763654 -293180 -1369917 -1519207 -227773 557114 -151545 -1083605 -1061049 -540512
11613 -540512 -398919 -838134 -1808096 -2998826 -3167938 -1086868 2351585 4421780 3619683
11604 3619683 1271824 -446317 -913233 -849092 -888406 -1263147 -1997374 -2481161 -1583328
11595 -1583328 826120 3000559 2974125 826171 -1570906 -2846565 -3272839 -3647584 -3976952
11586 -3976952 -3658125 -2441015 -778750 604635 1298710 1483070 1686816 2141157 2424623
$$ packed form
11648A773554j761048k140139r48971J123032K082217Q77759j033652j547525
11640a574773m72688Q52006J437082J002439l49739j627860j420900o1461K90200
11631a925694r35189j301623O55010K331390Q69886j848242j759249R57598K192459
11622g63654M70474j076737j49290J291434P84887p08659r32060K2556N20537
11613e40512J41593m39215r69962j190730j69112K081070L438453K070195q02097
11604C619683k347859j718141m66916O4141l9314l74741p34227m83787Q97833
11595a583328K409448K174439k6434k147954k397077j275659m26274l74745l29368
11586c976952L18827J217110J662265J383385O94075J84360K03746M54341K83466
$$ plain form
11577 2424623 2026560 1249159 1120144 2156452 3512757 3751246 2402848 461159 -708124
11568 -708124 -734020 -468706 -1004857 -2519961 -4051202 -4483071 -3784028 -2998981 -2839895
11559 -2839895 -2716180 -1695127 -76433 852499 585079 -61545 -406568 -878198 -1972352
11550 -1972352 -3178823 -3755481 -3819984 -3767182 -3290995 -2082199 -952479 -949689 -1571805 -1201941
11540 -1201941 548173 2097161 1879145 266389 -873102 -109806 2149200 3936998
11532 3936998 3690984 2179864 1664420 2637469 2794149 547857 -1978102 -1789811 223531
11523 223531 456924 -1732175 -2989318 -1371739 646056 318145 -1204886 -1322513 -301768
11514 -301768 -253535 -1292890 -1697762 -1122026 -854569 -1139973 -796559 351525 907935
$$ packed form
11577B424623l98063p77401j29015J036308J356305K38489j348398j941689j169283
11568g08124k5896K65314n36151j515104j531241m31869O99043P85047J59086
11559b839895J23715J021053J618694R28932k67420o46624l45023m71630j094154
11550a972352j206471n76658o4503N2802M76187J208796J129720K790o22116L69864
11540a201941J750114J548988k18016j612756j139491P63296K259006J787798
11532C936998k46014j511120n15444R73049J56680k246292k525959J88291K013342
11523B23531K33393k189099j257143J617579K017795l27911j523031j17627J020745
11514c01768M8233j039355m04872N75736K67457k85404L43414J148084N56410
$$ plain form
11505 907935 217410 -603162 -517702 45588 256387 108588 -3963 -13430 -3547 -941 -209548
11494 -209548 -851169 -1692557 -2343782 -2955236 -3861995 -4567641 -3957220 -1783686 662447
11485 662447 1708247 934446 -406234 -588111 761622 2121589 1869559 448331 -237747
11476 -237747 406304 919166 275901 -441042 146150 1583209 2475296 2371018 1581445
11467 1581445 284705 -943817 -941434 329089 1163702 675246 449785 1832755 3222121
11458 3222121 2484467 631306 195686 1013050 868861 -269048 -217465 1215866 1597708
11449 1597708 110082 -973352 -250446 432444 -801951 -2798124 -3294526 -1924645 249499
11440 249499 2358307 3461305 2534164 253041 -910946 139661 1562170 1636790 1465888
$$ packed form
11505I07935o90525q20572Q5460N63290K10799j47799j12551r467R883K606k08607
11494b09548o41621q41388o51225o11454r06759p05646O10421K173534K446133
11485F62447J045800p73801j340680j81877J349733J359967k52030j421228o86078
11476b37747O44051N12862o43265p16943N87192J437059Q92087j04278p89573
11467A581445j296740j228522K383J270523Q34613m88456k25461J382970J389366
11458C222121p37654j853161m35620Q17364j44189j137909N1583J433331L81842
11449A597708j487626j083434P22906O82890j234395j996173m96402J369881K174144
11440B49499K108808J102998r27141k281123j163987J050607J422509P4620j70902
$$ plain form
11431 1465888 2682198 4214351 3788320 1611783 169776 805189 2469063 3559626
11423 3559626 3311662 1656940 -705841 -2276876 -2163685 -1334367 -1271560 -1746641 -1267772
11414 -1267772 538546 2411099 3272622 3277861 2961244 2503298 2085829 2044333 2362824 2640414
11404 2640414 2699639 2722239 2787571 2766150 2601071 2239773 1441580 149217 -1101715 -1668886
11394 -1668886 -1635973 -1720125 -2350963 -3136865 -3264907 -2361411 -1060057 -585955 -1392920 -2358842
11384 -2358842 -1973439 -297221 1050699 980085 164679 -62542 756343 2066647 2917820
11375 2917820 2460988 662479 -1242394 -1909034 -1658518 -1975260 -3057027 -3350995 -2033490
11366 -2033490 -286116 795229 1817375 3225409 3501526 1314439 -1596631 -2080915
$$ packed form
11431A465888J216310J532153m26031k176537j442007O35413J663874J090563
11423C559626k47964j654722k362781j571035J13191Q29318O2807m75081M78869
11414a267772J806318J872553Q61523N239l16617m57946m17469m1496L18491K77590
11404B640414N9225K2600O5332k1421j65079l61298p98193j292363j250932n67171
11394a668886L2913q4152o30838p85902j28042R03496J301354M74102q06965r65922
11384b358842L85403J676218J347920p0614q15406k27221Q18885J310304Q51173
11375B917820m56832j798509j904873o66640K50516l16742j081767k93968J317505
11366b033490J747374J081345J022146J408034K76117k187087k911070m84284
$$ plain form
11358 -2080915 164146 2184253 1793916 27448 -1004400 -963615 -934027 -1372611 -1650505
11349 -1650505 -1237550 -445163 7325 -233637 -776968 -754252 316759 1800026 2344763
11340 2344763 1277670 -521166 -1366791 -439299 1406085 2594967 2515231 1984744 1997484
11331 1997484 2464267 2620256 2317229 2184285 2533464 2815175 2376294 1263261 81508
11322 81508 -553324 -352132 399947 845322 288024 -917195 -1610534 -1111586 37852
11313 37852 685273 210559 -890793 -1445719 -889571 -194397 -915277 -3084697 -4936898
11304 -4936898 -5189960 -4474485 -3716633 -2494123 -358349 1534078 1942264 1585964 1598098
11295 1598098 1073378 -1186288 -3386955 -2560644 489073 1666413 -417086 -2557043
$$ packed form
11358b080915K245061K020107l90337j766468j031848M0785K9588m38584k77894
11349a650505M12955P92387M52488k40962n43331K2716J071011J483267N44737
11340B344763j067093j798836q45625R27492J845384J188882p9736n30487J2740
11331A997484M66783J55989l03027j32944L49179K81711m38881j113033j181753
11322H1508o34832K01192P52079M45375n57298j205219o93339M98948J149438
11313C7852O47421m74714j101352n54926N56148O95174p20880k169420j852201
11304d936898k53062P15475P57852J222510K135774J892427M08186l56300J2134
11295A598098n24720k259666k200667Q26311L049717J177340k083499k139957
$$ plain form
11287 -2557043 -2298346 -1525232 -2614535 -4223102 -3759133 -1667458 -192123 458582 1691401
11278 1691401 3403103 4157065 3828101 3489429 3108851 1789860 68228 -381116 578259
11269 578259 1237642 709115 95967 538564 1595430 2202296 2181924 2165674 2585201 3154225
11259 3154225 3179382 2379106 1382162 997775 1035133 664244 -11724 51253 983096 1574753
11249 1574753 1297571 1201543 1923883 2386556 1654343 601513 359931 488236 173125
11240 173125 -78546 383522 688942 -199365 -1401383 -1228669 304991 1729566 2228928
11231 2228928 1993639 1197413 176173 -42063 1099054 2568430 3062966 2665655 2034405
11222 2034405 1081197 -136088 -482276 611679 1768601 1650308 1036442 1112896 1230017
$$ packed form
11287b557043K58697P73114j089303j608567M63969K091675J475335O50705J232819
11278A691401J711702P53962l28964l38672l80578j318991j721632m49344R59375
11269E78259O59383n28527o13148M42597J056866O06866k0372j6250M19527N69024
11259C154225K5157q00276r96944l84387L7358l70889o75968O2977R31843N91657
11249A574753k77182r6028P22340M62673p32213j052830k41582J28305l15111
11240A73125k51671M62068L05420q88307j202018J72714J533660J424575M99362
11231B228928k35289p96226j021240k18236J141117J469376M94536l97311o31250
11222B034405r53208j217285l46188J093955J156922j18293o13866P6454J17121
$$ plain form
11213 1230017 579598 486038 2236265 3955750 2859658 -202231 -1753021 -798580 391581
11204 391581 479382 629323 1521455 1995632 1441240 812696 547211 -56963 -896460 -1035949
11194 -1035949 -962125 -2023181 -3202269 -1759267 1942792 3752636 1628087 -992433
11186 -992433 -133813 3024821 4268172 2364320 45683 -116790 1690534 3730508 4645956
11177 4645956 4259489 3571390 3687420 4222683 3690300 1959602 793854 1035687 1047412
11168 1047412 -579756 -2454126 -2451775 -986350 2018 301959 1190498 2448606 2247831
11159 2247831 253149 -1464887 -1315773 -131680 627262 974585 1548352 1957481 1463758
11150 1463758 616902 672659 1509815 1556115 197508 -918328 74105 2535582 3826229
$$ packed form
11213A230017o50419r3560J750227J719485j096092l061889j550790R54441J190161
11204C91581Q7801J49941Q92132M74177n54392o28544k65485o04174q39497j39489
11194a035949P3824j061056j179088J443002L702059J809844k124549k620520
11186i92433Q58620L158634J243351j903852k318637j62473J807324K039974R15448
11177D645956l86467o88099J16030N35263n32383j730698j165748K41833J1725
11168A047412j627168j874370K351J465425R88368K99941Q88539J258108k00775
11159B247831j994682j718036J49114J184093P58942L47323N73767M09129m93723
11150A463758q46856N5757Q37156M6300j358607j115836R92433K461477J290647
$$ plain form
11141 3826229 2568743 380708 -124810 1658173 3981938 4919073 4126214 2685430 1991261
11132 1991261 2827166 4841352 6666889 7007436 5924081 4842610 5037490 6152381 6403373
11123 6403373 4406720 818873 -2091856 -2710873 -1610950 -458090 147350 908667 2176612
11114 2176612 3223509 3393256 2942021 2332158 1579026 712587 49001 -383461 -857865
11105 -857865 -1103013 -429086 980953 2006378 2198820 2279342 2632536 2658143 2151140 1877442
11095 1877442 2119097 2119456 1610978 1229990 774121 -848459 -2932960 -2683313 704900
11086 704900 3957122 3885539 1634218 338832 450927 321029 -33812 910819 2906852
11077 2906852 3928382 3352283 2553816 2370595 2272922 1974129 1717676 1083240 -463435
$$ packed form
11141C826229j257486k188035n05518J782983K323765R37135p92859j440784o94169
11132A991261Q35905K014186J825537L40547j083355j081471J94880J114891K50992
11123F403373j996653l587847k910729o19017J099923J152860O05440P61317J267945
11114B176612J046897J69747m51235o09863p53132q66439o63586m32462m74404
11105h57865k45148O73927J410039J025425J92442Q0522L53194K5607n07003k73698
11095A877442K41655L59n08478l80988m55869j622580k084501K49647L388213
11086G04900L252222p1583k251321j295386J12095j29898l54841R44631J996033
11077B906852J021530n76099p98467j83221r7673k98793k56453o34436j546675
$$ plain form
11068 -463435 -2024194 -2232727 -1499381 -1389396 -2126287 -2598606 -2358827 -1708018 -466815
11059 -466815 1290767 2110000 1053968 -155149 553078 2040576 1623076 -453007 -1443405
11050 -1443405 -609470 126798 -29175 191552 931568 549675 -1077440 -1773684 -564034
11041 -564034 874853 1195636 1128457 1367839 1365959 1186376 2023576 3883123 5076458 4853480
11031 4853480 4269523 3874145 3040747 2102954 2371020 3356894 2917128 983099 78271
11022 78271 1085734 1705886 509488 -671015 -155337 789045 614278 259490 1055411
11013 1055411 2205421 2513024 2515415 2841165 2458536 627581 -1230885 -1576697 -969272
11004 -969272 -536816 -81471 573339 353759 -1011792 -1638402 -242266 1548183 1741865
$$ packed form
11068d63435j560759k08533P33346J09985p36891m72319K39779O50809J241203
11059d66815J757582Q19233j056032j209117P08227J487498m17500k076083r90398
11050a443405Q33935P36268j55973K20727P40016l81893j627115o96244J209650
11041e64034J438887L20783o7179K39382j880j79583Q37200J859547J193335k22978
11031D853480n83957l95378q33398r37793K68066R85874m39766j934029r04828
11022G8271J007463O20152j196398j180503N15678R44382j74767l54788P95921
11013A055411J150010L07603K391L25750l82629j830955j858466l45812O07425
11004i69272M32456M55345O54810k19580j365551o26610J396136J790449J93682
$$ plain form
10995 1741865 1095829 1439659 2521212 2950066 2941453 3601671 4436876 4006335 2493926
10986 2493926 1512776 1724512 2418749 3057618 3616695 3717537 2889848 1559320 704753
10977 704753 704826 1199826 1668947 1622302 806725 -374151 -1255467 -1771777 -2042054 -1394917
10967 -1394917 718435 3067687 3784979 3079411 2632792 2334528 392845 -2814720 -4065262
10958 -4065262 -1735020 1735563 3305454 2905082 2084028 1425707 985867 1248130 1961482
10949 1961482 1759283 273861 -1109667 -1570616 -1827627 -1960882 -837435 1231839 2141722
10940 2141722 1634598 2162957 4397474 5225517 2613984 -675482 -1116032 529678 1239406
10931 1239406 499561 -92698 -81911 3611 437484 1217909 876577 -1065685 -2279253
$$ packed form
10995A741865o46036L43830J081553M28854q613O60218Q35205m30541j512409
10986B493926r81150K11736O94237O38869N59077J00842q27689j330528q54567
10977G04753P3M95000M69121m6645q15577j180876q81316n16310k70277O47137
10967a394917K113352K349252P17292p05568m46619k98264j941683l207565j250542
10958d065262K330242L470583J569891m00372q21054o58321m39840K62263P13352
10949A961482k02199j485422j383528m60949k57011j33255J123447K069274R09883
10940B141722n07124N28359K234517Q28043k611533l289466m40550J645710P09728
10931A239406p39845n92259J0787Q5522M33873P80425l41332j942262j213568
$$ plain form
10922 -2279253 -902606 1256121 1544838 537076 320426 671219 220917 -259219 794710
10913 794710 2446921 2681757 1910452 1767692 1681367 211889 -1262782 -103356 2840096
10904 2840096 3880561 1987422 146693 785818 2882495 4298864 4445547 3865772 3133786
10895 3133786 2780280 2949122 3015590 2585181 2304534 2541144 2346794 1206917 475872
10886 475872 1258493 2292837 2006110 1176243 1224730 1436781 583711 -169488 946104
10877 946104 2814643 3036127 2118323 2599266 4482328 5085915 3450296 1543615 705270
10868 705270 -4804 -1192597 -1615148 -356182 1483406 2242434 1555184 341153 -26171
10859 -26171 1332963 3658760 4866647 4039725 2669480 2289984 2349882 1962731 1903181
$$ packed form
10922b279253J376647K158727K88717j007762k16650L50793m50302m80136J053929
10913G94710J652211K34836p71305j42760q6325j469478j474671J159426K943452
10904B840096J040465j893139j840729O39125K096677J416369J46683n79775p31986
10895C133786l53506J68842O6468m30409k80647K36610j94350j139877p31045
10886D75872P82621J034344k86727q29867M8487K12051q53070p53199J115592
10877I46104J868539K21484r17804M80943J883062O03587j635619j906681q38345
10868G05270p10074j187793m22551J258966J839588P59028o87250j214031l67324
10859b6171J359134K325797J207887q26922j370245l79496N9898l87151n9550
$$ plain form
10850 1903181 2666686 2446169 -86796 -2568960 -1841267 1037223 2194770 756674 -337005
10841 -337005 745020 2421051 2800132 2156918 1555921 1266839 1155998 967200 119824
10832 119824 -1299936 -1873312 -825639 304344 -8614 -524543 648585 2441009 2397286
10823 2397286 921252 558181 1595458 1889225 867581 162031 163306 -465530 -1401900
10814 -1401900 -388202 2684482 4690355 3643480 1450454 860053 1911114 2785893
10806 2785893 2355804 694888 -1406503 -2532370 -1610861 571150 2077215 2320731 2432692
10797 2432692 2978323 2980199 1683392 -123953 -1114926 -817279 222533 991730 909470
10788 909470 687766 1565300 3134279 3337153 1652163 490318 1736480 3676885 3596374
$$ packed form
10850A903181P63505k20517k532965k482164P27693K878490J157547j438096j093679
10841c37005J082025J676031L79081o43214o00997k89082j10841j88798q47376
10832A19824j419760n73376J047673J129983l12958n15929J173128J792424m3723
10823B397286j476034l63071J037277K93767j021644p05550J275o28836r36370
10814a401900J013698L072684K005873j046875k193026n90401J051061Q74779
10806B785893m30089j660916k101391j125867R21509K182011J506065K43516J11961
10797B432692N45631J876j296807j807345r90973K97647J039812P69197q2260
10788I09470k21704Q77534J568979K02874j684990j161845J246162J940405q0511
$$ plain form
10779 3596374 1922121 1230030 2229038 3272117 3056926 1559105 -813282 -2848385 -2465599
10770 -2465599 672592 3669925 3880799 2595466 2756147 4394925 5126471 3979156 1987125
10761 1987125 132707 -733995 572349 3417661 4537908 2370747 104855 963482
10753 963482 2811813 1758262 -1048846 -1392797 718474 1385082 -130693 -412580 1737975
10744 1737975 3366362 2769246 1921598 2181411 1996666 471793 -618242 40857 1383353
10735 1383353 2363814 3283428 3915290 3348160 2335223 2726327 4091694 4123892 2802929
10726 2802929 2694921 4457982 5528863 4259130 2219658 1355816 1593498 2116884 2569032
10717 2569032 2435196 1453220 716005 1238265 2010674 1882483 2176345 4333113 6368469
$$ packed form
10779C596374j674253o92091R99008J043079k15191j497821k372387k035103L82786
10770b465599L138191K997333K10874j285333J60681J638778P31546j147315j992031
10761A987125j854418q66702J306344K845312J120247k167161k265892Q58627
10753I63482J848331j053551k807108l43951K111271O66608j515775k81887K150555
10744A737975J628387n97116q47648K59813j84745j524873j090035O59099J342496
10735A383353R80461R19614O31862n67130j012937L91104J365367L2198j320963
10726B802929j08008J763061J070881j269733k039472q63842K37682N23386M52148
10717B569032j33836r81976p37215N22260P72409j28191K93862K156768K035356
$$ plain form
10708 6368469 5530505 3253816 3076468 4595916 4375830 2326105 1918772 3897994 4969690
10699 4969690 3475747 1598903 1091029 1286672 2052617 4197252 6233189 5287232 2066888
10690 2066888 507333 1765103 3030041 2870821 2963752 3773292 3520235 2483521 3318308
10681 3318308 5828130 6370681 3908673 1822318 2197738 3081522 2949391 3122675 4103351
10672 4103351 4208113 3465937 4173302 6045399 5740222 2856580 1277642 2626367 3624957
10663 3624957 2259291 1339593 3125598 5252150 5052551 3625998 2730006 1734913 415241
10654 415241 728345 3032455 4339453 2980688 1369512 1709421 2656027 2604571 2563889
10645 2563889 3343683 3490394 2445320 2396633 4711114 7564713 8920522 8847369 7631198
$$ packed form
10708F368469q37964k276689j77348J519448k20086k049725m07333J979222J071696
10699D969690j493943j876844n07874J95643P65945K144635K035937r45957l220344
10690B066888j559555J257770J264938j59220R2931Q09540k53057j036714Q34787
10681C318308K509822N42551k462008k086355L75420Q83784j32131J73284R80676
10672D103351J04762p42176P07365J872097l05177k883642j578938J348725R98590
10663C624957j365666r19698J786005K126552j99599j426553q95992r95093j319672
10654D15241L13104K304110J306998j358765j611176L39909R46606n1456m0682
10645B563889P79794J46711j045074m8687K314481K853599J355809p3153j216171
$$ plain form
10636 7631198 4957099 2029326 941910 1144070 306761 -954552 297454 3580628
10628 3580628 4867887 2916610 682503 -171783 -790624 -685050 2170936 5981124 6247187
10619 6247187 3390824 2687642 5339604 6665677 4842285 3939239 5857558 6773333 4646808
10610 4646808 3027185 4048017 4657190 3253330 3053569 5212900 5617142 2479383 271906
10601 271906 1973353 4094642 3595293 3088585 4839087 6111410 4894833 3942619 4926046
10592 4926046 4969686 3029911 3001909 6333687 8451561 6778970 5201716 6233311 6256134
10583 6256134 3289941 1765892 4300919 6336553 4535589 2992381 5283943 7793129
10575 7793129 6971060 5919230 7608304 8823052 7087548 6339266 9346691 11697837
$$ packed form
10636G631198k674099k927773j087416K02160q37309j261313J252006L283174
10628C580628J287259j951277k234107q54286o18841J05574K855986L810188K66063
10619F247187k856363p03182K651962J326073j823392r03046J918319R15775k126525
10610D646808j619623J020832O09173j403860j99761K159331M04242l137759k207477
10601B71906J701447K121289m99349n06708J750502J272323j216577r52214R83427
10592D926046M3640j939775k8002L331778K117874j672591j577254J031595K2823
10583F256134k966193j524049K535027K035634j800964j543208K291562K509186
10575G793129q22069j051830J689074J214748j735504p48282L007425K351146
$$ plain form
10567 11697837 9717720 7126080 7496374 7605928 4786305 3144266 5622477 7588250
10559 7588250 5334212 3240399 5395272 7913539 6784394 5456972 7387581 9081739
10551 9081739 7697830 7164610 9620519 9817406 5451849 3394569 7665914 11279222
10543 11279222 8584864 5340610 7396440 10048940 8372187 7204997 10492055 11803379
10535 11803379 6506178 2231647 5683767 10255124 8672090 6361673 9710080 12930409
10527 12930409 9892990 7050932 10843111 14458563 11274036 8657581 13624596 18192397
10519 18192397 14558082 10756695 14884635 18768228 14721897 12417689 20173022 26554300
10511 26554300 21189440 15843593 22449575 29472516 24676856 20639164 30154211 38355737
$$ packed form
10567A1697837j980117k591640L70294J09554k819623j642039K478211J965773
10559G588250k254038k093813K154873K518267j129145j327422J930609J694158
10551I081739j383909n33220K455909J96887m365557k057280M271345L613308
10543A1279222k694358l244254K055830K652500j676753j167190L287058J311324
10535A1803379n297201m274531L452120M571357j583034k310417L348407L220329
10527A2930409l037419k842058L792179L615452l184527k616455M967015M567801
10519A8192397l634315l801387M127940L883593m046331k304208P755333O381278
10511B6554300n364860n345847O605982P022941m795660m037692R515047Q201526
$$ plain form
10503 38355737 30193733 22325968 32963053 44877711 37846852 30957458 46780827 62621210
10495 62621210 52217835 44823444 75167690 106646880 92004556 83860533 167013247
10488 167013247 279257597 238592783 253 -240623692 -284663412 -172873275
10482 -172873275 -87083459 -92751914 -107202992 -77375774 -49193322 -57711710 -66611438
10475 -66611438 -46875006 -27734066 -34603155 -44099095 -34042188 -22929081 -28660840
10468 -28660840 -34679261 -25967059 -18365366 -25329175 -31188056 -22466503 -13752152 -18851793
10460 -18851793 -25354653 -20259091 -14112189 -18141682 -22090975 -15701049 -9553767 -14323863
10452 -14323863 -20128484 -15910284 -9954471 -12413501 -15742388 -10936053 -6093943 -10590747
$$ packed form
10503C8355737q162004p867765J0637085J1914658p030859o889394J5823369J5840383
10495F2621210j0403375p394391L0344246L1479190j4642324q144023Q3152714
10488A67013247J12244350m0664814k38592530k40623945m4039720J11790137
10482a72873275Q5789816n668455j4451078K9827218K8182452q518388q899728
10475f6611438J9736432J9140940o869089r495940J0056907J1113107n731759
10468b8660840o018421Q712202P601693o963809n858881Q721553Q714351n099641
10460a8851793o502860N095562O146902m029493l949293O389926O147282m770096
10452a4323863n804621M218200N955813k459030l328887M806335M842110m496804
$$ plain form
10444 -10590747 -16559041 -13970135 -9498007 -12834844 -17830395 -14707000 -8783033 -9890211
10436 -9890211 -14057072 -12297537 -7857972 -8715384 -11631768 -9108094 -4561889 -5857516
10428 -5857516 -10350272 -10173725 -6577948 -6172161 -8168436 -7297715 -4670479 -4829471 -6439378
10419 -6439378 -5697448 -4452846 -5998847 -7606421 -5582325 -2725342 -3032482 -4451438
10411 -4451438 -4158117 -4852447 -8435307 -10100979 -6500352 -3045800 -5058478 -8408020
10403 -8408020 -7280986 -4512670 -5418635 -7795499 -7166509 -5968614 -8218060 -10548277
10395 -10548277 -7946699 -3471979 -3045496 -5148624 -4746386 -3050162 -4205520 -6250659
10387 -6250659 -4616941 -1325719 -1773062 -5169001 -6617156 -6048221 -6882151 -8267810 -6743289
$$ packed form
10444a0590747n968294K588906M472128l336837m995551L123395N923967j107178
10436i890211m166861J759535M439565q57412k916384K523674M546205j295627
10428e857516m492756J76547L595777M05787j996275Q70721K627236j58992j609907
10419f439378P41930J244602j546001j607574K024096K856983l07140j418956
10411d451438K93321o94330l582860j665672L600627L454552k012678l349542
10403h408020J127034K768316r05965k376864O28990J197895k249446k330217
10395a0548277K601578M474720M26483k103128M02238J696224j155358k045139
10387f250659J633718L291222m47343l395939j448155N68935q33930j385659J524521
$$ plain form
10378 -6743289 -3634457 -3212731 -5223225 -6143595 -5863767 -6463329 -6633412 -4072592 -1228095
10369 -1228095 -1933629 -4426639 -4317017 -2414306 -2909268 -5606903 -6623142 -5366241 -4556543
10360 -4556543 -4638088 -4079835 -3818159 -5669486 -7757173 -7027256 -4763976 -4264156 -4858826
10351 -4858826 -3751866 -1916672 -2414001 -4474827 -4944070 -4081901 -4309704 -4768477 -2971924
10342 -2971924 -547648 -1363509 -4795783 -6576776 -5686727 -4903563 -5089408 -4453371 -3249256
10333 -3249256 -3853803 -6000500 -6766186 -5516109 -4434262 -4055871 -2654408 -388109 67232
10324 67232 -2269062 -5148239 -6329109 -5792569 -4703759 -4333543 -5526921 -7395851 -7650789
10315 -7650789 -5858920 -4395657 -4395064 -3693655 -1269345 -178574 -2548250 -5138335 -4237531
$$ packed form
10378f743289L108832M21726k010494r20370K79828n99562j70083K560820K844497
10369a228095p05534k493010J09622J902711m94962k697635j016239J256901Q09698
10360d556543q1545N58253K61676j851327k087687P29917K263280M99820n94670
10351d858826J106960J835194m97329k060826m69243Q62169k27803m58773J796553
10342b971924K424276q15861l432274j780993Q90049P83164j85845O36037J204115
10333c249256o04547k146697p65686J250077J081847L78391J401463K266299M55341
10324F7232k336294k879177j180870N36540J088810L70216j193378j868930k54938
10315g650789J791869J463263N93P01409K424310J090771k369676k590085R00804
$$ plain form
10306 -4237531 -1797243 -1780276 -3292013 -2900486 -1454166 -2451178 -5017141 -4806407 -1552667
10297 -1552667 252179 -1287614 -2823086 -1617736 507171 666196 -1114099 -2905231
10289 -2905231 -3425560 -2626531 -1473671 -1383720 -2567646 -3530144 -3401395 -3251415 -3597095
10280 -3597095 -2855118 -432893 1141024 -98545 -2195040 -2579546 -2156717 -2725232 -2997533
10271 -2997533 -1162103 921850 369723 -1771202 -2391851 -1410142 -875841 -749912 215340
10262 215340 1106333 647177 618384 3006651 5459503 4323711 693969 -1432775 -1588880
10253 -1588880 -2302964 -3438844 -2608203 -521842 -352849 -1924739 -1868442 301793 1403995
10244 1403995 210346 -1060190 -1312942 -1877427 -2725895 -2122631 -735828 -1408904 -3867630
$$ packed form
10306d237531K440288J6967j511737L91527J446320r97012k565963K10734L253740
10297a552667J804846j539793j535472J205350K124907J59025j780295j791132
10289b905231n20329P99029J152860Q9951j183926r62498J28749J49980l45680
10280c597095P41977K422225J573917j239569k096495l84506M22829n68515k72301
10271b997533J835430K083953n52127k140925o20649R81709N34301J25929R65252
10262B15340Q90993m59156k8793K388267K452852j135792l629742k126744j56105
10253a588880p14084j135880Q30641K086361J68993j571890N6297K170235J102202
10244A403995j193649j270536k52752n64485q48468O03264J386803o73076k458726
$$ plain form
10235 -3867630 -4229080 -1142220 1764764 1176597 -1738836 -3938709 -4203305 -3024898 -1528046
10226 -1528046 -1326245 -3011737 -4560729 -3711050 -1508508 -615070 -967226 -676541 -269823
10217 -269823 -1700984 -3776448 -3391962 -1159379 -714518 -2217054 -1981676 629849 1655131
10208 1655131 -515411 -2217213 -957985 416163 -905493 -2780439 -2203733 -494680
10200 -494680 -522684 -1747750 -1877157 -1200736 -1583311 -2718929 -2752045 -1636472 -1005878
10191 -1005878 -1301814 -1393770 -753070 -186617 -460675 -1298089 -1726758 -1147632 -398675 -1288503
10181 -1288503 -4008035 -5852810 -4465851 -1573827 -798770 -2224090 -2520541 -643431
10173 -643431 426022 -1260965 -3497760 -3714800 -2699501 -2291981 -2159283 -1452854 -1383341
$$ packed form
10235c867630l61450L086860K906984n88167k915433k199873k64596J178407J496852
10226a528046K01801j685492j548992Q49679K202542Q93438l52156K90685M06718
10217b69823j431161k075464L84486K232583M44861j502536K35378K611525J025282
10208A655131k170542j701802J259228J374148j321656j874946N76706J709053
10200d94680k8004j225066j29407O76421l82575j135618l3116J115573O30594
10191a005878k95936r1956O40700N66453k74058q37414m28669N79126P48957q89828
10181a288503k719532j844775J386959K892024P75057j425320k96451J877110
10173f43431J069453j686987k236795k17040J015299M07520J32698P06429O9513
$$ plain form
10164 -1383341 -3244858 -5402003 -5064768 -2261069 324135 995180 520802 200935 208639
10155 208639 52069 -445228 -950539 -976324 -372850 494920 1243845 1836936 1985818 859890
10145 859890 -1590593 -3687195 -3821607 -2675804 -2029940 -1933154 -1156326 -155928 -1039759
10136 -1039759 -4120791 -6799751 -6798525 -4778768 -2919657 -2346438 -2661643 -2769163 -1666608
10127 -1666608 482822 1959205 1397478 -114778 -440447 413751 571867 -343183 -613198
10118 -613198 299061 379959 -1839244 -4758641 -5694781 -4110394 -1691581 -119882 331483
10109 331483 582759 1589053 2946906 2871412 417014 -2738455 -4013343 -3051310 -1692240
10100 -1692240 -1202134 -1195021 -1072671 -783632 -197687 686083 1049758 315740 -442737 159954
$$ packed form
10164a383341j861517k157145L37235K803699K585204O71045m74378l19867P704
10155B08639j56570m97297n05311k5785O03474Q67770P48925N93091J48882j125928
10145H59890k450483k096602j34412J145803O45864R6786P76828J000398q83831
10136a039759l081032k678960J226K019757J859111N73219l15205j07520J102555
10127a666608K149430J476383n61727j512256l25669Q54198J58116r15050k70015
10118f13198R12259Q0898k219203k919397r36140J584387K418813J571699M51365
10109C31483K51276J006294J357853p5494k454398l155469j274888R62033J359070
10100a692240M90106P113J22350K89039N85945Q83770L63675p34018p58477O02691
$$ plain form
10090 159954 1466816 1576982 88266 -1827793 -3510567 -4813448 -4633837 -2048850 1259727
10081 1259727 2330862 820267 -781020 -916379 -624008 -1302010 -3049774 -5333001 -7228726
10072 -7228726 -7226826 -5011007 -2999022 -3626248 -5687186 -6194905 -5108187 -4741312 -5066916
10063 -5066916 -3783839 -1122181 -85663 -1112057 -991886 1463093 3054054 1540974
10055 1540974 -683940 -781278 256904 288801 -186138 104172 284386 -622391 -1036815
10046 -1036815 637704 2675052 2337513 133298 -1163830 -719566 -146251 -484229 -1092179
10037 -1092179 -1219988 -803896 40015 955581 1254342 919893 950575 1811410 2560634 2391631
10027 2391631 1846701 1599013 1356260 907061 801059 961420 145827 -2035819 -3989857
$$ packed form
10090A59954J306862J10166j488716j916059j682774j302881J79611K584987L308577
10081A259727J071135j510595j601287j35359K92371o78002j747764k283227j895725
10072g228726J900K215819K011985o27226k060938n07719J086718L66875l25604
10063e066916J283077K661658J036518j026394J20171K454979J590961j513080
10055A540974k224914r7338J038182L1897m74939K90310J80214r06777m14424
10046a036815J674519K037348l37539k204215j297128M44264N73315l37978o07950
10037a092179j27809M16092Q43911R15566K98761l34449L0682Q60835P49224j69003
10027B391631n44930k47688k42753m49199j06002J60361q15593k181646j954038
$$ plain form
10018 -3989857 -4173461 -2911479 -1233236 495741 1727407 1336227 -496040 -1607806
10010 -1607806 -630035 911186 736023 -1159550 -2986067 -3545480 -2895496 -1718276 -1108742
10001 -1108742 -1885608 -3202303 -3065554 -1015524 1125600 1893923 1887878 2010191 1887651
9992 1887651 1112100 221128 -658844 -2231672 -3962926 -3762925 -1228765 926456 462613
9983 462613 -1338607 -2128396 -2047305 -2530874 -3173768 -2407922 -455526 709813 -12319
9974 -12319 -1922963 -3759393 -4538363 -3801835 -2217100 -1293845 -1600045 -2092138 -1886017
9965 -1886017 -1462100 -1367749 -1203247 -801515 -841122 -1297856 -974492 320231 893906 -274567
9955 -274567 -1867921 -2443562 -2479873 -2723030 -2355637 -629846 1210893 1480456 361759
$$ packed form
10018c989857j83604J261982J678243J728977J231666l91180j832267j111766
10010a607806R77771J541221j75163j895573j826517n59413O49984J177220O09534
10001a108742p76866j316695J36749K050030K141124P68323o045J22313j22540
9992A887651p75551q90972q79972j572828j731254K00001K534160K155221m63843
9983D62613j801220p89789Q1091m83569o42894P65846J952396J165339p22132
9974a2319j910644j836430p78970P36528J584735R23255l06200m92093K06121
9965a886017M23917R4351J64502M01732l9607m56734L23364J294723N73675j168473
9955b74567j593354n75641l6311k43157L67393J725791J840739K69563j118697
$$ plain form
9946 361759 -785412 -1247619 -938421 27906 693609 -186337 -1959382 -2323222 -739878
9937 -739878 577780 178561 -616035 -519916 -351933 -666029 -220509 1198297 1416388 -318507
9927 -318507 -1222432 554782 2382285 1358973 -783956 -812425 432225 -134524 -2196075
9918 -2196075 -2629340 -752675 1064801 1456391 1145087 527389 -506131 -863038 543557
9909 543557 2439973 2841476 2170190 1947535 1657352 84270 -1517853 -1103565 408557
9900 408557 633307 -57476 493901 1992320 2271112 1332654 982863 1189177 626797 -23569
9890 -23569 715051 1660158 939018 134526 1732642 3830589 2880873 437207 811193
9881 811193 2945281 1993639 -1254230 -992572 2725116 3313775 411943 2569127 11483096
$$ packed form
9946C61759j147171m62207L09198R66327O65703q79946j773045l63840J583344
9937g39878J317658l99219p94596R6119J67983l14096M45520J418806K18091j734895
9927c18507r03925J777214J827503j023312k142929k8469J244650n66749k061551
9918b196075m33265J876665J817476L91590l11304o17698j033520l56907J406595
9909E43557J896416M01503o71286k22655k90183j573082j602123M14288J512122
9900D08557K24750o90783N51377J498419K78792r38458l49791K06314n62380o50366
9890b3569P38620R45107p21140q04492J598116K097947r49716k443666L73986
9881H11193K134088r51642l247869K61658L717688N88659k901832K157184Q913969
$$ plain form
9872 11483096 14056796 -152724 -21058885 -29175922 -20663254 -9657082 -7053554 -8818263
9864 -8818263 -7314399 -3467806 -2272357 -3542402 -3548821 -1865749 -1085127 -1845777 -2508827
9855 -2508827 -2562237 -2839106 -3032011 -1918672 115241 1096483 184695 -1285214 -1730421
9846 -1730421 -1065109 -223511 122573 -95171 -731523 -1570937 -2139079 -1890455 -962510 -425012
9836 -425012 -1086818 -2154667 -2054569 -774294 -166852 -1318806 -2939716 -3464119 -3516640
9827 -3516640 -4659961 -6519589 -7073513 -5548757 -3235033 -1379028 43369 1206704
9819 1206704 1711520 1523991 1312171 1282877 863507 34269 -315693 -21631 -252481 -1442371
9809 -1442371 -1858815 236828 3697384 5409184 4006716 1280037 -283653 -108732 739030
$$ packed form
9872A1483096K573700j4209520k0906161q117037Q512668J1006172K603528j764709
9864h818263J503864L846593J195449j270045o419J683072P80622p60650o63050
9855b508827n3410k76869j92905J113339K033913R81242r11788j469909m45207
9846a730421O65312Q41598L46084k17744o36352q39414n68142K48624R27945N37498
9836d25012o61806j067849J00098J280275O07442j151954j620910n24403n2521
9827c516640j143321j859628n53924J524756K313724J856005J422397J163335
9819A206704N04816j87529k11820k9294m19370q29238l49962K94062k30850j189890
9809a442371m16444K095643L460556J711800j402468k726679j563690J74921Q47762
$$ plain form
9800 739030 1312419 1451318 1297378 945978 399126 -568058 -2190831 -3962000 -4555651
9791 -4555651 -3184450 -761815 1027195 1620231 1687267 1508641 530114 -1055719 -1640726
9782 -1640726 -270484 1480587 1256752 -670578 -1391536 772368 3838585 4685984 2997181
9773 2997181 1143567 556654 153829 -1063036 -1744370 -265925 2001648 1904441 -913930
9764 -913930 -3049830 -2005518 326016 692841 -717941 -1160133 -110646 -50913 -2244115
9755 -2244115 -4654356 -5100438 -4044977 -2906125 -1812659 -766195 -1077562 -3435362 -5881327
9746 -5881327 -5966408 -4065162 -2488362 -2091921 -1955877 -1834665 -2467397 -3459802 -3172534
9737 -3172534 -1241752 572797 649886 -716781 -2149143 -2572666 -1634520 -19546 587327
$$ packed form
9800G39030N73389J38899j53940l51400n46852r67184j622773j771169n93651
9791d555651J371201K422635J789010N93036O7036j78626r78527j585833n85007
9782a640726J370242J751071k23835j927330p20958K163904L066217Q47399j688803
9773B997181j853614n86913m02825j216865o81334J478445K267573r7207k818371
9764i13930k135900J044312K331534L66825j410782m42192J049487N9733k193202
9755b244115k410241m46082J055461J138852J093466J046464l11367k357800k445965
9746e881327q5081J901246J576800L96441J36044J21212o32732r92405K87268
9737c172534J930782J814549P7089j366667j432362m23523R38146J614974O06873
$$ plain form
9728 587327 -778480 -2661604 -2709580 -886549 608510 764713 956215 2061402 2613095
9719 2613095 1215702 -936436 -1692655 -930832 -167079 31478 448604 1334012 1809472
9710 1809472 1398574 859259 943796 1165701 518284 -896351 -1673534 -806350 824539
9701 824539 1327918 236522 -767651 -137263 1313719 1523782 36924 -1597533 -2159999
9692 -2159999 -2029323 -1821561 -1189032 255919 1846194 2587773 2403035 2002360 2003936 2632915
9682 2632915 3704016 4428823 3872528 2189201 852468 982894 1837284 1676706 -20098
9673 -20098 -1873024 -2281551 -1397477 -1029170 -2475511 -4800796 -5871360 -5061859 -3920820
9664 -3920820 -3681295 -3379573 -1721750 218265 179793 -1711039 -2797194 -1775573 -585771
$$ packed form
9728E87327j365807j883124m7976J823031J495059J56203J91502J105187N51693
9719B613095j397393k152138p56219P61823P63753J98557M17126Q85408M75460
9710A809472m10898n39315Q4537K21905o47417j414635p77183Q67184J630889
9701H24539N03379j091396j004173O30388J450982K10063j486858j634457n62466
9692b159999J30676K07762O32529J444951J590275P41579j84738m00675J576O28979
9682B632915J071101P24807n56295j683327j336733J30426Q54390j60578j696804
9673b0098j852926m08527Q84074L68307j446341k325285j070564Q09501J141039
9664c920820K39525L01722J657823J940015l8472j890832j086155J021621J189802
$$ plain form
9655 -585771 -1291313 -2860717 -2764165 -685721 1248755 1569923 1028647 839823 828889 146607
9645 146607 -978225 -1282981 -282590 802744 504774 -937713 -1975992 -2078829 -2484184
9636 -2484184 -4034898 -5432418 -4911339 -2956814 -1827794 -2559699 -3880379 -4201065 -3370077
9627 -3370077 -2165608 -1191307 -679631 -538695 -331630 114733 153793 -816679 -2210998
9618 -2210998 -3016142 -3308523 -3700529 -3751021 -2695648 -1457290 -1750358 -3105073 -3186851
9609 -3186851 -1550750 -495071 -1204281 -1706432 -325119 1234166 500112 -1842848 -3104657
9600 -3104657 -2509728 -1649007 -1765761 -2663368 -3761223 -4408250 -3695673 -1641074 94870
9591 94870 319718 246905 1407623 2632215 1616249 -1101648 -2555586 -1718616 -594566
$$ packed form
9655e85771p05542j569404R6552K078444J934476L21168n41276j88824j0934o82282
9645A46607j124832l04756J000391J085334k97970j442487j038279j02837m05355
9636b484184j550714j397520N21079J954525J129020p31905j320680l20686Q30988
9627c370077J204469R74301N11676J40936K07065M46363L9060r70472j394319
9618b210998q05144k92381l92006n0492J055373J238358k93068j354715q1778
9609c186851J636101J055679p09210n02151J381313J559285p34054k342960j261809
9600c104657N94929Q60721j16754q97607j097855o47027P12577K054599J735944
9591I4870K24848p2813J160718J224592j015966k717897j453938Q36970J124050
$$ plain form
9582 -594566 -489895 -78858 1687506 3335042 3237165 2241108 2006502 2215052 1495616 138242
9572 138242 -262324 484142 747534 -469779 -2172766 -2844899 -2124956 -552479 1403254
9563 1403254 3367350 4664170 4652470 3437059 1881938 866584 646026 846972 881249
9554 881249 361303 -654242 -1640616 -1931044 -1310396 -342612 67667 -480827 -1584446
9545 -1584446 -2532434 -2859293 -2435012 -1461467 -611303 -762073 -2107560 -3599682 -3644223
9536 -3644223 -1541384 1698111 3930977 3524956 854812 -1856694 -2587290 -1369300 283536
9527 283536 1451998 2387983 3166751 3174845 2447182 2164327 2837632 3095426 1530405 -1071688
9517 -1071688 -2770921 -3170890 -3522105 -4387144 -4835807 -4153216 -2940814 -2100926 -1830209
$$ packed form
9582e94566J04671M11037J766364J647536r7877r96057k34606K08550p19436j357374
9572A38242m00566P46466K63392j217313j702987o72133P19943J572477J955733
9563A403254J964096J296820j1700j215411j555121j015354k20558K00946L4277
9554H81249n19946j015545r86374k90428O20648R67784M10279n48494j103619
9545a584446r47988l26859M24281R73545Q50164j50770j345487j492122m4541
9536c644223K102839L239495K232866m06021k670144k711506p30596J217990J652836
9527B83536J168462R35985P78768Q094p27663k82855O73305K57794j565021k602093
9517a071688j699233l99969l51215q65039m48663O82591J212402Q39888K70717
$$ plain form
9508 -1830209 -2004155 -2566802 -3164706 -3299737 -3139650 -3238600 -3255034 -2184216 -326083 384186
9498 384186 -1021869 -2800034 -2679518 -987235 -52452 -854493 -1891069 -1595812 -450245
9489 -450245 20022 -602543 -1363325 -1335784 -479406 678565 1481497 1316295 102217 -1206927
9479 -1206927 -1347149 -436695 -269487 -2105744 -4657892 -5461683 -4131673 -2763506 -2675214
9470 -2675214 -2442588 -460204 1949432 2081227 -64037 -1588991 -899727 110023 -913634
9461 -913634 -3388004 -4952479 -4785478 -4006895 -3423471 -2664238 -1522057 -648718 -542469
9452 -542469 -846514 -1018279 -1007221 -1045627 -1316485 -1897192 -2518969 -2499342 -1571804 -606974
9442 -606974 -645048 -1307110 -1223161 -140494 587247 43673 -859261 -778596 173902 834298
$$ packed form
9508a830209j73946n62647n97904j35031J60087r8950j6434J070818J858133P10269
9498C84186j406055j778165J20516J692283R34783q02041j036576K95257J145567
9489d50245M70267o22565p60782K7541Q56378J157971Q02932j65202j214078j309144
9479a206927j40222R10454J67208j836257k552148q03791J330010J368167Q8292
9470b675214K32626J982384K409636J31795k145264j524954O89264J009750j023657
9461i13634k474370j564475J67001P78583N83424P59233J142181Q73339J06249
9452e42469l04045j71765J1058l8406k70858n80707o21777J9627R27538R64830
9442f06974l8074o62062Q3949J082667P27741n43574r02934Q0665R52498O60396
$$ plain form
9432 834298 631740 -47490 -650403 -780617 -183753 718273 678749 -1019475 -3314392 -4429547
9422 -4429547 -3980723 -2994647 -2029062 -623084 1176292 2165514 1627844 583678 429401
9413 429401 1018826 1132839 436595 -167578 -131492 -146402 -983859 -2141930 -2384168 -1485543
9403 -1485543 -729998 -1279636 -2448824 -2368887 -512685 1268254 935463 -1045871 -2260886
9394 -2260886 -1465669 37073 480125 -29454 -59190 972234 2118323 2158739 824020
9385 824020 -1092674 -2302863 -1864471 -10780 1879425 2507217 1810308 721528 60011
9376 60011 -37391 89357 -39433 -710699 -1654393 -2182135 -1947786 -1318726 -803753 -543249
9366 -543249 -620673 -1280343 -2355962 -3042318 -2831530 -2182869 -1664617 -1034936 19567 826484
$$ packed form
9432H34298k02558o79230o02913j30214N96864R02026l9524j698224k294917j115155
9422d429547M48824R86076R65585J405978J799376R89222n37670j044166j54277
9413D29401N89425J14013o96244o04173L6086j4910q37457j158071k42238Q98625
9403a485543P55545n49638j169188P9937J856202J780939l32791j981334j215015
9394b260886P95217J502742M43052n09579k9736J031424J146089M0416j334719
9385H24020j916694j210189M38392J853691J890205O27792o96909j088780o61517
9376F0011r7402J26748j28790o71266r43694n27742K34349O29060N14973K60504
9366e43249p7424o59670j075619o86356K10788O48661N18252O29681J054503Q06917
$$ plain form
9356 826484 511038 -475500 -775068 -33665 668020 400854 -539204 -1304243 -1373253 -576606
9346 -576606 886910 2144543 2121284 732601 -906802 -1738846 -1775775 -1714712 -2037706 -2632656
9336 -2632656 -2858673 -1963104 34888 1876022 2100744 646596 -1149105 -2150010 -2383033
9327 -2383033 -2378320 -2310882 -2068032 -1640856 -1196076 -1014284 -1276950 -1639151 -1400791 -551802
9317 -551802 -2839 -51226 461343 2167569 3277728 1672526 -1549258 -3027033 -1811621
9308 -1811621 -543696 -1234078 -2460258 -2186281 -1020119 -642572 -849657 -501942 -70035
9299 -70035 -741262 -1860217 -1767213 -713910 -474826 -1210486 -1202507 33820 778755 -45938
9289 -45938 -1180264 -1204736 -664107 -799181 -1507409 -1806735 -1349716 -412349 758991 1633674
$$ packed form
9356H26484l15446r86538k99568P41403P01685k67166r40058p65039o9010P96647
9346e76606J463516J257633k3259j388683j639403q32044l6929O1063l22994n94950
9336b632656k26017Q95569J997992J841134K24722j454148j795701j000905k33023
9327b383033M713O7438K42850M27176M44780J81792k62666l62201K38360Q48989
9317e51802N48963m8387N12569J706226J110159j605202l221784j477775J215412
9308a811621J267925o90382j226180K73977J166162L77547k07085L47715M31907
9299g0035o71227j118955R3004J053303K39084p35660P979J236327P44935q24693
9289d5938j134326k4472N40629j35074p08228k99326M57019R37367J171340Q74683
$$ plain form
9279 1633674 1322660 -145047 -1306101 -1187772 -1019329 -2624517 -5510112 -7087004 -5924584
9270 -5924584 -3492626 -2169356 -2430107 -2702141 -1562109 596983 2139552 2091877 1144476
9261 1144476 578902 502776 -133552 -1671649 -2906806 -2825515 -2276533 -2653243 -3463245 -2913737
9251 -2913737 -994712 -101987 -1696754 -3904218 -3914561 -1757528 78792 299850 120571
9242 120571 781330 1664888 1756039 1507157 1970752 2951433 3328279 2762994 1904660 1137571
9232 1137571 260216 -611231 -855567 -232528 851445 2056090 3251213 3865070 3142326
9223 3142326 1484970 553911 1264168 2370024 1978829 118699 -1183220 -442722 1441078
9214 1441078 2235859 851643 -1619615 -3205077 -3032367 -1867499 -931431 -677194 -900864
$$ packed form
9279A633674l11014j467707j161054J18329J68443j605188k885595j576892J162420
9270e924584K431958J323270k60751k72034J140032K159092J542569m7675r47401
9261A144476n65574p6126o36328j538097j235157Q1291N48982l76710q10002N49508
9251b913737J919025Q92725j594767k207464j0343K157033J836320K21058j79279
9242A20571O60759Q83558R1151k48882M63595R80681L76846n65285q58334p67089
9232A137571q77355q71447k44336O23039J083973J204645J195123O13857p22744
9223C142326j657356r31059P10257J105856l91195j860130j301919P40498J883800
9214A441078P94781j384216k471258j585462J72710J164868R36068K54237k23670
$$ plain form
9205 -900864 -1467206 -2202244 -2302365 -839079 1834363 3953236 4161424 2963543 1875774
9196 1875774 1645289 1930127 2264149 2459780 2222158 1257505 -108379 -1102675 -1427399
9187 -1427399 -1379446 -980218 157075 1722210 2340906 1076960 -1230852 -2919287 -3378629
9178 -3378629 -3155819 -2636860 -1819065 -1221761 -1535437 -2036570 -906298 2005320 4163456
9169 4163456 3478277 1341927 763041 2177014 3228993 2566102 1515727 1423953 1535781
9160 1535781 788442 -27653 424644 1690429 2214879 1738201 1395575 1707054 1884285
9151 1884285 1162854 -223195 -1469142 -1923793 -1521053 -974266 -1116541 -1619975 -1186440
9142 -1186440 368980 1386618 769074 -160914 210449 982156 200019 -1657538 -2191154
$$ packed form
9205i00864n66342p35038j00121J463286K673442K118873K08188j197881j087769
9196A875774k30485K84838L34022J95631k37622r64653j365884r94296l24724
9187a427399M7953L99228J137293J565135O18696j263946k307812j688435m59342
9178c378629K22810N18959Q17795N97304l13676n01133J130272K911618K158136
9169D163456o85179k136350n78886J413973J051979o62891j050375r1774J11828
9160A535781p47339q16095M52297J265785N24450m76678l42626L11479J77231
9151A884285p21431j386049j245947m54651M02740N46787j42275n03434M33535
9142a186440J555420J017638o17544r29988L71363P71707p82137j857557n33616
$$ plain form
9133 -2191154 -923804 -43141 -876112 -2035746 -1963876 -1211050 -984354 -1122604 -829475
9124 -829475 -146513 478669 1035692 1387730 930626 -234592 -837852 -145034 818776 731548
9114 731548 -203316 -855113 -809128 -493329 -333597 -586248 -1399487 -2402162 -2861137 -2668362
9104 -2668362 -2363119 -1931127 -788400 676856 1061332 80482 -890401 -1215538 -2036795
9095 -2036795 -3703659 -4263422 -2434464 -249717 -274702 -1569166 -1257687 685563 1324974
9086 1324974 -548862 -2529771 -2151065 -60885 1337126 722366 -1522974 -4085758 -5301561
9077 -5301561 -4204455 -1777407 -193488 -323767 -1007803 -1083992 -801765 -689729 -453646
9068 -453646 109735 316494 -244389 -752386 -463870 -134496 -902038 -2353629 -3022328 -2520085
$$ packed form
9133b191154J267350Q80663q32971j159634P1870P52826K26696j38250K93129
9124h29475O82962O25182N57023L52038m57104j165218o03260O92818R63810q7228
9114G31548r34864o51797M5985L15799J59732k52651q13239j002675m58975J92775
9104b668362L05243M31992J142727J465256L84476r80850r70883l25137q21257
9095b036795j666864n59763J828958K184747k4985j294464L11479J943250O39411
9086A324974j873836j980909L78706K090180J398011o14760k245340k562784j215803
9077e301561J097106K427048J583919j30279o84036p6189K82227J12036K36083
9068d53646N63381K06759n60883n07997K88516L29374p67542j451591o68699N02243
$$ plain form
9058 -2520085 -1906940 -1968623 -2320645 -2417580 -2307112 -1902968 -581234 1588057 2954757
9049 2954757 1920540 -671629 -2060733 -858989 1286109 2033262 1361615 1102956 2129750
9040 2129750 3477232 4104286 4044315 3594482 2737178 1781479 1302215 992386 -22909
9031 -22909 -1161662 -417830 2426965 4361061 2780209 -688059 -2250119 -1105168 -19025
9022 -19025 -844933 -2164741 -2223243 -1844090 -2725965 -4306304 -4323216 -2040760 762638 2148388
9012 2148388 2109591 1877723 2045796 2124972 1576629 489622 -823335 -2216470 -3349294
9003 -3349294 -3533086 -2606183 -1581202 -1562092 -2184434 -2100630 -997762 -9725 70354 -263973
8993 -263973 -529866 -1176874 -2416639 -3356012 -3333636 -3031620 -3084700 -2666677 -956509 868034
$$ packed form
9058b520085O13145o1683l52022r6935J10468M04144J321734K169291J366700
9049B954757j034217k592169j389104J201744K145098P47153o71647k58659J026794
9040B129750J347482O27054n9971m49833q57304r55699m79264l09829j015295
9031b2909j138753P43832K844795J934096j580852l468268j562060J144951J086143
9022a9025q25908j319808n8502L79153q81875j580339j6912K282456K803398J385750
9012B148388l8797k31868J68073P9176n48343j087007j312957j393135j132824
9003c349294j83792R26903J024981J9110o22342Q3804J102868R88037Q0079l34327
8993b63973k65893o47008j239765r39373K2376L02016n3080M18023J710168J824543
$$ plain form
8983 868034 891468 -721187 -1920647 -1638764 -785826 -335131 -67039 388041 660579 395639
8973 395639 -87087 -339352 -218458 420461 1612861 2711245 2824229 2014596 1205027
8964 1205027 790561 313215 -339946 -514760 64996 720232 836968 568747 45108 -1190287
8954 -1190287 -3221078 -4931065 -5011566 -3544849 -1944905 -1403212 -1818186 -2238048 -2032175
8945 -2032175 -1457365 -1104652 -1018248 -726105 -133916 191972 -69763 -380311 -127508 466144
8935 466144 809129 866767 942166 882143 225026 -1024923 -2305843 -3011277 -2806500 -1873693
8925 -1873693 -1120616 -1464556 -2534495 -2922153 -2142027 -1254335 -989615 -666770 126340
8916 126340 403207 -293484 -474189 942385 2380181 1987496 929941 1565365 3309604
$$ packed form
8983H68034K3434j612655j199460K81883Q52938M50695K68092M55080K72538k64940
8973C95639m82726k52265J20894O38919J192400J098384J12984q09633q09569
8964A205027m14466m77346o53161j74814N79756O55236J16736k68221n23639j235395
8954a190287k030791j709987q0501J466717J599944N41693m14974m19862K05873
8945b032175N74810L52713Q6404K92143N92189L25888k61735l10548K52803N93652
8935D66144L42985N7638P5399o0023o57117j249949j280920p05434K04777R32807
8925a873693P53077l43940j069939l87658P80126Q87692K64720L22845P93110
8916A26340K76867o96691j80705J416574J437796l92685j057555O35424J744239
$$ plain form
8907 3309604 3471465 1804352 907239 1879494 2808696 2285215 1386237 1095962 558627
8898 558627 -731333 -1498055 -959959 -338118 -588988 -706563 173523 999926 807870 595928
8888 595928 1432452 2457401 2591128 2500022 2911067 2706867 974887 -567087 227316
8879 227316 2374870 3013069 1530266 -59641 -458365 -362516 -507676 -678638 -803153
8870 -803153 -1100248 -1020448 193241 1867024 2605846 2605368 3264391 4350458 3780903 914922
8860 914922 -1971339 -2591358 -1413272 -335301 8409 209439 370422 15086 -670468
8851 -670468 -825798 -149409 737181 1158734 928263 78979 -1192510 -2190331 -2071851 -994322
8841 -994322 -411328 -1536216 -3653448 -4723929 -3841861 -2266667 -1480644 -1106430 93937
$$ packed form
8907C309604J61861j667113q97113R72255R29202n23481q98978k90275n37335
8898E58627j289960p66722N38096O21841k50870j17575Q80086Q26403j92056k11942
8888E95928Q36524J024949J33727r1106M11045k04200j731980j541974P94403
8879B27316K147554O38199j482803j589907l98724R5849j45160j70962j24515
8870h03153k97095P9800J213689J673783P38822m78O59023J086067n69555k865981
8860I14922k886261o20019J178086J077971L43710K01030J60983l55336o85554
8851f70468j55330O76389Q86590M21553k30471q49284j271489r97821J18480J077529
8841i94322N82994j124888k117232j070481Q82068J575194P86023L74214J200367
$$ plain form
8832 93937 1703107 1806399 -147866 -2287150 -2842280 -2307393 -2003385 -1751637 -510106
8823 -510106 1449123 2686277 2676160 2254887 2013854 1655615 1133488 1069819 1534068 1529075
8813 1529075 399769 -1073421 -1752981 -1719345 -1930863 -2627114 -2962088 -2331521 -1346240
8804 -1346240 -1018013 -1338766 -1328479 -558734 73148 -351097 -1167161 -792357 980413 2381082
8794 2381082 1879464 209947 -656542 -141854 295257 -803254 -2969887 -4320871 -3677769
8785 -3677769 -1795885 -467323 -666670 -1824979 -2806207 -3096210 -2855061 -2425036 -2342313
8776 -2342313 -3289587 -5177393 -6585349 -6076016 -3941544 -1750496 -375942 429549 713309
8767 713309 67807 -1108521 -1604843 -1185181 -1053538 -1899961 -2720187 -2308136 -832844
$$ packed form
8832I3937J609170J03292j954265k139284n55130N34887L04008K51748J241531
8823e10106J959229J237154j0117m21273k41033l58239n22127o3669M64249m993
8813A529075j129306j473190o79560L3636k11518o96251l34974O30567R85281
8804a346240L28227l20753J0287P69745O31882m24245q16064L74804J772770J400669
8794B381082n01618j669517q66489N14688M37111j098511k166633j350984O43102
8785c677769J881884J328562j99347j158309r81228k90003K41149M30025Q2723
8776b342313r47274j887806j407956N09333K134472K191048J374554Q05491K83760
8767G13309o45502j176328m96322M19662J31643q46423q20226M12051J475292
$$ plain form
8758 -832844 717648 1590696 1301096 -38910 -898178 499634 3374826 4601388 2851509
8749 2851509 586613 407466 1467558 1581450 933375 940843 937833 -749653 -3186856 -3630702
8739 -3630702 -1823845 -326750 -319387 -172797 1149865 2293461 2248180 2171058 2981585 3439031
8729 3439031 2276042 361206 -890210 -1632772 -2580424 -3387874 -3551479 -3548085 -3685077
8720 -3685077 -3244258 -2109615 -1590409 -2084458 -1784239 300763 1897474 606237 -2051384
8711 -2051384 -2702272 -1174289 -274216 -1147189 -2247239 -2754389 -3448632 -3842243 -2174133
8702 -2174133 710236 1171472 -1769250 -4189449 -2824768 197454 1076137 84115 38962
8693 38962 1047080 843776 -660612 -1298919 -928364 -1877868 -4617715 -6557540 -6164911
$$ packed form
8758h32844J550492Q73048k89600j340006q59268J397812K875192J226562j749879
8749B851509k264896j79147J060092J13892o48075P468l010j687486k437203m43846
8739c630702J806857J497095P363J46590J322662J143596m5281p7122Q10527M57446
8729C439031j162989j914836j251416p42562r47652q07450j63605L394j36992
8720c685077M40819J134643N19206m94049L00219K085002J596711j291237k657621
8711b051384o50888J527983R00073q72973j100050n07150o94243l93611J668110
8702b174133K884369M61236k940722k420199J364681L022222Q78683r92022m5153
8693C8962J008118k03304j504388o38307L70555r49504k739847j939825L92629
$$ plain form
8684 -6164911 -5111141 -5033165 -5041202 -3992015 -2654025 -1866488 -829135 953307 2131434
8675 2131434 1840197 1582091 2682152 3686214 2620745 305768 -996796 -930478 -615714
8666 -615714 -102318 1144078 2205157 1861403 1017630 1278933 1827319 683344 -1385648
8657 -1385648 -1467215 907263 2936927 2785549 1653091 900933 22615 -1409029 -2352599
8648 -2352599 -2159800 -1708082 -1603479 -1293842 -855555 -1434822 -2933596 -3564421 -2779712
8639 -2779712 -2240289 -2706833 -2621033 -1278425 -571638 -1491579 -1643863 1007507 4200714
8630 4200714 4340039 1781665 -65053 170417 826134 707168 463692 476274 55794
8621 55794 -900925 -1559753 -1723792 -2016309 -2429312 -2334255 -1900113 -1902423 -2213137 -2033901
$$ packed form
8684f164911J053770P7976q037J049187J337990P87537J037353J782442J178127
8675B131434k91237k58106J100061J004062j065469k314977j302564O6318L14764
8666f15714N13396J246396J061079l43754q43773K61303N48386j143975k068992
8657a385648q1567K374478K029664j51378j132458p52158q78318j431644r43570
8648b352599J92799M51718J04603L09637M38287n79267j498774o30825P84709
8639b779712N39423m66544Q5800J342608P06787r19941j52284K651370L193207
8630D200714J39325k558374j846718K35470O55717j18966k43476J2582m20480
8621E5794r56719o58828j64039k92517m13003R5057M34142k310l10714J79236
$$ plain form
8611 -2033901 -1453067 -1167586 -870831 326311 1911265 2193554 755569 -855413 -1218911
8602 -1218911 -577462 -17366 -140608 -715622 -908315 -26374 1356943 1667869 489009
8593 489009 -605738 -495269 -412194 -1686603 -3031887 -2537506 -1302384 -2059159 -4554469
8584 -4554469 -5505974 -3498701 -867669 152133 293307 909430 1257737 20439 -2138804
8575 -2138804 -3380415 -3058833 -1962748 -1068086 -1045580 -2009468 -2794942 -1547421 1859425
8566 1859425 4871510 4854096 2049059 -960399 -2114919 -1320974 365926 1892883 2632191
8557 2632191 2456570 1670874 748347 110502 -66 327802 854250 1728645 3283677
8548 3283677 4846529 4670325 2088081 -1033292 -2331064 -1825436 -1253284 -1146063 -520542
$$ packed form
8611b033901N80834K85481K96755J197142J584954K82289j437985j610982l63498
8602a218911O41449N60096j23242n75014j92693Q81941J383317L10926j178860
8593D89009j094747J10469Q3075j274409j345284M94381J235122p56775k495310
8584d554469r51505K007273K631032J019802J41174O16123L48307j237298k159243
8575b138804j241611L21582J096085Q94662K2506r63888p85474J247521L406846
8566A859425L012085j7414k805037l009458j154520P93945J686900J526957P39308
8557B632191j75621p85696r22527o37845j10568L27868N26448Q74395J555032
8548C283677J562852j76204k582244l121373j297772N05628N72152J07221O25521
$$ plain form
8539 -520542 769874 1523603 1241401 714745 248702 -724424 -1832815 -1666970 -208804
8530 -208804 682296 131826 -379484 404787 1536206 1811054 1821995 2414512 2753411 1815803
8520 1815803 477227 152739 455546 206254 -192104 403364 1324647 789615 -999794
8511 -999794 -1816369 -798857 303461 38006 -582677 -95413 794286 378604 -1082187
8502 -1082187 -1509891 -177759 1034423 373610 -1088157 -904589 1152655 2624519 1734989
8493 1734989 -315263 -1310870 -1063746 -1145779 -2276783 -3475358 -3628590 -2597040 -770925
8484 -770925 1252200 2453702 2049115 610820 -482476 -895674 -1541077 -2685190 -3098566
8475 -3098566 -1764208 484273 1833721 1527539 459080 11602 675630 1729248 2228674
$$ packed form
8539e20542J290416P53729k82202n26656m66043r73126j108391J65845J458166
8530b08804Q91100n50470n11310P84271J131419K74848J0941N92517L38899r37608
8520A815803j338576l24488L02807k49292l98358N95468R21283n35032j789409
8511i99794q16575J017512J102318k65455o20683M87264Q89699m15682j460791
8502a082187m27704J332132J212182o60813j461767J83568K057244J471864q89530
8493A734989k050252r95607K47124q2033j131004j198575j53232J031550J826115
8484g70925K023125J201502m04587j438295j093296m13198o45403j144113m13376
8475c098566J334358K248481J349448l06182j068459m47478O64028J053618M99426
$$ plain form
8466 2228674 2249161 2641165 3401004 3275199 1705062 83346 -144002 340313 10574
8457 10574 -858197 -732732 536808 1662921 2160566 2496995 2279517 721421 -1100884
8448 -1100884 -1105332 356899 693393 -628070 -898484 1475724 4234890 4639912 3157132
8439 3157132 1766505 745853 -531874 -1309903 -504101 975017 1204383 -114321 -1816641
8430 -1816641 -3309323 -4620214 -5069215 -3794147 -1432307 197131 111326 -973710 -1519006
8421 -1519006 -423759 1873289 3218651 1872853 -806972 -1540462 364010 1905342
8413 1905342 1051000 -55534 1227092 3436618 3212920 711184 -645967 552796 1894462
8404 1894462 1015717 -1334497 -2932238 -2853751 -1723660 -486410 338318 889559 1694711
$$ packed form
8466B228674K0487L92004P59839j25805j570137j621716k27348M84315l29739
8457A0574q68771J25465J269540J126113M97645L36429k17478j558096j822305
8448a100884m448J462231L36494j321463k70414K374208K759166M05022j482780
8439C157132j390627j020652j277727p78029Q05802J479118K29366j318704j702320
8430a816641j492682j310891m49001J275068K361840J629438q5805j085036n45296
8421a519006J095247K297048J345362j345798k679825p33490J904472J541332
8413A905342q54342j106534J282626K209526k23698k501736j357151J198763J341666
8404A894462q78745k350214j597741P8487J130091J237250Q24728N51241Q05152
$$ plain form
8395 1694711 2704531 2978671 2018585 769767 374809 631410 705906 571397 585885 501180
8385 501180 155259 256747 1144898 1767767 1390361 1231395 2623037 4558904 5100697
8376 5100697 4393173 4090223 4376918 3851385 2131679 462817 -247810 -226787 177053
8367 177053 675579 548788 -431424 -1096096 -526035 144157 -589743 -1971599 -2135109 -1047956
8357 -1047956 -75486 481071 979580 657685 -871756 -1461420 762516 3310794 2144667
8348 2144667 -1755475 -3200279 -590894 1911634 1344881 258666 1660391 3901131
8340 3901131 3856357 1960237 644528 214895 -392832 -671805 405972 1784092 1689615
8331 1689615 566576 134076 536708 730915 622282 542564 -292139 -2429183 -4295714
$$ packed form
8395A694711J009820K74140r60086j248818l94958K56601P4496j34509J4488q4705
8385E01180l45921J01488Q88151O22869l77406j58966J391642J935867N41793
8376E100697p07524l02950K86695n25533j719706j668862p10627K1023M03840
8367A77053M98526j26791r80212o64672N70061O70192p33900j381856j63510J087153
8357a047956R72470N56557M98509l21895j529441n89664K223936K548278j166127
8348B144667l900142j444804K609385K502528n66753j086215J401725K240740
8340C901131m4774j896120j315709m29633o07727k78973J077777J378120r4477
8331A689615j123039m32500M02632J94207j08633p9718q34703k137044j866531
$$ plain form
8322 -4295714 -4127545 -2955612 -3143221 -4527856 -4615110 -2472397 -36172 707610 -73002
8313 -73002 -996634 -1147816 -595237 -265862 -1151907 -2812038 -3345742 -1920267 -342319
8304 -342319 -649471 -2095688 -2318220 -752255 1039101 1910211 2093669 2010701 1987036 2803191
8294 2803191 4624581 5662500 3886921 3382 -3129805 -3961059 -3270034 -1949173 -17081
8285 -17081 1913860 2463358 1574454 989060 1759848 2709669 2178092 165060 -1910566
8276 -1910566 -2688725 -1809938 -304208 -21625 -1552247 -2966327 -2136117 7042 620271
8267 620271 -632029 -889885 1364992 3679375 3229875 1030116 321385 1959808 3699929
8258 3699929 3658247 2441887 1601361 1536988 1651121 1717178 2199458 3205023 3718586 2587924
$$ packed form
8322d295714J68169J171933j87609j384635q7254K142713K436225P43782p80612
8313g3002r23632j51182N52579L29375q86045j660131n33704J425475J577948
8304c42319l07152j446217k22532J565965J791356Q71110J83458q2968k3665Q16155
8294B803191J821390J037919j775579l883539l133187q31254O91025J320861J932092
8285a7081J930941N49498q88904n85394P70788R49821n31577k013032k075626
8276a910566p78159Q78787J505730K82583j530622j414080Q30210K143159O13229
8267F20271j252300k57856K254877K314383m49500k199759p08731J638423J740121
8258C699929m1682j216360q40526o4373J14133O6057M82280J005565N13563j130662
$$ plain form
8248 2587924 356619 -833714 78768 1406751 1021119 -457246 -679251 613929 1235476
8239 1235476 339424 -95349 1220775 2306850 853226 -1966701 -2980563 -1411747 442032
8230 442032 615743 -345113 -694371 469802 2667803 4561580 4948410 3900868 2731548
8221 2731548 2363935 2349338 2051537 1811284 1999704 1977629 1244119 598204 686941 451821
8211 451821 -1124094 -2654359 -2041959 2683 733474 -366941 -842036 617386 1993976
8202 1993976 1214383 -602657 -954747 478633 1888204 2052823 1425261 994225 1247866
8193 1247866 1932651 2113837 1007473 -765452 -1630028 -1225765 -856370 -1079848 -507576
8184 -507576 1657652 3505431 2841944 591586 -529777 -64808 -29081 -1237272 -2049897
$$ packed form
8248B587924k231305j190333R12482J327983l85632j478365k22005J293180O21547
8239A235476q96052m34773J316124J086075j453624k819927j013862J568816J853779
8230D42032J73711r60856l49258J164173K198001J893777L86830j047542j169320
8221B731548l67613j4597k97801k40253J88420k2075p33510o45915Q8737k35120
8211D51821j575915j530265O12400K044642P30791j100415m75095J459422J376590
8202A993976p79593j817040l52090J433380J409571J64619o27562m31036K53641
8193A247866O84785J81186j106364j772925q64576M04263L69395k23478N72272
8184e07576K165228J847779o63487k250358j121363M64969L5727j208191q12625
$$ plain form
8175 -2049897 -1341435 -357515 -548443 -1455889 -2011629 -2345347 -2871718 -2872096 -1573442 262371
8165 262371 1366471 1880997 2698313 3449879 2921364 1322220 358104 736232 1166254
8156 1166254 427073 -910531 -1563151 -1165128 25080 1909855 3897565 4421936 2605761
8147 2605761 -120855 -1589941 -1761324 -2306987 -3409166 -3142695 -832920 1063388 133353
8138 133353 -2339442 -3007949 -1081934 864106 667334 -907320 -1932106 -1813479 -1134205
8129 -1134205 -380560 122401 -12040 -544472 -473905 566790 1546799 1511021 1035254 1245159
8119 1245159 2054565 2410481 1783282 465134 -1108778 -2395099 -2641318 -1787534 -1007266
8110 -1007266 -1307036 -2020329 -1732302 -240561 1458358 2566335 2701370 1455736 -723992
$$ packed form
8175b049897P08462R83920j90928r07446n55740l33718n26371l78J298654J835813
8165B62371J104100N14526Q17316P51566n28515j599144r64116L78128M30022
8156A166254p39181j337604o52620L98023J190208J884775J987710N24371j816175
8147B605761k726616j469086j71383n45663j102179K66471K309775J896308r30035
8138A33353k472795o68507J926015J946040j96772j574654j024786J18627O79274
8129a134205P53645N02961j34441n32432P0567J040695R80009l5778m75767K09905
8119A245159Q09406L55916o27199j318148j573912j286321k46219Q53784P80268
8110a007266k99770p13293K88027J491741J698919J107977J35035j245634k179728
$$ plain form
8101 -723992 -1843752 -415435 2130396 3050072 2111942 1635891 2683225 3693704 3461295
8092 3461295 2932081 2980824 2785520 1866660 1526071 2423805 2722267 890148 -1270209
8083 -1270209 -989748 1163128 2102347 852475 -393353 28544 1021341 909484 -143591
8074 -143591 -915616 -972988 -777471 -762092 -948114 -983512 -393028 680780 1235553 772651
8064 772651 496946 1829278 3934992 4392302 2531666 409376 -132546 242502 -34611
8055 -34611 -946889 -1315283 -830682 -327470 -427008 -956220 -1504284 -1768389 -1524049 -869928
8045 -869928 -335249 -297072 -512060 -510978 -73057 892317 2273313 3231468 2629135 638141
8035 638141 -931652 -809857 17612 -101639 -929483 -934700 -48467 104333 -1004295 -1707053
$$ packed form
8101g23992j119760J428317K545831R19676r38130m76051J047334J010479k32409
8092C461295n29214M8743j95304r18860l40589Q97734K98462j832119k160357
8083a270209K80461K152876R39219j249872j245828M21897R92797j11857j053075
8074a43591p72025n7372J95517J5379j86022l5398N90484J073808N54773m62902
8064G72651k75705J332332K105714M57310j860636k122290n41922L75048k77113
8055c4611r12278l68394M84601N03212r9538n29212n48064k64105K44340O54121
8045h69928N34679L8177k14988J082M37921R65374J380996R58155o02333j990994
8035F38141j569793J21795Q27469j19251q27844n217Q86233J52800j108628p02758
$$ plain form
8025 -1707053 -772924 471055 99392 -1450432 -2134580 -1440306 -834706 -1045736 -830717
8016 -830717 801643 2698555 3072286 1866394 366459 -769677 -1681893 -2027967 -1195878
8007 -1195878 192045 580580 -295625 -902215 -269984 483223 33338 -874514 -490158
7998 -490158 1169354 2147366 1169767 -797528 -1919513 -1525083 -405754 265345 -39309
7989 -39309 -818250 -967823 59101 1498097 2145721 1937335 1931732 2580902 2909312 1993992
7979 1993992 540569 43820 657060 924305 -175726 -1808609 -2487437 -2109099 -1933358
7970 -1933358 -2677391 -3546613 -3471065 -2561605 -1707282 -1178697 -420732 863167 2130310
7961 2130310 2646556 2260379 1430195 810354 786171 1112792 1194140 1061563 1602355 3116163
$$ packed form
8025a707053R34129J243979l71663j549824o84148O94274O05600k11030K15019
8016h30717J632360J896912L73731j205892j499935j136136r12216l46074Q32089
8007a195878J387923L88535q76205o06590O32231P53207m49885r07852L84356
7998d90158J659512R78012r77599j967295j121985L94430J119329O71099l04654
7989c9309p78941j49573J026924J438996O47624k08386n603O49170L28410r15320
7979A993992j453423m96749O13240K67245j100031j632883o78828L78338J75741
7970a933358p44033q69222P5548R09460Q54323N28585P57965J283899J267143
7961B130310N16246l86177q30184o19841k4183L26621Q1348j32577N40792J513808
$$ plain form
7951 3116163 4216900 3413023 1495842 738398 1539739 1678739 -322120 -2819349 -3351928
7942 -3351928 -1941640 -450199 330433 1007931 1544778 986881 -579073 -1586140 -1137319
7933 -1137319 -291521 -439131 -1315658 -1477905 -309804 1139123 1300083 -163160 -1809216
7924 -1809216 -1825065 -100886 1524428 1424993 33468 -1054587 -1188904 -943015 -744557
7915 -744557 -404940 90705 432051 670586 1034277 1001911 -275703 -2331645 -3333695
7906 -3333695 -2330798 -619430 -7562 -362428 39018 1859537 3475765 2927773 509020
7897 509020 -1480384 -1614216 -989173 -1287265 -2093567 -1696306 -290255 -272943 -2560211
7888 -2560211 -4567261 -3510942 -373088 1429000 526896 -1358925 -2486120 -2942024 -3187265
$$ packed form
7951C116163J100737q03877j917181p57444Q01341J39000k000859k497229n32579
7942c351928J410288J491441P80632O77498N36847n57897j565954j007067M48821
7933a137319Q45798j47610q76527j62247J168101J448927J60960j463243j646056
7924a809216j5849J724179J625314r9435j391525j088055j34317K45889J98458
7915g44557L39617M95645L41346K38535L63691l2366j277614k055942j002050
7906c333695J002897J711368O11868l54866M01446J820519J616228n47992k418753
7897E09020j989404j33832O25043k98092q06302L97261J406051J7312k287268
7888b560211k007050J056319L137854J802088r02104j885821j127195m55904k45241
$$ plain form
7879 -3187265 -2841720 -1784077 -990633 -1295954 -2190385 -2536859 -1855389 -537445 592757
7870 592757 789814 131669 -319623 81176 281892 -1140888 -3547610 -4647104 -3515886
7861 -3515886 -1680550 -800401 -793438 -858140 -829227 -599261 482673 2459316 3933681 3553972
7851 3553972 1799518 387973 291844 992027 1324372 603353 -710006 -1223141 -33110
7842 -33110 1962694 2927656 2340069 1424169 1190026 1253822 1029142 841666 1113077 1419036
7832 1419036 1127887 227134 -1031188 -2483101 -3579852 -3513067 -2349796 -1107952 -249835
7823 -249835 772821 1941480 2015087 407657 -1456216 -1824419 -814754 105546 90945
7814 90945 -584709 -1304235 -1495022 -867449 36371 251161 -136947 35384 965691 1182624
$$ packed form
7879c187265L45545J057643P93444l05321q94431l46474O81470J317944J130202
7870E92757J97057o58145m51292M00799K00716j422780k406722j099494J131218
7861c515886J835336Q80149O963o4702K8913K29966J081934J976643J474365l79709
7851C553972j754454j411545r6129P00183L32345p21019j313359n13135J190031
7842c3110J995804R64962n87587r15900k34143O3796k24680j87476K71411L05959
7832A419036k91149r00753j258322j451913j096751O6785J163271J241844Q58117
7823b49835J022656J168659P3607j607430j863873l68203J009665R20300j4601
7814I0945o75654p19526j90787O27573R03820K14790l88108J72331R30307K16933
$$ plain form
7804 1182624 -155728 -1667558 -1740736 -831935 -298918 -184400 75401 -143958 -1597021
7795 -1597021 -3031056 -2431647 -207816 1101808 485591 -290308 365547 1595541 1748772
7786 1748772 808955 -65838 -434158 -655394 -524581 805667 3195759 4738357 3562202
7777 3562202 340843 -1989475 -1574271 188385 885221 618813 1398070 3340145 4062836
7768 4062836 2557261 1076415 1619719 2807383 2367120 803269 -22650 -474825 -2225834
7759 -2225834 -4545350 -4750932 -2392628 -52892 493570 303747 766699 1512606 1817744
7750 1817744 2018689 2372150 2173373 1070584 -138564 -824531 -1242151 -1358897 -662861
7741 -662861 185302 -528839 -2780849 -4145043 -3286135 -2100147 -2596341 -3609868 -3009336
$$ packed form
7804A182624j338352j511830p3178R08801N33017J14518K59801k19359j453063
7795a597021j434035N99409K223831J309624o16217p75899O55855J229994J53231
7786A748772r39817q74793l68320k21236J30813J330248K390092J542598j176155
7777C562202l221359k330318M15204J762656O96836k66408P79257J942075P22691
7768D062836j505575j480846N43304J187664m40263j563851q25919m52175j751009
7759b225834k319516k05582K358304K339736N46462j89823M62952P45907L05138
7750A817744K00945L53461j98777j102789j209148o85967m17620j16746O96036
7741f62861Q48163p14141k252010j364194Q58908J185988m96194j013527O00532
$$ [...]
##END NTUPLES=NMR SPECTRUM
##END=
