##TITLE=31Pdec_SR112
 CDCl3, 124 sc
 17.3.2022
##JCAMPDX= 6.0         $$ Bruker NMR JCAMP-DX V2.0
##DATA TYPE= NMR SPECTRUM
##DATA CLASS= NTUPLES
##ORIGIN= UXNMR, Bruker Analytische Messtechnik GmbH
##OWNER= root
$$ XWIN-NMR		Version 3.5
$$ Fri Mar 18 12:09:54 2022 Russian Standard Time (UT+4h)  she@DPX200
##.OBSERVE FREQUENCY= 81.013821
##.OBSERVE NUCLEUS= ^31P
##.ACQUISITION MODE= SIMULTANEOUS
##.ACQUISITION SCHEME= undefined
##.AVERAGES= 124
##.DIGITISER RES= 16
##SPECTROMETER/DATA SYSTEM= spect
##.PULSE SEQUENCE= zgpg30
##.SOLVENT NAME= CDCl3
##.SHIFT REFERENCE= (INTERNAL, CDCl3, 0, 248.564)
##AUDIT TRAIL= $$ (NUMBER, WHEN, WHO, WHERE, WHAT)
$$ ##TITLE= Audit trail, XWIN-NMR		Version 3.5
$$ ##JCAMPDX= 5.01
$$ ##ORIGIN= Bruker BioSpin GmbH
$$ ##OWNER= she
$$ F:/spectra/data/she/nmr/P31/1/pdata/1/auditp.txt
$$ ##AUDIT TRAIL=  $$ (NUMBER, WHEN, WHO, WHERE, WHAT)
(   1,<2022-03-18 12:08:34.56 +0400>,<she>,<DPX200>,
      <continue with go, POWCHK disabled, PULCHK disabled
       configuration hash MD5:
       00 E9 B6 7A A2 85 ED C7 34 08 36 98 17 FE 4E 26
       data hash MD5: 32K
       64 D8 D2 35 7F 59 7C D3 E6 F5 F2 57 A2 01 E9 80>)
(   2,<2022-03-18 12:08:37.73 +0400>,<she>,<DPX200>,
      <Start of raw data processing
       efp BC_mod = 2 LB = 1 FT_mod = 6 PKNL = 1 PHC0 = -9098.926 PHC1 = -87.52437 SI = 64K 
       data hash MD5: 64K
       83 F3 C8 4B 77 AB 40 93 7F 95 21 16 94 C2 B4 F2>)
(   3,<2022-03-18 12:09:28.07 +0400>,<she>,<DPX200>,
      <pk PHC0 = -58.70878 PHC1 = 141.8 
       data hash MD5: 64K
       EB 63 18 C9 CD 94 FB BA 54 96 47 5D 64 E3 A7 7F>)
$$ ##END=
$$ 
$$ hash MD5
$$ 3D F1 7F EC 05 50 4A 02 EF 68 B1 95 D9 C7 1D 8F
##$RELAX= 
##$RELAX= 
##$RELAX= 
##$RELAX= 
##$RELAX= 
##$RELAX= 
##$RELAX= 
##$RELAX= 
$$ Bruker specific parameters
$$ --------------------------
##$DU= <F:/spectra>
##$EXPNO= 1
##$NAME= <P31>
##$PROCNO= 1
##$TYPE= <nmr>
##$USER= <she>
##$AMP= (0..31)
100 100 100 100 100 100 100 100 100 100 100 100 100 100 100 100 100 100 
100 100 100 100 100 100 100 100 100 100 100 100 100 100 
##$AQSEQ= 0
##$AQ_mod= 1
##$AUNM= <au_zg>
##$AUTOPOS= <>
##$BF1= 81.014009
##$BF2= 200.13
##$BF3= 200.13
##$BF4= 200.13
##$BF5= 200.13
##$BF6= 200.13
##$BF7= 200.13
##$BF8= 200.13
##$BYTORDA= 1
##$CFDGTYP= 0
##$CFRGTYP= 5
##$CHEMSTR= <none>
##$CNST= (0..31)
1 1 145 1 1 1 1 1 1 1 1 1 1 1 1 1 1 1 1 1 1 1 1 1 1 1 1 1 1 1 1 1 
##$CPDPRG= <waltz16>
##$CPDPRG1= <>
##$CPDPRG2= <waltz16>
##$CPDPRG3= <>
##$CPDPRG4= <mlev>
##$CPDPRG5= <mlev>
##$CPDPRG6= <mlev>
##$CPDPRG7= <mlev>
##$CPDPRG8= <mlev>
##$CPDPRGB= <>
##$CPDPRGT= <>
##$D= (0..31)
0 1 0 0 0 0 0 0 0 0 0 0.03 2e-05 3e-06 0 0 0 0 0 0 0 0 0 0 0 0 0 0 0 0 
0 0 
##$DATE= 1647590718
##$DBL= (0..7)
120 120 120 11 120 120 24 19 
##$DBP= (0..7)
150 150 150 150 150 150 150 150 
##$DBP07= 0
##$DBPNAM0= <>
##$DBPNAM1= <>
##$DBPNAM2= <>
##$DBPNAM3= <>
##$DBPNAM4= <>
##$DBPNAM5= <>
##$DBPNAM6= <>
##$DBPNAM7= <>
##$DBPOAL= (0..7)
0.5 0.5 0.5 0.5 0.5 0.5 0.5 0.5 
##$DBPOFFS= (0..7)
$$ [...]
##$SUBNAM2= <"">
##$SUBNAM3= <"">
##$SUBNAM4= <"">
##$SUBNAM5= <"">
##$SUBNAM6= <"">
##$SUBNAM7= <"">
##$SUBNAM8= <"">
##$SUBNAM9= <"">
##$SW= 501.771253377433
##$SWIBOX= (0..15)
0 1 3 0 0 0 0 0 0 0 0 0 0 0 0 0 
##$SW_h= 40650.406504065
##$TD= 32768
##$TD0= 1
##$TE= 0
##$TE2= 300
##$TE3= 300
##$TEG= 300
##$TL= (0..7)
0 120 53 12 22 120 120 120 
##$TP= (0..7)
150 150 150 150 150 150 150 150 
##$TP07= 0
##$TPNAME0= <>
##$TPNAME1= <>
##$TPNAME2= <>
##$TPNAME3= <>
##$TPNAME4= <>
##$TPNAME5= <>
##$TPNAME6= <>
##$TPNAME7= <>
##$TPOAL= (0..7)
0.5 0.5 0.5 0.5 0.5 0.5 0.5 0.5 
##$TPOFFS= (0..7)
0 0 0 0 0 0 0 0 
##$TUNHIN= 0
##$TUNHOUT= 0
##$TUNXOUT= 0
##$USERA1= <user>
##$USERA2= <user>
##$USERA3= <user>
##$USERA4= <user>
##$USERA5= <user>
##$V9= 5
##$VALIST= <valist>
##$VCLIST= <CCCCCCCCCCCCCCC>
##$VD= 0
##$VDLIST= <DDDDDDDDDDDDDDD>
##$VPLIST= <PPPPPPPPPPPPPPP>
##$VTLIST= <TTTTTTTTTTTTTTT>
##$WBST= 1024
##$WBSW= 4
##$XGAIN= (0..3)
0 0 0 0 
##$XL= 0
##$YL= 0
##$YMAX_a= 17594
##$YMIN_a= -20498
##$ZGOPTNS= <>
##$ZL1= 120
##$ZL2= 120
##$ZL3= 120
##$ZL4= 120
##$ABSF1= 0
##$ABSF2= 0
##$ABSG= 0
##$ABSL= 0
##$ALPHA= 0
##$AQORDER= 0
##$ASSFAC= 0
##$ASSFACI= 0
##$ASSFACX= 0
##$ASSWID= 0
##$AUNMP= <proc_1d>
##$AZFE= 0.1
##$AZFW= 0.5
##$BCFW= 0
##$BC_mod= 2
##$BYTORDP= 0
##$COROFFS= 0
##$CY= -3
##$DATMOD= 1
##$DC= 0
##$DFILT= <>
##$DTYPP= 0
##$F1P= 0
##$F2P= 0
##$FCOR= 1
##$FTSIZE= 65536
##$FT_mod= 6
##$GAMMA= 0
##$GB= 0
##$INTBC= 1
##$INTSCL= 5.30512e-09
##$ISEN= 30
##$LB= 1
##$LEV0= 0
##$LPBIN= 0
##$MAXI= 10000
##$MC2= 0
##$MEAN= 0
##$ME_mod= 0
##$MI= 50
##$NCOEF= 0
##$NC_proc= -4
##$NLEV= 6
##$NOISF1= 182.463
##$NOISF2= 159.3651
##$NSP= 0
##$NTH_PI= 0
##$NZP= 0
##$OFFSET= 248.5645
##$PC= 4
##$PHC0= -9157.635
##$PHC1= 54.27563
##$PH_mod= 1
##$PKNL= yes
##$PPARMOD= 0
##$PSCAL= 0
##$PSIGN= 0
##$REVERSE= no
##$SF= 81.014009
##$SI= 65536
##$SIGF1= 159.3651
##$SIGF2= -187.1042
##$SINO= 113.3802
##$SIOLD= 16384
##$SREGLST= <1H.CDCl3>
##$SSB= 0
##$STSI= 65536
##$STSR= 0
##$SW_p= 40650.406504065
##$SYMM= 0
##$S_DEV= 0
##$TDeff= 32768
##$TDoff= 0
##$TI= <>
##$TILT= no
##$TM1= 0
##$TM2= 0
##$TOPLEV= 0
##$USERP1= <user>
##$USERP2= <user>
##$USERP3= <user>
##$USERP4= <user>
##$USERP5= <user>
##$WDW= 1
##$XDIM= 65536
##$YMAX_p= 269072281
##$YMIN_p= -32462951
$$ End of Bruker specific parameters
$$ ---------------------------------
##NTUPLES= NMR SPECTRUM
##VAR_NAME=  FREQUENCY,     SPECTRUM/REAL,   SPECTRUM/IMAG
##SYMBOL=    X,             R,               I
##VAR_TYPE=  INDEPENDENT,   DEPENDENT,       DEPENDENT
##VAR_FORM=  AFFN,          ASDF,            ASDF
##VAR_DIM=   65536,         65536,           65536
##UNITS=     HZ,            ARBITRARY UNITS, ARBITRARY UNITS
##FACTOR=    0.620285442955139, 1,           1
##FIRST=     20137.2065510759, 0,            0
##LAST=      -20513.1999529892, 0,           0
##MIN=       -20513.1999529892, -32462951,   0
##MAX=       20137.2065510759, 269072281,    0
$$ Real data points
##PAGE= N=1
##DATA TABLE= (X++(R..R)), XYDATA
$$ [...]
$$ plain form
40269 225455 -256523 -132297 137721 188492 282035 479108 276177 -403646 -751112 -244717
40259 -244717 464526 508091 -8107 -434009 -609189 -755700 -806581 -544462 -97840 252051
40249 252051 461039 521034 300435 -25709 67070 601605 807697 238990 -440864 -451316
40239 -451316 -66101 -15587 -270807 -313015 -183530 -316324 -607812 -574873 -260089 -128679
40229 -128679 -216504 -189287 -84851 -177007 -271526 -7251 289093 -5274 -629559 -651142
40219 -651142 81117 685625 623340 366586 414016 534287 371468 30981 -317390 -721307
40209 -721307 -1004409 -781568 -269010 -282461 -954651 -1256637 -440784 748914 1095925 587404
40199 587404 180593 240250 170709 -421351 -1041879 -1029794 -421809 177903 286197 -100359
$$ packed form
40269B25455m81978J24226K70018N0771R3543J97073k02931o79823l47466N06395
40259b44717P09243M3565n16198m25902j75180j46511n0881K62119M46622L49891
40249B52051K08988N9995k20599l26144R2779N34535K06092n68707o79854j0452
40239d51316L85215N0514k55220m2208J29485j32794k91488L2939L14784J31410
40229a28679q7825K7217J04436r2156r4519K64275K96344k94367o24285k1583
40219f51142P32259O04508o2285k56754M7430J20271j62819l40487l48371m03917
40209g21307k83102K22841N12558j3451o72190l01986Q15853J189698L47011n08521
40199E87404m06811N9657o9541n92060o20528J2085O07985N99712J08294l86556
$$ plain form
40189 -100359 -639589 -967994 -957725 -747372 -567636 -576000 -783341 -989048 -862944 -343367
40179 -343367 94435 -90930 -755299 -1184313 -1029091 -672741 -514331 -397799 -50246 381908
40169 381908 639154 803470 1002452 1009041 658593 383732 712320 1357749 1452083 733189
40159 733189 -84811 -308104 -132625 -208580 -688424 -1107717 -1075280 -707743 -334032 -52037
40149 -52037 231096 451538 356221 -108021 -584199 -672584 -392090 -72728 104982 195245
40139 195245 183507 -50311 -418243 -605664 -484486 -272071 -168111 -109525 -14011 13492
40129 13492 -111995 -268758 -294651 -151086 129576 397209 282739 -444403 -1336421 -1582010
40119 -1582010 -1060850 -567533 -688255 -995634 -799130 -194067 217867 277898 305080 436198
$$ packed form
40189a00359n39230l28405J0269K10353J79736q364k07341k05707J26104N19577
40179c43367M37802j85365o64369m29014J55222L56350J58410J16532L47553M32154
40169C81908K57246J64316J98982O589l50448k74861L28588O45429R4334p18894
40159G33189q18000k23293J75479p5955m79844m19293L2437L67537L73711K81995
40149e2037K83133K20442r5317m64242m76178q8385K80494L19362J77710R0263
40139A95245j1738k33818l67932j87421J21178K12415J03960N8586R5514K7503
40129A3492j25487j56763k5893J43565K80662K67633j14470p27142q92018k45589
40119a582010N21160M93317j20722l07379J96504O05063M11934O0031K7182J31118
$$ plain form
40109 436198 560313 740564 1083469 1296012 978247 308914 -129847 -179918 -198124 -350943
40099 -350943 -434791 -454856 -752258 -1361223 -1756779 -1471563 -583722 520921 1447832 1770379
40089 1770379 1228650 170518 -629791 -804918 -687799 -666173 -718451 -764498 -950221 -1280321
40079 -1280321 -1423153 -1219904 -988943 -991721 -1002286 -786098 -609769 -813015 -1189899 -1287909
40069 -1287909 -1089551 -912798 -817474 -605893 -301378 -140588 -123801 -6915 257027 461895
40059 461895 551742 697844 904931 886098 456136 -204655 -786164 -1132665 -1195239 -909259
40049 -909259 -287601 435582 869911 719864 24434 -824715 -1380661 -1501394 -1340541 -1021497
40039 -1021497 -560442 -149702 -154553 -596092 -950431 -804275 -473849 -565389 -1074065 -1373300
$$ packed form
40109D36198J24115J80251L42905K12543l17765o69333m38761n0071j8206j52819
40099c50943q3848k0065k97402o08965l95556K85216Q87841J104643R26911L22547
40089A770379n41729j058132q00309j75127J17119K1626n2278m6047j85723l30100
40079a280321j42832K03249K30961k778j0565K16188J76329k03246l76884r8010
40069a287909J98358J76753R5324K11581L04515J60790J6787J16886K63942K04868
40059D61895Q9847J46102K07087j8833m29962o60791n81509l46501o2574K85980
40049i09259O21658P23183M34329j50047o95430q49149n55946j20733J60853L19044
40039a021497M61055M10740m851m41539l54339J46156L30426r1540n08676k99235
$$ plain form
40029 -1373300 -1067444 -433840 36867 195225 248281 481292 1001338 1543775 1599721 1025537
40019 1025537 421875 488446 1036603 1151135 428791 -473037 -760579 -494021 -292218 -428485
40009 -428485 -668614 -769960 -672494 -296076 408364 1176839 1553110 1397036 1054921 948248
39999 948248 1152092 1419968 1478690 1269653 1030417 1137805 1702904 2303327 2329191 1700704
39989 1700704 1055073 1037159 1529713 1828178 1529662 948897 581587 487201 449978 469901
39979 469901 664169 805067 492065 -131008 -364454 85460 617037 590179 229015 131538
39969 131538 247059 70755 -310598 -210958 492373 972888 605709 -87782 -135017 619186
39959 619186 1410876 1522816 978255 379355 293420 699116 951902 513194 -272704 -544774
$$ packed form
40029a373300L05856O33604M70707J58358N3056K33011N20046N42437N5946n74184
40019A025537o03662O6571N48157J14532p22344r01828k87542K66558K01803j36267
40009d28485k40129j01346R7466L76418P04440P68475L76271j56074l42115j06673
39999I48248K03844K67876N8722k09037k39236J07388N65099O00423K5864o28487
39989A700704o45631j7914M92554K98465k98516n80765l67310r4386l7223J9923
39979D69901J94268J40898l13002o23073k33446M49914N31577k6858l61164r7477
39969A31538J15521j76304l81353R9640P03331M80515l67179o93491m7235P54203
39959F19186P91690J11940n44561n98900q5935M05696K52786m38708p85898k72070
$$ plain form
39949 -544774 -159927 27823 -561679 -1304393 -1282647 -638331 -286355 -560941 -909782 -824306
39939 -824306 -352255 299005 969165 1285638 879476 42982 -415991 -179610 260274 471321
39929 471321 658337 1058445 1347233 1130891 625246 358611 470148 709546 869541 820541
39919 820541 388793 -333600 -761130 -407629 374333 718989 316778 -249704 -292581 197489
39909 197489 632975 444463 -414021 -1340985 -1488557 -571195 711790 1338914 1066946
39900 1066946 573161 487396 681760 690488 464931 373780 623103 991573 1118400 866331
39890 866331 418752 127450 193078 393918 250415 -395181 -1092402 -1274178 -921398 -483531
39880 -483531 -232139 -54174 95463 -26511 -491044 -863266 -688566 -115768 319759 380726
$$ packed form
39949e44774L84847J87750n89502p42714K1746O44316L51976k74586l48841Q5476
39939h24306M72051O51260O70160L16473m06162q36494m58973K36381M39884K11047
39929D71321J87016M00108K88788k16342n05645k66635J11537K39398J59995m9000
39919H20541m31748p22393m27530L53501P81962L44656m02211n66482m2877M90070
39909A97489M35486j88512q58484r26964j47572R17362J282985O27124k71968
39900A066946m93785q5765J94364Q728k25557r1151K49323L68470J26827k52069
39890H66331m47579k91302O5628K00840j43503o45596o97221j81776L52780M37867
39880d83531K51392J77965J49637j21974m64533l72222J74700N72798M35527O0967
$$ plain form
39870 380726 201277 -179590 -809684 -1330595 -1123919 -218438 492553 360429 -126428 -72950
39860 -72950 544455 952561 731489 204721 -277139 -731745 -1083003 -972277 -370782 109443
39850 109443 -78986 -700528 -1052370 -778542 -121008 433156 551317 297913 113771 333721
39840 333721 684078 613367 155200 -64950 180768 391334 309289 460046 1114811 1438506
39830 1438506 607211 -691786 -983543 -76946 708210 495436 -60885 -27970 443665
39821 443665 667309 604113 688381 876862 698537 157298 -119439 226855 734708 716494
39811 716494 136537 -378627 -334024 78103 317878 209910 45493 30783 39903 42006 286217
39800 286217 713119 668695 -212947 -1221527 -1402345 -911141 -672002 -838221 -641919 136248
$$ packed form
39870C80726j79449l80867o30094n20911K06676R05481P10991j32124m86857N3478
39860g2950O17405M08106k21072n26768m81860m54606l51258J10726O01495M80225
39850A09443j88429o21542l51842K73828O57534N54164J18161k53404j84142K19950
39840C33721L50357p0711m58167k20150K45718K10566q2045J50757O54765L23695
39830A438506q31295j298997k91757R06597P85156k12774n56321L2915M71635
39821D43665K23644o3196Q4268J88481j78325n41239k76737L46294N07853j8214
39811G16494n79957n15164M4603M12127K39775j07968j64417j4710R120K103K44211
39800B86217M26902m4424q81642j008580j80818M91204K39139j66219J96302P78167
$$ plain form
39790 136248 670458 420250 -99379 -390155 -762004 -1348755 -1379163 -435595 429967 63769
39780 63769 -924699 -1005382 -61019 538262 94858 -599937 -790856 -761992 -875845 -782500
39770 -782500 -233687 225431 72172 -369107 -532006 -435515 -329786 -92068 399483 767786
39760 767786 636993 262810 130122 290580 574512 995265 1382100 1117236 -27638
39751 -27638 -1185809 -1338722 -694421 -285636 -396182 -344536 171547 522770 230242 -244062
39741 -244062 -254399 84049 188810 -164662 -715519 -1093929 -1012838 -405987 344291 648137
39731 648137 440094 294057 520066 617400 96770 -578620 -542246 197865 748339 601340
39721 601340 245267 326291 772880 1076247 1026679 795148 549885 363382 349253 551798
$$ packed form
39790A36248N34210k50208n19629k90776l71849n86751l0408R43568Q65562l66198
39780F3769r88468q0683R44363N99281m43404o94795j90919K8864j13853R3345
39770g82500N48813M59118j53259m41279j62899R6491J05729K37718M91551L68303
39760G67786j30793l74183j32688J60458K83932M20753L86835k64864j144874
39751b7638j158171j52913O44301M08785j10546N1646N16083L51223k92528m74304
39741b44062j0337L38448J04761l53472n50857l78410Q1091O06851P50278L03846
39731F48137k08043j46037K26009R7334n20630o75390L6374P40111N50474j46999
39721F01340l56073Q1024M46589L03367m9568k31531k45263j86503j4129K02545
$$ plain form
39711 551798 760058 714372 488052 436691 755034 1265532 1663585 1816773 1793112 1713927
39701 1713927 1610816 1375826 904306 348922 81829 224648 366547 50430 -535385
39692 -535385 -725176 -261368 393604 755191 891870 1039142 1052424 678847 99262 -302473
39682 -302473 -563377 -1006936 -1520900 -1526461 -811669 63082 425760 228970 -92878 -219076
39672 -219076 -160133 -92358 -186917 -453745 -632404 -429781 43550 333965 249724 86659
39662 86659 101199 154141 139119 327981 845635 1157988 679475 -276728 -761982 -380987
39652 -380987 337287 785889 920595 916904 766879 528019 507996 790319 896648 365569
39642 365569 -518157 -1005665 -820899 -413419 -257712 -286352 -184224 38085 53242 -276330
$$ packed form
39711E51798K08260m5686k26320n1361L18343N10498L98053J53188k3661p9185
39701A713927j03111k34990m71520n55384k67093J42819J41899l16117n85815
39692e35385j89791M63808O54972L61587J36679J47272J3282l73577n79585m01735
39682c02473k60904m43559n13964n561P14792Q74751L62678j96790l21848j26198
39672b19076N8943O7775r4559k66828j78659K02623M73331K90415q4241j63065
39662H6659J4540N2942j5022J88862N17654L12353m78513r56203m85254L80995
39652c80987P18274M48602J34706l691j50025k38860k0023K82323J06329n31079
39642C65569q83726m87508J84766M07480J55707k8640J02128K22309J5157l29572
$$ plain form
39632 -276330 -662751 -750315 -550265 -356463 -297991 -201913 50183 278072 307351 323656
39622 323656 609895 996285 929148 179758 -789881 -1310195 -1151658 -573522 40959 398626
39612 398626 331714 -97179 -551012 -681892 -471100 -208113 -147532 -279198 -413954 -401073
39602 -401073 -260012 -155022 -234836 -478586 -736368 -913224 -1013163 -992761 -738488 -284471
39592 -284471 105622 240988 283800 528336 945624 1163608 938827 470997 153615 121027
39582 121027 156756 17971 -244353 -336945 -98282 225062 186704 -310002 -785628 -687829
39572 -687829 -90894 343143 187310 -207411 -212295 213744 505635 306056 -97715 -273577
39562 -273577 -193069 -14898 319766 841075 1156988 884607 388462 438266 1036156 1260163
$$ packed form
39632b76330l86421q7564K00050J93802N8472R6078K52096K27889K9279J6305
39622C23656K86239L86390o7137p49390r69639n20314J58537N78136O14481L57667
39612C98626o6912m28893m53833j30880K10792K62987O0581j31666j34756J2881
39602d01073J41061J04990p9814k43750k57782j76856r9939K0402K54273M54017
39592b84471L90093J35366M2812K44536M17288K17984k24781m67830l17382l2588
39582A21027L5729j38785k62324r2592K38663L23344l8358m96706m75626R7799
39572f87829N96935M34037j55833l94721m884M26039K91891j99579m03771j75862
39562b73577Q0508J78171L34664N21309L15913k72381m96145M9804N97890K24007
$$ plain form
39552 1260163 561467 -421215 -787733 -531708 -170429 254599 981755 1645104 1537391
39543 1537391 743834 141610 139741 245715 117531 190982 796182 1379774 1245840 578946
39533 578946 96473 30132 50896 -53132 -202487 -360354 -527226 -532600 -281530 -52165
39523 -52165 -92875 -98307 390913 1177566 1547970 1216776 646566 397669 576305 925165
39513 925165 1062425 682368 -47240 -379353 193832 1091688 1253592 601474 151539 512561
39503 512561 1079713 1093902 732535 560046 529911 283645 14092 216569 789570 1145786
39493 1145786 1128752 1096117 1114671 834923 287394 35701 224339 169827 -598636 -1435453
39483 -1435453 -1359710 -420066 405034 561576 501251 800834 1283807 1339951 776107 5436
$$ packed form
39552A260163o98696r82682l66518K56025L61279M25028P27156O63349j07713
39543A537391p93557o02224j869J05974j28184P3451O05200N83592j33934o66894
39533E78946m82473o6341K0764j04028j49355j57867j66872n374K51070K29365
39523e2165m0710n432M89220P86653L70404l31194n70210k48897J78636L48860
39513I25165J37260l80057p29608l32113N73185Q97856J61904o52118m49935L61022
39503E12561N67152J4189l61367j72489l0135k46266k69553K02477N73001L56216
39493A145786j7034l2635J8554k79748n47529k51693J88638n4512p68463q36817
39483a435453P5743R39644Q25100J56542o0325K99583M82973N6144n63844p70671
$$ plain form
39473 5436 -458413 -441235 -130368 136506 122317 -153615 -496059 -726821 -684782 -151010
39463 -151010 872838 1785210 1774815 863159 101170 277400 831414 684118 -148154 -604874
39453 -604874 -184289 433702 576685 468329 460456 231113 -508838 -1156205 -967363 -272405
39443 -272405 -1121 -223409 -155749 396876 633784 69931 -623220 -569613 141973 740663
39433 740663 784234 440751 100971 92077 484644 868879 638727 -194135 -822234 -634855
39423 -634855 -30956 200842 -1754 -25834 423879 951797 1089905 822773 412245 41969
39413 41969 -261410 -564139 -909454 -1125521 -869351 -94446 672905 851375 507908 204039
39403 204039 229928 402015 577704 852844 1121053 954643 255304 -345487 -167653 611393
$$ packed form
39473E436m63849J7178L10867K66874j4189k75932l42444k30762M2039N33772
39463a51010J023848R12372j0395r11656p61989J76230N54014j47296q32272m56720
39453f04874M20585O17991J42983j08356p873k29343p39951o47367J88842O94958
39443b72405K71284k22288O7660N52625K36908n63853o93151N3607P11586N98690
39433G40663M3571l43483l39780q894L92567L84235k30152q32862o28099J87379
39423f34855O03899K31798k02596k4080M49713N27918J38108k67132m10528l70276
39413D1969l03379l02729l45315k16067K56170P74905P67351J78470l43467l03869
39403B04039K5889J72087J75689K75140K68209j66410o99339o00791J77834P79046
$$ plain form
39393 611393 1145446 966646 453395 179964 171800 70759 -186252 -251806 45139 357866
39383 357866 284134 -72649 -315593 -378569 -530928 -771512 -688347 -108203 516712 676570
39373 676570 461778 324481 446034 724050 1151900 1725002 2103591 1915244 1394532 1180204
39363 1180204 1368142 1302639 554768 -363339 -632620 -154332 444286 621563 367296 -24625
39353 -24625 -256777 -134686 312389 769229 884226 602990 148366 -248036 -455861 -430710
39343 -430710 -311540 -404686 -786128 -1021124 -641321 122425 492591 115318 -520646 -793459
39333 -793459 -660386 -390986 -17944 466457 651978 72380 -1006377 -1730783 -1687345 -1262819
39323 -1262819 -832849 -202824 756442 1466941 1294021 564854 225563 528036 760032
$$ packed form
39393F11393N34053j78800n13251k73431q164j01041k57011o5554K96945L12727
39383C57866p3732l56783k42944o2976j52359k40584Q3165N80144O24915J59858
39373F76570k14792j37297J21553K78016M27850N73102L78589j88347n20712k14328
39363A180204J87938o5503p47871r18107k69281M78288N98618J77277k54267l91921
39353b4625k32152J22091M47075M56840J14997k81236m54624l96402k07825K5151
39343d30710J19170r3146l81442k34996L79803P63746L70166l77273o35964k72813
39333g93459J33073K69400L73042M84401J85521n79598j078757p24406M3438M24526
39323a262819M29970O30025R59266P10499j72920p29167l39291L02473K31996
$$ plain form
39314 760032 432867 59901 344730 1083939 1434635 1046679 392057 20065 -22976 69590
39304 69590 288394 696584 1111633 1208649 939519 646828 668929 922050 989413 614771
39294 614771 -12459 -515937 -746856 -799513 -713495 -409326 42800 327569 210685 -158886
39284 -158886 -403083 -306290 18270 268015 199995 -152386 -450274 -352988 88195 461887
39274 461887 460100 143637 -279447 -663539 -796933 -412928 365120 860561 560749 -121419
39264 -121419 -274641 302200 797333 480148 -319127 -688807 -347627 97300 103455 -74799
39254 -74799 94330 465590 310163 -571195 -1337192 -1094088 -89805 613072 545606 285969
39244 285969 401490 615271 429890 36012 -12151 284473 433751 304683 263010 435023
$$ packed form
39314G60032l27165l72966K84829P39209L50696l87956o54622l71992m3041R2566
39304F9590K18804M08190M15049R7016k69130k92691K2101K53121O7363l74642
39294F14771o27230n03478k30919n2657Q6018L04169M52126K84769j16884l69571
39284a58886k44197R6793L24560K49745o8020l52381k97888R7286M41183L73692
39274D61887j787l16463m23084l84092j33394L84005P78048M95441k99812o82168
39264a21419j53222N76841M95133l17185p99275l69680L41180M44927O155j78254
39254g4799J69129L71260j55427q81358p65997K43104J004283P02877o7466k59637
39244B85969J15521K13781j85381l93878m8163K96624J49278j29068m1673J72013
$$ plain form
39234 435023 464758 182333 -28169 183990 606548 860520 993141 1271096 1576483 1448400
39224 1448400 746494 -41834 -289993 112894 715858 1063523 1155240 1254345 1349275 1083695
39214 1083695 317838 -530705 -959549 -966084 -834138 -567092 -22631 510646 496745 1490
39204 1490 -257892 43204 328697 52642 -388797 -246130 443145 951231 905019 572117
39194 572117 174597 -365575 -872310 -817741 -144827 379075 150811 -328498 -137477 654799
39184 654799 1002108 375564 -471811 -584495 -68018 292786 292004 433626 894246 1142809
39174 1142809 826538 380558 336801 527071 487827 264946 195602 149541 -289112 -937656
39164 -937656 -1040741 -328043 580292 1058415 1192491 1306297 1329620 1108856 916032 1078699
$$ packed form
39234D35023K9735k82425k10502K12159M22558K53972J32621K77955L05387j28083
39224A448400p01906p88328k48159M02887O02964L47665R1717R9105R4930k65580
39214A083695p65857q48543m28844o535J31946K67046N44461N33277j3901m95255
39204A490k59382L01096K85493k76055m41439J42667O89275N08086m6212l32902
39194E72117l97520n40172n06735N4569O72914N23902k28264m79309J91021P92276
39184F54799L47309o26544q47375j12684N16477L60804p82J41622M60620K48563
39174A142809l16271m45980m3757J90270l9244k22881o9344m6061m38653o48544
39164i37656j03085P12698R08335M78123J34076J13806K3323k20764j92824J62667
$$ plain form
39154 1078699 1348126 1187834 571326 -3426 -224366 -205844 -47473 316381 713627 685384
39144 685384 127811 -354309 -77920 887489 1781407 1952442 1389949 545249 -130625 -445392
39134 -445392 -455208 -330643 -222903 -208713 -296230 -401944 -338301 25111 510596 696071
39124 696071 408125 54914 208621 846154 1295603 1071424 484287 157340 164723 68571
39114 68571 -262615 -381818 32813 638525 900879 797924 695414 746033 812154 837477
39104 837477 860171 722397 233218 -337346 -394057 179802 746537 701731 241237 25408
39094 25408 262411 486519 252446 -230936 -323814 262650 1081580 1458492 1280704 1019108
39084 1019108 950754 775768 273640 -93425 199180 757591 641168 -263349 -976462 -767036
$$ packed form
39154A078699K69427j60292o16508n74752k20940J8522J58371L63854L97246k8243
39144F85384n57573m82120K76389R65409Q93918J71035n62493q44700o75874l14767
39134d45392r816J24565J07740J4190q7517j05714O3643L63412M85485J85475
39124F96071k87946l53211J53707O37533M49449k24179n87137l26947P383r6152
39114F8571l31186j19203M14631O05712K62354j02955j02510N0619O6121K5323
39104H37477K2694j37774m89179n70564n6711N73859N66735m4806m60494k15829
39094B5408K37003K24108k34073m83382r2878N86464Q18930L76912j77788k61596
39084A019108o8354j74986n02128l67065K92605N58411j16423r04517p13113K09426
$$ plain form
39074 -767036 -82446 257605 199290 211695 321395 77500 -639660 -1345909 -1534241 -1166399
39064 -1166399 -572694 -137689 -58308 -176206 -99895 315335 729850 774301 574541 539817
39054 539817 770019 1002373 1066955 1067928 1129848 1235556 1311606 1269276 1020604 659542 520211
39043 520211 798704 1211817 1314947 1085724 889778 912170 951252 811436 614859 622852
39033 622852 914909 1306066 1500514 1364855 1122667 1154356 1502340 1767437 1648884 1342456
39023 1342456 1180249 1151934 1091286 1056966 1127818 1068787 674319 241184 166707 233928 -97112
39012 -97112 -758745 -1090409 -821557 -390568 -160029 37145 344093 492180 299977 39628
39002 39628 -56530 -193918 -535982 -753358 -504130 -45664 85894 -203478 -544668 -626677
$$ packed form
39074g67036O84590L40051n8315J2405J09700k43895p17160p06249j88332L67842
39064a166399N93705M35005P9381j17898P6311M15230M14515M4451j99760l4724
39054E39817K30202K32354O4582R73O1920J05708P6050m2330k48672l61062j39331
39043E20211K78493M13113J03130k29223j95946K2392L9082j39816j96577P993
39033F22852K92057L91157J94448j35659k42188L1689L47984K65097j18553l06428
39023A342456j62207k8315o0648l4320P0852n9031l94468m33135p4477O7221l31040
39012i7112o61633l31664K68852M30989K30539J97174L06948J48087j92203k60349
39002C9628r6158j37388l42064k17376K49228M58466J31558k89372l41190q2009
$$ plain form
38992 -626677 -424796 -100055 48967 -242673 -806064 -1063006 -741164 -273008 -147599 -198334
38982 -198334 19128 436322 599692 389436 51511 -343245 -871408 -1268048 -1124517 -621233
38972 -621233 -410421 -624981 -660081 -197516 219387 74279 -244769 -82531 367712 322896
38962 322896 -372953 -1027941 -1154210 -1056350 -1118718 -1099026 -599067 126974 391676 -1382
38952 -1382 -533812 -704780 -564984 -385519 -188573 91694 241938 -18888 -495551 -561489
38942 -561489 109090 1076543 1566037 1240041 430177 -257927 -414708 -32153 515040 696882
38932 696882 251901 -531572 -1068732 -1045359 -611610 -24082 644306 1295574 1578773 1220044
38922 1220044 498220 15289 -63774 -183260 -654883 -1106250 -987871 -375929 137786 229261
$$ packed form
38992f26677K01881L24741J49022k91640n63391k56942L21842M68156J25409n0735
38982a98334K17462M17194J63370k10256l37925l94756n28163l96640J43531N03284
38972f21233K10812k14560l5100M62565M16903j45108l19048J62238M50243m4816
38962C22896o95849o54988j26269R7860o2368J9692M99959P26041K64702l93058
38952a382n32430j70968J39796J79465J96946K80267J50244k60826m76663o5938
38942e61489O70579R67453M89494l25996q09864o88104j56781L82555N47193J81842
38932F96882m44981p83473n37160K3373M33749N87528O68388O51268K83199l58729
38922A220044p21824m82931p9063j19486m71623m51367J18379O11942N13715R1475
$$ plain form
38912 229261 84206 -99639 -363388 -626888 -547305 -20083 512780 589869 345413 261830
38902 261830 459834 599613 453895 239593 281162 558322 739149 606362 338760 285772
38892 285772 460974 442596 -25272 -502452 -325202 415649 881807 633301 227401 322783
38882 322783 686132 641289 165681 -119613 73508 360817 357067 166736 83850 176606
38872 176606 278256 146507 -353135 -990916 -1233846 -869539 -377865 -291025 -425537 -280149
38862 -280149 40907 20399 -260149 -133900 524576 1013221 913350 715558 923300 1207106
38852 1207106 993118 398318 16768 80404 287391 255710 -144435 -668986 -749838 -46014
38842 -46014 907852 1115686 394609 -354876 -427823 -166810 -118266 -105238 198677 440657
$$ packed form
38912B29261j45055j83845k63749k63500P9583N27222N32863P7089k44456q3583
38902B61830J98004J39779j45718k14302M1569K77160J80827j32787k67602n2988
38892B85772J75202j8378m67868m77180J77250P40851M66158k48506m05900R5382
38882C22783L63349m4843m75608k85294J93121K87309l750j90331q2886R2756
38872A76606J01650j31749m99642o37781k42930L64307M91674Q6840j34512J45388
38862b80149L21056k0508k80548J26249O58476M88645r9871j97792K07742K83806
38852A207106k13988n94800l81550O3636K06987l1681m00145n24551q0852P03824
38842d6014R53866K07834p21077p49485p2947K61013M8544J3028L03915K41980
$$ plain form
38832 440657 156468 -330904 -433136 -322093 -553518 -973496 -918795 -327718 222979 456894
38822 456894 532176 394003 -90958 -458157 -91177 668555 880864 524183 535077 1150505
38812 1150505 1438080 922623 470993 837963 1401605 1276098 806496 867349 1303774 1240290
38802 1240290 590274 126732 185426 344406 407509 719298 1313944 1609988 1262614 639423
38792 639423 154547 -229964 -499134 -228119 730884 1656029 1680459 925818 370498 627385
38782 627385 1308706 1666988 1476194 1083869 836103 723040 560618 319726 165031 216070
38772 216070 378056 455238 374554 230053 143699 173007 342499 647361 982318 1171006
38762 1171006 1153305 1074090 1076738 1055266 767128 212172 -272928 -399568 -257243 -103896
$$ packed form
38832D40657k84189m87372j02232J11043k31425m19978N4701N91077N50697K33915
38822D56894P5282j38173m84961l67199L66980P59732K12309l56681J0894O15428
38812A150505K87575n15457m51630L66970N63642j25507m69602O0853M36425o3484
38802A240290o50016m63542N8694J58980O3103L11789N94646K96044l47374o23191
38792F39423m84876l84511k69170K71015R59003R25145K4430p54641n55320K56887
38782F27385O81321L58282j90794l92325k47766j13063j62422k40892j54695N1039
38772B16070J61986P7182q0684j44501q6354K9308J69492L04862L34957J88688
38762A171006j7701p9215K648k1472k88138n54956m85100j26640J42325J53347
$$ plain form
38752 -103896 25755 249668 477988 484521 354050 444162 759227 803485 345302 -102945
38742 -102945 -17223 290007 159590 -307999 -366204 184048 667009 568949 206923 44908
38732 44908 -46473 -407727 -937387 -1285179 -1344291 -1137226 -564740 283598 888409 851207
38722 851207 436180 134621 -3970 -129221 -52122 390683 712688 305573 -510669 -771610
38712 -771610 -236027 331699 392434 323739 560159 817657 695316 443203 513620 773870
38702 773870 807132 727056 1046832 1818866 2456517 2465016 1962749 1416896 1152528 1181038
38692 1181038 1301795 1312696 1212130 1166225 1247398 1362134 1497460 1788837 2204474 2448093
38682 2448093 2393843 2330912 2485562 2566915 2154741 1352104 681728 455346 557408 708137
$$ packed form
38752a03896J29651K23913K28320O533j30471R0112L15065M4258m58183m48247
38742a02945Q5722L07230j30417m67589n8205N50252M82961r8060l62026j62015
38732D4908r1381l61254n29660l47792n9112K07065N72486Q48338O04811l7202
38722H51207m15027l01559j38591j25251P7099M42805L22005m07115q16242k60941
38712g71610N35583N67726O0735o8695K36420K57498j22341k52113P0417K60250
38702G73870L3262q0076L19776P72034O37651Q499n02267n45853k64368K8510
38692A181038J20757J0901j00566m5905Q1173J14736J35326K91377M15637K43619
38682B448093n4250o2931J54650Q1353m12174q02637o70376k26382J02062J50729
$$ plain form
38672 708137 648292 266915 -134402 19430 765892 1267179 858856 122658 133587 825058
38662 825058 1081082 522945 108999 513508 934887 358146 -707332 -820166 325901
38653 325901 1455022 1441750 664065 271187 664211 1202224 1189532 688380 280313 294346
38643 294346 501121 546959 461943 562886 962826 1406535 1564647 1280422 582079 -259152
38633 -259152 -707557 -370940 482314 1138694 1254930 1124673 1080878 1079757 1032254 1077703
38623 1077703 1269092 1395945 1377542 1421126 1549271 1465505 1197829 1308113 2011248 2634758
38613 2634758 2516501 1944830 1585582 1462393 1230274 1004673 1058720 1051006 507876 -154846
38603 -154846 -96630 569661 896514 600605 371159 536940 531778 60369 -214789 283406
$$ packed form
38672G08137n9845l81377m01317J53832P46462N01287m08323p36198J0929O91471
38662H25058K56024n58137m13946M04509M21379n76741j065478j12834J146067
38653C25901J129121j3272p77685l92878L93024N38013j2692n01152m08067J4033
38643B94346K06775M5838q5016J00943L99940M43709J58112k84225o98343q41231
38633b59152m48405L36617Q53254O56380J16236j30257m3795j121m7503M5449
38623A077703J91389J26853j8403M3584J28145q3766k67676J10284P03135O23510
38613B634758j18257n71671l59248j23189k32119k25601N4047p714n43130o62722
38603a54846N8216O66291L26853k95909k29446J65781n162m71409k75158M98195
$$ plain form
38593 283406 1096324 1401800 1052295 478147 87449 128393 591511 942280 579836 -155588
38583 -155588 -196587 662850 1269268 763600 -141087 -304365 191891 477209 386917 486138
38573 486138 929480 1263522 1225293 950755 520559 -12379 -303503 -69639 416212 751713
38563 751713 1024609 1392197 1473422 978881 559303 1032094 1999757 2300759 1721676 1137676
38553 1137676 940108 552818 -225192 -619220 -182246 334388 155093 -276187 -57644
38544 -57644 728665 1198833 988569 603417 529308 642790 604981 407222 339354 591013
38534 591013 1008144 1247964 1168948 976332 894879 864729 757837 678460 722448 656433 277334
38523 277334 -104088 -80117 122006 -12025 -301267 -31513 827137 1393255 1117053 505209
$$ packed form
38593B83406Q12918L05476l49505n74148l90698M0944M63118L50769l62444p35424
38583a55588m0999Q59437O06418n05668r04687j63278M96256K85318r0292R9221
38573D86138M43342L34042l8229k74538m30196n32938k91124K33864M85851L35501
38563G51713K72896L67588Q1225m94541m19578M72791R67663L01002n79083n84000
38553A137676j97568l87290p78010l94028M36974N16634j79295m31280K18543
38544e7644P86309M70168k10264l85152p4109J13482l7809j97759o7868K51659
38534E91013M17131K39820p9016j92616q1453l0150j06892p9377M3988o6015l79099
38523B77334l81422K3971K02123j34031k89242K69754Q58650N66118k76202o11844
$$ plain form
38513 505209 284201 527340 954262 1405880 1623546 1248951 518600 296333 894279 1518736
38503 1518736 1458262 1114939 1130206 1185436 638819 -148198 -221626 449732 918977 694935
38493 694935 291702 268156 565927 951614 1352876 1558486 1266161 639509 213874 96790
38483 96790 -99633 -392586 -258003 379199 756287 360565 -251008 -310729 31117 124733
38473 124733 -50166 39261 477410 756859 633509 431303 370623 207776 -215175 -568856
38463 -568856 -516235 -233821 -113230 -195150 -223016 -73633 171397 436109 634971 581651
38453 581651 234367 -84017 -86454 -62538 -549443 -1422168 -1837061 -1302247 -328084 329264
38443 329264 633178 982384 1309344 1141931 486018 -19733 31419 327321 419571 329634
$$ packed form
38513E05209k21008K43139M26922M51618K17666l74595p30351k22267N97946O24457
38503A518736o0474l43323J5267N5230n46617p87017p3428O71358M69245k24042
38493F94935m03233k3546K97771L85687M01262K05610k92325o26652m25635j17084
38483I6790j96423k92953J34583O37202L77088l95722o11573n9721L41846R3616
38473A24733j74899Q9427M38149K79449j23350k02206o0680j62847m22951l53681
38463e68856N2621K82414J20591q1920k7866J49383K45030K64712J98862n3320
38453E81651l47284l18384k437K3916m86905q72725m14893N34814R74163O57348
38443C29264L03914L49206L26960j67413o55913n05751N1152K95902R2250q9937
$$ plain form
38433 329634 294188 285936 131574 -137704 -354888 -450078 -374098 -9720 555180 859414
38423 859414 511560 -293149 -983657 -1249998 -1192003 -947575 -551820 -171660 -93850 -332678
38413 -332678 -537081 -472175 -350482 -440271 -547324 -259076 337651 616438 272550 -144703
38403 -144703 62250 729097 1036736 683443 259737 280428 443034 268937 -11979 166726
38393 166726 739005 1082816 966656 783546 833962 970843 1022693 993727 742785 63653
38383 63653 -731017 -902150 -250931 515293 686970 353962 9847 -145614 -141179 56178
38373 56178 334546 345159 52647 -8520 514603 1164405 1307768 1056124 978502 1179488
38363 1179488 1300082 1269542 1404494 1781415 2084512 2153405 2241479 2638211 3325842 4003367
$$ packed form
38433C29634l5446q252j54362k69278k17184r5190P5980L64378N64900L04234
38423H59414l47854q04709o90508k66341N7995K44428L95755L80160P7810k38828
38413c32678k04403O4906J21693q9789j07053K88248N96727K78787l43888m17253
38403a44703K06953O66847L07639l53293m23706K0691J62606j74097k80916J78705
38393A66726N72279L43811j16160j83110N0416J36881N1850k8966k50942o79132
38383F3653p94670j71133O51219P66224J71677l33008l44115j55461M435J97357
38373E6178K78368J0613k92512o1167N23123O49802J43363k51644p7622K00986
38363A179488J20594l0540J34952L76921L03097O8893Q8074L96732O87631O77525
$$ plain form
38353 4003367 4233308 3744809 2898369 2584212 3201582 3974216 3844900 2877985 2114645
38344 2114645 2108675 2356410 2293362 2105011 2212200 2555776 2843949 3080781 3368761 3480067
38334 3480067 3139039 2619214 2569922 3150428 3686401 3432907 2532351 1907399 2125230 2657077
38324 2657077 2573330 1799636 1175856 1225458 1480771 1354415 1099426 1307113 1844880 2036189
38314 2036189 1743126 1526388 1701015 1927629 1918149 1943434 2336583 2916938 3206605 2948252
38304 2948252 2236474 1413985 951596 1097522 1497117 1486294 925382 414731 486048 905534
38294 905534 1064971 832536 676433 992030 1554409 1734179 1221478 454895 186600 597712
38284 597712 1098685 1150378 930512 844274 745539 257621 -314730 -151354 889126 1891756
$$ packed form
38353D003367K29941m88499q46440l14157O17370P72634j29316r66915p63340
38344B114645n970K47735o3048j88351J07189L43576K88173K36832K87980J11306
38334C480067l41028n19825m9292N80506N35973k53494r00556o24952K17831N31847
38324B657077q3747p73694o23780M9602K55313j26356k54989K07687N37767J91309
38314B036189k93063k16738J74627K26614r480K5285L93149N80355K89667k58353
38304B948252p11778q22489m62389J45926L99595j0823n60912n10651P1317M19486
38294I05534J59437k32435j56103L15597N62379J79770n12701p66583k68295M11112
38284E97712N00973N1693k19866q6238r8735m87918n72351J63376J040480J002630
$$ plain form
38274 1891756 1971712 1253024 495088 170689 222767 400912 509164 493375 472267 544082
38264 544082 546344 270489 -108028 -193794 29209 216124 312581 633265 1156405 1352467
38254 1352467 1005209 646813 803988 1296564 1675010 1875894 1987827 1823138 1288541
38245 1288541 850944 1043279 1695936 2161477 2133726 1789188 1320389 841239 607692 797775
38235 797775 1127767 1161349 958255 965926 1311555 1673033 1843458 1933517 1963757 1759261
38225 1759261 1397514 1295728 1609327 1922940 1839469 1582723 1652707 2043529 2194658 1746663
38215 1746663 1041020 705258 901172 1207185 1227675 1066504 1037465 1098249 890582 317866
38205 317866 -263703 -546207 -657855 -849263 -1048222 -1009734 -754912 -559980 -554785 -577452
$$ packed form
38274A891756P9956p18688p57936l24399N2078J78145J08252j5789k1108P1815
38264E44082K262k75855l78517q5766K23003J86915R6457L20684N23140J96062
38254A352467l47258l58396J57175M92576L78446K00884J11933j64689n34597
38245A288541m37597J92335O52657M65541k7751l44538m68799m79150k33547J90083
38235G97775L29992L3582k03094P671L45629L61478J70425R0059L0240k04496
38225A759261l61747j01786L13599L13613q3471k56746O9984L90822J51129m47995
38215A746663p05643l35762J95914L06013K0490j61171k9039O0784k07667n72716
38205C17866n81569k82504j11648j91408j98959L8488K54822J94932N195k2667
$$ plain form
38195 -577452 -438995 -163489 61300 93615 17014 124745 608446 1235645 1528955 1337671
38185 1337671 987000 734691 401755 -172705 -600770 -338839 466904 1004804 790336
38176 790336 274380 224367 712848 1032620 625616 -155339 -419744 179162 1001031 1203023
38166 1203023 746508 322488 405722 801289 1140830 1349854 1434152 1240535 757197 328938
38156 328938 217150 205166 5863 -200824 -98880 91298 -155607 -786553 -1110482 -799832
38146 -799832 -428815 -645300 -1174778 -1174448 -474601 99436 -144311 -754581 -731297 47737
38136 47737 607936 228928 -586547 -929824 -780713 -788507 -1033551 -894577 -216536 265908
38126 265908 21517 -490643 -613694 -456076 -467373 -560202 -371069 -65734 -120424 -436776
$$ packed form
38195e77452J38457K75506K24789L2315p6601J07731M83701O27199K93310j91284
38185A337671l50671k52309l32936n74460m28065K61931Q05743N37900k14468
38176G90336n15956n0013M88481L19772m07004p80955k64405N98906Q21869K01992
38166A203023m56515m24020Q3234L95567L39541K09024Q4298j93617m83338m28259
38156C28938j11788j1984j99303k06687J01944J90178k46905o30946l23929L10650
38146g99832L71017k16485n29478L30O99847N74037k43747o10270K3284P79034
38136D7737N60199l79008q15475l43277J49111p794k45044J38974O78041M82444
38126B65908k44391n12160j23051J57618j1297r2829J89133L05335n4690l16352
$$ plain form
38116 -436776 -401658 145474 632449 561481 86287 -364068 -596873 -603804 -362952 56866
38106 56866 396264 412466 119269 -245940 -441367 -415702 -322873 -280382 -144261 251962
38096 251962 641147 513831 -80104 -400540 -10093 580810 715539 551898 588072 658819
38086 658819 247168 -447554 -713503 -575897 -846497 -1710764 -2230684 -1726829 -844476 -592287
38076 -592287 -919394 -998686 -560308 -165168 -251148 -580202 -724873 -603050 -358143 -71356
38066 -71356 178593 190324 -163709 -657397 -828497 -459981 151306 526546 555319 539265
38056 539265 693077 871138 905811 914022 1010438 985780 650739 322404 515164 1190040
38046 1190040 1732288 1704850 1269248 844033 698526 889649 1213760 1183518 451566 -664432
$$ packed form
38116d36776L5118N47132M86975p0968m75194m50355k32805o931K40852M19818
38106E6866L39398J6202k93197l65209j95427K5665R2829M2491J36121L96223
38096B51962L89185j27316n93935l20436L90447N90903J34729j63641L6174P0747
38086F58819m11651o94722k65949J37606k70600q64267n19920N03855Q82353K52189
38076e92287l27107p9292M38378L95140q5980l29054j44671J21823K44907K86787
38066g1356K49949J1731l54033m93688j71100L68516O11287L75240K8773j6054
38056E39265J53812J78061L4673Q211R6416k4658l35041l28335J92760O74876
38046A190040N42248k7438m35602m25215j45507J91123L24111l0242p31952j115998
$$ plain form
38036 -664432 -1446314 -1614466 -1505755 -1389935 -1128949 -657838 -248637 -14717 336218 884827
38026 884827 1120999 692669 162031 382568 1285405 1925936 1769814 1340665 1361824 1730019
38016 1730019 1764454 1241442 676740 527141 565339 352109 11432 22157 336579 349968
38006 349968 -72660 -200168 476921 1327310 1431331 954206 827909 1256685 1472867 1028660
37996 1028660 415841 163458 166692 267470 680380 1322489 1452333 644617 -438278 -940876
37986 -940876 -994522 -1237742 -1566150 -1301749 -483974 -37943 -444328 -976991 -650853 523104
37976 523104 1613393 1864700 1412847 974286 1004531 1220527 999665 246284 -344991 -71577
37966 -71577 888868 1635072 1526472 774538 82868 -67066 258534 638794 712476 459234
$$ packed form
38036f64432p81882j68152J08711J15820K60986M71111M09201K33920L50935N48609
38026H84827K36172m28330n30638K20537R02837O40531j56122m29149K1159L68195
38016A730019L4435n23012n64702j49599L8198k13230l40677J0725L14422J3389
38006C49968m22628j27508O77089Q50389J04021m77125j26297M28776K16182m44207
37996A028660o12819k52383L234J00778M12910O42109J29844q07716j082895n02598
37986i40876n3646k43220l28408K64401Q17775M46031m06385n32663L26138J173957
37976E23104J090289K51307m51853m38561L0245K15996k20862p53381n91275K73414
37966g1577R60445P46204j08600p51934o91670j49934L25600L80260P3682k53242
$$ plain form
37956 459234 147172 69215 349852 858817 1160026 748793 -304267 -1082763 -721470 409727
37946 409727 1015508 521994 -239465 -308677 133278 313639 87605 -120094 -170308 -203830
37936 -203830 -52590 499233 991698 697478 -193219 -609175 -2615 999450 1569778
37927 1569778 1598850 1323370 749465 -20673 -412500 26412 901351 1366976 1110140 517687
37917 517687 9329 -341227 -551964 -528475 -239201 147080 404909 419140 217268 -24939
37907 -24939 -47795 240843 591979 689077 593908 661881 931341 917787 308103 -371191 -270237
37896 -270237 589923 1196287 896277 344953 528569 1209065 1199537 195077 -591930 -35606
37886 -35606 1384772 2279729 2059652 1262831 522204 -11107 -306345 -245025 96502 440449
$$ packed form
37956D59234l12062p7957K80637N08965L01209m11233j053060p78496L61293J131197
37946D09727O05781m93514p61459o9212M41955J80361k26034k07699n0214l3522
37936b03830J51240N51823M92465k94220q90697m15956O06560J002065N70328
37927A569778K9072k75480n73905p70138l91827M38912Q74939M65625k56836n92453
37917E17687n08358l50556k10737K3489K89274L86281K57829J4231k01872k42207
37907b4939k2856K88638L51136R7098r5169O7973K69460j3554o09684o79294J00954
37896b70237Q60160O06364l00010n51324J83616O80496r528j004460p87007N56324
37886c5606J420378Q94957k20077p96821p40627n33311k95238O1320L41527L43947
$$ plain form
37876 440449 659003 755764 567347 -30596 -670801 -803840 -472576 -210696 -157691 51724
37866 51724 425953 447070 61653 20473 693064 1282502 974558 283743 307830 984878
37856 984878 1172762 457707 -192151 69869 710260 681267 -63060 -664206 -664902 -454632
37846 -454632 -431891 -401991 -43629 498319 831506 867263 823922 816499 751611 592524 459596
37835 459596 432797 455392 470640 472754 392104 144363 -125500 -71136 425957 1025846 1312168
37824 1312168 1265454 1141946 1000815 661119 153882 -93375 252715 881039 1057952 500311
37814 500311 -171619 -125687 579837 981929 498597 -203176 -139933 477924 469779 -533513
37804 -533513 -1430385 -1208638 -373961 -72924 -366316 -366863 141604 313174 -354804 -1157775
$$ packed form
37876D40449K18554R6761j88417n97943o40205j33039L31264K61880N3005K09415
37866E1724L74229K1117l85417m1180O72591N89438l07944o90815K4087O77048
37856I84878J87884p15055o49858K62020O40391k8993p44327o01146o96K10270
37846d54632K2741K9900L58362N41948L33187L5757m3341p423o4888j59087j32928
37835D59596k6799K2595J5248K114q0650k47741k69863N4364M97093N99889K86322
37824A312168m6714j23508j41131l39696n07237k47257L46090O28324J76913n57641
37814E00311o71930M5932P05524M02092m83332p01773O3243O17857q145j003292
37804e33513q96872K21747Q34677L01037k93392n47N08467J71570o67978q02971
$$ plain form
37794 -1157775 -1187227 -545707 -7499 115603 193579 550051 1024798 1287886 1267373 1158402
37784 1158402 1126754 1073248 735369 90213 -435241 -378796 137589 472914 239792 -234912
37774 -234912 -374281 -81690 200856 88137 -282962 -449049 -230983 -17447 -280546 -868874
37764 -868874 -1110607 -726702 -239110 -180693 -314439 -129357 233281 228440 -93138 -100283
37754 -100283 388821 855927 1018802 1266633 1846215 2292792 2124592 1574266 1143907 849843
37744 849843 403343 -165150 -527195 -504384 -146029 450295 1124979 1669675 2049620 2361112
37734 2361112 2471889 2128879 1562920 1411477 1755066 1853742 1262572 570434 464882 686714
37724 686714 647931 544787 954142 1686446 2014802 1878744 1904739 2247777 2332751 1881515
$$ packed form
37794a157775k9452O41520N38208J23102P7976L56472M74747K63088k0513j08971
37784A158402l1648n3506l37879o45156n25454N6445N16385L35325k33122m74704
37774b34912j39369K92591K82546j12719l71099j66087K18066K13536k63099n88328
37764h68874k41733L83905M87592N8417j33746J85082L62638m841l21578p145
37754a00283M89104M67106J62875K47831N79582M46577j68200n50326m30359k94064
37744H49843m46500n68493l62045K2811L58355N96324O74684N44696L79945L11492
37734B361112J10777l43010n65959j51443L43589R8676n91170o92138j05552K21832
37724F86714l8783j03144M09355P32304L28356j36058K5995L43038Q4974m51236
$$ plain form
37714 1881515 1382788 1318234 1598489 1980499 2438295 2925437 3334491 3858193 4834086 6090034
37704 6090034 7034313 7562129 8278490 9639680 11473693 13532383 15878189 18528055 21424230
37695 21424230 25005852 30031159 36556249 44101072 53403029 66847805 85902721 108631728
37687 108631728 130876048 149546172 163709378 173029433 177018483 176243358 172540007 166696910
37679 166696910 156733363 139933042 116658989 91261697 68977345 52418608 41048780
37672 41048780 33117979 27354719 23141394 20030395 17593522 15516784 13573442 11654422
37664 11654422 9994497 9081435 8959375 8808155 7737927 5985225 4725754 4528580 4617494
37655 4617494 4057979 3087929 2599628 2688909 2592206 2014771 1634493 1995956 2616799 2690808
$$ packed form
37714A881515m98727o4554K80255L82010M57796M87142M09054N23702R75893J255948
37704F090034R44279N27816P16361J361190J834013K058690K345806K649866K896175
37695B1424230L581622N025307O525090P544823R301957J3444776J9054916K2729007
37687A08631728K2244320J8670124J4163206R320055L989050p75125l703351n843097
37679A66696910r963547j6800321k3274053k5397292k2284352j6558737j1369828
37672D1048780p930801n763260m213325l110999k436873k076738j943342j919020
37664A1654422j659925r13062j22060j51220j070228j752702j259471j97174Q8914
37655D617494n59515r70050m88301Q9281r6703n77435l80278L61463O20843P4009
$$ plain form
37645 2690808 2209491 1831633 1913424 2214237 2435202 2526975 2469996 2232016 2040011 2260812
37635 2260812 2822440 3121418 2767697 2128811 1823776 1920206 2023034 1993129 2078895 2316036
37625 2316036 2307780 1835779 1310040 1268395 1644403 1878039 1650429 1191303 881777 833343
37615 833343 912769 987007 1062736 1261763 1657333 2093493 2270691 2098407 1810047 1595367
37605 1595367 1326396 871206 459284 401813 611104 777678 887853 1117598 1314047 1134195
37595 1134195 711160 585546 838393 893448 430781 -90503 -177628 -3780 122377 460513
37585 460513 1334848 2263921 2375232 1639291 1016011 1253996 2048213 2545353 2306243 1615733
37575 1615733 1105987 1168791 1559684 1619600 1094776 575513 761556 1447424 1759154 1375329
$$ packed form
37645B690808m81317l77858Q1791L00813K20965R1773n6979k37980j92005K20801
37635B260812N61628K98978l53721o38886l05035R6430J02828k9905Q5766K37141
37625B316036q256m72001n25739m1645L76008K33636k27610m59126l09526m8434
37615H33343P9426P4238P5729J99027L95570M36160J77198j72284k88360k14680
37605A595367k68971m55190m11922n7471K09291J66574J10175K29745J96449j79852
37595A134195m23035j25614K52847N5055m62667n21284q7125J73848J26157L38136
37585D60513Q74335R29073J11311p35941o23280K37985P94217M97140k39110o90510
37575A615733n09746O2804L90893N9916n24824n19263J86043O85868L11730l83825
$$ plain form
37565 1375329 916160 967767 1305621 1425886 1374947 1565064 2017398 2271541 1999819 1370135
37555 1370135 798494 591574 839075 1437031 2144451 2725589 3090492 3286121 3407633
37546 3407633 3573055 3906871 4425292 4916136 4996690 4382175 3197514 2034272 1544405
37537 1544405 1837396 2352853 2439436 1953424 1181835 405083 -194352 -399668 -157849 169500
37527 169500 194237 121349 499814 1313505 1873258 1788591 1487601 1471192 1592069 1509354
37517 1509354 1373718 1480171 1590380 1266111 694681 509209 819405 1048951 811023
37508 811023 378977 145542 131095 223533 426209 611729 465450 -4054 -265684 58366
37498 58366 614796 812602 654763 622586 861665 978843 700526 328763 376589 986020
$$ packed form
37565A375329m59169N1607L37854J20265n0939J90117M52334K54143k71722o29684
37555A370135n71641k06920K47501N97956P07420N81138L64903J95629J21512
37546C407633J65422L33816N18421M90844Q0554o14515j184661j163242m89867
37537A544405K92991N15457Q6583m86012p71589p76752n99435k05316K41819L27349
37527A69500K4737p2888L78465Q13691N59753q4667l00990j6409J20877q2715
37517A509354j35636J06453J10209l24269n71430j85472L10196K29546k37928
37508H11023m32046k33435j4447R2438K02676J85520j46279m69504k61630L24050
37498E8366N56430J97806j57839l2177K39079J17178k78317l71763M7826O09431
$$ plain form
37488 986020 1835640 2462242 2602488 2373412 2163697 2194646 2192534 1727797 899497 351034
37478 351034 447101 767591 723210 412604 437926 992009 1627462 1981617 2234186 2623507
37468 2623507 2938705 2872921 2606664 2601091 2931763 3241728 3314278 3274707 3181183 2848474
37458 2848474 2268678 1858806 1997199 2507424 2869739 2829114 2566627 2364730 2341510 2478081
37448 2478081 2686785 2829915 2831897 2795963 2877334 3024877 2983758 2596911 1992122 1419716
37438 1419716 1011183 774546 722658 851287 1012079 991131 798877 722482 916782 1071368
37428 1071368 778548 211348 55509 619921 1388796 1746808 1807269 2080240 2567153 2756249
37418 2756249 2445811 1995384 1717976 1593260 1701974 2327523 3324629 3906961 3474736
$$ packed form
37488I86020Q49620O26602J40246k29076k09715L0949k112m64737q28300n48463
37478C51034R6067L20490m4381l10606K5322N54083O35453L54155K52569L89321
37468B623507L15198o5784k66257n573L30672L09965P2550l9571r3524l32709
37458B848474n79796m09872J38393N10225L62315m0625k62487k01897k3220J36571
37448B478081K08704J43130J982l5934Q1371J47543m1119l86847o04789n72406
37438A419716m08533k36637n1888J28629J60792k0948j92254p6395J94300J54586
37428A071368k92820n67200j55839N64412P68875L58012O0461K72971M86913J89096
37418B756249l10438m50427k77408j24716J08714O25549R97106N82332m32225
$$ plain form
37409 3474736 2325310 1244095 743191 966462 1875179 3090983 3917748 3978844 3583874
37400 3583874 3157788 2717292 2287516 2300309 2980748 3779253 4070919 4009855 3995829 3789334
37390 3789334 3077526 2484236 2851682 3733491 3873227 3158439 2741163 3041644 3103930 2425420
37380 2425420 1956086 2441154 3094662 3029602 2884132 3695585 5014682 5602550 5433997
37371 5433997 5522171 6110127 6562408 6921441 8015987 9867193 11449481 12406114 13667546
37362 13667546 15860075 18365573 20648079 23369618 27335935 32304365 37788487 44252509
37354 44252509 52579180 63217871 77094242 96617639 123935344 157803298 193216174
37347 193216174 224458826 247981088 262711575 269072281 268114283 260311469 244370829
$$ packed form
37409C474736j149426j081215n00904K23271R08717J215804Q26765O1096l94970
37400C583874m26086m40496m29776J2793O80439P98505K91666o1064j4026k06495
37390C789334p11808n93290L67446Q81809J39736p14788m17276L00481O2286o78510
37380B425420m69334M85068O53508o5060j45470Q11453J319097N87868j68553
37371E433997Q8174N87956M52281L59033J094546J851206J582288R56633J261432
37362A3667546K192529K505498K282506K721539L966317M968430N484122O464022
37354D4252509Q326671J0638691J3876371J9523397K7317705L3867954L5412876
37347A93216174L1242652K3522262J4730487O360706r57998p802814j5940640
$$ plain form
37340 244370829 218294180 182867836 143636771 108150599 81025038 62136918 49067822
37333 49067822 39920423 33569905 28752639 24349092 20320985 17386797 15675916 14350741
37325 14350741 12674584 10847272 9481737 8680092 8013532 7180729 6302901 5629282 5231200
37316 5231200 5000378 4785968 4528459 4325662 4284041 4258028 3939741 3348490 2973239 3135641
37306 3135641 3416468 3130809 2293059 1640569 1638545 1929392 1966472 1761135 1644967 1598580
37296 1598580 1294290 729052 375824 593115 1170330 1623909 1770559 1822014 1989671 2194982
37286 2194982 2220166 2001987 1644557 1216369 729425 325729 237576 440560 589871 511190
37276 511190 500813 806846 1059306 739947 109574 5921 605133 1073431 786127 250070
$$ packed form
37340B44370829k6076649l5426344l9231065l5486172k7125561j8888120j3069096
37333D9067822r147399o350518m817266m403547m028107k934188j710881j325175
37325A4350741j676157j827312j365535q01645o66560q32803q77828o73619l98082
37316E231200k30822k14410k57509k02797m1621k6013l18287n91251l75251J62402
37306C135641K80827k85659q37750o52490k024K90847L7080k05337j16168m6387
37296A598580l04290n65238l53228K17291N77215M53579J46650N1455J67657K05311
37286B194982K5184k18179l57430m28188m86944m03696q8153K02984J49311p8681
37276E11190j0377L06033K52460l19359o30373j03653N99212M68298k87304n36057
$$ plain form
37266 250070 263868 680877 746858 367599 207627 560648 909266 787753 420811 204491
37256 204491 91452 -116172 -247647 36581 719399 1414441 1753504 1605220 1103579 645283
37246 645283 643867 1073376 1438406 1374614 1067245 898913 948049 1079383 1272824 1551296
37236 1551296 1766215 1746845 1522622 1197731 843967 718521 1195084 2114241 2632897 2270901
37226 2270901 1726647 1941414 2663632 2854986 2386391 2232370 2794289 3157133 2555621
37217 2555621 1612686 1334315 1609902 1629799 1289617 1198783 1552824 1939113 2186252 2541937
37207 2541937 2959408 2993241 2559732 2141219 2066927 2172097 2302412 2550795 2817544 2741248
37197 2741248 2310516 1990985 1998297 2005342 1841416 1867786 2265325 2534012 2218862 1654399
$$ packed form
37266B50070J3798M17009O5981l79259j59972L53021L48618j21513l66942k16320
37256B04491j13039k07624j31475K84228O82818O95042L39063j48284n01641m58296
37246F45283j416M29509L65030o3792l07369j68332M9136J31334J93441K78472
37236A551296K14919j9370k24223l24891l53764j25446M76563R19157N18656l61996
37226B270901n44254K14767P22218J91354m68595j54021N61919L62844o01512
37217B555621r42935k78371K75587J9897l40182r0834L54041L86289K47139L55685
37207B541937M17471L3833m33509m18513p4292J05170J30315K48383K66749p6296
37197B741248m30732l19531P312P045j63926K6370L97539K68687l15150n64463
$$ plain form
37187 1654399 1419445 1450624 1321346 1102850 1266509 1849106 2330258 2349071 2073957 1854252
37177 1854252 1886918 2195263 2589153 2714047 2471200 2274511 2544633 3106924 3474954 3522349
37167 3522349 3400303 3024368 2280080 1598971 1582382 2037788 2164025 1825581 1809480 2493542
37157 2493542 3099642 2862159 2257777 2288942 2975574 3421540 3217388 2934636 3124426 3534627
37147 3534627 3629743 3413312 3356183 3735654 4336880 4709530 4545833 3894521 3141850 2719891
37137 2719891 2728128 2885993 2915539 2876040 3003448 3281707 3355171 2937950 2201918 1639288
37127 1639288 1571126 1894616 2289930 2528439 2546773 2383518 2155637 1996175 1918183 1826548
37117 1826548 1713766 1684210 1711890 1612392 1410356 1448721 1853391 2165586 1918551 1380697
$$ packed form
37187A654399k34954L1179j29278k18496J63659N82597M81152J8813k75114k19705
37177A854252L2666L08345L93890J24894k42847j96689K70122N62291L68030M7395
37167C522349j22046l75935p44288o81109j6589M55406J26237l38444j6101O84062
37157B493542O06100k37483o04382L1165O86632M45966k04152k82752J89790M10201
37147C534627R5116k16431n7129L79471O01226L72650j63697o51312p52671m21959
37137B719891Q237J57865K9546l9499J27408K78259P3464m17221p36032n62630
37127A639288o8162L23490L95314K38509J8334j63255k27881j59462p7992r1635
37117A826548j12782k9556K7680r9498k02036L8365M04670L12195k47035n37854
$$ plain form
37107 1380697 1221522 1536268 1764557 1594385 1350247 1326251 1306816 1037483 680834 446374
37097 446374 184438 -239647 -511792 -281817 208770 377336 83687 -222145 -98405 431784
37087 431784 974972 1092208 622637 -97937 -454058 -195873 273058 460620 431615 584906
37077 584906 960362 1161281 943008 560275 484625 953765 1763783 2366187 2296131 1685572
37067 1685572 1198376 1258221 1543709 1501780 1118614 812986 753768 731697 638347 639325 842456
37056 842456 1128413 1340687 1396925 1268529 1103589 1237765 1753232 2165019 1944087 1252371
37046 1252371 738843 693110 850812 951969 967801 794745 287030 -329635 -590772 -427396
37036 -427396 -182604 38730 451931 937865 985008 532631 235019 539424 1063628 1265795
$$ packed form
37107A380697j59175L14746K28289j70172k44138k3996j9435k69333l56649k34460
37097D46374k61936m24085k72145K29975M90587J68566k93649l05832J23740N30189
37087D31784N43188J17236m69571p20574l56121K58185M68931J87562k9005J53291
37077E84906L75456K00919k18273l82733p5650M69140Q10018O02404p0056o10559
37067A685572m87196N9845K85488m1929l83166l05628n9218k2071r3350R78K03131
37056H42456K85957K12274N6238j28396j64940J34176N15467M11787k20932o91716
37046A252371n13528m5733J57702J01157J5832j73056n07715o16665k61137J63376
37036d27396K44792K21334M13201M85934M7143m52377k97612L04405N24204K02167
$$ plain form
37026 1265795 1194446 1143823 1067620 831936 634201 664454 689216 438133 90478 -45293
37016 -45293 -1915 87812 290215 495073 225679 -622291 -1326315 -1261924 -819253 -673955
37006 -673955 -641490 -184740 349493 145841 -599515 -825222 -287797 111289 -66839 -71812
36996 -71812 644873 1391008 1297563 568155 -85893 -542892 -1019467 -1330816 -1235826 -1060308
36986 -1060308 -1168652 -1201247 -652507 115520 296412 -129673 -441377 -346414 -256140 -381515
36976 -381515 -391869 -147852 -50281 -378679 -830507 -983916 -797723 -468252 -178760 -119332
36966 -119332 -363051 -619372 -504891 -131146 -2728 -281353 -626314 -820255 -996851 -1128745
36956 -1128745 -913281 -415272 -217961 -579116 -974584 -883723 -527882 -366316 -319063 -40279
$$ packed form
37026A265795p1349n0623p6203k35684j97735L0253K4762k51083l47655j35771
37016d5293M3378Q9727K02403K04858k69394q47970p04024O4391M42671J45298
37006f73955L2465M56750N34233k03652p45356k25707N37425L99086j78128m973
36996g1812P16685P46135r3445p29408o54048m56999m76575l11349R4990J75518
36986a060308j08344l2595N48740P68027J80892m26085l11704R4963R0274j25375
36976c81515j0354K44017R7571l28398m51828j53409J86193L29471K89492N9428
36966a19332k43719k56321J14481L73745J28418k78625l44961j93941j76596j31894
36956a128745K15464M98009J97311l61155l95468R0861L55841J61566M7253K78784
$$ plain form
36946 -40279 387995 608239 590281 549934 463716 182946 -126010 -172462 -71465 -192524
36936 -192524 -533769 -697886 -464756 6192 485781 790630 673725 60408 -611100 -719876
36926 -719876 -187108 465853 768410 667875 325272 -18584 -3671 540126 1192345 1301935
36916 1301935 818795 315279 97639 -188779 -858735 -1561370 -1690128 -1132123 -322323
36907 -322323 268334 507150 616028 934391 1539587 2093028 2222775 1966223 1592737 1171148
36897 1171148 703206 474330 696478 946887 678064 227129 449735 1263621 1575065
36888 1575065 994211 549371 1048257 1725506 1447596 458823 -179873 -294269 -493232
36879 -493232 -721967 -279473 725537 1228507 802844 297801 454031 828516 649054
$$ packed form
36946d0279M28274K20244j7958m0347q6218k80770l08956m6452J00997j21059
36936a92524l41245j64117K33130M70948M79589L04849j16905o13317o71508j08776
36926g19876N32768O52961L02557j00535l42603l43856J4913N43797O52219J09590
36916A301935m83140n03516k17640k86418o69956p02635j28758N58005Q09800
36907c22323N90657K38816J08878L18363O05196N53441J29747k56552l73486m21589
36897A171148m67942k28876K22148K50409k68823m50935K22606Q13886L11444
36888A575065n80854m44840M98886O77249k77910r88773o38696j14396j98963
36879d93232k28735M42494J005010N02970m25663n05043J56230L74485j79462
$$ plain form
36870 649054 -29710 -633586 -939216 -1038105 -895930 -528800 -268711 -321639 -340912 77826
36860 77826 726972 1073365 992140 763343 540913 304685 191136 364506 609020 524233
36850 524233 148582 -37400 204974 575101 728318 711651 733059 784771 712251 469869
36840 469869 122882 -254437 -521014 -469921 -95211 256241 236296 -52045 -192310 -37567
36830 -37567 104408 -65207 -445068 -742121 -824538 -663454 -177153 532105 967168 705725
36820 705725 42811 -284521 -53526 227239 146617 -97333 -211991 -236584 -84866 706978
36810 706978 2144081 3190244 2862468 1647014 936185 1150402 1379123 994754 583879
36801 583879 803366 1192441 886115 -24296 -647825 -553986 -142211 169754 441654 764000
$$ packed form
36870F49054o78764o03876l05630r8889J42175L67130K60089n2928j9273M18738
36860G7826O49146L46393q1225k28797k22430k36228j13549J73370K44514q4787
36850E24233l75651j85982K42374L70127J53217j6667K1408N1712p2520k42382
36840D69869l46987l77319k66577N1093L74710L51452j9945k88341j40265J54743
36830c7567J41975j69615l79861k97053q2417J61084M86301P09258M35063k61443
36820G05725o62914l27332K30995K80765q0622k43950j14658k4593J51718P91844
36810G06978J437103J046163l27776j215454p10829K14217K28721l84369m10875
36801E83879K19487L89075l06326r10411o23529R3839M11775L11965K71900L22346
$$ plain form
36791 764000 867874 509216 -29836 -166849 272294 797058 829754 436737 248455 596262
36781 596262 1031991 972924 566846 469283 879669 1314459 1336729 986189 446805 -109709
36771 -109709 -237851 495637 1622146 1903860 889298 -304478 -434950 206889 422839
36762 422839 -41662 -327019 -22273 207964 -168172 -625216 -385401 450261 1136178 1293167
36752 1293167 1166012 1040822 868587 507818 57614 -198286 -132690 34780 -13029 -259888
36742 -259888 -352297 -88368 335253 699029 1056197 1394838 1375065 835037 254139 183672
36732 183672 456531 541690 439582 507454 580139 152265 -573387 -781538 -356834 -121236
36722 -121236 -445274 -644137 -271790 19071 -319686 -621921 -122159 598935 508705 -88396
$$ packed form
36791G64000J03874l58658n39052j37013M39143N24764L2696l93017j88282L47807
36781E96262M35729n9067m06078r7563M10386M34790K2270l50540n39384n56514
36771a09709j28142P33488J126509K81714j014562j193776j30472O41839K15950
36762D22839m64501k85357L04746K30237l76136m57044K39815Q35662O85917J56989
36752A293167j27155j25190j72235l60769m50204k55900O5596J67470m7809k46859
36742b59888r2409K63929M23621L63776L57168L38641j9773n40028n80898p0467
36732A83672K72859Q5159j02108O7872P2685m27874p25652k08151M24704K35598
36722a21236l24038j98863L72347K90861l38757l02235M99762P21094r0230n97101
$$ plain form
36712 -88396 -38969 646185 748141 -96609 -731562 -322635 402376 452501 72414 76993
36702 76993 470327 687563 703237 930394 1261728 1094481 291267 -559998 -882460 -602779
36692 -602779 63821 838826 1406761 1657054 1889103 2393574 2910112 2937485 2502215 2114879
36682 2114879 1981804 1795967 1368566 929120 662155 458684 312970 457693 847196
36673 847196 995331 676049 362309 559846 1057247 1295398 1210041 1210985 1485915 1802832
36663 1802832 1927139 1815923 1468013 993157 753046 961594 1172468 708162 -311364
36654 -311364 -946658 -692304 -195152 -285105 -747464 -694562 64178 739226 699429 237601
36644 237601 -69397 -214490 -509474 -847988 -820353 -456634 -261274 -408030 -429490 30060
$$ packed form
36712h8396M9427O85154J01956q44750o34953M08927P25011N0125l80087M579
36702G6993L93334K17236J5674K27157L31334j67247q03214q51265l22462K79681
36692f02779O66600P75005N67935K50293K32049N04471N16538K7373m35270l87336
36682B114879j33075j85837m27401m39446k66965k03471j45714J44723L89503
36673H47196J48135l19282l13740J97537M97401K38151q5357R44K74930L16917
36663A802832J24307j11216l47910m74856k40111K08548K10874m64306j019526
36654c11364o35294K54354M97152q9953m62359N2902P58740O75048l9797m61828
36644B37601l06998j45093k94984l38514K7635L63719J95360j46756k1460M59550
$$ plain form
36634 30060 580077 585625 25125 -559985 -776612 -603886 -53834 837227 1630970 1651074
36624 1651074 799177 -141680 -311166 325107 1079743 1336854 1018681 435188 -79194
36615 -79194 -414828 -678001 -900503 -854936 -420509 -44060 -341187 -1126299 -1405453 -658639
36605 -658639 387733 725045 329372 -120246 -369193 -651217 -859404 -558950 119729
36596 119729 444759 182515 -5266 374308 842569 715426 162659 -98173 146336 458001
36586 458001 502547 397420 311632 189252 -23774 -216662 -309938 -381897 -487905 -537775
36576 -537775 -461796 -347913 -289723 -212522 -7098 216627 200697 -82485 -302089 -192406
36566 -192406 6480 -193838 -819349 -1298883 -1195759 -778991 -587906 -666860 -631684 -388651
$$ packed form
36634C0060N50017N548n60500n85110k16627J72726N50052Q91061P93743K0104
36624A651074q51897r40857j69486O36273P54636K57111l18173n83493n14382
36615g9194l35634k63173k22502M5567M34427L76449k97127p85112k79154P46814
36605f58639J046372L37312l95673m49618k48947k82024k08187L00454O78679
36596A19729L25030k62244j87781L79574M68261j27143n52767k60832K44509L11665
36586D58001M4546j05127q5788j22380k13026j92888r3276p1959j06008m9870
36576e37775P5979J13883N8190P7201K05424K23725j5930k83182k19604J09683
36566a92406J98886k00318o25511m79534J03124M16768J91085p8954L5176K43033
$$ plain form
36556 -388651 -322544 -675753 -1119696 -1177352 -873870 -716915 -1035233 -1484845 -1359465 -464544
36546 -464544 478702 609941 67518 -133889 488515 1204924 1227110 934739 1191599 1847082
36536 1847082 1896099 1047235 155515 -61854 150004 331916 544356 894375 1025253 643550
36526 643550 79048 -171338 -80462 95199 208427 79045 -540180 -1425549 -1802105 -1307319
36516 -1307319 -605944 -519033 -941941 -1189900 -1048736 -856418 -813565 -839952 -941248 -1155715
36506 -1155715 -1270841 -1074661 -728682 -463687 -150966 358230 764289 736708 511493 473148
36496 473148 435802 35946 -420480 -323484 162235 252909 -211182 -536816 -316583 36428
36486 36428 126973 157435 318431 320319 -1451 -212823 43537 349377 69929 -658255
$$ packed form
36556c88651O6107l53209m43943n7656L03482J56955l18318m49612J25380Q94921
36546d64544R43246J31239n42423k01407O22404P16409K2186k92371K56860O55483
36536A847082M9017q48864q91720k17369K11858J81912K12440L50019J30878l81703
36526F43550n64502k50386R0876J75661J13228j29382o19225q85369l76556M94786
36516a307319P01375Q6911m22908k47959J41164J92318M2853k6387j01296k14467
36506a155715j15126J96180L45979K64995L12721N09196M06059k7581k25215l8345
36496D73148l7346l99856m56426R6996M85719R0674m64091l25634K20233L53011
36486C6428R0545L0462J60996J888l21770k11372K56360L05840k79448p28184
$$ plain form
36476 -658255 -1051001 -695824 -8752 346868 189263 -129442 -241395 -181187 -212601 -312156
36466 -312156 -114482 463326 874592 625772 87599 84056 728630 1238103 990148 243729
36456 243729 -355695 -509921 -286465 162678 603180 751573 590439 440729 520137 633120
36446 633120 476198 77665 -217679 -102006 385020 788784 599055 -87839 -438396 197578
36436 197578 1371181 2035006 1874268 1525415 1444202 1281238 647574 -147240 -551909 -504465
36426 -504465 -281231 17965 407670 702836 656407 268880 -263118 -714824 -814154 -367162
36416 -367162 402092 937772 954577 646789 205890 -393321 -943617 -934263 -319721 156516
36406 156516 -103358 -720710 -968250 -833398 -841225 -1110016 -1255051 -1098170 -857635 -681107
$$ packed form
36476f58255l92746L55177O87072L55620j57605l18705j11953O0208l1414r9555
36466c12156J97674N77808M11266k48820n38173l543O44574N09473k47955p46419
36456B43729n99424j54226K23456M49143M40502J48393j61134j49710P9408J12983
36446F33120j56922l98533k95344J15673M87026M03764j89729o86894l50557O35974
36436A97578J173603O63825j60738l48853q1213j62964o33664p94814m04669M7444
36426e04465K23234K99196L89705K95166m6429l87527n31998m51706r9330M46992
36416c67162P69254N35680J6805l07788m40899n99211n50296R354O14542M76237
36406A56516k59874o17352k47540J34852p827k68791j45035J56881K40535J76528
$$ plain form
36396 -681107 -523336 -440962 -498203 -434732 26877 561071 518478 -99597 -544496 -378354
36386 -378354 -42421 -61659 -237418 -129992 63389 -219954 -879957 -1075622 -362414 601810
36376 601810 847089 275873 -368317 -555333 -493630 -562456 -718908 -739553 -697302 -820033
36366 -820033 -1045787 -1050840 -637526 124606 982074 1503369 1277688 469813 -74546 265481
36356 265481 1065502 1422871 1145780 817840 871436 1273054 1984683 2927601 3515013 3127043
36346 3127043 2190465 1881029 2516211 3170625 3194948 3074840 3260271 3211849 2419057 1461094
36336 1461094 1112605 1149986 1039492 1092198 1768184 2416495 2050689 1057504 754311 1334274
36326 1334274 1616679 966756 140518 -132661 -196262 -542339 -861087 -705773 -359800 -375885
$$ packed form
36396f81107J57771Q2374n7241O3471M61609N34194m2593o18075m44899J66142
36386c78354L35933j9238j75759J07426J93381k83343o60003j95665P13208R64224
36376F01810K45279n71216o44190j87016O1703o8826j56452k0645M2251j22731
36366h20033k25754n053M13314P62132Q57468N21295k25681q07875n44359L40027
36356B65481Q00021L57369k77091l27940N3596M01618P11629R42918N87412l87970
36346C127043r36578l09436O35182O54414K4323j20108J85431m8422p92792r57963
36336A461094l48489L7381j10494N2706O75986O48311l65806r93185l03193N79963
36326A334274K82405o49923q26238k73179o3601l46077l18748J55314L45973j6085
$$ plain form
36316 -375885 -784489 -1262422 -1568597 -1408440 -496459 753145 1249861 566593 -323664
36307 -323664 -365181 62333 -157525 -1016614 -1298194 -395669 763104 973756 239442 -470358
36297 -470358 -471687 125099 866433 1383338 1435177 984307 343634 -33146 -44200 -33998
36287 -33998 -290820 -660310 -832506 -816258 -855493 -994225 -1057682 -1029651 -1073656 -1120149 -830485
36276 -830485 -144444 504246 770413 862722 1110790 1371535 1280526 891607 614745 603361
36266 603361 618458 481423 292408 178696 140257 178925 327701 542681 772482 1074112
36256 1074112 1431521 1567186 1233921 626665 207117 178120 413283 799478 1288891 1670418
36246 1670418 1676997 1343740 952745 639560 352269 129841 54715 -29512 -357433 -793133
$$ packed form
36316c75885m08604m77933l06175J60157R11981J249604M96716o83268q90257
36307c23664m1517M27514k19858q59089k81580R02525J158773K10652p34314p09800
36297d70358j329N96786P41334N16905N1839m50870o40673l76780j1054J0202
36287c3998k56822l69490j72196J6248l9235j38732o3457K8031m4005m6493K89664
36276h30485O86041O48690K66167R2309K48068K60745r1009l88919k76862j1384
36266F03361J5097j37035j89015j13712l8439L8668J48776K14980K29801L01630
36256A074112L57409J35665l33265o07256m19548k8997K35163L86195M89413L81527
36246A670418O579l33257l90995l13185k87291k22428p5126q4227l27921m35700
$$ plain form
36236 -793133 -918407 -592803 -82226 361250 684510 824036 717196 531027 490924 497738
36226 497738 321905 111505 198184 437134 348417 -36569 -135741 224287 503313 377134
36216 377134 280412 599579 951530 823402 432861 321065 443263 322498 -90459 -335240
36206 -335240 -154812 237127 592364 873385 1034753 972827 785521 760340 990488 1223729
36196 1223729 1166219 768309 196929 -284692 -401513 -59181 468436 735088 631681 553405
36186 553405 876365 1351550 1293357 458454 -535922 -943831 -848042 -941360 -1395826 -1554748
36176 -1554748 -988813 -260291 -142358 -545437 -845653 -906290 -1003003 -978700 -394172 481135
36166 481135 759079 224032 -313727 -285664 -184740 -640547 -1368320 -1636601 -1273524 -632584
$$ packed form
36236g93133j25274L25604N10577M43476L23260J39526j06840j86169m0103O814
36226D97738j75833k10400Q6679K38950q8717l84986r9172L60028K79026j26179
36216C77134r6722L19167L51951j28128l90541j11796J22198j20765m12957k44781
36206c35240J80428L91939L55237K81021J61368o1926j87306k5181K30148K33241
36196A223729n7510l97910n71380m81621j16821L42332N27617K66652j03407p8276
36186E53405L22960M75185n8193q34903r94376m07909R5789r3318m54466j58922
36176a554748N65935P28522J17933m03079l00216o0637r6713K4303N84528Q75307
36166D81135K77944n35047n37759K8063J00924m55807p27773k68281L63077O40940
$$ plain form
36156 -632584 22011 532694 618104 210676 -225114 -223891 47578 132966 1959 -56814
36146 -56814 -14303 -42752 -43295 238038 688659 887327 677943 334318 180867 320762 645122
36135 645122 860016 656992 110748 -300006 -338405 -393027 -857028 -1428799 -1520790 -1145937
36125 -1145937 -843991 -828171 -758263 -377494 114513 423824 525295 556145 606204 673250
36115 673250 650284 396048 -14279 -228777 -11234 449852 815540 968329 906901 590781
36105 590781 210793 265811 913223 1521027 1373730 599499 -122441 -532056 -842504 -1014968
36095 -1014968 -739659 -177118 -18916 -592344 -1383620 -1632295 -1070798 -51372 718977
36086 718977 660503 -36247 -393925 209764 1084758 1098860 325242 -96805 243407 452203
$$ packed form
36156f32584O54595N10683Q5410m07428m35790J223K71469Q5388j31007n8773
36146e6814M2511k8449n43K81333M50621J98668k09384l43625j53451J39895L24360
36135F45122K14894k03024n46244m10754l8399n4622m64001n71771r1991L74853
36125a145937L01946J5820O9908L80769M92007L09311J01471L0850N0059O7046
36115F73250k2966k54236m10327k14498K17543M61086L65688J52789o1428l16120
36105E90781l79988N5018O47412O07804j47297p74231p21940m09615l10448j72464
36095a014968K75309N62541J58202n73428p91276k48675N61497J019426P70349
36086G18977n8474o96750l57678O03689Q74994J4102p73618m22047L40212K08796
$$ plain form
36076 452203 -106552 -713033 -427041 460022 906171 536074 -177632 -758632 -999971 -672027
36066 -672027 256453 1176709 1300845 628316 -56677 -200643 -36907 -56041 -346186 -626380
36056 -626380 -651744 -417160 -104156 78495 60993 -78137 -268206 -468101 -504980 -179308
36046 -179308 305564 355108 -248310 -874879 -803084 -270347 -212910 -949724 -1689459 -1568392
36036 -1568392 -738891 -68946 -16415 -212536 -122546 240639 428072 211561 -105954 -90885
36026 -90885 253830 486981 277422 -220930 -605810 -666192 -441225 11898 644979 1209066
36016 1209066 1289415 751400 59812 -79520 524885 1312125 1641894 1574189 1682653 2121701
36006 2121701 2344697 1999287 1632865 1929710 2502874 2233244 899781 -312805 -325070
$$ packed form
36076D52203n58755o06481K85992Q87063M46149l70097p13706n81000k41339L27944
36066f72027R28480R20256J24136o72529o84993j43966J63736j9134k90145k80194
36056f26380k5364K34584L13004J82651j7502j39130j90069j99895l6879L25672
36046a79308M84872M9544o03418o26569P1795N32737N7437p36814p39735J21067
36036a568392Q29501O69945N2531j96121Q9990L63185J87433k16511l17515J5069
36026i0885L44715K33151k09559m98352l84880o0382K24967M53123O33081N64087
36016A209066Q0349n38015o91588j39332O04405P87240L29769o7705J08464M39048
36006B121701K22996l45410l66422K96845N73164k69630j333463j212586j2265
$$ plain form
35997 -325070 460705 880247 626239 389407 597180 831848 611006 73097 -384337 -643143
35987 -643143 -719441 -485012 72882 570746 602205 262240 -27765 -105781 -134630 -151108
35977 -151108 35770 406650 572144 295369 -78013 -29007 412785 696370 511903 197214
35967 197214 233482 597886 877819 876078 775029 714688 555581 217512 -13563 189907
35957 189907 653425 779389 246050 -571258 -1020161 -908321 -652761 -705333 -999749 -1080447
35947 -1080447 -703748 -149605 117977 1019 -136448 76161 548866 788369 432233
35938 432233 -313324 -832695 -722794 -194785 206881 214940 39751 3105 174221 423475
35928 423475 635038 724379 592297 242932 -129195 -324816 -352980 -332371 -278753 -166808
$$ packed form
35997c25070P85775M19542k54008k36832K07773K34668k20842n37909m57434k58806
35987f43143p6298K34429N57894M97864L1459l39965k90005p8016k8849j6478
35977a51108J86878L70880J65494k76775l73382M9006M41792K83585j84467l14689
35967A97214L6268L64404K79933j741j01049o0341j59107l38069k31075K03470
35957A89907M63518J25964n33339q17308m48903J11840K55560n2572k94416q0698
35947a080447L76699N54143K67582j16958j37467K12609M72705K39503l56136
35938D32233p45557n19371J09901N28009M01666Q059j75189l6646J71116K49254
35928D23475K11563Q9341j32082l49365l72127j95621k8164K0609N3618J11945
$$ plain form
35918 -166808 -119411 -302190 -631914 -803871 -669777 -441984 -456035 -811590 -1275913 -1498172
35908 -1498172 -1347768 -1068087 -987010 -1032821 -763996 -46566 570018 496893 -60225 -356268
35898 -356268 -124008 165155 115134 -43150 55123 293658 293512 -21534 -393427 -589724
35888 -589724 -549815 -334953 -141780 -190504 -402535 -392834 -6979 348108 186921 -404244
35878 -404244 -867003 -780226 -146183 713520 1252522 942044 -143329 -1132401 -1230628 -709892
35868 -709892 -501336 -807221 -756097 319400 1821670 2548653 2084843 1083477 356450
35859 356450 137045 191223 231916 108213 -149569 -337852 -278088 -79754 -66927 -362599
35849 -362599 -667728 -574677 -55368 468085 556603 196971 -235516 -424663 -411655 -375939
$$ packed form
35918a66808M7397j82779l29724j71957J34094K27793j4051l55555m64323k22259
35908a498172J50404K79681Q1077m5811K68825P17430O16584p3125n57118k96043
35898c56268K32260K89163n0021j58284R8273K38535j46l15046l71893j96297
35888e89724L9909K14862J93173m8724k12031R701L85855L55087j61187n91165
35878d04244m62759Q6777O34043Q59703N39002l10478j085373r89072r8227N20736
35868g09892K08556l05885N1124J075497J502270P26983m63810j001366p27027
35859C56450k19405N4178M0693j23703k57782j88283N9764J98334J2827k95672
35849c62599l05129R3051N19309N23453Q8518l59632m32487j89147J3008L5716
$$ plain form
35839 -375939 -246935 216076 912422 1249965 762914 -239874 -940381 -934185 -613150 -537088
35829 -537088 -703169 -685400 -341680 -42472 -136874 -445077 -476467 -71563 364980 334011
35819 334011 -152802 -561339 -445369 54486 446569 544137 641222 964396 1230924 1031421
35809 1031421 498552 209394 396379 634332 482512 114019 17385 288883 568270 575502
35799 575502 364379 74621 -205025 -272538 114146 813394 1243993 1011267 389587 -87296
35789 -87296 -345277 -733721 -1344181 -1771105 -1665503 -1208366 -827396 -668629 -603521 -608980
35779 -608980 -813659 -1159890 -1312327 -1048882 -585583 -352060 -501270 -769654 -824198 -655123
35769 -655123 -557108 -718537 -911971 -738699 -211087 121923 -166680 -748433 -875374 -301767
$$ packed form
35839c75939J29004M63011O96346L37543m87051j002788p00507O196L21035P6062
35829e37088j66081J7769L43720K99208r4402l08203l1390M04904M36543l0969
35819C34011m86813m08537J15970M99855L92083R7568R7085L23174K66528j99503
35809A031421n32869k89158J86985K37953j51820l68493r6634K71498K79387P232
35799E75502k11123k89758k79646o7513L86684O99248M30599k32726o21680m76883
35789h7296k57981l88444o10460m26924J05602M57137L80970J58767O5108n459
35779f08980k04679l46231j52437K63445M63299K33523j49210k68384n4544J69075
35769f55123R8015j61429j93434J73272N27612L33010k88603n81753j26941N73607
$$ plain form
35759 -301767 479349 937140 1028665 909542 587067 141623 -122717 -126928 -255929 -720793
35749 -720793 -1046119 -734679 -110508 174902 211580 574385 1118625 1010029 110143 -627674
35739 -627674 -529550 -126110 -201166 -663847 -981050 -1090767 -1185080 -1093674 -613752 -74657
35729 -74657 103020 57228 41847 -245185 -1090645 -1860102 -1601920 -451195 451622 475103
35719 475103 145118 193877 676566 1177504 1297596 836164 23899 -418684 -30884 622519
35709 622519 584881 -149304 -683201 -599831 -415228 -510393 -529915 -178912 198572 257075
35699 257075 169841 115531 -90006 -457981 -592256 -412690 -454484 -993013 -1513753 -1526515
35689 -1526515 -1261162 -1061207 -774574 -319107 -144752 -440445 -551684 9539 578868
$$ packed form
35759c01767P81116M57791R1525j19123l22475m45444k64340m211j29001m64864
35749g20793l25326L11440O24171K85410L6678L62805N44240j08596q99886p37817
35739f27674R8124M03440p5056m62681l17203j09717r4313R1406M79922N39095
35729g4657J77677m5792j5381k87032q45460p69457K58182J150725R02817K3481
35719D75103l29985M8759M82689N00938J20092m61432q12265m42583L87800O53403
35709F22519l7638p34185n33897Q3370J84603r5165j9522L51003L77484N8503
35699B57075q7234n4310k05537l67975j34275J79566m1794n38529n20740j2762
35689a526515K65353J99955K86633M55467J74355k95693j11239N61223N69329
$$ plain form
35680 578868 277271 -545230 -783927 -171572 579985 1015180 1326645 1583331 1518656 1193830
35670 1193830 1084283 1347325 1621813 1644748 1511111 1293620 952259 632380 535993 523484
35660 523484 330564 71853 11639 25269 -101835 -75537 455133 1054423 1002574 537047
35650 537047 586946 1225737 1474155 899817 331892 494118 890033 722133 163055 -38564
35640 -38564 314012 840202 1307298 1743812 2070248 2124368 1892847 1421821 776247 304782
35630 304782 484240 1171506 1508312 1004009 246056 44187 322995 444623 239975 58278
35620 58278 58125 110672 242457 551053 791769 648787 347855 402299 763338 819635 308570
35609 308570 -342963 -726007 -945926 -1161903 -1130335 -630255 -48570 -49821 -686560 -1229238
$$ packed form
35680E78868l01597q22501k38697O12355P51557M35195L11465K56686o4675l24826
35670A193830j09547K63042K74488K2935j33637k17491l41361l19879r6387j2509
35660E23484j92920k58711o0214J3630j27104K6298N30670N99290n1849m65527
35650E37047M9899O38791K48418n74338n67925J62226L95915j67900n59078k01619
35640c8564L52576N26190M67096M36514L26436N4120k31521m71026o45574m71465
35630C04782J79458O87266L36806n04303p57953k01869K78808J21628k04648j81697
35620E8278j53N2547J31785L08596K40716j42982l00932N4444L61039N6297n11065
35609C08570o51533l83044k19919k15977L1568N00080N81685j251o36739n42678
$$ plain form
35599 -1229238 -1042025 -387479 -76528 -387093 -714614 -477769 12030 46972 -342799 -422598
35589 -422598 49290 405842 167569 -141587 157715 765953 851352 334890 -47121 101988
35579 101988 340199 161914 -304884 -597562 -521548 -246555 -43998 -40163 -67289 203083
35569 203083 775883 1130049 833024 212220 -28142 222516 400814 159027 -209655 -346653
35559 -346653 -308319 -273304 -237080 -253273 -574450 -1252790 -1903468 -2123803 -1892759 -1380254
35549 -1380254 -691688 -13096 354760 395174 485029 802567 949932 528960 -192655 -604194
35539 -604194 -530933 -286394 -126006 -65127 -98234 -168603 -19518 489669 984333 938409
35529 938409 420653 31388 70819 228597 187664 74528 123603 288148 419154 520882
$$ packed form
35599a229238J87213O54546L10951l10565l27521K36845M89799L4942l89771p9799
35589d22598M71888L56552k38273l09156K99302O08238Q5399n16462l82011J49109
35579A01988K38211j78285m66798k92678P6014K74993K02557L835k7126K70372
35569B03083N72800L54166k97025o20804k40362K50658J78298k41787l68682j36998
35559c46653L8334L5015L6224j6193l21177o78340o50678k20335K31044N12505
35549a380254O88566O78592L67856M0414Q9855L17538J47365m20972p21615m11539
35539f04194P3261K44539J60388O0879l3107p0369J49085N09187M94664m5924
35529I38409n17756l89265L9431J57778m0933j13136M9075J64545J31006J01728
$$ plain form
35519 520882 604182 548743 312132 34408 -223079 -553912 -854441 -766737 -270403 11587
35509 11587 -476875 -1414365 -1929052 -1622156 -867826 -172548 343447 803941 1276477 1697847
35499 1697847 1874747 1584617 924184 453377 613516 1047790 958490 196389 -498317 -517507
35489 -517507 -155947 -33920 -162292 -60633 405633 805096 754842 380365 72742 35613
35479 35613 191959 393978 575348 682222 543318 -19200 -844604 -1380125 -1246326 -751715
35469 -751715 -481399 -439962 -114426 552057 900441 581790 213002 464622 1003510 1046369
35459 1046369 605239 359225 467311 416818 104656 154916 846664 1513693 1509140 1165401
35449 1165401 1207120 1631437 1799919 1411847 794087 308084 -9575 -195654 -192860 -42834
$$ packed form
35519E20882Q3300n5439k36611k77724k57487l30833l00529Q7704M96334K81990
35509A1587m88462r37490n14687L06896P54330O95278N15995M60494M72536M21370
35499A697847J76900k90130o60433m70807J60139M34274q9300p62101o94706j9190
35489e17507L61560J22027j28372J01659M66266L99463n0254l74477l07623l7129
35479C5613J56346K02019J81370J06874j38904n62518q25404n35521J33799M94611
35469g51715K70316M1437L25536O66483L48384l18651l68788K51620N38888M2859
35459A046369m41130k46014J08086n0493l12162N0260O91748O67029m553l43739
35449A165401M1719M24317J68482l88072o17760m86003l17659j86079K794J50026
$$ plain form
35439 -42834 76545 132015 313330 706268 1070013 1077375 672847 94426 -373184 -570776
35429 -570776 -466372 -130050 273933 579407 761819 899995 921836 545018 -297858 -1073355
35419 -1073355 -1072986 -319737 334527 232883 -334998 -708181 -781670 -878892 -1028503 -1008153
35409 -1008153 -938167 -1135867 -1416734 -1255156 -703449 -411834 -570325 -600748 -185553 197453
35399 197453 212319 336227 933899 1364431 883712 -49350 -337499 148684 516300 325509
35389 325509 109401 243205 234798 -396705 -1215635 -1414047 -869271 -152705 285999 498376
35379 498376 695349 888494 918195 666872 211687 -186235 -287461 -98222 168219 344306
35369 344306 429217 471961 446084 254548 -182909 -772061 -1125909 -804874 123860 933798
$$ packed form
35439d2834J19379N5470J81315L92938L63745P362m04528n78421m67610j97592
35429e70776J04404L36322M03983L05474J82412J38176K1841l76818q42876p75497
35419a073355L69P53249O54264j01644n67881l73183p3489r7222j49611K0350
35409a008153O9986j97700k80867J61578N51707K91615j58491l0423M15195L83006
35399A97453J4866J23908N97672M30532m80719r33062k88149M86183L67616j90791
35389C25509k16108J33804q407o31503q18930j98412N44776P16566M38704K12377
35379D98376J96973J93145K9701k51323m55185l97922j01226J89239K66441J76087
35369C44306Q4911M2744k5877j91536m37457n89152l53848L21035R28734Q09938
$$ plain form
35359 933798 942929 304355 -193597 -89122 288797 349087 -55352 -574602 -832445 -799437
35349 -799437 -725239 -758312 -715871 -368522 103363 255459 63883 58320 522086 974257
35339 974257 855355 364516 89898 101083 32528 -135855 -91139 97446 9030 -345759
35329 -345759 -494839 -368110 -447344 -842247 -978555 -572824 -211431 -449459 -912955 -886398
35319 -886398 -365893 58825 58646 -241122 -657688 -1007795 -970238 -421308 199490 317891
35309 317891 -49314 -380668 -373730 -204282 -122317 -144061 -145381 -13880 259385 484543 413086
35298 413086 122602 6145 164201 141606 -390633 -1019073 -1106677 -679523 -296771 -212733
35288 -212733 -192823 -67873 48059 88980 153524 286569 477190 769567 1032341 852826
$$ packed form
35359I33798R131o38574m97952J04475L77919O0290m04439n19250k57843L3008
35349g99437P4198l3073M2441L47349M71885J52096j91576n563M63766M52171
35339I74257j18902m90839k74618J1185o8555j68383M4716J88585q8416l54789
35329c45759j49080J26729p9234l94903j36308M05731L61393k38028m63496K6557
35319h86398N20505M24718j79k99768m16566l50107L7557N48930O20798J18401
35309C17891l67205l31354O938J69448Q1965k1744j320J31501K73265K25158p1457
35298D13086k90484j16457J58056k2595n32239o28440q7604M27154L82752Q4038
35288b12733J9910J24950J15932M0921O4544J33045J90621K92377K62774j79515
$$ plain form
35278 852826 153796 -350009 485 687622 614395 -175214 -389812 567127 1535199 1154684
35268 1154684 -253944 -1229226 -1129704 -615500 -337650 -112614 373549 794199 616235
35259 616235 -63284 -605599 -659266 -520967 -624370 -975742 -1276948 -1395278 -1408839 -1274766
35249 -1274766 -860056 -385979 -375796 -856049 -1035491 -283606 874379 1367263 1001000
35240 1001000 545106 456740 385743 130827 161998 684031 969006 363311 -593665 -886758
35230 -886758 -505733 -329953 -693563 -982315 -761332 -465059 -619917 -1013475 -1099317 -821171
35220 -821171 -563635 -512380 -500523 -410804 -360084 -443042 -557381 -583751 -565129 -581504 -570497
35209 -570497 -455894 -395126 -622067 -949078 -740878 291748 1455634 1671625 702810
$$ packed form
35278H52826o99030n03805L50494O87137p3227p89609k14598R56939R68072l80515
35268A154684j408628r75282R9522N14204K77850K25036M86163M20650j77964
35259F16235o79519n42315n3667J38299j03403l51372l01206j18330j3561J34073
35249a274766M14710M74077J0183m80253j79442P51885J157985M92884l66263
35240A001000m55894q8366p0997k54916L1171N22033K84975o05695r56976k93093
35230h86758L81025J75780l63610k88752K20983K96273j54858l93558q5842K78146
35220h21171K57536N1255J1857Q9719N0720q2958j14339k6370J8622j6375J1007
35209e70497J14603O0768k26941l27011K08200J032626J163886K15991r68815
$$ plain form
35200 702810 -609873 -1353463 -1330403 -790808 19830 763901 1008586 749667 539581 709443
35190 709443 900930 788363 720038 1026466 1223336 745783 83941 180994 895303 1164137
35180 1164137 718765 474961 930396 1305240 849982 48127 -240907 -96280 -158570 -482487
35170 -482487 -629468 -553433 -561412 -590741 -299961 198362 384895 113022 -242839 -420738
35160 -420738 -510863 -551342 -421247 -203872 -170305 -310842 -323895 -154303 -95381 -234523
35150 -234523 -238971 114279 570616 776497 715629 553371 321612 -1760 -300637 -433879
35140 -433879 -415252 -325851 -169097 67837 337324 622628 977597 1376956 1652106 1671601
35130 1671601 1475600 1158253 740005 237684 -251773 -615573 -778646 -657368 -210463
$$ packed form
35200G02810j312683p43590K3060N39595Q10638P44071K44685k58919k10086J69862
35190G09443J91487j12567o8325L06428J96870m77553o61842R7053P14309K68834
35180A164137m45372k43804M55435L74844m55258q01855k89034J44627o2290l23917
35170d82487j46981P6035p979k9329K90780M98323J86533k71873l55861j77899
35160d20738r0125m0479J30095K17375L3567j40537j3053J69592N8922j39142
35150b34523m448L53250M56337K05881o0868j62258k31759l23372k98877j33242
35140d33879J8627Q9401J56754K36934K69487K85304L54969L99359K75150J9495
35130A671601j96001l17347m18248n02321m89457l63800j63073J21278M46905
$$ plain form
35121 -210463 380301 732796 623149 259204 68173 236040 559747 744827 728504 638331
35111 638331 515762 253143 -139968 -386323 -251821 94794 294276 315900 417170 564582
35101 564582 359275 -246674 -627429 -290110 345095 490134 90175 -199571 -40028 214159
35091 214159 241540 269021 595283 1019700 1085768 692303 213427 85585 365131 628333
35081 628333 362433 -400281 -972348 -782060 -85790 446442 662827 912829 1207142 1096299
35071 1096299 517285 82533 218838 581952 685212 600753 617645 649955 461928 142226
35061 142226 -99610 -318626 -602044 -765560 -726906 -856004 -1417317 -1928611 -1687348 -800009
35051 -800009 -86574 5195 -161962 -85990 266484 596563 598161 104526 -677184 -1055326
$$ packed form
35121b10463N90764L52495j09647l63945j91031J67867L23707J85080j6323r0173
35111F38331j22569k62619l93111k46355J34502L46615J99482K1624J01270J47412
35101E64582k05307o05949l80755L37319O35205J45039l99959k89746J59543K54187
35091B14159K7381K7481L26262M24417O6068l93465m78876j27842K79546K63202
35081F28333k65900p62714n72067J90288O96270N32232K16385K50002K94313j10843
35071A096299n79014m34752J36305L63114J03260q4459J6892L2310j88027l19702
35061A42226k41836k19016k83418j63516L8654j29098n61313n11294K41263Q87339
35051h00009P13435R1769j67157P5972L52474L30079J598m93635p81710l78142
$$ plain form
35041 -1055326 -458161 722767 1336687 740859 -458958 -1133586 -827588 -52106 379531
35032 379531 111672 -511029 -826254 -559389 -129579 -86745 -338794 -279058 316898 944150
35022 944150 1073084 814859 603679 507062 237870 -241877 -498378 -142435 578743 901768
35012 901768 382564 -439662 -490857 545923 1676232 1744194 947182 570257 1152697 1674887
35002 1674887 1023872 -344859 -988839 -465610 150329 -111972 -781300 -750616 82346
34993 82346 717003 485974 -130855 -355040 -192990 -189958 -446550 -507795 -185535 104519
34983 104519 -12261 -377435 -698052 -991087 -1288872 -1304711 -849845 -277271 2412 195687
34973 195687 717787 1290051 1178918 353405 -348812 -401970 -206828 -187858 -22225 617457
$$ packed form
35041a055326N97165J180928O13920n95828j199817o74628L05998P75482M31637
35032C79531k67859o22701l15225K66865M29810M2834k52049N9736N95956O27252
35022I44150J28934k58225k11180r6617k69192m79747k56501L55943P21178L23025
35012I01768n19204q22226n1195J036780J130309O7962p97012l76925N82440N22190
35002A674887o51015j368731o43980N23229O15939k62301o69328L0684Q32962
34993H2346O34657k31029o16829k24185J62050L032k56592o1245L22260K90054
34983A04519j16780l65174l20617k93035k97785j5839M54866N72574K79683J93275
34973A95687N22100N72264j11133q25513p02217n3158J95142J8970J65633O39682
$$ plain form
34963 617457 1138466 699843 -435623 -1085695 -726432 -112435 -70761 -353159 -188842 461318
34953 461318 860969 606097 148270 14960 -3729 -444495 -1174885 -1380843 -672135 270425
34943 270425 501095 -25260 -533253 -530033 -310961 -309342 -449245 -408881 -167210 60614
34933 60614 232485 489418 837531 1083375 1068241 809333 460062 235681 256357 345710
34923 345710 163314 -293396 -533418 -176206 481809 841520 796955 744664 859928 847677
34913 847677 515526 143657 44676 93541 -22261 -335581 -665684 -936389 -1119588 -1044823
34903 -1044823 -635945 -240215 -324725 -836967 -1223975 -1130945 -729831 -296613 109846 373707
34893 373707 194215 -396188 -749872 -339150 443320 759092 475798 228208 314218 234797
$$ packed form
34963F17457N21009m38623j135466o50072L59263O13997M1674k82398J64317O50160
34953D61318L99651k54872m57827j33310j8689m40766p30390k05958P08708R42560
34943B70425K30670n26355n07993L220K19072J619j39903M0364K41671K27824
34933F0614J71871K56933L48113K45844j5134k58908l49271k24381K0676Q9353
34923C45710j82396m56710k40022L57212O58015L59711m4565n2291J15264j2251
34913H47677l32151l71869r8981M8865j15802l13320l30103k70705j83199P4765
34903a044823M08878L95730q4510n12242l87008R3030M01114M33218M06459K63861
34893C73707j79492n90403l53684M10722P82470L15772k83294k47590Q6010p9421
$$ plain form
34883 234797 -378408 -990363 -830590 29491 792700 935812 630941 302637 220454 482076
34873 482076 979770 1352478 1291489 902993 508127 172085 -233901 -608447 -700737 -593545
34863 -593545 -633012 -829194 -825596 -592544 -618890 -1138970 -1635470 -1502017 -872073 -384999
34853 -384999 -349876 -515996 -519483 -230866 213363 448166 111694 -663263 -1165929 -870882
34843 -870882 -147794 187455 -55407 -267828 32141 550308 668898 224485 -380759 -638220
34833 -638220 -335082 319658 806437 689189 66193 -502279 -671372 -752673 -1228752 -1939102
34823 -1939102 -2129603 -1424426 -416828 9768 -231719 -434979 -187806 38472 -320000
34814 -320000 -940619 -991569 -368928 95194 -152731 -551802 -256963 586168 1013735 581212
$$ packed form
34883B34797o13205o11955J59773Q60081P63209J43112l04871l28304q2183K61622
34873D82076M97694L72708o0989l88496l94866l36042m05986l74546r2290J07192
34863e93545l9467j96182L598K33052k6346n20080m96500J33453O29944M87074
34853c84999L5123j66120l487K88617M44229K34803l36472p74957n02666K95047
34843h70882P23088L35249k42862k12421K99969N18167J18590m44413o05244k57461
34833f38220L03138O54740M86779j17248o22996n68472j69093q1301m76079p10350
34823a939102j90501P05177J007598M26596k41487k03260K47173K26278l58472
34814c20000o20619n0950O22641M64122k47925l99071K94839Q43131M27567m32523
$$ plain form
34804 581212 -90374 -243524 59775 236896 84017 -80713 -61991 -119217 -520361 -1059789
34794 -1059789 -1257870 -931570 -374636 -13924 -48015 -391328 -770182 -837326 -418587 201210
34784 201210 400271 -152077 -1046038 -1509608 -1225285 -586768 -133635 52626 266283 625638
34774 625638 802091 375686 -584490 -1420338 -1497352 -892051 -280610 -102932 -95967 177031
34764 177031 609325 706708 335551 -54534 27874 613208 1304943 1588106 1161550 240345
34754 240345 -511153 -626383 -362373 -293627 -515390 -675327 -690633 -847622 -1125010 -1038213
34744 -1038213 -401763 280237 496442 354675 214797 142430 101490 264163 658953 840312
34734 840312 424815 -248150 -475187 -89705 419014 611197 538245 486907 564170 567520
$$ packed form
34804E81212o71586j53150L03299J77121j52879j64730J8722n7226m01144n39428
34794a059789j98081L26300N56934L60712l4091l43313l78854o7144M18739O19797
34784B01210J99061n52348q93961m63570K84323O38517M53133J86261K13657L59355
34774F25638J76453m26405r60176q35848p7014O05301O11441J77678O965K72998
34764A77031M32294R7383l71157l90085Q2408N85334O91735K83163m26556r21205
34754B40345p51498j15230K64010O8746k21763j59937j5306j56989k77388Q6797
34744a038213O36450O82000K16205j41767j39878p2367m0940J62673L94790J81359
34734H40312m15497o72965k27037L85482N08719J92183p2952n1338P7263L350
$$ plain form
34724 567520 176589 -615678 -1253741 -1124911 -410884 5054 -311701 -800363 -829754 -583417
34714 -583417 -498843 -389915 118061 668813 556620 -138103 -617487 -528238 -284688 -207139
34704 -207139 -108232 107237 122749 -249297 -729429 -995130 -1025445 -901709 -688304 -589708
34694 -589708 -791136 -1089539 -1110428 -875826 -684194 -515775 -152896 204765 181844 41435
34684 41435 388935 1003517 970544 227859 -101170 583969 1360975 1211295 515199 226582
34674 226582 346473 275687 95713 330508 770621 704731 214492 140489 691990 1091828
34664 1091828 811780 280337 53308 32590 -100039 -256827 -164626 168948 501625 586006
34654 586006 235504 -489829 -1103364 -1118758 -721669 -564887 -853743 -1166802 -1235223 -1241983
$$ packed form
34724E67520l90931p92267o38063J28830P14027M15938l16755m88662k9391K46337
34714e83417Q4574J08928N07976N50752j12193o94723m79384Q9249K43550P7549
34704b07139R8907K15469J5512l72046m80132k65701l0315J23736K13405R8596
34694e89708k01428k98403k0889K34602J91632J68419L62879L57661k2921j40409
34684D1435L47500O14582l2973p42685l29029O85139P77006j49680o96096k88617
34674B26582J19891p0786j79974K34795M40113o5890m90239p4003N51501L99838
34664A091828k80048n31443k27029k0718j32629j56788R2201L33574L32677Q4381
34654E86006l50502p25333o13535j5394L97089J56782k88856l13059o8421o760
$$ plain form
34644 -1241983 -1197592 -783604 -152816 -93845 -838523 -1421961 -995671 -205926 -312250 -1264023
34634 -1264023 -1719281 -980251 89458 355419 -199755 -815711 -1066317 -1105242 -1165975 -1283226
34624 -1283226 -1326397 -1033760 -253599 626083 839989 177636 -571293 -544126 53095 225523
34614 225523 -491054 -1467338 -1753289 -1042234 153823 966241 803628 -159503 -1101747
34605 -1101747 -1389641 -1195193 -1013990 -826414 -273751 486068 805578 486592 -988
34596 -988 -376476 -873047 -1445082 -1483455 -830719 -325469 -644930 -1233968 -1184634 -644704
34586 -644704 -411818 -514993 -270758 391417 734109 424166 -27517 -234137 -447042 -805448
34576 -805448 -891445 -447301 116221 323295 195798 -88498 -506193 -837377 -630625 81908
$$ packed form
34644a241983M4391M13988O30788N8971p44678n83438M26290P89745j06324r51773
34634a264023m55258P39030J069709K65961n55174o15956k50606l8925o0733j17251
34624a283226m3171K92637P80161Q79682K13906o62353p48929K7167N97221J72428
34614B25523p16577r76284k85951P11055J196057Q12418j62613r63131r42244
34605a101747k87894J94448J81203J87576N52663P59819L19510l18986m87580
34596i88l75488m96571n72035l8373O52736N05250l19461n89038M9334N39930
34586f44704K32886j03175K44235O62175L42692l09943m51683k06620k12905l58406
34576h05448q5997M44144N63522K07074j27497k84296m17695l31184K06752P12533
$$ plain form
34566 81908 606064 523292 234600 155846 5816 -556150 -1171440 -1322142 -1165013 -1149758
34556 -1149758 -1196176 -955988 -588413 -549987 -793320 -836097 -514515 -100959 198568 336249
34546 336249 174088 -319262 -777872 -863016 -798986 -963824 -1175309 -980833 -442350 20257
34536 20257 374813 856888 1272650 1216956 909595 973158 1353265 1320025 678509 125597
34526 125597 148026 353445 229627 -135718 -442567 -626226 -566395 -15151 775623 1006334
34516 1006334 399296 -267159 -217002 276177 470935 276688 129258 154074 166273 229753
34506 229753 497605 645015 162413 -782441 -1365120 -1075672 -241329 453548 578536 85557
34496 85557 -745042 -1377533 -1361731 -744730 2534 454350 470204 96225 -484071 -954202
$$ packed form
34566H1908N24156q2772k88692p8754j50030n61966o15290j50702J57129J5255
34556a149758m6418K40188L67575L8426k43333m2777L21582M13556K99527J37681
34546C36249j62161m93350m58610q5144O4030j64838k11485J94476N38483M62607
34536B0257L54556M82075M15762n5694l07361O3563L80107l3240o41516n52912
34526A25597K2429K05419j23818l65345l06849j83659N9831N51244P90774K30711
34516A006334o07038o66455N0157M93179J94758j94247j47430K4816J2199O3480
34506B29753K67852J47410m82602r44854n82679K89448Q34343O94877J24988m92979
34496H5557q30599o32491J5802O17001P47264M51816J5854l73979n80296m70131
$$ plain form
34486 -954202 -1102553 -1043410 -982331 -851356 -474346 -31162 17259 -458529 -1019450 -1161785
34476 -1161785 -850476 -439956 -243855 -321027 -572193 -880800 -1130247 -1154670 -788590 -73071
34466 -73071 623410 862658 571544 86529 -262388 -431512 -505317 -533328 -630478 -930800
34456 -930800 -1245265 -1083677 -325058 398518 380278 -261716 -762774 -676617 -225671 270801
34446 270801 811726 1400199 1733024 1524122 951064 497739 403514 473034 439453 334844
34436 334844 378746 581492 658989 415805 35881 -180122 -219640 -253561 -259479 -97442 119572
34425 119572 169994 222904 655900 1282641 1387913 794455 252357 335092 560339 204782
34415 204782 -544167 -997307 -1109686 -1350917 -1669540 -1520203 -903947 -496514 -599134 -743130
$$ packed form
34486i54202j48351N9143O1079J30975L77010M43184M8421m75788n60921j42335
34476a161785L11309M10520J96101p7172k51166l08607k49447k4423L66080P15519
34466g3071O96481K39248k91114m85015l48917j69124p3805k8011r7150l00322
34456i30800l14465J61588P58619P23576j8240o41994n01058Q6157M50946M96472
34446B70801N40925N88473L32825k08902n73058m53325r4225O9520l3581j04609
34436C34844M3902K02746P7497k43184l79924k16003l9518l3921n918J62037K17014
34425A19572N0422N2910M32996O26741J05272n93458n42098Q2735K25247l55557
34415B04782p48949m53140j12379k41231l18623J49337O16256M07433j02620j43996
$$ plain form
34405 -743130 -552704 -288134 -251319 -288890 -211046 -150073 -175590 -61763 228688 309774 -10603
34394 -10603 -298836 -67569 543723 987141 927649 416159 -227195 -500008 -83806 644276
$$ packed form
34405g43130J90426K64570L6815l7571P7844O0973k5517J13827K90451Q1086l20377
34394a0603k88233K31267O11292M43418n9492n11490o43354k72813M16202P28082
$$ [...]
##END NTUPLES=NMR SPECTRUM
##END=
