##TITLE=31Pdec_SR111_rmo
 , 24 sc
 15.3.2022
##JCAMPDX= 6.0         $$ Bruker NMR JCAMP-DX V2.0
##DATA TYPE= NMR SPECTRUM
##DATA CLASS= NTUPLES
##ORIGIN= UXNMR, Bruker Analytische Messtechnik GmbH
##OWNER= root
$$ XWIN-NMR		Version 3.5
$$ Tue Mar 15 13:15:46 2022 Russian Standard Time (UT+4h)  she@DPX200
##.OBSERVE FREQUENCY= 81.013821
##.OBSERVE NUCLEUS= ^31P
##.ACQUISITION MODE= SIMULTANEOUS
##.ACQUISITION SCHEME= undefined
##.AVERAGES= 24
##.DIGITISER RES= 16
##SPECTROMETER/DATA SYSTEM= spect
##.PULSE SEQUENCE= zgpg30
##.SOLVENT NAME= CDCl3
##.SHIFT REFERENCE= (INTERNAL, CDCl3, 0, 248.564)
##AUDIT TRAIL= $$ (NUMBER, WHEN, WHO, WHERE, WHAT)
$$ ##TITLE= Audit trail, XWIN-NMR		Version 3.5
$$ ##JCAMPDX= 5.01
$$ ##ORIGIN= Bruker BioSpin GmbH
$$ ##OWNER= she
$$ F:/spectra/data/she/nmr/P31/1/pdata/1/auditp.txt
$$ ##AUDIT TRAIL=  $$ (NUMBER, WHEN, WHO, WHERE, WHAT)
(   1,<2022-03-15 13:14:51.17 +0400>,<she>,<DPX200>,
      <created by zg, POWCHK disabled, PULCHK disabled
       configuration hash MD5:
       00 E9 B6 7A A2 85 ED C7 34 08 36 98 17 FE 4E 26
       data hash MD5: 32K
       27 98 D5 E2 F0 0A FA 44 D0 61 0F 5A 64 DF C8 F9>)
(   2,<2022-03-15 13:14:54.51 +0400>,<she>,<DPX200>,
      <Start of raw data processing
       efp BC_mod = 2 LB = 1 FT_mod = 6 PKNL = 1 PHC0 = -9224.15 PHC1 = 162.6757 SI = 64K 
       data hash MD5: 64K
       0E 1C B6 83 22 92 EF 7D 24 AE 60 FE 85 2C AC 9E>)
(   3,<2022-03-15 13:15:10.39 +0400>,<she>,<DPX200>,
      <pk PHC0 = 14.94509 PHC1 = 0 
       data hash MD5: 64K
       75 EC A1 A2 09 A1 D3 B0 B6 38 AA E5 7D 1F F5 26>)
(   4,<2022-03-15 13:15:15.37 +0400>,<she>,<DPX200>,
      <abs ABSG = 5 
       data hash MD5: 64K
       23 A5 4E FB 03 71 64 22 52 7B 58 1B FC B8 65 19>)
$$ ##END=
$$ 
$$ hash MD5
$$ BE AB 30 C5 21 30 73 48 5D 42 BA 18 7A D6 7D BC
##$RELAX= 
##$RELAX= 
##$RELAX= 
##$RELAX= 
##$RELAX= 
##$RELAX= 
##$RELAX= 
##$RELAX= 
$$ Bruker specific parameters
$$ --------------------------
##$DU= <F:/spectra>
##$EXPNO= 1
##$NAME= <P31>
##$PROCNO= 1
##$TYPE= <nmr>
##$USER= <she>
##$AMP= (0..31)
100 100 100 100 100 100 100 100 100 100 100 100 100 100 100 100 100 100 
100 100 100 100 100 100 100 100 100 100 100 100 100 100 
##$AQSEQ= 0
##$AQ_mod= 1
##$AUNM= <au_zg>
##$AUTOPOS= <>
##$BF1= 81.014009
##$BF2= 200.13
##$BF3= 200.13
##$BF4= 200.13
##$BF5= 200.13
##$BF6= 200.13
##$BF7= 200.13
##$BF8= 200.13
##$BYTORDA= 1
##$CFDGTYP= 0
##$CFRGTYP= 5
##$CHEMSTR= <none>
##$CNST= (0..31)
1 1 145 1 1 1 1 1 1 1 1 1 1 1 1 1 1 1 1 1 1 1 1 1 1 1 1 1 1 1 1 1 
##$CPDPRG= <waltz16>
##$CPDPRG1= <>
##$CPDPRG2= <waltz16>
##$CPDPRG3= <>
##$CPDPRG4= <mlev>
##$CPDPRG5= <mlev>
##$CPDPRG6= <mlev>
##$CPDPRG7= <mlev>
##$CPDPRG8= <mlev>
##$CPDPRGB= <>
##$CPDPRGT= <>
##$D= (0..31)
0 1 0 0 0 0 0 0 0 0 0 0.03 2e-05 3e-06 0 0 0 0 0 0 0 0 0 0 0 0 0 0 0 0 
0 0 
##$DATE= 1647335690
##$DBL= (0..7)
120 120 120 11 120 120 24 19 
##$DBP= (0..7)
150 150 150 150 150 150 150 150 
##$DBP07= 0
##$DBPNAM0= <>
##$DBPNAM1= <>
##$DBPNAM2= <>
$$ [...]
##$SUBNAM3= <"">
##$SUBNAM4= <"">
##$SUBNAM5= <"">
##$SUBNAM6= <"">
##$SUBNAM7= <"">
##$SUBNAM8= <"">
##$SUBNAM9= <"">
##$SW= 501.771253377433
##$SWIBOX= (0..15)
0 1 3 0 0 0 0 0 0 0 0 0 0 0 0 0 
##$SW_h= 40650.406504065
##$TD= 32768
##$TD0= 1
##$TE= 0
##$TE2= 300
##$TE3= 300
##$TEG= 300
##$TL= (0..7)
0 120 53 12 22 120 120 120 
##$TP= (0..7)
150 150 150 150 150 150 150 150 
##$TP07= 0
##$TPNAME0= <>
##$TPNAME1= <>
##$TPNAME2= <>
##$TPNAME3= <>
##$TPNAME4= <>
##$TPNAME5= <>
##$TPNAME6= <>
##$TPNAME7= <>
##$TPOAL= (0..7)
0.5 0.5 0.5 0.5 0.5 0.5 0.5 0.5 
##$TPOFFS= (0..7)
0 0 0 0 0 0 0 0 
##$TUNHIN= 0
##$TUNHOUT= 0
##$TUNXOUT= 0
##$USERA1= <user>
##$USERA2= <user>
##$USERA3= <user>
##$USERA4= <user>
##$USERA5= <user>
##$V9= 5
##$VALIST= <valist>
##$VCLIST= <CCCCCCCCCCCCCCC>
##$VD= 0
##$VDLIST= <DDDDDDDDDDDDDDD>
##$VPLIST= <PPPPPPPPPPPPPPP>
##$VTLIST= <TTTTTTTTTTTTTTT>
##$WBST= 1024
##$WBSW= 4
##$XGAIN= (0..3)
0 0 0 0 
##$XL= 0
##$YL= 0
##$YMAX_a= 2836
##$YMIN_a= -3074
##$ZGOPTNS= <>
##$ZL1= 120
##$ZL2= 120
##$ZL3= 120
##$ZL4= 120
##$ABSF1= 248.5645
##$ABSF2= -253.2056
##$ABSG= 5
##$ABSL= 3
##$ALPHA= 0
##$AQORDER= 0
##$ASSFAC= 0
##$ASSFACI= 0
##$ASSFACX= 0
##$ASSWID= 0
##$AUNMP= <proc_1d>
##$AZFE= 0.1
##$AZFW= 0.5
##$BCFW= 0
##$BC_mod= 2
##$BYTORDP= 0
##$COROFFS= 0
##$CY= -3
##$DATMOD= 1
##$DC= 0
##$DFILT= <>
##$DTYPP= 0
##$F1P= 0
##$F2P= 0
##$FCOR= 1
##$FTSIZE= 65536
##$FT_mod= 6
##$GAMMA= 0
##$GB= 0
##$INTBC= 1
##$INTSCL= 5.30512e-09
##$ISEN= 30
##$LB= 1
##$LEV0= 0
##$LPBIN= 0
##$MAXI= 10000
##$MC2= 0
##$MEAN= 0
##$ME_mod= 0
##$MI= 50
##$NCOEF= 0
##$NC_proc= -8
##$NLEV= 6
##$NOISF1= 182.463
##$NOISF2= 159.3651
##$NSP= 0
##$NTH_PI= 0
##$NZP= 0
##$OFFSET= 248.5645
##$PC= 4
##$PHC0= -9209.205
##$PHC1= 162.6757
##$PH_mod= 1
##$PKNL= yes
##$PPARMOD= 0
##$PSCAL= 0
##$PSIGN= 0
##$REVERSE= no
##$SF= 81.014009
##$SI= 65536
##$SIGF1= 159.3651
##$SIGF2= -187.1042
##$SINO= 113.3802
##$SIOLD= 16384
##$SREGLST= <1H.CDCl3>
##$SSB= 0
##$STSI= 65536
##$STSR= 0
##$SW_p= 40650.406504065
##$SYMM= 0
##$S_DEV= 0
##$TDeff= 32768
##$TDoff= 0
##$TI= <>
##$TILT= no
##$TM1= 0
##$TM2= 0
##$TOPLEV= 0
##$USERP1= <user>
##$USERP2= <user>
##$USERP3= <user>
##$USERP4= <user>
##$USERP5= <user>
##$WDW= 1
##$XDIM= 65536
##$YMAX_p= 341968180
##$YMIN_p= -153327981
$$ End of Bruker specific parameters
$$ ---------------------------------
##NTUPLES= NMR SPECTRUM
##VAR_NAME=  FREQUENCY,     SPECTRUM/REAL,   SPECTRUM/IMAG
##SYMBOL=    X,             R,               I
##VAR_TYPE=  INDEPENDENT,   DEPENDENT,       DEPENDENT
##VAR_FORM=  AFFN,          ASDF,            ASDF
##VAR_DIM=   65536,         65536,           65536
##UNITS=     HZ,            ARBITRARY UNITS, ARBITRARY UNITS
##FACTOR=    0.620285442955139, 1,           1
##FIRST=     20137.2065510759, 0,            0
##LAST=      -20513.1999529892, 0,           0
##MIN=       -20513.1999529892, -153327981,  0
##MAX=       20137.2065510759, 341968180,    0
$$ Real data points
##PAGE= N=1
##DATA TABLE= (X++(R..R)), XYDATA
$$ [...]
44116 3607007 4983302 3311027 -138267 -2099507 -1199765 402191 -243056 -3125339
44108 -3125339 -5268734 -4490551 -1911976 47982 933887 1825144 2361071 743852 -2645106
44099 -2645106 -4158628 -1482365 2278684 1992921 -2464769 -5826300 -4798936 -2345844
44091 -2345844 -2401002 -3567477 -2059005 1210658 1801218 -439913 -735483 2057344 2435060
44082 2435060 -2760261 -7956561 -6737816 -1791451 -563936 -3910591 -6173839 -4982843
44074 -4982843 -3380177 -2308544 1216669 6838868 9004450 5350090 928515 705830
44066 705830 3040257 3984324 3116401 1501960 -1301400 -4169599 -3019046 2863685 7302212
44057 7302212 5154629 63960 -1236643 860921 539464 -3670440 -7275515 -7217229 -5074338
44048 -5074338 -2909606 -1056524 -440746 -2590894 -6531949 -9080447 -8554637 -5477572
44040 -5477572 -518046 4747609 6180215 792818 -7924448 -12659403 -10656821 -5811122
44032 -5811122 -2484550 -1352527 -1646716 -3083326 -4353567 -3425082 -756850 742380
44024 742380 -105382 -1402673 -1527239 -878595 52467 1232705 1559055 242423 -292479
44015 -292479 2935852 7583882 7632650 2118690 -2885708 -3112816 -1721342 -2808400 -4207537
44006 -4207537 -1614311 3456258 5286707 2071145 -2321533 -4178781 -3547778 -2052791
43998 -2052791 -536526 722333 2008334 4504868 8306389 10336473 7137881 157822
43990 157822 -4643879 -3716005 -142006 663679 -2441280 -6196792 -8064231 -8545894 -8423661
43981 -8423661 -6827490 -3700270 -1786541 -3249906 -5414350 -3423683 2509103 6084675
43973 6084675 2854589 -3850599 -7549036 -6759228 -5113798 -4868002 -4406744 -2267069 32417
43964 32417 407787 -931128 -2200338 -2073587 -440886 1399077 1152405 -2128665 -5963549
43955 -5963549 -6631480 -3809023 -1116715 -1497006 -3886744 -5296310 -4640184 -3444338 -3584794
43946 -3584794 -5048558 -5767628 -3946225 -787492 344561 -1605793 -3538243 -2582059
43938 -2582059 -346000 -60839 -1297307 -1242941 -45385 -392475 -1912959 -781919 3929853
43929 3929853 7750826 6636391 2031520 -1928023 -3585289 -4068325 -4468150 -4608509 -3519020
43920 -3519020 -397977 3744228 5868809 4505849 2717479 4189477 7100442 6314918
43912 6314918 1686763 -1066760 1035265 4096195 3954830 1812922 350297 -893979
43904 -893979 -2574783 -2382895 814615 3283900 1458970 -2219323 -3031557 -1119759 -329421
43895 -329421 -1750223 -2797655 -1545764 1647617 5552606 8063847 6694659 2138945
43887 2138945 -1076880 -786263 -957426 -5215107 -10046687 -9872887 -5931864 -3688059 -3534888
43878 -3534888 -1335512 2738786 3681408 568343 -1424468 279360 1762444 80779
43870 80779 -1593077 151307 3137236 3645098 2158430 1100602 185227 -2018699 -4357070
43861 -4357070 -4482275 -2178093 1365368 5506582 8900408 8763364 4455417 -168279
43853 -168279 -1118269 495953 525100 -2239177 -5215795 -6425147 -6779380 -7926857 -9929698
43844 -9929698 -11368649 -10621023 -7306279 -3278219 -1377942 -2268405 -3439371 -2259559
43836 -2259559 1044481 4294660 5977508 6025461 5272836 5053334 6121678 7369307 7062090
43827 7062090 5552142 4534258 3406022 -274207 -5594443 -7589938 -4316499 -825973
43819 -825973 -2196317 -5591988 -4199733 2494842 7573794 5877765 -53270 -4084189
43811 -4084189 -3174054 951256 4154384 3207610 -1052562 -3694981 -1060024 4054387
43803 4054387 5350252 1114777 -3886039 -5066491 -3149701 -1412932 -972055 -791631
43795 -791631 -136810 979415 2345353 3159108 2395093 470072 -888429 -987354 -635358
43786 -635358 4388 1602041 3181520 2418173 -460100 -2110609 -860023 1212090 2704877
43777 2704877 5407358 9404856 9839386 3378902 -4957545 -7084196 -2503023 1993657
43769 1993657 2618161 2468089 4408090 6221240 5399878 3856873 4407936 5895647 5096696
43760 5096696 1206110 -4092629 -8816716 -10810440 -8278405 -2734347 940362 38994
43752 38994 -2525574 -2813218 -1319559 -771595 -1103077 -618699 -163874 -1631391 -3496695
43743 -3496695 -2418192 1246857 3946545 4668312 5583443 6852874 5730382 1909487
43735 1909487 -882170 -345431 1403257 2067746 2391226 3145530 2960861 1641141 1706313
43726 1706313 3694372 3786022 -305631 -4651626 -4597257 -1968888 -1974037 -5058826 -6981916
43717 -6981916 -5829147 -3986177 -3536743 -4197316 -5661397 -7685750 -7852041 -3644101 2759534
43708 2759534 5906627 3997972 548758 -1380283 -2327408 -2917205 -1921566 265637 567996
43699 567996 -1859058 -3552899 -2363425 -1342810 -3536959 -6265117 -4929691 -319869
43691 -319869 2327265 450243 -3561816 -6569446 -7609507 -6931698 -5364194 -4719629 -6160827
43682 -6160827 -8123419 -8059920 -5824181 -3122735 -599680 1646997 1732114 -1908916 -6354316
43673 -6354316 -6568051 -2730373 -755031 -3728757 -7179235 -5826097 -1273209 1124874
43665 1124874 410222 197427 1959534 3289336 3252876 4637356 8860521 12392802 11226225
43656 11226225 6508023 2532475 612129 -1560782 -4877125 -6809645 -5528470 -3144232
43648 -3144232 -2868379 -4726628 -6222217 -6131130 -5377493 -4660482 -3562712 -2234510 -1887657
43639 -1887657 -2868364 -3800528 -3437726 -2046546 -241392 2070079 4523394 5479768 3855430
43630 3855430 878657 -1330093 -2120862 -1939881 -635283 1924014 4094590 3570115 518832
43621 518832 -2164400 -2180681 80807 3074402 5925656 7861482 7464907 4126006 -385725
43612 -385725 -3212778 -3361555 -2607689 -3250475 -5307983 -6333734 -4401209 -1114756 -441608
43603 -441608 -3665616 -6775854 -4891259 1233500 5644425 4475278 173538 -2691972
43595 -2691972 -3206018 -3445148 -4015566 -3408635 -1308182 379112 358738 -279262 33097
43586 33097 1150071 1842896 1645652 1219541 1329805 1927541 2051261 724868 -1674559
43577 -1674559 -3399046 -3469297 -3316819 -5045462 -8297607 -10289676 -9026291 -5082268 -147426
43568 -147426 4425770 7160759 6562262 3027565 -727520 -2668800 -3961849 -7028851
43560 -7028851 -11751719 -15155966 -14706067 -10749021 -5823545 -2531970 -1915827 -2958979
43552 -2958979 -3703145 -3442852 -3422826 -4705641 -6142121 -5711602 -3368498 -1115535 -482649
43543 -482649 -1334100 -2920090 -4457499 -4767072 -3273698 -1567680 -1761067 -2698961 -488092
43534 -488092 5551166 10026371 7495782 -126638 -5591741 -5249080 -2294760 -621993
43526 -621993 449485 2943103 5149595 3916654 543905 -247502 2304136 2971714 -2039374
43517 -2039374 -9144878 -12165109 -10648032 -9152837 -9301614 -7696453 -2877312 591293
43509 591293 -1568186 -6200715 -6456925 -1418000 2670121 1179715 -3120049 -4865868
43501 -4865868 -3281591 -1605305 -1371889 -812893 1268416 3039500 2141140 -1050478 -3885724
43492 -3885724 -4365088 -2763195 -1007999 -1319303 -4854397 -10326282 -13883384 -11892135
43484 -11892135 -4918228 1957475 4182091 2581500 1543716 2790395 3573853 1766459
43476 1766459 -294846 582844 3180610 3459553 393419 -3051979 -4309918 -3310979 -502952
43467 -502952 3325534 4869020 492175 -7627086 -11823682 -8274485 -2279537 -714593
43459 -714593 -2757384 -2891969 -413825 177984 -2520300 -4407899 -2878909 -752725 -905077
43450 -905077 -1501363 257036 2997722 3313476 889814 -1724326 -2978827 -3027109 -1761036
43441 -1761036 881478 3241839 3309488 1633829 578167 740824 307922 -1873955 -4583980
43432 -4583980 -5948569 -5254647 -2907057 -279299 359429 -2097799 -5164272 -4724170 -443954
43423 -443954 3170525 2843159 1298393 3114851 7442656 8799332 5099118 724557
43415 724557 -79492 806440 -766318 -3887643 -3580680 1424826 6346838 6791192 3729281
43406 3729281 234667 -3094666 -6359007 -6989459 -2714628 3194738 4331672 -609803
43398 -609803 -5918148 -6518837 -4101083 -3473253 -5579274 -7077446 -5471876 -1938523 584988
43389 584988 279637 -2273347 -4373174 -3354633 334548 3081810 2425140 170044 -625196
43380 -625196 -308241 -1317517 -2984706 -1640405 3086924 5860064 2225694 -4849363
43372 -4849363 -8438918 -6446521 -3220148 -2383540 -2071439 773677 4557959 5072091 2160110
43363 2160110 514821 3217663 7622747 9237077 7251765 4061279 1214490 -1287176
43355 -1287176 -2720409 -1958627 -115655 189008 -1046803 -661171 2768891 6132974 5950352
43346 5950352 3175700 1227448 726308 -654866 -3550078 -5328362 -3966338 -1022894
43338 -1022894 802339 1626231 4028505 8896270 13060199 12144103 5820977 -771389
43330 -771389 -2041013 1973479 6196185 7207912 6722243 7144908 6860259 3365354 -932705
43321 -932705 -841333 3741841 6841639 4701281 636229 -1005117 -1569120 -4408320 -7274176
43312 -7274176 -4259121 4730602 11820520 10536142 3661093 -817676 938709 5996799
43304 5996799 9415765 8509782 3344934 -3735724 -8864392 -9535484 -7414022 -6314999
43296 -6314999 -6998811 -6253519 -1937069 3564468 6475013 6050750 3888457 873572 -2487856
43287 -2487856 -4271402 -2977379 -440805 327669 -406850 -494156 -1180914 -5852966 -12472367
43278 -12472367 -13161638 -4875933 4424599 5468585 107504 -2075239 2421391 7591621
43270 7591621 8269240 6612902 5828811 3778458 -2446248 -9505087 -10733699 -4827850
43262 -4827850 2468098 5099651 2272146 -2482709 -5300040 -4771959 -2457027 -1073579
43254 -1073579 -1672489 -2968520 -3509344 -3017295 -1232542 2206603 5559122 5431545 1632471
43245 1632471 -1069192 874978 4136499 2959600 -2353178 -6036374 -5305607 -3213276
43237 -3213276 -2639726 -2582223 -2108452 -3045539 -5670645 -5921419 -1169638 4093133 3292351
43228 3292351 -2750082 -6357901 -3382742 1414902 1167398 -4275311 -9120713 -9373994
43220 -9373994 -6649277 -4539943 -4132858 -4385150 -4915135 -6069037 -6890453 -5718760 -3376849
43211 -3376849 -3113221 -5702969 -6990922 -3067052 3821377 8014651 8103770 7733231 8855521
43202 8855521 8859811 5699766 1500003 -1087255 -2230241 -2325771 -256514 2761495 2126581
43193 2126581 -3055413 -6143349 -1873029 4578227 4355365 -1936629 -5899610 -4646997
43185 -4646997 -3168331 -3076440 646977 8424664 11673104 5735487 -1207635 -30707
43177 -30707 5387605 5498702 1250260 1819714 8334205 11408817 6063999 -1308638 -4134943
43168 -4134943 -4708960 -7130888 -8851975 -5834496 -822220 561227 -1243507 -1335735 950728
43159 950728 1357836 -1725111 -4769588 -4897711 -3309574 -1607362 1043119 4946490 7394130
43150 7394130 5889435 1906312 -1073814 -2106087 -3056290 -4875212 -5845341 -4035278
43142 -4035278 -124163 3012653 3010732 -54063 -3876158 -5592999 -3802930 237023 3536621
43133 3536621 4257161 3591556 3853229 4920667 4364927 1651333 -46992 1960367 5682203
43124 5682203 6995532 5164657 2818400 1266920 -464719 -1964699 -988875 2094876
43116 2094876 3292715 436218 -3704901 -6011257 -7314612 -9209857 -9905224 -7226561
43108 -7226561 -3282087 -1681334 -1757885 -214315 2487667 2382016 -1342094 -4790687 -5417030
43099 -5417030 -5236487 -6384865 -7290921 -5505739 -1563836 2038394 3654211 2878281 266052
43090 266052 -2197698 -2629912 -2186759 -3788749 -6925811 -7089969 -2191172 3812589 6157363
43081 6157363 5036123 3254581 1271462 -1595227 -3522428 -2324511 100375 -24135
43073 -24135 -2332130 -2944733 -1058757 -320121 -2663539 -4995561 -3924399 -520003 1819923
43064 1819923 1747243 85616 -2321069 -4597783 -5159375 -3297842 -697434 374621 -97472
43055 -97472 -152111 1447316 3719405 4346341 1761243 -2784421 -5228261 -2549596 2792772
43046 2792772 4476345 -192665 -6456873 -7790022 -3490101 2083199 6096668 9064889
43038 9064889 10488493 7464204 -259520 -7331052 -8270384 -4285600 -1382999 -2268257
43030 -2268257 -3410658 -835645 4025091 6265749 3862518 -77867 -1203120 1674477
43022 1674477 6412543 10367935 12350787 12398627 10916903 8519094 6177562 4786071
43014 4786071 4285798 3528123 1557848 -834550 -1447707 805578 4008820 4811314 2125323
43005 2125323 -1466266 -2375691 521706 5423031 9689291 11477411 9963346 5503646
42997 5503646 -131 -3900466 -4833214 -3857345 -3234782 -4084307 -5342102 -5056473 -2739703
42988 -2739703 -251738 123429 -1513389 -2589909 -1181552 1696550 3722229 4255544
42980 4255544 4349082 4420505 3722892 2125815 653797 -144716 -750692 -1070488 -9932
42971 -9932 2415262 4188428 3841132 2498803 1827987 1242589 -784924 -3449801 -4067309
42962 -4067309 -1811119 1122440 2501568 2348738 1592950 212616 -2090468 -4573267
42954 -4573267 -6103994 -6477099 -6074194 -4824782 -2602559 -321536 508715 -470337 -1793935
42945 -1793935 -1478543 1216035 5222454 8537485 9713923 8785048 6824222 4696795
42937 4696795 2505138 195758 -1841349 -3043395 -3110395 -1860769 877968 4685734
42929 4685734 8102539 9431256 8228090 5810185 4152107 4225429 5277483 5647470 4349895
42920 4349895 1898705 -352479 -1397624 -1006639 478515 2202438 3019785 2413287 1018590
42911 1018590 -382759 -1857265 -3227200 -2712588 1186818 6302980 7852944 4176053
42903 4176053 -781367 -2629624 -2155749 -2962388 -4954658 -4102714 1102182 6768320 8765617
42894 8765617 7774702 6924567 6758927 5575194 3483961 2786963 4300423 6180683 7137261
42885 7137261 8326842 10620466 11879488 9079853 2564943 -3487727 -4879608 -827585
42877 -827585 5899129 11008104 11189350 6394930 302543 -2648013 -1458897 961142
42869 961142 1935661 2168825 3499441 4889276 3087000 -2706722 -9039286 -11855954 -10395637
42860 -10395637 -6726205 -3056946 -667052 -33887 -460081 -476938 160948 52992 -971803
42851 -971803 -321331 3666889 7986778 8197889 4716132 2127442 2178275 1791736 -700613
42842 -700613 -2067301 19472 1715790 -1757627 -7970113 -9710881 -4963251 703480
42834 703480 2430232 1934171 3015944 5220612 5305368 2705547 106123 -572038 2900
42825 2900 603077 1200432 2429460 4568607 7190120 9041944 8543693 5274225 824892
42816 824892 -2447110 -3363138 -2450475 -1181454 -888168 -1482047 -1076248 1708973 4825621
42807 4825621 4444545 638485 -1227989 2778661 9157384 10955784 6440169 148323
42799 148323 -3929075 -5877764 -6252550 -3716256 1477512 5256092 4059566 -654448
42791 -654448 -4656331 -5799708 -4427911 -1207578 2403218 3262870 -276246 -5009259
42783 -5009259 -6024400 -2951569 41649 365471 -317238 -121552 -196953 -2241856 -5208039
42774 -5208039 -6483708 -5035864 -2034835 552423 1174688 -163812 -1257764 301966
42766 301966 3750626 5454298 3505220 261876 -824094 818360 3373842 5335290
42758 5335290 6043825 5051393 2848579 1241977 1402847 2361282 2572483 1788900 401154
42749 401154 -1290433 -1912028 486650 4829016 6561350 3628931 269362 1038274 3422756
42740 3422756 1465697 -4610972 -8342770 -6718409 -3882250 -3666007 -4317017 -3498073 -3152364
42731 -3152364 -5229824 -6854506 -4712293 -1243571 -1248801 -4289098 -5798642 -4754115 -4766752
42722 -4766752 -7301021 -8950045 -6926883 -3068096 -314518 1458011 3679661 5609968
42714 5609968 5201983 2160622 -1727287 -4393373 -4482389 -1913804 1267242 2022665 -156482
42705 -156482 -2093180 -923438 1951190 2934738 1369625 121685 1176480 3219319
42697 3219319 4315197 4636525 4894232 3797568 -409011 -6228556 -9182031 -6740707
42689 -6740707 -1509936 1711205 1140833 -974527 -1925307 -1511219 -1314211 -2303030 -3753192
42680 -3753192 -3941648 -1730715 1896724 3950477 2121194 -2426091 -5955911 -6131899
42672 -6131899 -4044446 -2058298 -1008320 -132963 1498119 4220934 7201498 8002470
42664 8002470 4382847 -2378434 -7592803 -7999417 -5003011 -1771264 789314 3013063
42656 3013063 3674721 1625723 -1055130 -1358290 -248051 -1196814 -3725738 -3064691 2203503
42647 2203503 6591874 4829928 -740283 -3626916 -1983967 109359 -599535 -2499073
42639 -2499073 -2587181 -962210 -92348 -1043508 -2163190 -1532170 98387 -374278 -4560766
42630 -4560766 -9562669 -10396897 -5879337 -378737 1368122 -476542 -2312375 -2114662
42622 -2114662 -573189 1666281 4873999 8303744 10032141 9375671 7515719 5346879
42614 5346879 2795271 692383 830350 3071503 4699911 4058053 2648450 2000448 933801
42605 933801 -1521233 -2742772 258599 5365228 7185566 4412468 1419629 1656152
42597 1656152 3299998 3292054 2196279 2288966 3478553 4335401 5324086 7646838 10008161
42588 10008161 9796740 6894678 3446580 557361 -1787311 -2393539 -137704 2827750
42580 2827750 3192927 1868693 2794035 5798280 5809104 1015488 -3431523 -3078560 -797749
42571 -797749 -1527602 -4453599 -5591274 -5028192 -5702199 -6884663 -5071885 -775351 1433802
42562 1433802 -67469 -2232250 -3196830 -4560765 -6709445 -7139819 -5413984 -5001761 -7669058
42553 -7669058 -10135236 -8923713 -4831724 -82949 5084997 10057132 11914450 9485422
42545 9485422 6060469 4364697 2100459 -3193380 -8024199 -7233590 -2426954 -62512
42537 -62512 -1745612 -2530897 449836 3663726 3658539 2635957 3985812 6089256 4966629
42528 4966629 963864 -1713130 -1504437 -1246317 -2668423 -3052925 193202 4343020 4394612
42519 4394612 413234 -2174392 -327702 2600436 2857471 2322429 4208806 5751751
42511 5751751 1713996 -5400144 -6168874 2246420 10260309 8377248 245265 -3262644
42503 -3262644 439603 3729465 1479741 -2140400 -1629822 1338975 1458793 -1743608
42495 -1743608 -3358322 -8907 5840367 8915502 6993767 2997298 1306574 2561719
42487 2561719 3416872 1759293 -37634 1088964 3774055 3840857 61261 -4725595 -7736573
42478 -7736573 -8444416 -6959851 -3500110 259169 2259239 2748402 3088280 2136010 -2382752
42469 -2382752 -8560523 -10854152 -7574789 -3710015 -3852772 -5974301 -5291758 -1263164
42461 -1263164 2861892 5226875 6291627 5912114 3258687 -617923 -3127598 -3242310
42453 -3242310 -2262345 -1700384 -2123505 -3513990 -4909482 -4338199 -1186546 1892296 1657311
42444 1657311 -1388734 -3562910 -2819733 -679320 886140 1939411 2921730 2769820 576463
42435 576463 -2160448 -3070786 -2361154 -2746604 -5436246 -7870584 -6852085 -3003498 -181569
42426 -181569 -454665 -1761375 -1464248 -174066 -113843 -1144202 -1007260 1014371 3194651
42417 3194651 4033303 3544571 2009662 -63780 -812020 1223791 3917385 3350517 -549389
42408 -549389 -3656899 -3953953 -4131034 -5989886 -6663412 -3713501 -31606 738054 456922
42399 456922 2932571 6367937 5400894 -25110 -3818417 -2423828 968693 2241691
42391 2241691 1531671 686571 -10331 -60643 2368601 6698697 8340791 4429372 -1140210
42382 -1140210 -2053773 2422035 7109366 7778958 5329762 3468675 4860884 9576453
42374 9576453 15117974 17716856 15265607 9259319 2977415 -1636422 -4219438 -4476996
42366 -4476996 -2600666 -455415 34759 -593257 -647712 -636353 -2485632 -5401317 -5812409
42357 -5812409 -2400121 1925624 4508078 6202680 7987753 7670481 3644063 -475543
42349 -475543 340343 4993427 7318731 4821092 1464878 622028 429545 -1126197 -1475305
42340 -1475305 1576701 3909740 224247 -6625661 -8113674 -2235171 3204896 1719145
42332 1719145 -3161912 -4221565 -1125634 694327 -644813 -1090895 2396891 7357218
42324 7357218 9770655 9083900 7307762 5409539 2947980 329471 -691732 861279
42316 861279 3493813 4368484 2272295 -924016 -2428988 -1948879 -1686899 -2729776 -3309314
42307 -3309314 -1776212 611488 1800563 2154771 2867567 2381745 -2091696 -9479389 -14668727
42298 -14668727 -14319803 -10097443 -5227413 -828274 2772961 3978986 1773906 -2044843
42290 -2044843 -4799805 -5946717 -6373903 -6151560 -5049872 -3990621 -3751832 -3344725 -1870635
42281 -1870635 -633661 -734756 -19073 3900517 8329674 7652274 1402924 -4133289 -3974726
42272 -3974726 -148631 2830251 4209017 5410206 5704654 4038414 2896041 5114685
42264 5114685 7769522 4706884 -4245638 -11621808 -11515471 -6175305 -1358656 818197
42256 818197 1488027 1065741 -472769 -1581653 -1089935 -614628 -1797754 -2833096 -1334167
42247 -1334167 963450 674693 -1093164 3569 4145055 6335863 3985473 703448
42239 703448 441723 2209761 3486083 5017919 8434990 11899211 12335468 10399362 9289181
42230 9289181 9529921 8726725 6254615 4560398 5162174 6281726 5548796 2927853 -175228
42221 -175228 -3076718 -5751132 -7488959 -6965275 -3920411 -347268 765203 -1353856
42213 -1353856 -3697008 -2525800 2014848 6077039 7127282 6451286 5881569 4897341 2809311
42204 2809311 1107159 944789 468445 -2242279 -5240732 -5065776 -1953411 453902 -220495
42195 -220495 -3470696 -7650344 -10226537 -7972068 -916575 5232207 5224238 1859005 2253019
42186 2253019 7146562 10197720 8515774 6937450 9367304 12459741 11932515 9555285
42178 9555285 8909264 8819742 6617449 4239740 4759893 5224359 -279860 -10928385 -18592441
42169 -18592441 -17730259 -11111512 -4819738 -1763731 -1285593 -1485771 -434989 2145778
42161 2145778 3453440 512551 -4935465 -7609891 -5637968 -2871832 -2677192 -2914784
42153 -2914784 57272 4915263 6488569 2484837 -3925897 -8255067 -9014135 -7407885
42145 -7407885 -4789681 -1805829 855483 2390639 2767987 2814229 2968839 2630376 1406313
42136 1406313 260271 170710 200577 -1269105 -3552416 -4279636 -3365475 -3408633 -4920226
42127 -4920226 -4599652 -951474 1773713 -523291 -4411630 -3006701 3365488 6727004
42119 6727004 2851547 -2731984 -3070135 803021 3092975 2268881 1464546 1617947 45029
42110 45029 -3651071 -5417127 -2811401 530531 -146588 -3581510 -4375558 -1378882 232686
42101 232686 -3249133 -8046627 -8061568 -3609174 -392837 -586315 -356546 2557425 4411169
42092 4411169 2027868 -906788 752133 5179254 6611881 4833932 4698335 6533134
42084 6533134 4618822 -2734913 -8561502 -6683335 -412382 2990885 2457490 2315707
42076 2315707 4080715 4793178 2715414 -231988 -1995860 -2708321 -3101868 -3439378 -4228341
42067 -4228341 -5605672 -6002394 -3644992 569885 3543289 3223624 100246 -3652335
42059 -3652335 -5032516 -1775290 4622904 8820177 7254510 2664990 188600 379498
42051 379498 -273274 -2920665 -4812391 -4192766 -2497028 -967996 949068 2754424 2317332
42042 2317332 -210560 -1434205 302577 2107585 1017667 -1495124 -2156507 -871031
42034 -871031 -318695 -2010007 -5116910 -8107622 -9531126 -8267485 -4883186 -1781628
42026 -1781628 -396357 675284 3200397 6276272 7589920 6609054 4657424 2775200
42018 2775200 1376712 1124682 2079250 2565497 919491 -1932758 -3467191 -2888468 -1646378
42009 -1646378 -757620 364927 1954475 2629696 1347269 -361382 318514 3676600 6060442
42000 6060442 3595656 -2615659 -6636209 -4288056 1665873 4940776 3395491 467674
41992 467674 -738969 -1129157 -2271768 -2962421 -1579414 675723 1655550 1580022 1773531
41983 1773531 1587848 -484675 -3497105 -4686089 -3208246 -995437 15704 -270466
41975 -270466 -805882 -469259 1177312 3097225 3592235 2851700 3116951 5023990 5991898
41966 5991898 4338295 2607779 3795463 6328338 6469019 4150561 2414942 2258090
41958 2258090 2409447 3306138 6239729 8812187 6944083 2306628 1794082 7273498 11558291
41949 11558291 8387231 1567924 -872873 1860194 3691648 1801976 110417 1970767
41941 1970767 4677274 3753300 -551746 -3969783 -3915229 -2004104 -1292152 -2876321 -5487992
41932 -5487992 -7199716 -7012467 -5590839 -5023279 -7086687 -10881627 -12948424 -11074087
41924 -11074087 -7322272 -5320457 -5030858 -3194598 695540 2724808 713371 -1832694
41916 -1832694 -1225856 309928 -1480290 -5449825 -6896212 -5463015 -5356431 -7815855
41908 -7815855 -9159139 -7207511 -4250986 -2181284 137876 2716718 2732150 -402459
41900 -402459 -2808333 -1896985 -201175 -453504 -1011852 237677 1255812 -714891 -4110239
41891 -4110239 -5567551 -5027871 -4413821 -3498102 -1133848 1147618 658328 -2433677 -5608127
41882 -5608127 -7132824 -6260591 -2471990 2672032 5306365 3973765 2173527 3157421
41874 3157421 5009615 4365121 1882162 -112544 -2245820 -5534400 -7207449 -4645743
41866 -4645743 -1010317 -998882 -3104457 -2506093 64685 -529171 -4610223 -6957689 -5510512
41857 -5510512 -3710410 -3344198 -1989901 972705 2427166 1401609 650769 645428 -1530997
41848 -1530997 -5326526 -5771791 -2185775 -666256 -4099016 -6782319 -3956330 28982
41840 28982 -743639 -3880835 -3554154 -687082 -351132 -1965347 -211652 5490355 9876262
41831 9876262 10081144 8373157 6286467 2379228 -2835985 -5406920 -3635284 -947213
41823 -947213 -902890 -2811026 -4182953 -4331568 -3562411 -1681878 524357 794458 -1289154
41814 -1289154 -2491205 -24973 3913587 4564465 1158635 -1749847 -308684 3469437
41806 3469437 4423431 1063550 -2750855 -3249630 -1416826 -564858 -1148645 -733220 1739541
41797 1739541 4822262 7778509 11694951 16442344 19422693 18706601 14897744 8756935
41789 8756935 261498 -7924751 -9751758 -2672153 6670409 8169795 -237082 -10076424
41781 -10076424 -11869395 -4681911 4427160 8326767 5983557 1761378 -214553 -332284
41773 -332284 -1627186 -4447799 -5378475 -2317843 1868037 2871525 445023 -1992440
41765 -1992440 -2114539 -610294 954693 1722854 1124305 -891775 -2782728 -2170122 1660479
41756 1660479 6693893 9822090 9344407 6250311 3208083 1678635 284266 -2649696
41748 -2649696 -5404368 -4268394 951754 5786231 6804442 5659290 5616245 6802560
41740 6802560 7352223 6949017 6535038 6361481 6797641 9071546 12588545 13652603 9903745
41731 9903745 4166294 836434 432712 990181 2428524 5143575 6187146 2243322
41723 2243322 -4118742 -6451583 -3179305 461092 319925 -1314061 -261054 3179288
41715 3179288 4952399 2435102 -2901098 -7004736 -6815319 -3274413 -435900 -428154 -737279
41706 -737279 1369673 3748083 2378644 -1953859 -4574300 -4075975 -3767667 -5683722 -8025286
41697 -8025286 -9493556 -11256281 -12964829 -11578956 -6523997 -1751049 36585 1234135
41689 1234135 4360845 7020985 5663537 1504615 -1283987 -1261388 87432 2019877
41681 2019877 4480885 5560574 3006963 -1921648 -5455561 -6225707 -6171335 -6316991 -4826531
41672 -4826531 -546326 3962421 5003495 2325936 -702249 -1327605 -254324 315221
41664 315221 130232 708113 2085868 2027123 -603135 -3681855 -4713969 -4185939 -3909072
41655 -3909072 -3585292 -1879280 97640 -302025 -2986139 -4783262 -3673421 -863663
41647 -863663 1397183 1660402 -720775 -4659381 -6805090 -4951972 -1414799 296025
41639 296025 1096956 4215995 8399394 8995967 5903550 3897668 3845839 834378 -6134780
41630 -6134780 -10028712 -6237905 -685928 -1231600 -6069754 -7693407 -4524397 -995115
41622 -995115 1440241 5345216 10028767 10767327 6271054 865973 -2054242 -3524316
41614 -3524316 -4663756 -3955196 -1028657 1015117 -288133 -3171530 -4390292 -3485881
41606 -3485881 -2452046 -2646135 -3561584 -3976402 -3598701 -3689487 -5454638 -7515986 -6814855
41597 -6814855 -3161084 -246298 115843 1597153 7276407 12669066 10462354 1330651
41589 1330651 -5810247 -5078571 -105107 2152919 -347857 -4568194 -6821681 -5346808
41581 -5346808 -1194963 1879115 709311 -3238162 -5504340 -4522939 -2753609 -1780743
41573 -1780743 -278737 2147536 3170347 1529781 -887261 -2433964 -3741765 -4772855
41565 -4772855 -3601196 -223726 2100171 1764814 1542764 3717294 6029718 5700081 4309191
41556 4309191 5053108 7661380 9505549 9479215 7562604 3140274 -2587097 -5126896 -1998709
41547 -1998709 2477990 2326305 -1574298 -2890646 1048699 6354546 8723253 7941110
41539 7941110 5731303 3220065 1590763 1946370 3478210 4257456 4119537 4296716 4652522
41530 4652522 4402243 4884716 7632624 10131130 8353104 3788721 2408013 5282305
41522 5282305 6279525 2016383 -1886236 609038 5892887 5621133 -1031724 -6743709
41514 -6743709 -6787334 -3929843 -1896258 97556 3865893 7825429 9317566 8556173 7238354
41505 7238354 5224144 1661443 -1801723 -2140419 719221 3356353 3438995 2851516 4811723
41496 4811723 9032921 11666360 10148691 6507266 4836066 6376121 8507478 8379434
41488 8379434 5929868 2842246 84541 -2222634 -3437901 -2610879 -130440 2033466
41480 2033466 2226173 794599 -338125 423500 2887854 5436002 6826629 7235293 7076230
41471 7076230 5715496 2944444 1124637 3128752 7612707 9531925 7152615 5254132
41463 5254132 8042297 11678781 8947440 362766 -5208300 -2331882 3734633 4547318
41455 4547318 -604157 -5238283 -4884370 -1454589 1073970 1573786 1363561 1269728 733984
41446 733984 -718452 -2048246 -1163908 2806020 7784514 10064859 7655090 1897703
41438 1897703 -3879506 -6436609 -4255198 741198 3401759 94303 -6198735 -8349156
41430 -8349156 -3678529 2765152 4859954 2190074 -1782274 -4927604 -6701189 -5919224
41422 -5919224 -2133963 2253586 4509438 4863521 4548901 2674338 -1396347 -4654975
41414 -4654975 -3902557 -1216674 -1257606 -3991848 -5043874 -2897524 -522420 411523 1579650
41405 1579650 3308656 3098702 515719 -1228867 -468225 809781 2082412 6471767
41397 6471767 14622158 20798405 19073442 10488466 968581 -4864894 -5065778 531156
41389 531156 8494133 12107675 7996186 688151 -2926919 -1637798 945717 2644603
41381 2644603 3706793 3402885 406259 -3916754 -6350113 -5703980 -3234301 -391732
41373 -391732 1231557 -328334 -4419013 -6586928 -4014093 17495 1084606 463816
41365 463816 1985812 4512192 3832016 472322 -1421908 -2227919 -5912932 -10469138 -8179002
41356 -8179002 1676563 8869386 5986447 -1092715 -2832064 -9000 -25875 -3444160
41348 -3444160 -3591608 1374767 4977678 2793872 -911144 -299770 3633826 5932047
41340 5932047 5377155 4916137 6264865 8139616 9183043 9141939 7179628 2423023 -2931129
41331 -2931129 -4202460 51325 5109593 5426173 1423184 -1933558 -2321601 -2085507 -2962722
41322 -2962722 -3084731 -1157084 100820 -2036793 -5370701 -5562606 -2330235 868081
41314 868081 2352040 3422639 4274273 2855195 -1280242 -5437740 -7429433 -7957283 -8122211
41305 -8122211 -7287465 -4981388 -2527401 -1048341 95931 1163187 394836 -3197357
41297 -3197357 -6841222 -6377865 -1355526 4100713 5641695 2773491 -1434718 -3681320
41289 -3681320 -3012521 -598490 2103613 4195400 4811865 3461771 1528495 1658386 4285390
41280 4285390 6382501 5421658 2917371 1839877 2280374 2578976 3084997 5017906 6622960
41271 6622960 4798865 498481 -1668096 246736 3304481 4241303 2694366 -246373
41263 -246373 -2730729 -1440572 4985206 11482203 11130113 5274544 2809956 7189180
41255 7189180 10947398 7057965 -722456 -4379359 -3202817 -2282125 -3223335 -3251174 -1440551
41246 -1440551 392069 1739896 3000324 2358197 -1759218 -6330949 -6883453 -3886235
41238 -3886235 -1199328 469122 3323792 6922834 8426912 7660776 6566940 4624446
41230 4624446 716808 -1472343 2991530 11236027 14438162 9971200 4544578 3361882
41222 3361882 3538529 1373173 -1046161 -1024671 -942085 -3504042 -6171968 -5646878 -3869399
41213 -3869399 -4249881 -5422428 -4211702 -1924234 -2062813 -3922828 -4068432 -2767484 -3456396
41204 -3456396 -6376686 -7819117 -5865647 -2659685 -652692 -123513 -511958 -947017 492842
41195 492842 4833486 9470174 10316558 6775354 2153227 -423783 -138412 2347426 4920726
41186 4920726 4509173 970942 -903845 2675098 8015279 8427439 4167150 1747780
41178 1747780 3294072 3665017 78014 -2531338 326143 5212235 6552216 5117443
41170 5117443 4922126 5314132 2664453 -2107032 -4133719 -2062881 826841 2784474
41162 2784474 5180781 7373589 5702967 -402839 -5972272 -6608658 -3411928 374940
41154 374940 3836636 6681805 6641961 2534515 -2230511 -3144998 -500129 1596880 1197925
41145 1197925 47347 -370104 -623690 -824419 162503 1853542 1620189 -1151671 -2929899
41136 -2929899 -434940 4616979 7745178 7466466 5987283 4751750 2656207 -571218
41128 -571218 -2344144 -687295 2237231 2674110 416442 -1282172 -805218 -385385 -2298205
41119 -2298205 -5268395 -6532140 -5932971 -5709441 -6806038 -7529989 -6016219 -2433721 1515727
41110 1515727 3967212 3546351 62365 -4851990 -8716914 -10210553 -9521242 -7023290
41102 -7023290 -3184239 117636 351318 -2404960 -4629922 -3443726 -426970 466429
41094 466429 -1763478 -3821389 -2241980 2623198 7279244 8811748 7255813 4630867
41086 4630867 2402308 537824 -931305 -672704 2127809 5241358 4969421 869488
41078 869488 -3215436 -4084458 -3106250 -3334491 -4478656 -3492291 552577 4882426 6412893
41069 6412893 4686017 1391072 -1092459 -623594 3091661 7288644 8319561 5649889
41061 5649889 2194046 305669 -736727 -2426110 -3954599 -2993559 1049752 5617055
41053 5617055 6962548 3691188 -1291145 -3100511 -242423 3192657 2407426 -1945000
41045 -1945000 -5087300 -5063473 -4733109 -6157933 -6998825 -4743748 -1118191 1006460 2557226
41036 2557226 6103077 10251962 10651392 6407694 1313755 -1917435 -4466241 -6999103
41028 -6999103 -6785037 -2346908 2413894 3075125 1583289 3227864 7530376 8085419 2822964
41019 2822964 -1551034 876612 6069205 6051283 886742 -2292369 -1105071 -971080 -4800997
41010 -4800997 -7162276 -2980387 3725378 5458534 1800963 -1525601 -1669199 -750271
41002 -750271 -326210 294956 429456 -1803842 -5117237 -5637491 -2566197 1085640 3845107
40993 3845107 7086403 10223531 9863895 5653814 2180203 2583920 4462076 4611098 3712643
40984 3712643 3447126 2917094 1291874 522862 1908545 3093351 2069645 1128333 2864393
40975 2864393 4969340 3428373 -1030202 -4017192 -3668033 -1801369 -120225 862792
40967 862792 94101 -3014870 -6467205 -7901188 -8117559 -9158474 -10013476 -7965988 -3432909
40958 -3432909 318440 1808157 2184424 2118101 1577312 1943924 4203188 5610632 2837830
40949 2837830 -1717822 -2027719 2427263 5177536 2450625 -985056 851796 6188296
40941 6188296 8338963 5073126 694526 -371990 1658386 3823074 4432083 4311400
40933 4311400 5158538 7167436 8230821 6079332 1335923 -2701604 -3750450 -2674813
40925 -2674813 -1291479 284454 2661224 4773148 4528517 1797965 -909786 -1436054
40917 -1436054 -623236 -887842 -2499916 -2818747 -7597 3869554 5276928 3991633 3023244
40908 3023244 3855446 4768679 4673203 5264680 7443575 8655622 6583235 3085940 1464933
40899 1464933 1870560 2491338 3128695 4019920 3242591 -377351 -3421105 -1835559 2213439
40890 2213439 2616716 -1841215 -6269886 -7603461 -8024208 -9045177 -7860509 -2556360
40882 -2556360 3481576 5890934 4990488 3917970 3505821 2123094 -836410 -3881357
40874 -3881357 -5198428 -4123901 -1523423 790150 1898754 2647990 3309532 1850595
40866 1850595 -2639992 -6429565 -5392234 -1828684 -1715438 -5302807 -6659761 -3617084
40858 -3617084 -1414740 -3836490 -7176753 -6872779 -4345027 -2689230 -895562 2326546
40850 2326546 3722609 638610 -2731523 -743051 4749280 7321516 5882084 5047031
40842 5047031 6749356 8110643 7688915 7686483 8946018 8969442 6404818 3417120 2265647
40833 2265647 2739281 3687042 4122627 2683026 -809823 -3281913 -1338297 3623514 6579055
40824 6579055 5203469 1716461 -1338821 -3316978 -3482109 -1094366 1737985 1279331
40816 1279331 -2605386 -5943579 -6344455 -5588437 -5405041 -4476422 -1526405 1811213 3344016
40807 3344016 3152776 2383324 1344749 207441 -327141 -96077 473033 1623265 3488754
40798 3488754 4411462 2994330 1365283 2457463 4208703 1509777 -5188558 -8841948
40790 -8841948 -5698297 -837423 -375673 -2932257 -3227827 -257518 3035719 5304259
40782 5304259 6968308 6856464 3500221 -1401389 -4822762 -6408962 -7051899 -5550992
40774 -5550992 -1093127 2902517 2660113 492049 1710068 5735992 6536479 2440628
40766 2440628 -914279 607192 3816784 4265843 2951985 2901865 3151216 970854 -2429737
40757 -2429737 -3266155 -1186112 283011 -753432 -1894251 89944 5183774 10073279
40749 10073279 11183475 7914377 3374220 1086822 816167 -398058 -2632692 -1883046
40741 -1883046 3387921 7957427 6068432 -282970 -4004743 -2781914 -1121852 -2284600
40733 -2284600 -3518463 -1439311 2129279 2886394 -20715 -3798054 -5944102 -5675078
40725 -5675078 -2797630 2008406 6299803 7656649 6463163 5379551 6122792 7992073
40717 7992073 9358598 9410937 8449573 7307282 6458770 5362602 3232084 811827 351170
40708 351170 2889699 6308377 7088450 3725262 -1968305 -6263990 -6063688 -1378057 4102427
40699 4102427 6153221 4330157 1821666 787042 174957 -976050 -1149810 496240
40691 496240 1359325 -923034 -3956235 -3596439 -374569 1227167 -263388 -1313348 693854
40682 693854 3364127 3182650 807345 -92778 1912373 4090178 2913895 -1623506 -5548550
40673 -5548550 -5118344 -1321541 1225198 374426 -841556 683658 2916560 1849986
40665 1849986 -2039237 -4736437 -5112772 -5666111 -6879731 -5901181 -2063482 935478 426164
40656 426164 -1558861 -2150837 -1498030 -371464 2398412 6937551 9741039 7579815 2135136
40647 2135136 -2116529 -2987576 -1220152 1923845 5093365 6546111 5792562 4090364
40639 4090364 1785381 -2305164 -7039528 -8061080 -4036872 -486194 -3017819 -9197839
40631 -9197839 -11970939 -9456554 -6174245 -5382915 -5513607 -4469914 -2689030 -986256
40623 -986256 722680 1723001 1108699 649491 3224281 7592052 8730545 4720329 -550871
40614 -550871 -3172083 -3775200 -4140277 -3244236 -85475 2699727 2216138 455134 1829554
40605 1829554 6342671 9300905 8021463 4977717 3083639 1345380 -2290467 -6150768
40597 -6150768 -6393196 -2763173 623376 1102504 1066895 3657577 7186361 7211875 3238273
40588 3238273 -504793 -1400622 -1688951 -3671889 -5286406 -3558118 99559 1906088
40580 1906088 1695174 2804232 6172571 8542037 7656203 6027836 7454819 11618143
40572 11618143 14272131 12282598 7082466 2992069 2665568 4611706 5545572 4757178
40564 4757178 4686729 6817104 9080938 8853485 6583631 4129658 1181583 -3366895 -7350834
40555 -7350834 -6654885 -1320750 3144022 2284431 -1937883 -4198088 -2393310 930228
40547 930228 2673289 2574767 2498341 3703509 5404795 5806146 4260552 1907357 -88164
40538 -88164 -1985962 -4055404 -4595060 -1525206 3807624 6625801 3943280 -1419502 -3704656
40529 -3704656 -761900 3805496 5428071 4163190 4016427 6937988 9591981 7656268
40521 7656268 2090723 -1429195 561211 5431093 8440962 8375831 7471174 7293214 6872346
40512 6872346 4548641 222556 -4207191 -6155139 -4659222 -1618759 183831 226945
40504 226945 -31295 -221504 -1350988 -2881470 -2682159 -759541 394465 494808 2519026
40495 2519026 6842474 8648028 4838001 -280856 -884503 1776929 1953266 -1567454
40487 -1567454 -4771492 -5730074 -6612045 -8064527 -7131106 -2410283 2937036 5309043 4856722
40478 4856722 3970212 3741183 3157790 573252 -4213036 -8420321 -7982323 -2365261 3992989
40469 3992989 7080193 7873584 8914068 9329583 7184638 3897751 1403022 -2437863
40461 -2437863 -9648784 -15570570 -13661131 -5999016 -1417033 -2831656 -4165384 -1383761
40453 -1383761 1261466 -724488 -4588642 -5341174 -3309501 -2286250 -3527945 -5114361
40445 -5114361 -4824676 -1606384 3157377 5011266 827325 -5555209 -6866118 -2446599
40437 -2446599 855008 -730431 -2758209 -580336 3886292 6904623 8379742 8507340
40429 8507340 4882808 -2109054 -6310678 -3658597 1415284 2765786 1391937 1859587
40421 1859587 3979786 4452750 3682003 4408472 5696734 4515806 1880585 1652421 4138318
40412 4138318 6014461 5855783 5118369 4413261 3108794 1892521 1878026 2119715 1491603
40403 1491603 1541919 3864727 6430499 6458321 5131301 5333371 6485703 5983776 4142964
40394 4142964 3257799 3175346 2210856 1083212 1583500 2799940 3052657 3808735 6773491
40385 6773491 8810012 5350431 -2117159 -7510316 -8432859 -7505257 -6110005 -2991265
40377 -2991265 682868 1194217 -1386086 -2382931 2126 1534887 -1138646 -4876368
40369 -4876368 -4710959 -1081486 1177416 -279230 -2446357 -1319301 2477637 3949287
40361 3949287 245457 -4771462 -5393554 -2552448 -2363031 -5441151 -4458215 4009113 12019056
40352 12019056 10942980 4042100 592217 1824649 1788118 -660543 -766484 2067525
40344 2067525 2974774 1033459 789571 2940296 2342678 -2464494 -6123425 -5539362 -4143028
40335 -4143028 -4211116 -3009044 -19545 241850 -3000856 -3352141 2017063 6106102 3272082
40326 3272082 -578849 2726035 9880198 11100760 5444131 1458417 3565708 6740286
40318 6740286 5880398 3032684 2552555 4318063 5090776 3715307 2082275 1958958 2650326
40309 2650326 2032751 -391864 -2166242 -736969 2772632 4662961 3525125 1532732
40301 1532732 646372 464771 415902 860570 1146229 -121718 -1982189 -1856097 -144813
40292 -144813 92303 -1055390 92444 3904672 5750683 3647857 1630929 2178614 1599986
40283 1599986 -2427595 -4969510 -1552707 3658464 4412045 2505122 3581079 6515395
40275 6515395 5741400 1954248 1336534 4581660 5533720 1768791 -1574318 -607793 1836042
40266 1836042 2365206 2495718 4642613 7581434 9088287 9054512 7373272 2816127 -3242138
40257 -3242138 -5968287 -3187980 964388 1843904 822330 2256115 6000748 7144525
40249 7144525 2928206 -3327679 -6135985 -4081037 -1043378 -1350879 -4595376 -6638103
40241 -6638103 -5758883 -5056483 -6888367 -8064280 -4625601 798193 1991892 -1133537
40233 -1133537 -2092366 1982095 6185958 6423061 5742404 7688905 8859194 4366797 -2768276
40224 -2768276 -4656714 321821 5821381 6978657 5660075 5152750 5000873 3611561
40216 3611561 2023458 2133510 3669151 5266888 6477089 6744390 4679515 714221
40208 714221 -1550733 513165 4468156 5776890 3904385 2373152 3201802 4609848
40200 4609848 4556836 3331659 1647444 -826743 -3452484 -3814937 -1060307 2031025 2535978
40191 2535978 1164183 292271 231662 416748 2406208 7492483 12007317 9802946 552233
40182 552233 -8351967 -10077904 -5502108 -214076 2562423 3348943 3104649 2018616 858697
40173 858697 791777 1877848 3369466 5050264 6794235 7497914 6197445 3885373 2636111
40164 2636111 3045242 3713507 3026257 474537 -3304588 -6735206 -7995520 -6543063 -3671865
40155 -3671865 -962024 1114170 2469188 2524396 1255477 164776 845206 3064882 5186890
40146 5186890 5856470 4660759 2182333 100709 -33952 1197259 1860260 1885217 2987401
40137 2987401 4478896 2815310 -2175684 -4398317 830438 8909967 11153554 6457434
40129 6457434 1913059 1980754 3391414 2324856 522205 891516 1853536 375588 -2643100
40120 -2643100 -4318382 -4717740 -5562730 -5762925 -2809109 2106415 4750278 3801479 2284423
40111 2284423 2452771 2868372 1768189 95181 -597673 -715430 -1192219 -1520049 -1019839
40102 -1019839 -280516 408254 2127620 4770764 5445635 2300075 -1552834 -1313528 3063637
40093 3063637 7237463 8963206 10170476 11935409 11698092 7653395 2484446 -108779
40085 -108779 -145851 92802 39079 379005 527615 -179588 -231929 1794351 3962467 3497751
40075 3497751 1569540 1689436 3971817 5175107 4329882 3859094 4537694 3888958 967722
40066 967722 -1463919 -1338958 -4278 1353029 3988403 7868295 9612976 7349290
40058 7349290 4191847 3452260 3661806 2352609 1691414 5229071 10884321 12679812 9224626
40049 9224626 5607858 6124307 9079993 10095466 7682546 4257998 3401482 6628526
40041 6628526 11555542 13733951 11889241 10033246 11877931 14777444 13169568 7296888
40033 7296888 3646885 5839647 9708363 9619360 5809521 2359562 773687 -626921
40025 -626921 -2376820 -2816606 -1523378 -755283 -2255985 -4362721 -3793618 239303 4881446
40016 4881446 6801163 5859512 5087132 7157067 11387635 14288784 12694634 6545342
40008 6545342 -689677 -4470577 -3115369 655049 3139099 4217064 6446781 9725789
40000 9725789 10249107 6401572 2343571 2533198 5097914 4825193 1541040 721348 5186232
39991 5186232 10496641 10659635 5464732 -257670 -2730390 -2026827 152845 2675902
39983 2675902 4422911 3604788 -487957 -5314425 -6551687 -2913123 1776132 3278035
39975 3278035 2769569 4865859 9844810 12086316 8244648 2914088 2378011 5660677
39967 5660677 6604881 3273732 40368 432702 2901468 4770193 6028424 7327020
39959 7327020 7685455 6379782 4506187 2762686 111744 -3355543 -4606676 -1391137
39951 -1391137 3697018 5677649 3329222 588682 1407828 4778847 6009936 2709755
39943 2709755 -1651397 -1445198 3933370 8638902 7482821 2557920 268149 3051732
39935 3051732 7372620 9552472 9787395 9465165 8091211 5103370 2347834 2163505 4112586
39926 4112586 5674579 5658514 5324676 6218667 7981969 8608126 6623194 2802074 -695871
39917 -695871 -2853799 -4290189 -4865843 -2939769 1329255 4242178 3145524 976839
39909 976839 2156401 4964231 3218028 -3834465 -8841158 -6216161 -105293 1539837
39901 1539837 -2252763 -5367164 -3950308 -1045498 -1067999 -3241303 -2892418 1954031 7486032
39892 7486032 8348654 4131891 117714 1062233 5763104 9278518 9182007 7235993 5678707
39883 5678707 4875141 4724710 5391595 5936130 4849544 2711233 1808788 2465528 2473795
39874 2473795 896340 -638711 -1428195 -3077506 -5883777 -7349653 -6355173 -5254856
39866 -5254856 -5170731 -2836848 4124210 11735758 13983843 10826573 7438273 6507661 5814531
39857 5814531 3389860 823185 399161 2045293 4337070 6441930 8239133 10022931
39849 10022931 12307895 14539346 14389116 10198806 3844188 -760074 -1809682 -538977
39841 -538977 1346813 2932489 3298664 2068341 707392 877143 1616567 785403 -802408
39832 -802408 112571 4045151 7384442 7458990 5919960 5302627 5033511 3234828 264796
39823 264796 -2194006 -3875490 -5021288 -4163483 -23082 5009507 6608243 4048564
39815 4048564 1181131 1139780 2654100 2847987 1416945 177386 44079 554713 1578724
39806 1578724 3479525 5737243 7041404 6955670 6384047 6245352 6488211 6345168 4921275
39797 4921275 2068457 -403524 620007 5784891 10674338 9626096 2749531 -3264435
39789 -3264435 -2632888 3138947 7887040 8035225 5135857 2354187 958200 432098 309450
39780 309450 1129467 3925078 8675759 13226110 14676595 12398138 8788673 6552688
39772 6552688 6225932 6631278 6252259 3847062 -202766 -2610729 -3884 5858601 8930793
39763 8930793 6772073 3853495 4131209 4595917 1080366 -3082381 -1002819 6580803
39755 6580803 11217476 8414077 2938343 879363 2383486 4837028 7862424 11449124
39747 11449124 13100034 10760467 6137673 2265056 131333 -25281 2983288 8916708
39739 8916708 14601363 17605481 19118307 20636458 20543455 17263477 13457499 13285060 16923523
39730 16923523 21208492 24407672 26908225 28343186 28010372 27958541 31931982 40549374
39722 40549374 50338988 58142756 63697520 66832567 64949877 55869004 42266413 30822374
39714 30822374 26063557 26031631 25118393 20781092 15921314 14293378 15594193 16719328
39706 16719328 16172177 14744019 13054743 11510591 11932540 15520276 19260044 18452800
39698 18452800 13601935 10607239 12491684 14996530 12949416 7570638 4235406 5292538
39690 5292538 8170280 9265745 7536775 5328294 6651868 12753597 18904895 18812615
39682 18812615 13237829 10112208 14034265 20139079 21697543 19468007 18835251 20993382
39674 20993382 22473647 21660638 20497538 20291054 20271312 20248225 21075314 22437440 23006611
39665 23006611 22546019 21705904 20848591 21341946 26188805 36311970 47753482 55649439
39657 55649439 59368627 60644766 58945338 52978297 45072389 39207151 35507552 31299584
39649 31299584 26887198 25158623 25464093 23343304 17716918 13595951 15289589 20392566
39641 20392566 23084195 21176217 17654457 16440416 18234996 20265797 19706722 17247051
39633 17247051 16177809 17460591 17935950 15169836 11636171 11179044 13270781 14275751
39625 14275751 13064261 11709790 11484475 11791131 12586764 14451805 16459769 16914234 15893096
39616 15893096 14664013 13570143 12873561 13896703 16427379 17339336 15457617 15070370
39608 15070370 19769451 25318787 24707100 18761500 15145357 17272316 20756211 21097328
39600 21097328 18503359 14421132 9642949 6991093 9667309 15403916 18080809 16412786
39592 16412786 14843613 14687188 11851285 5843881 3118579 7011791 11272094 9131115
39584 9131115 3193658 510616 2546774 6009136 9630654 13895805 17081174 17697862
39576 17697862 18594145 22789805 27069447 25581607 18696558 12639925 10768615 10538960
39568 10538960 9271850 7819408 7436018 7304706 6864052 7403877 9548540 11360406 10624478
39559 10624478 7765957 5306654 5092319 6808900 9000567 10994955 13151962 14946505
39551 14946505 14257490 10423165 6837241 7350663 10396696 10602053 6879660 4472791
39543 4472791 7061940 11321128 12545750 11759500 12829440 15330183 15480816 13167347
39535 13167347 13110584 18283789 25480481 28684407 25306328 18668880 15145985 18374687
39527 18374687 25529920 30208830 29425218 25991766 23468718 21693675 19082048 16360361
39519 16360361 15058447 14396221 12829207 11223740 11436887 12852729 13343806 12929123 13564837
39510 13564837 15632314 17290711 17384446 16797210 16596161 16455063 15415110 13439632 11924421
39501 11924421 12485371 14775828 16356083 16246464 17308665 22019133 26939384 26256448
39493 26256448 21125206 19561788 24931605 30764194 30993103 29376561 32685582 39209969
39485 39209969 41655326 38918690 36968225 38507885 39360995 36372460 32435556 31420676
39477 31420676 33254958 36421620 40860593 45678697 47846840 46454595 45617695 49982535
39469 49982535 58895389 67560806 72834389 75697483 78888156 84309876 92766438 104656119
39461 104656119 120388592 140711936 166739553 198806093 234265426 266284431 286175346
39454 286175346 288719774 275563506 252813767 226163848 199916065 179348255 170065871
39447 170065871 173837757 187772495 208515188 234160771 260648988 279713459 283141295
39440 283141295 267631310 235156571 192302525 150229848 119633259 101753352 88189779
39433 88189779 72978769 60102180 54641993 52321514 45459074 35509750 30591230 31825547
39425 31825547 31405064 25271662 19187885 19289006 23638290 27009492 28414483 29518504
39417 29518504 29827726 28034174 25555348 24862191 25805014 26307560 25267976 22703946 18657209
39408 18657209 14002689 10996411 11160063 13470599 15767973 17013554 17526144 18152558
39400 18152558 19512552 20719081 19093031 13359204 7142023 6434388 12655947 20677676
39392 20677676 24883246 24927504 24150863 24535270 25381147 25845745 26662449 29089324 33001767
39383 33001767 36550269 38016387 37795054 37527178 37275359 35439913 32045303 29544277
39375 29544277 29010809 28552951 27598200 29026289 33420164 34975834 28739650 19513113
39367 19513113 17010285 22927939 29347729 30282255 28313628 28297101 30545902 32886219
39359 32886219 34609753 35595173 35411392 35658841 39537529 46861871 52942733 54482560
39351 54482560 53289853 52376115 51940504 51204478 50657771 50217769 48370336 45302366 43889659
39342 43889659 45638146 48570126 50747983 52788435 55505240 58477653 62168220 67571366
39334 67571366 72615993 73533934 71250229 71044754 73716383 73083358 65593153 56328968
39326 56328968 50897669 47058105 40109029 31689680 26675739 25002171 23138282 20712521
39318 20712521 19126308 16312443 10033512 4492044 6015978 12781390 16381732 14182264
39310 14182264 12814961 17462957 24229639 26527630 24166369 22035430 22537394 23094612
39302 23094612 20563223 15968391 14199591 18680662 26475742 30687422 28746015 25419338
39294 25419338 25362305 26327052 23921672 19825708 19334580 22523092 24410989 23494851 23482380
39285 23482380 25892946 27529080 26990217 27255170 28946220 27048653 18574002 8832757
39277 8832757 5250403 8054398 11590747 12470658 11837083 10992059 9315803 6596981 4178395
39268 4178395 3255876 3895162 5635920 7597037 8530598 8256334 8362907 10004964 11808578
39259 11808578 11660245 9960001 9252312 10738249 12708018 12668604 10019538 6420900 4100477
39250 4100477 3814449 4196824 3402073 1515848 626356 2128575 4787294 6191280 5573521
39241 5573521 4435824 4604503 6168800 7296219 6062361 2780731 335773 1429199
39233 1429199 5369313 8394244 7593132 4014122 1554196 3114336 8097000 13455572
39225 13455572 16871337 18553019 19721137 20097799 18320848 14788176 12089086 11642601
39217 11642601 11698449 10166476 7805983 6635989 6572381 6185581 6038708 8439743 13607693
39208 13607693 18322573 19207966 16245223 12707604 12162641 15116882 18182160 17634365
39200 17634365 14119120 11690819 11511688 10030581 5536227 2294223 4056620 7302858
39192 7302858 6698090 4248747 5812684 10300848 10857296 6851531 5588700 9966706
39184 9966706 13466300 11478064 9141802 12082956 16743725 17111901 14974558 15347133
39176 15347133 16495971 13488197 8506148 8261852 12528438 14266814 11057505 7895086
39168 7895086 7902993 8532844 8540441 10600138 14281284 14019841 7850087 1651601 735476
39159 735476 3193949 5677632 9475595 15476820 18796293 15202871 8921796 7134410
39151 7134410 9524045 10160849 7736655 6598481 8160217 8429334 5153037 1469101
39143 1469101 695965 2311973 4832936 8294352 11892269 13095223 11447315 10070392
39135 10070392 11146270 12767527 12673764 12640886 16327963 24135679 32705309 39148854 44217006
39126 44217006 51072019 60978944 69976488 71182499 62417992 50445456 44553958 46446243
39118 46446243 50161169 51777715 54179476 60774751 69759141 78039290 86813409 98898117
39110 98898117 112965988 124486205 130686598 131001735 124364754 110218025 91572918 73515469
39102 73515469 58801735 47351175 38941947 33324101 28614824 22918951 17053865 12760011
39094 12760011 9181524 4609508 925730 2168298 8431758 14827527 17021123 14723066
39086 14723066 9701392 3974180 342043 861588 3717986 4824028 3280712 1953170
39078 1953170 2120229 1555638 -962280 -3441409 -4728517 -6595150 -9357346 -9420470 -4489701
39069 -4489701 1981681 5178688 5336693 6129835 8475256 9730134 8328906 6024149
39061 6024149 5362040 6743767 7971155 6105147 813985 -3970088 -3979953 -631183 100945
39052 100945 -4065719 -8518053 -8926692 -7284227 -7202902 -7247508 -4078591 529373 1735843
39043 1735843 -348912 -381542 4133011 9312212 10571898 7943954 4234947 962997
39035 962997 -1878074 -3663910 -2601423 2414585 9443515 13756440 12431214 8742353
39027 8742353 9014279 14584375 21140492 27340997 37754071 52876211 62589816 57214593
39019 57214593 41187048 27373036 20334398 14428243 7092773 3166448 4307330 4457586
39011 4457586 77023 -3609629 -1710280 2179796 2563935 668910 456241 1144842 42870
39002 42870 -1230806 292984 2769731 2189344 -1274269 -4739984 -7690724 -10289934 -9708742
38993 -9708742 -4379484 489000 -1497557 -8100651 -10926296 -7061845 -1621397 1020359
38985 1020359 1435209 -35515 -5097461 -11662019 -12989010 -6691040 461492 977820
38977 977820 -3938458 -7487697 -6628984 -4088136 -3226209 -5052497 -9109978 -13625378 -15285833
38968 -15285833 -11948652 -5563028 -241918 2237960 3103788 3497309 3245458 2717797 3440425
38959 3440425 5882601 8103954 7661436 4217948 -331661 -3779654 -5089344 -4387997
38951 -4387997 -2363782 -39265 1377984 1328333 758292 1262950 2827896 3346021 1359635
38942 1359635 -1562612 -2667733 -1778592 -1441053 -3217972 -5611417 -6395719 -5681104 -5600236
38933 -5600236 -7564559 -10668009 -12728911 -12611861 -11354194 -10575596 -9866818 -7149817 -2457933
38924 -2457933 442028 -1585132 -6104906 -7415064 -3743568 713923 1613240 -437460
38916 -437460 -2053487 -2080328 -2161029 -3221995 -3436811 -191076 6307295 11728476 11013202
38907 11013202 4133739 -2657401 -3332685 1004338 4256636 3503763 1371881 397701
38899 397701 -319166 -1486107 -1351415 223822 -366150 -4804622 -8482915 -6200352 260398
38890 260398 4839834 5589356 5522517 6394944 6878960 6717175 7648097 9507178 9797234
38881 9797234 8142143 7286268 8645489 10496554 11508296 12343700 12727435 10868938 7271128
38872 7271128 5291721 6235581 7662870 8292801 10320440 14376600 16543066 13944435
38864 13944435 9688021 8270411 9062199 8470045 5958574 3535691 1350178 -1668314
38856 -1668314 -4289862 -4441185 -3002610 -2202203 -1688871 -305502 117649 -2275316 -4355048
38847 -4355048 -1971688 2125506 1322161 -3779292 -5136348 -177381 3001287 -2183591
38839 -2183591 -10123848 -10847498 -3988383 2103812 2832915 1814189 2930311 4208785
38831 4208785 1847490 -3495197 -7213525 -6201563 -2088771 805479 219612 -1752977
38823 -1752977 -1755251 13070 97052 -2854375 -5737903 -5357726 -2690770 -954300 -1557118
38814 -1557118 -3914250 -7100928 -9398536 -8255465 -3357054 1812636 3799402 2946911
38806 2946911 1358381 -490953 -2557376 -3465523 -3276278 -5046162 -9411439 -10791842
38798 -10791842 -4839345 2774221 2517677 -4654647 -7452611 -518741 7569736 6738453
38790 6738453 -902149 -5708217 -4131373 -1044268 -893469 -2888141 -4479906 -4498390 -2520952
38781 -2520952 937606 3333042 2573935 670995 1482132 4627942 5481944 2280524 -531907
38772 -531907 1662955 7080151 9902813 7651151 3226865 147213 -1446640 -3406891
38764 -3406891 -6220950 -8369773 -8346190 -6395693 -4318657 -3754650 -4465906 -4453451 -2296093
38755 -2296093 862469 2598162 2337070 1764816 1926501 1966308 1691261 2817479 5393789
38746 5393789 5504085 425351 -5493226 -5221463 791913 4622397 2464114 -23902
38738 -23902 2587159 6528695 5366413 847452 -213623 2780113 4212383 2766233
38730 2766233 3368185 7268217 8495701 3834433 -693063 1533630 7829022 10635158
38722 10635158 8143082 4604119 2462306 222442 -2611700 -3895026 -2684146 -680609
38714 -680609 882696 2642090 4929474 7128507 9613747 13261577 16132599 13779401
38706 13779401 5015094 -4533028 -7231325 -1543414 6439060 9802832 7609097 3884514
38698 3884514 1265961 -1482490 -5052391 -6211446 -2207885 3441843 4327146 192955
38690 192955 -2433725 14345 3024514 1631798 -1765276 -2093103 -428436 -1830726
38682 -1830726 -6002029 -6888282 -2220962 2632436 2586760 -363026 -1525268 -776556 -1064319
38673 -1064319 -1885489 636360 6849502 10968750 7609189 -1331577 -8925662 -11390793
38665 -11390793 -11239983 -12114017 -13539922 -12775775 -9699477 -6850436 -5480985 -4672597 -4169464
38656 -4169464 -4752021 -5301022 -3037762 1856744 5099134 3887826 870872 72381 1247195
38647 1247195 1167489 -1189362 -3638963 -3999850 -2117365 312480 352791 -4070459 -10944647
38638 -10944647 -15036500 -13775373 -9885705 -6433822 -2876903 1076806 2018913 -1893061
38630 -1893061 -5887604 -4921660 -2232851 -4271049 -8870286 -7187511 2052343 9210140
38622 9210140 7589877 2664415 2711875 6821193 8392031 6008340 4041961 4632993 5173910
38613 5173910 3330269 -30020 -3021863 -4574608 -4177973 -2366342 -1096153 -1578042
38605 -1578042 -2573884 -2761256 -3272662 -5328211 -6894675 -5095893 -1226826 188430 -2490620
38596 -2490620 -6037222 -7207842 -6747219 -7166058 -8617042 -8843859 -6352751 -2149014 1575921
38587 1575921 3625820 4397060 4544598 3565024 387040 -4569992 -8877758 -10369849 -9425694
38578 -9425694 -8235726 -8051551 -7910539 -6206528 -3039609 -450024 -15480 -699830 -233881
38569 -233881 1334182 1348941 -1131115 -2814162 -284559 4841995 7762942 6603354 3599430
38560 3599430 910755 -1034229 -1266743 1242558 4061684 2774229 -2283278 -5031120
38552 -5031120 -1834945 3299592 4777904 2948679 1746224 1908807 1145827 -819618
38544 -819618 -1971730 -1962021 -2378339 -3357055 -3231579 -1368277 1326361 4125572 6138460
38535 6138460 5347439 1139196 -3033711 -2931861 868212 3808161 3456213 1575271 311262
38526 311262 -305419 -811909 -1303028 -2260811 -3736061 -3900090 -1375083 1427005 906593
38517 906593 -1974104 -2738246 -549096 373418 -2227681 -5078443 -5295208 -5342847 -8366356
38508 -8366356 -12085488 -11900654 -8080714 -5250593 -5356041 -5352903 -2526264 1212833 1984122
38499 1984122 -818061 -3556158 -2386389 2442230 6685893 6680515 3307140 459993 28036
38490 28036 195988 -1078408 -3069524 -3807157 -2752800 -544796 2419049 5512007 7124486
38481 7124486 6171358 3940686 3180930 5467428 9870583 13587273 13830039 10424248 6713935
38472 6713935 6095322 7409406 6352120 2241689 -47693 2863649 7191612 7102615 3263631
38463 3263631 1711323 4962428 8888637 9023379 5885193 2536913 206588 -1547947
38455 -1547947 -2702850 -3054006 -3233140 -3713199 -3889040 -3370804 -2836525 -2315270 -248800
38446 -248800 3847608 7162464 6595844 3511371 2714147 6018179 9158963 6776060 -782180
38437 -782180 -7556861 -8638327 -5002327 -1246126 -91040 -545206 -668143 -66879 807628
38428 807628 2084716 3892692 5334767 5424938 4491855 3406590 2034381 20019 -1374288
38419 -1374288 -304288 2600632 4316633 3291985 1362256 849567 1654805 2603017 3780075
38410 3780075 5521269 6580221 5705022 3980188 3073081 2147361 -367517 -2644302 -1160868
38401 -1160868 3093410 4691740 1836751 -285721 2366571 5386205 2030796 -5917612
38393 -5917612 -9826058 -6415357 -2018159 -3185528 -8527558 -12452932 -12316020 -8607990
38385 -8607990 -2260387 4100762 5637642 970226 -3855345 -2186005 3749032 5466654
38377 5466654 21085 -6277042 -6967237 -3344094 -1032863 -2430453 -5347784 -6843908
38369 -6843908 -5930509 -3688770 -2176695 -2338798 -2735353 -1795648 -729642 -1421561 -2001974
38360 -2001974 1159159 6397691 6796747 -249201 -8098188 -9130359 -4263235 -80161
38352 -80161 359033 -1026180 -2747955 -5123842 -7037141 -6352555 -3739082 -2016406 -1628214
38343 -1628214 -627201 876241 487647 -1707740 -2348595 -17249 2405941 2172191 356338
38334 356338 -447859 531517 2597487 4872860 6105491 5502546 4538116 5420597 7330637
38325 7330637 7331560 5481284 5002067 6243163 5253063 808616 -1969276 1008595 5810517
38316 5810517 5879240 1618641 -982146 154703 861586 -1900823 -5410449 -5424081 -1472246
38307 -1472246 3667564 7207995 7724101 5301557 1576781 -1485157 -3298929 -4323847
38299 -4323847 -4630846 -4269691 -4157806 -4534163 -3415293 797240 5770788 7269884 4593385
38290 4593385 1053541 -925869 -1982772 -2879431 -3017221 -2881219 -4477395 -7651031 -8927039
38281 -8927039 -5965699 -823263 2857661 3574969 1541019 -2501502 -6075302 -5691322
38273 -5691322 -1570450 1042173 -1495023 -5678318 -5703562 -1798703 897857 698420 1332951
38264 1332951 4962560 8177562 7179871 3343469 814615 959630 2045397 2921004 4040763
38255 4040763 5189195 4787640 2232103 -529203 -770957 2060414 5778863 7781604
38247 7781604 7475006 6155629 5026335 4270667 3936578 4174678 3930156 1132687 -4221502
38238 -4221502 -8595637 -8767790 -6237169 -5107205 -6074743 -5819406 -2758133 229684 467309
38229 467309 -364268 637154 2732873 2989022 1059887 -740235 -1284100 -1318931 -798818
38220 -798818 964819 2319303 166083 -4956371 -8075382 -6069379 -1874217 156397
38212 156397 558095 2846990 6748042 7635229 3251726 -2572215 -4647204 -2589558 -288440
38203 -288440 -605730 -2711687 -4289603 -4515185 -4237101 -4140064 -3722870 -2331807 -654657
38194 -654657 -173353 -788431 -178490 3167383 7023454 7447271 3767007 -374972 -1552214
38185 -1552214 -372426 158863 -1500039 -4412926 -6646750 -6389153 -2776503 2805461
38177 2805461 7041124 7696733 5637345 2909272 279847 -1808024 -1746978 1001525 3414558
38168 3414558 2071778 -1465036 -1970395 2249746 6981968 8159241 6912309 6444507
38160 6444507 6732541 5329267 1744010 -1948872 -4016514 -4052382 -1761385 2586692 6649189
38151 6649189 7518459 5248177 2898077 2469920 2591784 1100139 -1684647 -3631149 -3823281
38142 -3823281 -3429060 -3692502 -4261878 -3987048 -2776452 -1953885 -2658082 -4238149 -4556298
38133 -4556298 -1978878 2793949 6695810 6484315 1913239 -3191127 -4307630 -1274003
38125 -1274003 1540406 1186148 212825 2394690 6146024 6119895 1117463 -3857006 -4547050
38116 -4547050 -2510346 -1287203 -1181802 -723160 -266720 -662844 -619022 1005894 2177446
38107 2177446 788448 -912302 524449 3258150 2055342 -3136333 -5946191 -2673658
38099 -2673658 2199732 2588288 -908614 -3172457 -2499130 -1854483 -2900788 -3105123 -103377
38090 -103377 3956096 4774982 1578187 -1840925 -2149730 -765514 -1520360 -4947260 -7390471
38081 -7390471 -6239281 -3349774 -1566914 -336907 2261777 4819853 3859981 -465539
38073 -465539 -3864513 -3975217 -3427141 -5069899 -7069659 -5456928 -64824 4667036 4602930
38064 4602930 26667 -5244155 -7918376 -8018248 -7706086 -7833771 -6883201 -3790490 -71602
38055 -71602 2336469 3611366 4328218 3208733 -237501 -2687041 -1105668 1161448 -2037115
38046 -2037115 -9621593 -12885786 -7335075 613102 2312325 -2188472 -6104220 -5412100
38038 -5412100 -1926366 904718 1193217 -1018921 -3456534 -3069885 -23692 2048602
38030 2048602 1786231 2431332 5404746 6133071 1250203 -4230150 -3557522 1057745 2190060
38021 2190060 -175050 1246332 7895623 11621838 7157077 354530 -832934 2590840
38013 2590840 4125175 1654237 -1919224 -4753006 -7034801 -7618875 -4941783 -801668
38005 -801668 910488 -792505 -3302242 -4330796 -3833538 -2638999 -1814676 -2788993 -5497063
37996 -5497063 -7004059 -4607839 250287 3873151 5461233 7160113 9185907 8757435
37988 8757435 4998666 1451658 1507060 3753990 4442123 2941708 1804794 2032697 1540223
37979 1540223 -764235 -2118849 499705 5257866 6949863 3844937 105741 -256289
37971 -256289 727627 -1715296 -7197159 -9680730 -5629997 1006981 4118716 3098724
37963 3098724 2246905 3887449 5333956 3031526 -2442331 -6496141 -5012449 1396957
37955 1396957 7280521 7132749 1092171 -4756199 -4637511 1041486 6957682 8931518
37947 8931518 7148727 4095099 1474769 -407005 -1743132 -2601288 -2781558 -2191752 -1675050
37938 -1675050 -2811659 -5861004 -8427322 -7716674 -4183151 -1429515 -1949582 -4170995
37930 -4170995 -4572929 -2012657 993512 1172523 -1952835 -5668110 -7059011 -5920842
37922 -5920842 -4199866 -2972053 -1369578 1042072 2469456 1063406 -2041989 -3840373
37914 -3840373 -3419322 -2928720 -4336099 -7003852 -9140816 -10032556 -9806874 -8367355 -5983545
37905 -5983545 -4084654 -3951948 -4958670 -5409021 -4956792 -4893489 -5946602 -7080609 -6935570
37896 -6935570 -5379007 -3025683 -269842 2262899 3233723 2000408 94896 -298825
37888 -298825 624594 432100 -1953534 -4547760 -5184248 -4494246 -4497154 -5490163 -6203567 -6167455
37878 -6167455 -5898683 -5343609 -4285388 -3809263 -4867669 -5623773 -3203927 1538212 4300069
37869 4300069 3534688 2977212 5744115 8946701 7570879 1885968 -2799200 -3299870 -2088160
37860 -2088160 -3129364 -6752202 -9859531 -9966837 -8004270 -7170066 -9017699 -11138335
37852 -11138335 -10017573 -5992171 -2993849 -2901187 -3397511 -2886169 -3498488 -6137963 -6647518
37843 -6647518 -1849356 3827664 3946896 81114 -1008348 900572 -814301 -7176792
37835 -7176792 -10072621 -4929532 1392887 1183463 -2601092 -2506051 1344313 3619596 4242096
37826 4242096 7299146 11445899 10746355 5209720 1772776 3264975 4380228 1115059
37818 1115059 -3267608 -5162760 -6528899 -9226064 -9545556 -4238574 2488038 4203870
37810 4203870 1496134 103360 1928233 3593160 2635439 -205386 -4046890 -8092875
37802 -8092875 -9344358 -5293720 960304 3207222 195367 -3505709 -5122375 -6763608
37794 -6763608 -9579434 -10611505 -8408566 -6745053 -8711464 -11053779 -9011310 -3901629
37786 -3901629 -973768 -1583126 -2559310 -2506396 -3589087 -6501802 -8131779 -5881906 -1231095
37777 -1231095 2593741 4159626 3769347 2033905 -83848 -1483250 -2352511 -3835828
37769 -3835828 -5384379 -4451607 -387580 3148459 1978599 -3103100 -6830857 -5695644
37761 -5695644 -2121977 -1593117 -6173180 -11812047 -12700012 -8090431 -3442285 -3769355 -7205930
37752 -7205930 -7490777 -2323519 3863824 6221572 5347884 4739244 5022518 4047690 1550682
37743 1550682 184300 1529768 3727625 4104304 2531720 1152987 1556676 2821679
37735 2821679 2205232 -1832415 -6890879 -8091296 -3557772 2762312 5728038 5382627
37727 5382627 5910915 8758180 10477998 8371246 4698915 2952810 2522901 107596
37719 107596 -4929414 -9605131 -11272021 -9910542 -6461897 -1439328 3942977 7296250
37711 7296250 7326210 5701115 5201052 6221366 6410437 4096394 813198 -761377 -608805
37702 -608805 -1151715 -3146995 -4311912 -3314162 -2382070 -3226701 -2949749 1408521 5641635
37693 5641635 1929695 -9298881 -17395025 -14744480 -6597802 -2872703 -4707124 -5527703
37685 -5527703 -2429671 1080425 2840190 4889506 7410690 6731410 2093010 -1270501
37677 -1270501 690680 4990158 6401413 4300775 1168128 -2252527 -6244184 -9208075
37669 -9208075 -9434642 -7854615 -5780723 -2357209 2192827 3696977 -781476 -7033860
37661 -7033860 -8383845 -4978826 -2753543 -3894512 -4791917 -3978860 -5077366 -9258108
37653 -9258108 -11168051 -6754325 -233446 2044336 1170560 3098080 8353282 10814395
37645 10814395 7173514 1837791 151567 1135970 390738 -2554971 -3854839 -1461943
37637 -1461943 2084122 3569119 2806880 1031711 -1804150 -5565715 -7436717 -4447231
37629 -4447231 1466335 4338100 1348366 -3719689 -5948341 -5439300 -5332235 -6027398 -5143741
37620 -5143741 -2206807 458583 1546770 2169727 3063980 3402012 2924319 2431102 1615614
37611 1615614 -651314 -3221537 -3112554 -247900 1464887 -496342 -3771906 -4947513
37603 -4947513 -4039642 -2872447 -1704235 -290898 -43505 -1958643 -3983231 -3494327 -1229276
37594 -1229276 91372 539 299907 1674946 3098169 4023395 4521210 3744131 935205
37585 935205 -2334970 -3529219 -2635717 -1940355 -2492966 -3246697 -3674103 -4630178 -6061824
37576 -6061824 -6034049 -3041020 1739219 4856174 2999605 -3792956 -10391537 -10113962 -2201011
37567 -2201011 6220184 8529640 6850324 7789528 11685773 11924420 5387399 -2267582
37559 -2267582 -4235945 -1033927 1866450 1756518 597124 789726 1818813 818160
37551 818160 -4307317 -11392580 -14148503 -8532924 1027406 5502153 2127906 -2762655
37543 -2762655 -3179496 -788238 52365 -494242 -135578 -48394 -2351336 -4631104 -3165263
37534 -3165263 -162759 -1347036 -6476709 -8730762 -4801501 391375 1535392 158932
37526 158932 353229 1490960 108548 -3129057 -3408740 1213109 6596477 7625932 4247782
37517 4247782 720208 -163492 -224056 -2663567 -6916026 -8743342 -5877401 -1357015 555074
37508 555074 -46540 -31917 1136445 968124 -947372 -1738580 -490212 -584424 -4316916
37499 -4316916 -8582679 -9072846 -6040428 -2492818 774522 4162163 5426924 2168985
37491 2168985 -2544751 -2676483 1888818 4301920 491266 -5108574 -6618835 -4912566
37483 -4912566 -4301041 -4520998 -1766699 3690866 6730650 4783206 1191236 -335129
37475 -335129 -626853 -2164339 -4353402 -4567479 -2267735 427938 1563906 1007904 -123470
37466 -123470 -412115 955282 3310376 5092958 5729264 5864088 5485138 3676397 1016643
37457 1016643 -31781 1303947 2278756 490929 -2389885 -3407389 -3055895 -3789971 -4926993
37448 -4926993 -3219896 1290107 4131232 2596363 -277491 -142228 2660715 4077371
37440 4077371 1972505 -1543471 -2951135 -868433 3045468 5720256 5356786 2875928
37432 2875928 303652 -1996222 -5071894 -8425848 -9583014 -7607259 -4902847 -3867398
37424 -3867398 -3623533 -2239835 -628500 -1333999 -4054863 -5427801 -3729922 -1229520
37416 -1229520 -801215 -2269967 -3647753 -4508472 -6119793 -8656106 -10116436 -8582029
37408 -8582029 -4734875 -1651477 -2295936 -7033836 -13001687 -16041402 -14224418 -9796967
37400 -9796967 -6751247 -6051113 -4534856 378213 6340951 8714588 6953792 5402076
37392 5402076 7065624 9558197 9126218 6338685 4909652 5971586 6491898 3570236
37384 3570236 -1759619 -5614988 -5181010 -1482086 1275094 -212146 -4444152 -6573643
37376 -6573643 -4322893 -431583 1776250 2407762 2637523 1695633 -455169 -643985 2712562
37367 2712562 4979999 1083868 -5974764 -8858643 -7104399 -7191988 -11160091 -13244709
37359 -13244709 -9988586 -5829166 -4947171 -4747134 -2202343 -152760 -1538754 -3029881
37351 -3029881 -885000 1579085 -577291 -4739976 -4409368 471689 4065038 3781807
37343 3781807 1957985 -280139 -3796100 -6677503 -5545952 -1837732 -645429 -2997269
37335 -2997269 -4972524 -4557685 -3677902 -3478817 -3429897 -4810237 -8732076 -11152666 -7222357
37326 -7222357 -576284 139657 -5081191 -6820557 -1422500 3169640 1133334 -1925741
37318 -1925741 -160609 1526055 -3098891 -8862586 -6906665 -17607 1587099 -2799144
37310 -2799144 -3691448 2251527 6723381 3391836 -2752984 -4274826 -1966720 -1236592
37302 -1236592 -3164826 -4608390 -3898094 -1819129 964529 3852923 5275514 4516653
37294 4516653 3191102 2768110 2177501 -136712 -3257567 -4759644 -3455499 122793
37286 122793 4484955 7217269 6112522 1900726 -1651498 -1838807 223272 2052764
37278 2052764 2948472 3049965 1531675 -1715312 -4209139 -3510902 -820444 642792 73801
37269 73801 -764808 -1149350 -2041265 -3184731 -2870975 -1361915 -1399838 -3849636 -5742653
37260 -5742653 -4836461 -3538842 -5142149 -7836977 -6405809 235695 6859439 8272336
37252 8272336 4828426 227741 -3178848 -4579345 -2921520 1372274 4176192 1224132
37244 1224132 -5798376 -10209090 -8379891 -3791131 -1623486 -2279446 -2635608 -1431737
37236 -1431737 -327518 -568610 -1305006 -1055053 896580 4031078 6089110 4295559 -831233
37227 -831233 -4275978 -1990447 3486107 6344708 5763711 6389921 10085009 12318586 9295519
37218 9295519 4227935 2486198 3633374 3113220 142697 -1324562 573828 2729377
37210 2729377 2279316 637111 258469 614772 -43430 -1308072 -1844389 -2372031 -4402770
37201 -4402770 -6828858 -6873886 -4619617 -3753411 -6570764 -10225625 -9927387 -5179586 -804893
37192 -804893 -1102413 -4416070 -5282589 -1696224 2227189 2190441 -78734 219243 3054590
37183 3054590 3257481 -1122017 -5103302 -4326928 -2033915 -3877113 -8753104 -10630497
37175 -10630497 -8240824 -6599645 -8298494 -9456254 -6672802 -2778305 -2152050 -4184904
37167 -4184904 -5167604 -3834232 -1433639 1319603 3790441 4019126 1457280 -596224
37159 -596224 1078130 4810319 6780042 6809241 7183737 7335143 4964421 1778983 2213333
37150 2213333 5725202 6219766 1200500 -3804092 -3075300 1403247 3625627 1736495
37142 1736495 -1507020 -3893635 -5102140 -4416812 -1310864 2057410 2376076 -577747
37134 -577747 -3654361 -4256751 -2554092 -135756 1593814 2133322 2753694 5689290 10373113
37125 10373113 11926750 6659847 -1782310 -5807603 -3615726 -1216320 -3338869 -6749900
37117 -6749900 -5747403 -894608 2167320 1074646 -642645 631702 4098495 6850619
37109 6850619 7403182 5392547 717812 -4706097 -6725809 -3536717 943680 1591429
37101 1591429 -867022 -1198374 1773537 2545104 -2814669 -9646761 -10118298 -3789376 1915659
37092 1915659 1811922 -944488 -645047 2642660 3922765 910592 -2910795 -3529652 -1981552
37083 -1981552 -2638734 -6935914 -11098279 -10734866 -6159945 -1807888 -1118207 -3548143 -6361117
37074 -6361117 -7543403 -6574683 -4087754 -1785791 -1472781 -3109633 -4621176 -4260991 -2307702
37065 -2307702 -224282 477708 -1488722 -5820371 -9115849 -7584136 -2278160 1634586
37057 1634586 2306581 3781808 8389379 11254343 7276021 -243330 -4241324 -4500639
37049 -4500639 -6297507 -9875907 -9742373 -5278518 -3535967 -8283656 -13460641 -11865057
37041 -11865057 -4607446 2561533 7157670 9300328 7837569 2831583 -1457836 -1544285
37033 -1544285 7689 -755699 -2261619 -852759 1535808 -142628 -5211784 -7791211
37025 -7791211 -6144349 -4975581 -7295536 -9915853 -9090534 -5748235 -2742958 -901381
37017 -901381 -79324 -595180 -1333941 315445 4201946 6027248 2914049 -2024691 -3502295
37008 -3502295 -702680 2587621 3234617 1519705 -700385 -2180985 -2477527 -1538351 327113
36999 327113 2385983 3314129 1544201 -2806390 -6297602 -4651173 1899377 7631958
36991 7631958 7613704 3574937 1175511 2289321 3021068 -201248 -5538366 -8574607 -8187327
36982 -8187327 -6856942 -5985946 -4225967 -1211429 250180 -1800620 -4299858 -2410721
36974 -2410721 3596636 8152243 7625800 4569305 3295925 4000677 3562822 352963 -4247571
36965 -4247571 -8132681 -10048762 -9367145 -6250241 -2242774 356569 -792 -3035168
36957 -3035168 -6250580 -6164378 -2007824 1866729 199059 -5964581 -9867840 -8281812
36949 -8281812 -5850123 -7368038 -10275947 -9619714 -6721261 -6486124 -8279950 -6866311
36941 -6866311 -2093587 26936 -2524601 -3915298 -65051 4540576 4591636 2959584
36933 2959584 5434047 10237467 10496339 5821303 3443174 6590056 9120559 5416704
36925 5416704 -259179 50961 5964986 9439744 6492692 1847443 790500 2190724
36917 2190724 2473102 1761639 1914256 1948956 302492 -747875 1742547 5253767 4610593
36908 4610593 371377 -1851007 -967479 -2480007 -8745331 -13842243 -12237255 -7147678
36900 -7147678 -5313549 -7570532 -9714868 -9448796 -7409393 -4048938 -462062 173565
36892 173565 -3032632 -5246710 -1964409 3869018 6307457 5530260 5977958 7171757 4135840
36883 4135840 -2874300 -6601637 -2706637 4525906 8688340 8570388 6799269 5389753
36875 5389753 4926193 5145061 4907100 3895751 4100287 6543506 7724753 3770248 -2874417
36866 -2874417 -6108385 -4732047 -2584018 -1056122 1551109 3599787 1313916 -2671025
36858 -2671025 -888080 6424386 9521173 3819021 -2677186 -2136524 1454578 572798
36850 572798 -3321914 -3997895 -1466231 92823 1097440 4238106 6558709 3125459
36842 3125459 -3107945 -4123565 898605 4600244 3222773 1255188 2563896 4219047
36834 4219047 2295148 -1760134 -3993807 -3273788 -873459 2218599 5055062 6056786
36826 6056786 4702960 2509714 1124197 631301 323299 -78265 -398003 -441912 -512824
36817 -512824 -1669209 -4310237 -6278397 -4614751 -18137 3259695 3189287 2199242 2032448
36808 2032448 818905 -1964655 -2677019 59293 1149695 -2989734 -6888320 -3753955
36800 -3753955 2933001 4152404 -511039 -2790172 682468 4242249 3838212 2559950
36792 2559950 2800694 1573092 -2123970 -2864395 2764976 9078135 8483076 1780175 -3896552
36783 -3896552 -4411892 -1434908 1578685 2239128 -51404 -3219144 -4174429 -3151957 -3540282
36774 -3540282 -5805458 -5738332 -1326530 3123052 3368334 1612794 2239758 4827942 6075546
36765 6075546 5449878 4000470 574730 -5307379 -9377745 -7487834 -2800520 -1812661
36757 -1812661 -4274946 -3825312 1339264 5427267 4210251 862673 43249 1542776
36749 1542776 2946398 3878643 3966337 753138 -5947172 -10713500 -8334681 -1215404 3447760
36740 3447760 2786953 263157 -878191 -1527294 -3273897 -5049034 -5103533 -3727824 -2249505
36731 -2249505 -1287038 -1393226 -3354816 -6137788 -6481315 -2751614 2208491 4429901 3978934
36722 3978934 4225021 6557530 8639700 8143871 5739152 3611365 2848518 2968427 2636057
36713 2636057 663678 -2244885 -3210819 -902972 1093253 -1826729 -7852404 -9664553
36705 -9664553 -4351871 2108285 3083568 -316061 -2948048 -3643847 -4176867 -3420598 792226
36696 792226 5399579 4697286 -602854 -3576221 -1591258 -67523 -3288951 -7713148
36688 -7713148 -8377211 -6743980 -7112012 -8914272 -8054802 -3826238 515556 2925691 3863380
36679 3863380 3185950 201812 -3042624 -2524629 2640258 8528820 10645471 7862545
36671 7862545 2145551 -3203981 -4891389 -2038631 1817235 1506510 -3713416 -8745781
36663 -8745781 -8658872 -4504782 -1437601 -2019722 -3388128 -1287856 4353330 8779830 7330097
36654 7330097 541341 -6217237 -8229495 -5739732 -2369198 -445615 563698 1500745
36646 1500745 1555950 -271595 -3059491 -4557816 -3557033 -995440 946295 405973 -2830717
36637 -2830717 -6657814 -7750337 -4614721 298034 2707723 1265365 -903295 -275234
36629 -275234 2617910 4365562 3430583 1425054 -251963 -2267284 -4832515 -5999037
36621 -5999037 -4522431 -2424075 -2192336 -2932878 -2127206 -86080 631852 -301013 -671493
36612 -671493 -44429 -645072 -2913756 -3701135 -658615 4416220 8327558 9792060 8350156
36603 8350156 3410732 -2927130 -5505149 -2482021 550772 -2476738 -8853074 -10274022
36595 -10274022 -4736061 775366 626832 -2335084 -2936792 -1893423 -3244628 -6787579
36587 -6787579 -8294098 -6046205 -2507990 274530 2754218 4931617 5169234 3119677
36579 3119677 701689 -1063140 -3192173 -5406206 -5053508 -1641032 760579 -1056489
36571 -1056489 -4071461 -3088882 1399664 3848754 1679132 -1803743 -2976472 -2063558
36563 -2063558 -406219 2372770 6098927 8051257 6042480 1606679 -1994853 -3222203
36555 -3222203 -2184485 494963 2797398 1866990 -2027605 -4462731 -2612730 345039
36547 345039 -16853 -2428065 -2028605 1869040 4831988 4073265 1885676 1515812 3038963
36538 3038963 4369660 3829754 1168239 -1760109 -1577040 2594275 6134189 3510561
36530 3510561 -4040033 -9194651 -7485615 -1757905 3081008 5438611 5473696 2598923
36522 2598923 -2265524 -5122460 -3194395 987451 2718955 905540 -1909259 -3941236
36514 -3941236 -5694681 -7596776 -8623885 -7593442 -4404362 103275 4532439 7181833
36506 7181833 6808862 3755346 490578 437058 4749482 9923905 10733231 6684434 2847389
36497 2847389 2260674 1198553 -4034064 -9343069 -8239427 -2640973 -479880 -3177437
36489 -3177437 -4139820 -766163 1330685 -810442 -1668461 2541169 6322663 4475008
36481 4475008 1801350 4941103 10475644 10442306 5326935 1947319 1584776 276869 -1027287
36472 -1027287 2780077 10183907 13345786 10650966 9385987 13405605 17187010 15819760
36464 15819760 12633880 12122282 12311318 9540355 5186465 2366092 641453 -1120253
36456 -1120253 -1065075 1517056 2552308 -1006267 -5270509 -4801262 -929564 1019448 567481
36447 567481 2126793 7137520 11663101 12026122 8666002 4233170 1234941 1394091 4243512
36438 4243512 6606855 6004465 3692244 1972368 481354 -1527435 -1613816 2331711 6683620
36429 6683620 5960236 1553658 338499 3932518 5961036 2296748 -2372978 -2285421 423097
36420 423097 41626 -2962831 -2846920 2117497 7261973 8808157 8371527 8573269 8350817
36411 8350817 5399418 709046 -2367128 -2585590 -1877416 -2006313 -2101127 -383395 2521932
36402 2521932 3291083 -460591 -6737739 -10597343 -9400926 -5357934 -2014044 13503
36394 13503 1741529 1938693 -1622051 -6952751 -8240721 -3504685 1777950 1874704 -1414929
36385 -1414929 -2525589 -1447326 -3364552 -9073063 -12161909 -8306384 -2131739 -671409
36377 -671409 -3692285 -5471508 -3907537 -2387393 -3236664 -4695952 -5271371 -6317762 -8305781
36368 -8305781 -8444817 -4830947 -143081 1844004 1466060 1760075 3149626 2917880 -187636
36359 -187636 -3795425 -5013923 -3569330 -1110557 807550 1050370 -1288656 -5863103
36351 -5863103 -10287437 -11584065 -8804524 -4046199 -731285 -565295 -1929918 -1707805
36343 -1707805 826258 2663621 749305 -3555125 -5571330 -3074864 1125834 3408490
36335 3408490 4053037 5621824 8034128 8314867 5362649 2057140 1227377 1599024 -154135
36326 -154135 -4329727 -7396021 -6385769 -2469851 492504 66568 -2727973 -4990206
36318 -4990206 -4873448 -2950659 -1093349 -458037 -788330 -1335116 -1774689 -2101295 -2207761
36309 -2207761 -1917932 -1196006 -284222 166190 -442657 -1427722 -798702 2212092 5259096
36300 5259096 5513419 3731367 2944370 3126472 990329 -3688154 -5986009 -3149257 10513
36291 10513 -2262222 -7485773 -8119649 -2580712 3006704 4109745 2792522 2171436 1632217
36282 1632217 56539 -1130711 -1289115 -2812011 -6630437 -9032473 -6725245 -2215815
36274 -2215815 -323518 -1562309 -2651702 -1710015 630506 3595728 6183064 6181700 2903025
36265 2903025 -309908 78948 2432576 2094179 -1780535 -5262044 -5220493 -2296614 1604103
36256 1604103 5218802 7035608 5875190 3039727 1060168 -41132 -2197999 -4644641
36248 -4644641 -3493238 2463086 8625786 9656451 5803618 1930099 1312835 2507494
36240 2507494 2215368 -322378 -2584441 -2122001 235973 1459383 259717 -1672676
36232 -1672676 -2579753 -2573914 -1805782 528682 3398950 2996370 -2260996 -7952851 -8677716
36223 -8677716 -5408338 -3796460 -6044803 -8757056 -8589884 -5651754 -990014 4785592
36215 4785592 9217144 8559319 2709211 -3487650 -5757685 -4781993 -3674708 -3686176 -4040070
36206 -4040070 -3810628 -2371752 241060 2314021 1628671 -1536517 -4532507 -5988408
36198 -5988408 -6963380 -7903948 -7337933 -4769583 -2120429 -748007 506374 2593513 3803688
36189 3803688 2044428 -1884248 -4977892 -5215570 -3337002 -2239656 -4392505 -8502593
36181 -8502593 -9673233 -5197229 936102 2650993 -62782 -1877936 -425685 1435070
36173 1435070 1945196 2974509 4607228 3431107 -819391 -2739646 745335 5085554
36165 5085554 5165026 2713534 1733505 1286244 -1239444 -3669007 -2472531 311135 292763
36156 292763 -1489963 -965688 667625 -1420723 -6607204 -9177674 -8029389 -8147903 -11021466
36147 -11021466 -11462648 -6871193 -2368312 -2461874 -3918129 -2289427 -401527 -3827302
36139 -3827302 -11018119 -14673930 -11972110 -7575934 -6174304 -7050157 -7373728 -6770541 -6307280
36130 -6307280 -5625811 -3702180 -1191146 198617 194870 43554 259322 133172 -102305
36121 -102305 1369416 4910990 7349225 5525654 1350122 119159 3123945 5202171
36113 5202171 1586261 -5577437 -10353678 -10586489 -8926569 -7527098 -5617060 -2526620
36105 -2526620 276692 1336401 1197580 1190949 1656478 2049932 1874830 1342475 1562734
36096 1562734 3103575 3662804 -436290 -8146476 -11865086 -6106531 3567120 5969981
36088 5969981 -1100129 -7663762 -5058413 3009879 6904820 4183319 787451 1190197
36080 1190197 3085322 2381480 -857028 -3380421 -3375560 -2173245 -1956709 -2905467 -2964692
36071 -2964692 -493858 3285781 5386317 4453771 1699684 -1609235 -5471913 -9049351
36063 -9049351 -9603782 -5822286 -954391 -67505 -4196153 -9075081 -10062643 -7064559 -3962490
36054 -3962490 -3719599 -4793354 -3086688 2339436 6893580 5651538 128027 -3156139
36046 -3156139 -1274181 1394626 -188905 -4605425 -6549197 -4263568 -808005 926041
36038 926041 952815 403749 178398 1265694 3603105 4842023 3082461 378341 119803
36029 119803 1297900 -211167 -4055809 -4246801 2033175 9164487 10532603 7639497
36021 7639497 6926484 9776359 11196951 8006345 3105232 504666 275636 275218 -232120
36012 -232120 -721087 -925202 -395376 1619960 4211743 4473266 977955 -3725478 -5904587
36003 -5904587 -4953213 -3291222 -2897471 -3725451 -4956428 -5905640 -5593282 -2913798 2124640
35994 2124640 7803929 11636399 12088170 9859409 7366118 6165541 5059810 1906317
35986 1906317 -2980092 -7015848 -8795089 -8930449 -7358592 -3259428 1152105 817966
35978 817966 -5209738 -10357868 -8106548 -726735 3749299 1560494 -4180538 -9356840
35970 -9356840 -12093606 -10836779 -5004368 1668560 3696557 1087660 -831393 -97308
35962 -97308 -1008289 -5903394 -9852019 -7850399 -2778556 -1011197 -3168919 -4506095 -2600761
35953 -2600761 400030 2264354 2876334 2315383 668768 -353849 908023 2879400
35945 2879400 2518791 197173 -600930 1140076 1980606 -1128340 -6305879 -8470774 -4655143
35936 -4655143 2825173 7931174 6266097 -216816 -5061221 -4938389 -3317009 -4538120
35928 -4538120 -7039495 -6328834 -2710749 -928772 -2456574 -3370021 -951709 2300347
35920 2300347 3256965 2717318 2681987 2233224 -635029 -4974504 -7688116 -7532551 -6109743
35911 -6109743 -5380889 -5754735 -6174270 -5041293 -1691964 2288869 4125885 2928388 674057
35902 674057 -486322 -552546 -485447 -299163 205445 36945 -1782765 -4061582 -4204801
35893 -4204801 -1369087 2299577 4062944 3587864 2964664 3928267 5794105 6630704 5867893
35884 5867893 4590235 3496220 2334656 1693399 3008512 5462702 5322482 837812
35876 837812 -4111370 -4441560 -707431 2002731 1302679 -300222 -469986 -70876 -72386
35867 -72386 622878 2381708 3200385 2049954 961819 1421846 1453476 -860976 -3401550
35858 -3401550 -3050823 -1039670 -1319321 -4121146 -5045774 -1384739 3710018 4981880 1175740
35849 1175740 -4137273 -6738544 -5364953 -1746174 1497713 2778537 2325080 1661886
35841 1661886 1916269 2241698 595006 -3034336 -5053673 -2040253 3925902 6562239
35833 6562239 3310443 -985722 -827133 2318665 3041221 586542 -741654 770830
35825 770830 1880183 704193 -112972 1102035 1506899 -818414 -2443539 -247878 2145895
35816 2145895 -570409 -5942141 -5811366 2057956 10271475 11490947 7165748 3841247
35808 3841247 4167624 5111464 3492192 -88610 -2913749 -3545443 -2823194 -2438954 -3119295
35799 -3119295 -4056968 -4063762 -3220462 -2891325 -3744493 -4321582 -2609394 820525 2495771
35790 2495771 95773 -3898172 -4686467 -1533741 936046 -636939 -3173595 -1843058
35782 -1843058 2043831 2583463 -1542244 -4807048 -3436687 -1149179 -2856128 -6766852
35774 -6766852 -7529301 -4564720 -1924694 -1106217 416918 3297140 4330221 2059878
35766 2059878 -129536 834369 2905072 2376317 -368805 -2020298 -1690892 -1466355 -2118553
35757 -2118553 -1858514 -54264 824960 -1389758 -5218101 -7456661 -7198335 -6015234 -4956039
35748 -4956039 -3557012 -1710334 -273946 708454 2254370 3858226 2866696 -1571372
35740 -1571372 -5721149 -5335350 -1680312 -168724 -2819596 -5637179 -4893510 -2648485
35732 -2648485 -3160187 -6086717 -7063390 -4428741 -1600102 -1907177 -4220917 -5621389 -6024115
35723 -6024115 -7251130 -8615719 -6963690 -1833959 2515096 2398898 -52953 63578
35715 63578 3193545 4717117 1806722 -2783657 -5192194 -5335086 -5031132 -4270400 -2492639
35706 -2492639 -1173430 -1478041 -1256599 1508838 3868541 1509962 -3510004 -4307013 844272
35697 844272 5656858 4855729 829837 -1604546 -2290480 -3554243 -4666554 -3231821 27584
35688 27584 2253810 3006233 4074423 5604326 5825490 4184125 1915513 -50099 -1398268
35679 -1398268 -1487940 -462169 -251832 -1983918 -3609805 -2881003 -1321372 -1844795 -3469778
35670 -3469778 -2389341 1911273 5564697 5757013 3568986 753262 -2454534 -4974191
35662 -4974191 -4179857 7115 3280765 2121968 -1173125 -1566000 1918847 5447456
35654 5447456 5886750 4079490 2216463 627549 -1290390 -2645444 -1726984 1132027
35646 1132027 3156914 2196729 -920153 -3770253 -5059797 -5055188 -4363324 -3741589 -4310389
35637 -4310389 -6105245 -6963379 -5038363 -2063061 -1385298 -2742932 -2445002 311814 1252042
35628 1252042 -2384872 -6472933 -4936747 2033895 8578587 10702304 9267763 6104425
35620 6104425 1550716 -3139543 -4568027 -617818 6513372 12254329 13769733 11368363
35612 11368363 6875679 1802185 -2892031 -5931196 -5718489 -2242559 1566735 2365407
35604 2365407 519698 -532211 427384 687342 -1451907 -3431892 -2708946 -1106788 -1402340
35595 -1402340 -2333270 -1319385 63279 -1578366 -5027567 -5999092 -4680180 -5629996 -9209112
35586 -9209112 -9287296 -2271843 6627458 9978833 7457060 4635064 4850891 6330520 6372677
35577 6372677 4802481 2961484 1471280 -311196 -3259066 -6806660 -8367498 -5622584
35569 -5622584 261445 5176344 6471210 5358848 4315619 3863779 3100892 1898365
35561 1898365 1017448 849827 1291347 2384269 4151667 6006480 6854762 5882470 3545834
35552 3545834 1900868 2857409 5310209 5528796 2026832 -1616243 -1354559 1335858 1584295
35543 1584295 -1460240 -3544896 -2131663 -90875 -895292 -3597719 -4933226 -4025266
35535 -4025266 -2803666 -3277931 -5750923 -8219712 -7018170 -497203 7147049 8702114
35527 8702114 2099575 -6939312 -11861804 -11876320 -9855464 -7267641 -4350232 -2571433
35519 -2571433 -3122757 -4392625 -4113141 -2870688 -2703135 -3489197 -3647946 -3299066 -3686453
35510 -3686453 -4338650 -3925720 -3288283 -4233453 -5434198 -3116729 3220725 8809278 9131454
35501 9131454 5586913 3678642 6210447 9910037 9280161 3196132 -3334614 -4664883
35493 -4664883 -970547 2458143 2160035 165226 -223515 516856 -268613 -2652828 -4033593
35484 -4033593 -3100294 -1133198 535557 1935753 3154779 3842984 4603472 6999354 11124748
35475 11124748 14233784 12853204 6243564 -2323325 -7777579 -7452056 -3573326 -830714
35467 -830714 -1003710 -1299325 952627 3633465 2248926 -3505203 -8236823 -6822252 -213209
35458 -213209 6020734 8088631 7322123 6921978 7003152 4876466 174012 -3050446 -1407267
35449 -1407267 2499079 3055605 -696727 -4008729 -3355760 -676260 525642 -325313 -2178389
35440 -2178389 -4658850 -6494786 -4910011 102361 3627680 1722643 -2698976 -3892145
35432 -3892145 -1379121 513050 22367 -298696 669701 187845 -3428255 -7428875 -8386203
35423 -8386203 -6658940 -5156036 -5611257 -7624424 -9674980 -9715374 -6317566 -625634 3987167
35414 3987167 5372031 4801506 4794780 5630276 5170921 2028393 -1873505 -2654587 971177
35405 971177 5050613 4157016 -1783050 -6759751 -6058398 -1793425 1083636 1570751 2051506
35396 2051506 3210131 3873989 4648198 6933969 8694080 6103522 -19493 -4000062
35388 -4000062 -2581482 1688781 5258439 7336872 7657429 5372153 2348367 2903931
35380 2903931 7446598 10686621 9270680 6767026 7213361 8113260 4976520 -638594
35372 -638594 -3511469 -2982899 -2827999 -4152707 -4373647 -2989333 -2637550 -3858822 -4048213
35363 -4048213 -2591231 -2083186 -3114577 -2758801 -189728 942034 -1561708 -4415778
35355 -4415778 -4052702 -2117361 -1850646 -2070249 571122 5154272 7187733 5328541 3158638
35346 3158638 3822105 6425250 8576559 9397025 8772853 6281298 2636148 413135 1490051
35337 1490051 4604832 6626798 5539705 1530809 -3596060 -7030315 -6377454 -2333056
35329 -2333056 720288 -1166746 -6678231 -10297545 -8659675 -4089688 -903125 -82304
35321 -82304 410017 1388252 1491972 432122 79661 1176104 1752449 740804 515697
35312 515697 2920083 4993496 2748720 -1974189 -3226579 452687 4304740 5331751
35304 5331751 6314628 8969247 8838650 2376310 -5090510 -5479912 -143611 1440039 -4574930
35295 -4574930 -10917122 -9569539 -1752308 5651334 8869158 8448814 5262366 18402
35287 18402 -4709746 -5868046 -3283766 315931 2087047 844883 -2374991 -4391988
35279 -4391988 -2566229 1291922 2185288 -1324990 -4663238 -3809654 -1048179 -862406 -3076338
35270 -3076338 -4297126 -3986449 -4325625 -5152770 -3733680 534566 5081622 7822789 8563122
35261 8563122 7160092 3731326 391494 -474160 753782 2448278 4744740 7367541
35253 7367541 6738711 758171 -5120078 -3427045 3958087 7402758 3440361 -864105
35245 -864105 816 1778508 -902926 -4926304 -4381972 -637730 478691 -1789745 -3236631
35236 -3236631 -2133947 -312059 1578510 3990463 4981105 2626785 -51712 1432400
35228 1432400 5121178 4461303 -1543845 -6390140 -5809509 -3382305 -3642085 -4906982 -3093511
35219 -3093511 1014961 2928330 1156457 -1152562 -764358 2320101 5966061 8073573
35211 8073573 7420328 4084856 -232705 -3096565 -3204451 -1365487 534557 1597725
35203 1597725 2746895 5093046 7728671 8295170 6086103 3161931 1400133 -117467
35195 -117467 -3069024 -6275050 -6445589 -2666194 1732979 2627646 -399645 -3612179 -3019694
35186 -3019694 1353338 5258520 4761683 740689 -2176923 -992252 2883416 6237101
35178 6237101 7381864 6385629 4280150 3044126 4160674 6090548 5627116 3043246
35170 3043246 2859555 7285871 11851275 10726429 4287520 -1870069 -3841546 -2213653
35162 -2213653 535321 2117488 949339 -2299694 -4374901 -3177034 -742071 -111640
35154 -111640 -961930 -1249409 -1254470 -2332616 -3228901 -1698063 1232419 2579003 2116701
35145 2116701 1857716 1695632 -261667 -3576059 -5766156 -6197015 -5811336 -4006699 -227514
35136 -227514 2504136 981404 -2000659 -826406 3681549 4717696 22573 -4849542
35128 -4849542 -5682329 -5251020 -6746488 -7809293 -5337223 -1181870 1444331 3167804
35120 3167804 5730513 7624311 6771490 4633278 3615626 3024208 1394326 201840
35112 201840 1276210 2818491 1994779 -396749 -1613572 -1511497 -1647118 -1540561 203327
35103 203327 2302951 2303033 931289 1203357 3483129 4882166 3692988 1443351 141117
35094 141117 -120275 -274306 -731468 -1179397 -997887 56493 1129921 1024265 25463
35085 25463 -405988 -134047 -511410 -1479416 -1220676 103692 -615857 -4599841 -8313808
35076 -8313808 -8146709 -5430647 -3765033 -3526143 -2446021 -92093 1700444 2064966 1861436
35067 1861436 1738219 1688247 1797355 1633095 127375 -2225912 -2892916 -1095311 35279
35058 35279 -2289997 -6088378 -7309058 -5183490 -2012677 423156 1076916 -1586616 -7069994
35049 -7069994 -10695057 -8239083 -1821171 2784839 3727920 3715200 3984054 2783669 220113
35040 220113 -449638 2009998 4408051 3884045 1783552 688351 401849 -597083 -1684096
35031 -1684096 -889219 1429836 2044231 -1277584 -6315440 -8026318 -4155004 1677471
35023 1677471 3985944 1979686 -270385 -101235 844475 1046341 2209867 5199878 6753886
35014 6753886 4249153 637287 -40770 493161 -2148904 -6708566 -7173771 -1886672 3947736
35005 3947736 5746132 4507890 2971502 1499414 -128881 -604592 815237 2623657
34997 2623657 3229609 2819303 2090168 1237842 842403 1552155 2425794 1788471 -111803
34988 -111803 -1617036 -2573616 -3932697 -4752677 -2996658 505884 2343461 1318814 -153231
34979 -153231 153830 2101466 4838027 7247645 6865114 2271249 -3325905 -5152419 -3673161
34970 -3673161 -3492661 -5081414 -3605957 2129160 5817635 2479219 -3865714 -5947474
34962 -5947474 -3105253 -780479 -2532619 -6740634 -9832478 -9526106 -5959642 -1886101
34954 -1886101 -361931 -753731 637591 4514581 6482371 3405599 -1593281 -3832990
34946 -3832990 -3853448 -5639246 -10155516 -14491728 -16127114 -14753973 -10976352 -6130249
34938 -6130249 -2496455 -1367495 -1885196 -3202880 -5619796 -7920277 -6774276 -1599148
34930 -1599148 2955450 2699771 -580219 -2604740 -2602854 -2008794 -390300 2519355 3576159
34921 3576159 558019 -2543719 -648645 3761738 3881736 -496173 -2755584 -455154
34913 -455154 1267611 -763645 -2356408 312299 4044971 4427444 3076118 3774121 5367714
34904 5367714 4261536 1388575 940890 3369984 4823920 3220078 366651 -2047470
34896 -2047470 -4347502 -6080245 -5218991 -1666301 1407216 1408080 -755790 -3124331 -5803309
34887 -5803309 -9416475 -11983285 -10181000 -3826856 2864534 5262110 2686046 -1552747
34879 -1552747 -3662182 -2449265 429073 2459380 2434177 990185 -651392 -2028072
34871 -2028072 -3196045 -3663300 -2656279 -650321 461425 -591032 -3032817 -5262295
34863 -5262295 -6444144 -6052530 -3382619 545938 1771068 -2974727 -11267373 -16419759
34855 -16419759 -14868728 -9849110 -6541528 -5876981 -5052672 -2409452 692641 2277227
34847 2277227 2053333 1216498 900321 740839 -1101682 -5420489 -9350774 -8336649 -1779928
34838 -1779928 5289804 7792959 6022909 3697426 2656767 2154999 1831931 2091863 2129730
34829 2129730 671412 -1440009 -2209234 -2002085 -3138856 -5641332 -6521989 -4471288 -2484943
34820 -2484943 -3938600 -7922852 -10494263 -9524014 -6578678 -4478441 -4311575 -4781956 -3835183
34811 -3835183 -1051825 1482271 1383334 -785711 -1633589 869486 4260649 4087194 -533094
34802 -533094 -5306210 -5611457 -2069441 394470 -867115 -2733462 -1010493 3177196
34794 3177196 4797947 2324135 84231 2057507 6580187 9328499 8811107 6150499
$$ [...]
##END NTUPLES=NMR SPECTRUM
##END=
