##TITLE=31Pdec_SR111_rm1d
 CDCl3, 24 sc
 15.3.2022
##JCAMPDX= 6.0         $$ Bruker NMR JCAMP-DX V2.0
##DATA TYPE= NMR SPECTRUM
##DATA CLASS= NTUPLES
##ORIGIN= UXNMR, Bruker Analytische Messtechnik GmbH
##OWNER= root
$$ XWIN-NMR		Version 3.5
$$ Tue Mar 15 11:28:41 2022 Russian Standard Time (UT+4h)  she@DPX200
##.OBSERVE FREQUENCY= 81.013821
##.OBSERVE NUCLEUS= ^31P
##.ACQUISITION MODE= SIMULTANEOUS
##.ACQUISITION SCHEME= undefined
##.AVERAGES= 24
##.DIGITISER RES= 16
##SPECTROMETER/DATA SYSTEM= spect
##.PULSE SEQUENCE= zgpg30
##.SOLVENT NAME= CDCl3
##.SHIFT REFERENCE= (INTERNAL, CDCl3, 0, 248.564)
##AUDIT TRAIL= $$ (NUMBER, WHEN, WHO, WHERE, WHAT)
$$ ##TITLE= Audit trail, XWIN-NMR		Version 3.5
$$ ##JCAMPDX= 5.01
$$ ##ORIGIN= Bruker BioSpin GmbH
$$ ##OWNER= she
$$ F:/spectra/data/she/nmr/P31/1/pdata/1/auditp.txt
$$ ##AUDIT TRAIL=  $$ (NUMBER, WHEN, WHO, WHERE, WHAT)
(   1,<2022-03-15 11:26:23.12 +0400>,<she>,<DPX200>,
      <created by zg, POWCHK disabled, PULCHK disabled
       configuration hash MD5:
       00 E9 B6 7A A2 85 ED C7 34 08 36 98 17 FE 4E 26
       data hash MD5: 32K
       2A AA A9 32 9F 46 43 2A CE 43 92 00 D5 0F C3 42>)
(   2,<2022-03-15 11:26:59.32 +0400>,<she>,<DPX200>,
      <Start of raw data processing
       efp BC_mod = 2 LB = 1 FT_mod = 6 PKNL = 1 PHC0 = -9173.941 PHC1 = 80.4745 SI = 64K 
       data hash MD5: 64K
       AF 48 41 A0 07 CF 49 DA AA 82 23 23 1A 32 E1 F1>)
(   3,<2022-03-15 11:27:26.73 +0400>,<she>,<DPX200>,
      <pk PHC0 = -147.2679 PHC1 = 362.8 
       data hash MD5: 64K
       93 AF 46 8F FB A1 81 E5 D0 45 95 43 A9 CD F3 6B>)
(   4,<2022-03-15 11:27:56.01 +0400>,<she>,<DPX200>,
      <pk PHC0 = 106.8626 PHC1 = -280.5988 
       data hash MD5: 64K
       1C 5A BB 24 8A FD 92 96 FD 05 48 8A C9 78 D5 8F>)
$$ ##END=
$$ 
$$ hash MD5
$$ D3 68 F0 24 7D B3 18 2C 45 5C DA 43 21 33 D7 D2
##$RELAX= 
##$RELAX= 
##$RELAX= 
##$RELAX= 
##$RELAX= 
##$RELAX= 
##$RELAX= 
##$RELAX= 
$$ Bruker specific parameters
$$ --------------------------
##$DU= <F:/spectra>
##$EXPNO= 1
##$NAME= <P31>
##$PROCNO= 1
##$TYPE= <nmr>
##$USER= <she>
##$AMP= (0..31)
100 100 100 100 100 100 100 100 100 100 100 100 100 100 100 100 100 100 
100 100 100 100 100 100 100 100 100 100 100 100 100 100 
##$AQSEQ= 0
##$AQ_mod= 1
##$AUNM= <au_zg>
##$AUTOPOS= <>
##$BF1= 81.014009
##$BF2= 200.13
##$BF3= 200.13
##$BF4= 200.13
##$BF5= 200.13
##$BF6= 200.13
##$BF7= 200.13
##$BF8= 200.13
##$BYTORDA= 1
##$CFDGTYP= 0
##$CFRGTYP= 5
##$CHEMSTR= <none>
##$CNST= (0..31)
1 1 145 1 1 1 1 1 1 1 1 1 1 1 1 1 1 1 1 1 1 1 1 1 1 1 1 1 1 1 1 1 
##$CPDPRG= <waltz16>
##$CPDPRG1= <>
##$CPDPRG2= <waltz16>
##$CPDPRG3= <>
##$CPDPRG4= <mlev>
##$CPDPRG5= <mlev>
##$CPDPRG6= <mlev>
##$CPDPRG7= <mlev>
##$CPDPRG8= <mlev>
##$CPDPRGB= <>
##$CPDPRGT= <>
##$D= (0..31)
0 1 0 0 0 0 0 0 0 0 0 0.03 2e-05 3e-06 0 0 0 0 0 0 0 0 0 0 0 0 0 0 0 0 
0 0 
##$DATE= 1647329182
##$DBL= (0..7)
120 120 120 11 120 120 24 19 
##$DBP= (0..7)
150 150 150 150 150 150 150 150 
##$DBP07= 0
##$DBPNAM0= <>
$$ [...]
##$SUBNAM2= <"">
##$SUBNAM3= <"">
##$SUBNAM4= <"">
##$SUBNAM5= <"">
##$SUBNAM6= <"">
##$SUBNAM7= <"">
##$SUBNAM8= <"">
##$SUBNAM9= <"">
##$SW= 501.771253377433
##$SWIBOX= (0..15)
0 1 3 0 0 0 0 0 0 0 0 0 0 0 0 0 
##$SW_h= 40650.406504065
##$TD= 32768
##$TD0= 1
##$TE= 0
##$TE2= 300
##$TE3= 300
##$TEG= 300
##$TL= (0..7)
0 120 53 12 22 120 120 120 
##$TP= (0..7)
150 150 150 150 150 150 150 150 
##$TP07= 0
##$TPNAME0= <>
##$TPNAME1= <>
##$TPNAME2= <>
##$TPNAME3= <>
##$TPNAME4= <>
##$TPNAME5= <>
##$TPNAME6= <>
##$TPNAME7= <>
##$TPOAL= (0..7)
0.5 0.5 0.5 0.5 0.5 0.5 0.5 0.5 
##$TPOFFS= (0..7)
0 0 0 0 0 0 0 0 
##$TUNHIN= 0
##$TUNHOUT= 0
##$TUNXOUT= 0
##$USERA1= <user>
##$USERA2= <user>
##$USERA3= <user>
##$USERA4= <user>
##$USERA5= <user>
##$V9= 5
##$VALIST= <valist>
##$VCLIST= <CCCCCCCCCCCCCCC>
##$VD= 0
##$VDLIST= <DDDDDDDDDDDDDDD>
##$VPLIST= <PPPPPPPPPPPPPPP>
##$VTLIST= <TTTTTTTTTTTTTTT>
##$WBST= 1024
##$WBSW= 4
##$XGAIN= (0..3)
0 0 0 0 
##$XL= 0
##$YL= 0
##$YMAX_a= 8682
##$YMIN_a= -11561
##$ZGOPTNS= <>
##$ZL1= 120
##$ZL2= 120
##$ZL3= 120
##$ZL4= 120
##$ABSF1= 0
##$ABSF2= 0
##$ABSG= 0
##$ABSL= 0
##$ALPHA= 0
##$AQORDER= 0
##$ASSFAC= 0
##$ASSFACI= 0
##$ASSFACX= 0
##$ASSWID= 0
##$AUNMP= <proc_1d>
##$AZFE= 0.1
##$AZFW= 0.5
##$BCFW= 0
##$BC_mod= 2
##$BYTORDP= 0
##$COROFFS= 0
##$CY= -3
##$DATMOD= 1
##$DC= 0
##$DFILT= <>
##$DTYPP= 0
##$F1P= 0
##$F2P= 0
##$FCOR= 1
##$FTSIZE= 65536
##$FT_mod= 6
##$GAMMA= 0
##$GB= 0
##$INTBC= 1
##$INTSCL= 5.30512e-09
##$ISEN= 30
##$LB= 1
##$LEV0= 0
##$LPBIN= 0
##$MAXI= 10000
##$MC2= 0
##$MEAN= 0
##$ME_mod= 0
##$MI= 50
##$NCOEF= 0
##$NC_proc= -8
##$NLEV= 6
##$NOISF1= 182.463
##$NOISF2= 159.3651
##$NSP= 0
##$NTH_PI= 0
##$NZP= 0
##$OFFSET= 248.5645
##$PC= 4
##$PHC0= -9214.347
##$PHC1= 162.6757
##$PH_mod= 1
##$PKNL= yes
##$PPARMOD= 0
##$PSCAL= 0
##$PSIGN= 0
##$REVERSE= no
##$SF= 81.014009
##$SI= 65536
##$SIGF1= 159.3651
##$SIGF2= -187.1042
##$SINO= 113.3802
##$SIOLD= 16384
##$SREGLST= <1H.CDCl3>
##$SSB= 0
##$STSI= 65536
##$STSR= 0
##$SW_p= 40650.406504065
##$SYMM= 0
##$S_DEV= 0
##$TDeff= 32768
##$TDoff= 0
##$TI= <>
##$TILT= no
##$TM1= 0
##$TM2= 0
##$TOPLEV= 0
##$USERP1= <user>
##$USERP2= <user>
##$USERP3= <user>
##$USERP4= <user>
##$USERP5= <user>
##$WDW= 1
##$XDIM= 65536
##$YMAX_p= 429864328
##$YMIN_p= -436118766
$$ End of Bruker specific parameters
$$ ---------------------------------
##NTUPLES= NMR SPECTRUM
##VAR_NAME=  FREQUENCY,     SPECTRUM/REAL,   SPECTRUM/IMAG
##SYMBOL=    X,             R,               I
##VAR_TYPE=  INDEPENDENT,   DEPENDENT,       DEPENDENT
##VAR_FORM=  AFFN,          ASDF,            ASDF
##VAR_DIM=   65536,         65536,           65536
##UNITS=     HZ,            ARBITRARY UNITS, ARBITRARY UNITS
##FACTOR=    0.620285442955139, 1,           1
##FIRST=     20137.2065510759, 0,            0
##LAST=      -20513.1999529892, 0,           0
##MIN=       -20513.1999529892, -436118766,  0
##MAX=       20137.2065510759, 429864328,    0
$$ Real data points
##PAGE= N=1
##DATA TABLE= (X++(R..R)), XYDATA
$$ [...]
##PAGE= N=2
##DATA TABLE= (X++(I..I)), XYDATA
$$ plain form
13005 -2520273 5742514 8595388 4720250 578735 580418 1511840 -930101 -5180603 -6693715
12996 -6693715 -4195525 -35567 2996488 2924904 -574514 -4510835 -4594493 -946720 1192109
12987 1192109 -1394914 -5233597 -5259454 -1654663 1349829 1072894 -2013725 -6092196 -8856240
12978 -8856240 -8677545 -7058741 -7450893 -9792066 -9690974 -5468842 -1764634 -2419395 -4041888
12969 -4041888 -1761768 2157801 1632330 -3499342 -7332843 -6416108 -2555863 2058161
12961 2058161 6466799 7923930 3595113 -3803350 -7677542 -6087315 -3442634 -2660902
12953 -2660902 -1452421 1520448 2693427 -432908 -3839484 -1919616 4730008 10149770
12945 10149770 9974380 4747367 -2163483 -7340510 -8867608 -7030026 -3363011 950696
$$ packed form
13005b520273Q262787K852874l875138m141515J683R31422k441941m250502j513112
12996f693715K498190M159958L032055p1584l499418l936321q3658L647773K138829
12987A192109k587023l838683k5857L604791L004492k76935l086619m078471k764044
12978h856240J78695J618804l92152k341173J01092M222132L704208o54761j622493
12969d041888K280120L919569n25471n131672l833501R16735L860245M614024
12961B058161M408638J457131m328817p398463l874192J590227K644681P81732
12953b660902J208481K972869J172979l126335l406576J919868O649624N419762
12945A0149770j75390n227013o910850n177027j527098J837582L667015M313707
$$ plain form
12937 950696 4449389 4170010 -1528151 -8784274 -10925965 -6592811 -1360327 286253
12929 286253 393529 2567012 5858738 7277066 6900917 6168212 3741494 -2040682 -8172648
12920 -8172648 -9582557 -6545918 -4817619 -7434525 -10322263 -7930639 -485808 6650450
12912 6650450 9407324 8647329 7610639 7271590 5236990 -534235 -7549797 -9807165
12904 -9807165 -4030664 5849838 11944242 10321219 4605286 1204928 2070413 3631961
12896 3631961 2586968 340552 59187 1224380 469993 -2553806 -4187040 -2702937
12888 -2702937 -1064985 -1394012 -907714 2737811 5750088 3153779 -2954304 -5914371
12880 -5914371 -3929051 -1111176 12879 633286 347804 -3337768 -8855352 -10517662
$$ packed form
12937I50696L498693k79379n698161p256123k141691M333154N232484J646580
12929B86253J07276K173483L291726J418328l76149p32705k426718n782176o131966
12920h172648j409909L036639J728299k616906k887738K391624P444831P136258
12912F650450K756874p59995j036690l39049k034600n771225p015562k257368
12904i807165N776501R880502O094404j623023n715933l400358Q65485J561548
12896C631961j044993k246416k81365J165193p54387l023799j633234J484103
12888b702937J637952l29027M86298L645525L012277k596309o108083k960067
12880e914371J985320K817875J124055O20407k85482l685572n517584j662310
$$ plain form
12872 -10517662 -6953739 -3717618 -4813470 -7167804 -6546588 -3717231 -1390484 134848
12864 134848 974193 11796 -1567180 7907 4660495 7099624 5278936 4022390 5888982
12855 5888982 5429172 -1201950 -7619001 -6343860 -1132314 -850789 -5057130 -5881135 -1946018
12846 -1946018 260862 -1479453 -2018986 788781 2130190 -905308 -4965793 -7734814
12838 -7734814 -11408041 -15422208 -13933712 -5643167 1035010 -1028816 -7022398 -7368595
12830 -7368595 -1578803 2172755 -927613 -7527753 -12614045 -14748496 -14251842 -11219043
12822 -11219043 -6963429 -4035682 -3298340 -3275373 -3151039 -3947551 -5855967 -7029291 -6604673
12813 -6604673 -6634535 -8745519 -10577634 -8518785 -3259206 735300 1573258 2078480 4071301
$$ packed form
12872a0517662L563923L236121j095852k354334O21216K829357K326747J525332
12864A34848Q39345r62397j578976J575087M652588K439129j820688j256546J866592
12855E888982m59810o631122o417051J275141N211546K81525m206341q24005L935117
12846a946018K206880j740315n39533K807767J341409l035498m060485k769021
12838g734814l673227m014167J488496Q290545O678177k063826n993582l46197
12830g368595N789792L751558l100368o600140n086292k134451M96654L032799
12822a1219043M255614K927747P37342K2967J24334p96512j908416j173324M24618
12813f604673k9862k110984j832115K058849N259579L994506Q37958N05222J992821
$$ plain form
12804 4071301 4439688 345133 -4749307 -5193840 -1705678 -256517 -2696573 -4395977
12796 -4395977 -2263187 842632 1970932 2660928 4359309 4499227 1394062 -1435011
12788 -1435011 -530806 1713078 1353851 -615713 -1308298 -2100755 -5796828 -10147496 -10402202
12779 -10402202 -6780188 -3632280 -2407991 -979126 1206850 2810457 4393667 7079996
12771 7079996 8458052 5413711 207623 -1840469 42739 2221191 3201611 4145572
12763 4145572 4119463 1418549 -1286915 -18495 3120558 2982705 921316 2758482 7346796
12754 7346796 6850608 -28670 -5030219 -3646466 -1837122 -4898956 -8623850 -7486935
12746 -7486935 -3882377 -2498887 -2002906 581178 2522163 -241740 -5191885 -6539437
$$ packed form
12804D071301L68387m094555n094440m44533L488162J449161k440056j699404
12796d395977K132790L105819J128300O89996J698381J39918l105165k829073
12788a435011R04205K243884l59227j969564o92585p92457l696073m350668k54706
12779a0402202L622014L147908J224289J428865K185976J603607J583210K686329
12771G079996J378056l044341n206088k048092J883208K178452R80420R43961
12763D145572k6109k700914k705464J268420L139053j37853k061389J837166M588314
12754G346796m96188o879278n001549J383753J809344l061834l724894J136915
12746g486935L604558J383490M95981K584084J940985k763903m950145j347552
$$ plain form
12738 -6539437 -3810278 -1291674 -1145021 -2170579 -3410851 -4460551 -3924701 -1188865
12730 -1188865 2099175 4768534 7473185 9351684 7738865 3804758 3061261 6494792
12722 6494792 7066651 229375 -7689852 -8070122 -2199409 2242111 2863170 2806135 2295131
12713 2295131 -1382233 -6508262 -7741422 -4655113 -2390044 -2945108 -2410449 1471471
12705 1471471 4882245 3788460 34010 -1307768 1673623 6010068 7407920 4696684
12697 4696684 1136914 675749 2667230 2537802 -1385544 -5087340 -4966116 -2880320 -1887072
12688 -1887072 -937154 1617606 2725456 -1300796 -7402733 -8451112 -2835571 3602152
12680 3602152 5176667 1753795 -3402024 -7487814 -9535643 -10275047 -10438285 -8486919
$$ packed form
12738f539437K729159K518604J46653j025558j240272j049700N35850K735836
12730a188865L288040K669359K704651J878499j612819l934107p43497L433531
12722F494792N71859o837276p919227l80270N870713M441520O21059n7035n11004
12713B295131l677364n126029j233160L086309K265069n55064N34659L881920
12705A471471L410774j093785l754450j341778K981391M336445J397852k711236
12697D696684l559770m61165J991481j29428l923346l701796J21224K085796R93248
12688a887072R49918K554760J107850m026252o101937j048379N615541O437723
12680C602152J574515l422872n155819m085790k047829p39404j63238J951366
$$ plain form
12672 -8486919 -2596825 4034420 4569861 -1883955 -7373755 -6158123 -3069814 -4873925
12664 -4873925 -8897830 -8273177 -4004571 -2438886 -3664088 -2406129 1084515 1316458
12656 1316458 -1523027 -1168320 3246914 5249032 2433733 172365 1291927 1573687
12648 1573687 -899660 -1235178 2776709 5432713 2996035 725854 3528748 6851038
12640 6851038 4335405 -1494936 -4184282 -4097163 -5789747 -8161476 -6097279 -417377
12632 -417377 2146153 -845351 -4323945 -3728450 -372972 2663621 4879422 6293931
12624 6293931 5005448 -158172 -6444615 -9090711 -6093781 -102919 4209717 4337504
12616 4337504 1722529 -435895 -729896 -335676 -792515 -2210526 -3421508 -2649819 1388615
$$ packed form
12672h486919N890094O631245N35441o453816n489800J215632L088309j804111
12664d873925m023905O24653M268606J565685j225202J257959L490644K31943
12656A316458k839485L54707M415234K002118k815299k261368J119562K81760
12648A573687k473347l35518M011887K656004k436678k270181K802894L322290
12640F851038k515633n830341k689346Q7119j692584k371729K064197N679902
12632d17377K563530k991504l478594N95495L355478L036593K215801J414509
12624F293931j288483n163620o286443k646096K996930N990862M312636J27787
12616D337504k614975k158424k94001L94220m56839j418011j210982P71689M038434
$$ plain form
12607 1388615 7383245 11225105 10116851 6050924 2684206 200617 -3000609 -5077003
12599 -5077003 -2846844 1001347 -625976 -8716183 -15348566 -14516131 -9994424 -8245913
12591 -8245913 -8699705 -6568957 -1523660 2483255 3889473 4437279 4545024 2766276 -473790
12582 -473790 -2803895 -3607573 -4404082 -5444033 -4762518 -977422 4656288 8769762 7752470
12573 7752470 872909 -7308299 -10182896 -6497387 -1641581 336564 1947906 6204061
12565 6204061 9834896 8028991 2832726 461742 1869639 2375145 -48444 -2637725
12557 -2637725 -4245214 -7356013 -12169218 -14493122 -11907122 -7237660 -3649399 -859239
12549 -859239 1412377 1073849 -1965347 -3478116 -1043617 1249080 -1145139 -5587600
$$ packed form
12607A388615N994630L841860j108254m065927l366718k483589l201226k076394
12599e077003K230159L848191j627323q090207o632383Q32435M521707J748511
12591h245913m53792K130748N045297M006915J406218N47806J07745j778748l240066
12582d73790k330105q03678p96509j039951O81515L785096N633710M113474j017292
12573G752470o879561q181208k874597L685509M855806J978145J611342M256155
12565F204061L630835j805905n196265k370984J407897N05506k423589k589281
12557b637725j607489l110799m813205k323904K586000M669462L588261K790160
12549h59239K271616l38528l039196j512769K434499K292697k394219m442461
$$ plain form
12541 -5587600 -6103496 -2808850 -1357817 -3471432 -4457212 -1721940 124886 -3715954
12533 -3715954 -10300452 -12787864 -10115766 -7852648 -9578681 -12001759 -10234977 -4520933
12525 -4520933 906983 3655641 4928291 6143766 6549688 4762837 999161 -2917974
12517 -2917974 -4820471 -3317865 1064572 5420601 6393576 3535106 151089 42597
12509 42597 3667259 7932017 9404349 7230109 3088198 -1031424 -4333111 -6413520
12501 -6413520 -6039482 -2343454 2765360 5426682 4142072 1542119 399625 -283170
12493 -283170 -2989580 -7063669 -9327014 -8514657 -6083990 -3123327 205650 2232457
12485 2232457 549488 -3886580 -6787726 -6013651 -4124174 -4139735 -5675662 -6915802 -7611122
$$ packed form
12541e587600n15896L294646J451033k113615r85780K735272J846826l840840
12533c715954o584498k487412K672098K263118j726033k423078J766782N714044
12525d520933N427916K748658J272650J215475M05922j786851l763676l917135
12517b917974j902497J502606M382437M356029R72975k858470l384017j08492
12509D2597L624662M264758J472332k174240m141911m119622l301687k080409
12501f413520L74038L696028N108814K661322j284610k599953j142494o82795
12493b83170k706410m074089k263345Q12357K430667K960663L328977K026807
12485B232457j682969m436068k901146P74075J889477j5561j535927j240140o95320
$$ plain form
12476 -7611122 -8105875 -7783023 -6520163 -5633786 -5602897 -4968042 -3110281 -1709280 -1706516
12467 -1706516 -1559697 -570697 -858957 -3269695 -4442586 -1601663 2337600 2629417 -302590
12458 -302590 -2160558 -1594148 -923715 -771559 986478 4502473 6705425 5812979 3370584
12449 3370584 868428 -2040222 -4861090 -5427271 -3273521 -651837 1263862 3864226
12441 3864226 7099535 7638982 3779984 -849505 -1850286 -50620 642552 -331641 -76348
12432 -76348 1993119 2528226 -619631 -4969758 -6859694 -6012344 -4658263 -3687216 -2110421
12423 -2110421 51819 739341 -1291454 -3960807 -3954669 -1311735 -243486 -4109410 -10499419
12414 -10499419 -13419215 -10657165 -6740392 -7032904 -10668884 -11962568 -8134181 -2509680
$$ packed form
12476g611122m94753L22852J262860Q86377L0889O34855J857761J401001K764
12467a706516J46819R89000k88260k410738j172891K840923L939263K91817k932007
12458c02590j857968N66410O70433J52156J758037L515995K202952q92446k442395
12449C370584k502156k908650k820868n66181K153750K621684J915699K600364
12441C864226L235309N39447l858998m629489j000781J799666O93172r74193K55293
12432g6348K069467N35107l147857m350127j889936Q47350J354081R71047J576795
12423b110421K162240O87522k030795k669353O138K642934J068249l865924o390009
12414a0499419k919796K762050L916773k92512l635980j293684L828387N624501
$$ plain form
12406 -2509680 521705 641392 -95384 -1486137 -4673427 -8619098 -10386376 -9140138
12398 -9140138 -7312280 -7197449 -8448959 -9580992 -10047304 -10049816 -9887580 -10050273 -10331384
12389 -10331384 -8674044 -3222796 3968351 8019545 7003099 3752218 803701 -2673631
12381 -2673631 -6703412 -7547503 -3032101 2436987 3190120 441616 -229228 1936413 2222409
12372 2222409 -1184596 -4200943 -3491461 -904663 637971 1306722 2309859 3334537
12364 3334537 4007345 4795371 5034745 3267559 593723 20697 1394315 1100747 -1857531
12355 -1857531 -4042139 -3557696 -2902064 -3500148 -2630525 988240 3732390 3132041 2309637
12346 2309637 3685152 3311496 -2596128 -9788721 -11397624 -7922203 -4800977 -2910763
$$ packed form
12406b509680L031385J19687p36776j390753l187290l945671j767278J246238
12398i140138J827858J14831j251510j132033m66312k512J62236j62693k81111
12389a0331384J657340N451248P191147M051194j016446l250881k948517l477332
12381b673631m029781q44091M515402N469088P53133k748504o70844K165641K85996
12372B222409l407005l016347P09482K586798J542634O68751J003137J024678
12364C334537O72808P88026K39374j767186k673836n73026J373618k93568k958278
12355a857531k184608M84443O55632n98084Q69623L618765K744150o00349q22404
12346B309637J375515l73656n907624p192593j608903L475421L121226J890214
$$ plain form
12338 -2910763 524752 3380121 178 -8465442 -13542761 -11114594 -6119156 -3166866
12330 -3166866 -19513 5532969 9084075 5884627 -643894 -2894819 552044 3863027
12322 3863027 2277733 -3017918 -8132054 -10658598 -9996761 -6594999 -2402190 -499306
12314 -499306 -2776673 -8048198 -12841919 -14163928 -11781598 -8066309 -5598097 -5014564
12306 -5014564 -5173817 -4770925 -3370790 -1562036 -667928 -1546787 -3251049 -4067513 -4258529
12297 -4258529 -5720279 -8031417 -7728120 -3593659 352841 324192 -1692145 -2125142 -2803631
12288 -2803631 -7752085 -14374320 -15000370 -8143234 -1402578 -672481 -2614794 -1587399
12280 -1587399 1337623 1342322 -1912077 -4520452 -4789330 -4506059 -4710927 -4470599 -3587975
$$ packed form
12338b910763L435515K855369l379943q465620n077319K428167M995438K952290
12330c166866L147353N552482L551106l199448o528521k250925L446863L310983
12322C863027j585294n295651n114136k526544O61837L401762M192809J902884
12314d99306k277367n271525m793721j322009K382330L715289K468212N83533
12306e014564j59253M02892J400135J808754Q94108q78859j704262q16464j91016
12297d258529j461750k311138L03297M134461L946500k8649k016337m32997o78489
12288b803631m948454o622235o26050O857136O740656P30097j942313J027395
12280a587399K925022M699l254399k608375k68878K83271k04868K40328Q82624
$$ plain form
12271 -3587975 -3074756 -3009353 -2709269 -2726847 -4025621 -5473258 -4765235 -1834447 850611
12262 850611 1355915 -84565 -2017414 -2664107 -873056 1761674 1115632 -4286538 -9626033
12253 -9626033 -9116774 -4257728 -2103772 -4869613 -6528333 -2112705 4360519 5375240
12245 5375240 166436 -5308110 -7048648 -6729322 -6860439 -6900912 -5551301 -3356271 -1106661
12236 -1106661 1707716 4867074 6071448 3904098 490818 -1207806 -1569121 -3187700
12228 -3187700 -6176286 -7274717 -4036055 2008913 6928752 7925541 5191353 1468976
12220 1468976 -184048 729948 1654255 238539 -2764482 -5292973 -7362566 -10114322
12212 -10114322 -12385883 -11689919 -8719715 -7216155 -8330266 -8633217 -5456406 -974475
$$ packed form
12271c587975N13219O5403L00084j7578j298774j447637P08023K930788K685058
12262H50611N05304j440480j932849o46693J791051K634730o46042n402170n339495
12253i626033N09259M859046K153956k765841j658720M415628O473224J014721
12245E375240n208804n474546j740538L19326j31117m0473J349611K195030K249610
12236a106661K814377L159358J204374k167350l413280j698624l61315j618579
12228c187700k988586j098431L238662O044968M919839R96789k734188l722377
12220A468976j653024R13996R24307j415716l003021k528491k069593k751756
12212a0114322k271561O95964K970204J503560j114111l02951L176811M481931
$$ plain form
12204 -974475 1340419 1527733 1714043 2259294 2325266 2438010 3350588 3676525 1687160
12195 1687160 -1546222 -3691289 -4821245 -6376112 -7185827 -4207608 2355583 7884230
12187 7884230 8521971 5399230 2558806 2258954 3491605 4191914 3734579 3130277 3136050
12178 3136050 2952111 1645590 152722 -10382 343712 -785444 -2442977 -1501580 1314124
12169 1314124 815839 -4455330 -8057729 -4212968 3153611 5554834 1562377 -2925670
12161 -2925670 -4510436 -5565655 -7636036 -8264591 -6176322 -4251853 -5012568 -7149991
12153 -7149991 -8369613 -8185738 -6645927 -3890100 -1991761 -3387071 -6489439 -6960545
12145 -6960545 -4289220 -2486460 -3020040 -2385309 1146130 3951632 3581462 3624798 7568843
$$ packed form
12204i74475K314894J87314J86310N45251O5972J12744R12578L25937j989365
12195A687160l233382k145067j129956j554867q09715K978219O563191N528647
12187G884230O37741l122741k840424k99852J232651P00309m57335o04302N773
12178C136050j83939j306521j492868j63104L54094j129156j657533R41397K815704
12169A314124m98285n271169l602399L844761P366579K401223l992457m488047
12161b925670j584766j055219k070381o28555K088269J924469p60715k137423
12153g149991j219622J83875J539811K755827J898339j395310l102368m71106
12145f960545K671325J802760n33580O34731L531439K805502l70170M3336L944045
$$ plain form
12136 7568843 12061451 11441011 6040711 1120041 -205343 1463071 4955605 8438906
12128 8438906 8049182 1864518 -5542600 -7374037 -3289912 476214 -268691 -3166386
12120 -3166386 -4088063 -2667090 -1649353 -3143446 -6476911 -8263585 -4932176 2729050
12112 2729050 8281960 5766657 -3108692 -10720401 -12206487 -9340146 -6069241 -4123116
12104 -4123116 -3813619 -5353666 -7596152 -8331512 -7419695 -6956876 -7053566 -4853819 91052
12095 91052 3069517 419360 -4114057 -3561039 3051037 9936860 12380456 10837559 7080682
12086 7080682 1270365 -5173619 -8049281 -5100388 138151 2205845 -220487 -4409262
12078 -4409262 -7602756 -8269042 -5556992 -960264 1222604 -1168973 -4324029 -3619500
$$ packed form
12136G568843M492608o20440n400300m920670j325384J668414L492534L483301
12128H438906l89724o184664p407118j831437M084125L766126p44905k897695
12120c166386r21677J420973J017737j494093l333465j786674L331409P661226
12112B729050N552910k515303q875349p611709j486086K866341L270905J946125
12104d123116L09497j540047k242486p35360R11817M62819r6690K199747M944871
12095I1052K978465k650157m533417N53018O612076O885823K443596j542897l756877
12086G080682n810317o443984k875662K948893N238539K067694k426332m188775
12078d409262l193494o66286K712050M596728K182868k391577l155056P04529
$$ plain form
12070 -3619500 -751568 -440928 -1595757 1179107 7211364 9011873 4185035 78240
12062 78240 2347435 6339109 5660595 2611368 2668037 4006276 1163364 -4463206 -6707658
12053 -6707658 -5119189 -4705677 -6475768 -6818827 -5711166 -6830107 -9347607 -8400716 -4589162
12044 -4589162 -4086483 -7659927 -8595268 -4041041 567432 1556360 2209205 3760624 913215
12035 913215 -7483265 -12280299 -6516835 3259240 6684503 4368091 3799521 5649585
12027 5649585 4449370 15083 -1944472 143516 1782246 553264 -1198018 -1911982
12019 -1911982 -2366833 -1700536 1757730 5701504 6009766 3554648 2734116 3565960 2021765
12010 2021765 -1598802 -2001027 2035263 5119736 4276582 3836466 7658486 11999767 10689500
$$ packed form
12070c619500K867932L10640j154829K774864O032257J800509m826838m106795
12062G8240K269195L991674o78514l049227N6669J338239k842912n626570k244452
12053f707658J588469M13512j770091l43059J107661j118941k517500R46891L811554
12044d589162N02679l573444r35341M554227M608473R88928O52845J551419k847409
12035I13215q396480m797034N763464R776075L425263k316412n68570J850064
12027E649585j200215m434287j959555K087988J638730j228982j751282p13964
12019a911982m54851O66297L458266L943774L08262k455118q20532Q31844j544195
12010B021765l620567m02225M036290L084473q43154m40116L822020M341281j310267
$$ plain form
12001 10689500 3868946 -2468450 -3582539 33964 3988054 3742900 -886670 -4233337
11993 -4233337 -607665 7775753 12385038 8964500 2358575 -1114829 -1636488 -2973565
11985 -2973565 -5371158 -5928300 -4273443 -3401455 -4776569 -5807809 -3294847 2129349
11977 2129349 6136625 5283783 979873 -2120253 -2035108 -1901376 -4763964 -8054006 -6867513
11968 -6867513 -1771967 1173528 -1237075 -5355948 -6627691 -5479120 -4659126 -4110797
11960 -4110797 -2104966 522885 1036478 -862212 -2424045 -1799780 -251107 300246 244974
11951 244974 1500488 4292769 6089292 4501596 646529 -1768940 -918264 1163838
11943 1163838 1871777 1552468 2148046 3788556 4886467 4744368 3936513 2734506 1261728
$$ packed form
12001A0689500o820554o337396j114089L616503L954090k45154m629570l346667
11993d233337L625672Q383418M609285l420538o605925l473404n21659j337077
11985b973565k397593n57142J654857Q71988j375114j031240K512962N424196
11977B129349M007276q52842m303910l100126Q5145J33732k862588l290042J186493
11968f867513N095546K945495k410603m118873j271743J148571Q19994N48329
11960d110797K005831K627851N13593j898690j561833O24265J548673N51353n5272
11951B44974J255514K792281J796523j587696l855067k415469Q50676K082102
11943A163838P07939l19309N95578J640510J097911j42099q07855j202007j472778
$$ plain form
11934 1261728 701956 2186744 4685507 5888122 5023038 3272160 1831561 940560 84670
11925 84670 -2051976 -6485686 -11408511 -12749561 -9193094 -4391665 -1872280 -509772
11917 -509772 1824405 3280199 1193718 -2347323 -3435113 -3068102 -5255224 -9506586
11909 -9506586 -11114134 -8459696 -4290916 -120521 4532453 7527584 5550053 814154
11901 814154 -596205 1737191 1881319 -1829947 -3304043 899352 5173970 3624646
11893 3624646 -1098505 -3012531 -1621874 -186395 411834 888854 467576 -675675 344109
11884 344109 3810393 4385405 -1427548 -8503855 -9378840 -4380633 -130242 -504925 -4151389
11875 -4151389 -8398158 -10607544 -8244648 -2659388 -79129 -3684097 -7813842 -5858214
$$ packed form
11934A261728n59772J484788K498763J202615q65084j750878j440599q91001q55890
11925H4670k136646m433710m922825j341050L556467M801429K519385J362508
11917e09772K334177J455794k086481l541041j087790L67011k187122m251362
11909i506586j607548K654438M168780M170395M652974K995131j977531m735899
11901H14154j410359K333396J44128l711266j474096M203395M274618j549324
11893C624646m723151j914026J390657J435479N98229M77020m21278j143251J019784
11884C44109L466284N75012n812953p076307q74985M998207M250391l74683l646464
11875d151389m246769k209386K362896N585260K580259l604968m129745J955628
$$ plain form
11867 -5858214 -560143 610755 -2385214 -2893512 775441 3036602 835077 -2303386
11859 -2303386 -3586600 -4971372 -7565680 -8694252 -7522463 -7769847 -11401730 -14511359
11851 -14511359 -13035468 -8617353 -5492283 -4856728 -5245001 -5551742 -5130812 -3614528 -2676420
11842 -2676420 -4962244 -9323029 -10559957 -6325960 -791591 1502173 2033648 4744671
11834 4744671 8770219 9253935 4401617 -2162849 -5979292 -5867900 -3603673 -1819947
11826 -1819947 -2123867 -3448377 -2709381 1135511 4551003 3362966 -1274602 -3829876
11818 -3829876 -1788582 872809 -765883 -5938709 -9753634 -10046498 -9293184 -9532618 -9067311
11809 -9067311 -6304339 -3880825 -5163194 -7992872 -6473621 480547 6607902 6139301
$$ packed form
11867e858214N298071J170898k995969n08298L668953K261161k201525l138463
11859b303386j283214j384772k594308j128572J171789k47384l631883l109629
11851a4511359J475891M418115L125070O35555l88273l06741M20930J516284R38108
11842b676420k285824m360785j236928M233997N534369K293764N31475K711023
11834D744671M025548M83716m852318o564466l816443J11392K264227J783726
11826a819947l03920j324510P38996L844892L415492j188037m637568k555274
11818c829876K041294K661391j638692n172826l814925k92864P53314k39434M65307
11809i067311K762972K423514j282369k829678J519251O954168O127355m68601
$$ plain form
11801 6139301 821416 -3114876 -2129802 2752163 8211499 9979119 5071326 -3555340
11793 -3555340 -7319976 -1567540 7228317 8946075 3147839 -940428 2316791 8005968
11785 8005968 8802928 4657179 978607 677352 1670634 835145 -2123560 -4412105 -3042944
11776 -3042944 1346959 4211508 2455812 -1019285 -1229022 1394628 1895901 -689703
11768 -689703 -1090082 3868894 9492348 9305944 3629766 -1683736 -3012282 -1958147 -1633733
11759 -1633733 -2845713 -3881584 -2741478 32972 805239 -2853933 -7214865 -5271925
11751 -5271925 3784171 11534696 9781788 467859 -7233058 -7934736 -4475279 -2164422
11743 -2164422 -2377494 -2778011 -1605939 -119934 -843566 -3823985 -5644875 -3446352 843642
$$ packed form
11801F139301n317885l936292R85074M881965N459336J767620m907793q626666
11793c555340l764636N752436Q795857J717758n798236m088267L257219N689177
11785H005968P96960m145749l678572l01255R93282q35489k958705k288545J369161
11776c042944M389903K864549j755696l475097k09737K623650N01273k585604
11768f89703m00379M958976N623454j86404n676178n313502j328546J054135L24414
11759a633733j211980j035871J140106K774450P72267l659172m360932J942940
11751e271925R056096P750525j752908r313929p700917p01678L459457K310857
11743b164422k13072m00517J172072J486005p23632k980419j820890K198523M289994
$$ plain form
11734 843642 2655193 880567 -1316805 -2158985 -3773045 -7404991 -10073900 -8949800
11726 -8949800 -5924893 -4354605 -3734355 -1513898 1473114 1585497 -1973809 -5528120
11718 -5528120 -5425144 -2116378 435936 -1566791 -7827020 -12958807 -11429865 -4735653
11710 -4735653 -869840 -4527519 -10937600 -12524574 -8538330 -3829286 -859896 1522151
11702 1522151 2980302 1669373 -650069 420922 4555585 5928810 2020679 -2073785
11694 -2073785 -1571380 250350 -2892291 -10081095 -13478819 -8671551 -284259 4122497
11686 4122497 2705023 -298817 -1079711 -235056 -125481 -903572 -1098179 -834309 -1798879
11677 -1798879 -3921452 -4641498 -2458945 866839 2886126 3347647 3228839 2824162 2301392
$$ packed form
11734H43642J811551j774626k197372q42180j614060l631946k668909J124100
11726h949800L024907J570288O20250K220457K987012J12383l559306l554311
11718e528120J02976L308766K552314k002727o260229n131787J528942O694212
11710d735653L865813l657679o410081j586974L986244M709044K969390K382047
11702A522151J458151j310929k319442J070991M134663J373225l908131m094464
11694b073785N02405J821730l142641p188804l397724M807268Q387292M406756
11686D122497j417474l003840p80894Q44655J09575p78091j94607K63870r64570
11677a798879k122573p20046K182553L325784K019287M61521j18808m04677n22770
$$ plain form
11668 2301392 2233692 2058162 201256 -2643253 -3176960 -683293 735822 -1562926 -3553121
11659 -3553121 -214454 6224292 9282830 7812481 6455497 7132518 6615418 3456334
11651 3456334 1136684 2203679 4441576 5300322 5621904 6467948 6452759 4991175 4392976
11642 4392976 5768227 6215419 3193593 -1087343 -2602565 -565062 2919745 5992681
11634 5992681 7590931 7082135 5397780 4482411 4269156 2844073 593054 415708 2309347
11625 2309347 2303082 -734922 -2074185 1597443 6594323 8268396 8037477 9068363 9201853
11616 9201853 4828154 -1177649 -2616968 509301 2580143 1555140 629372 915780
11608 915780 -311483 -3071148 -3223764 343514 2994976 1333525 -2171279 -4076123
$$ packed form
11668B301392o7700j75530j856906k844509n33707K493667J419115k298748j990195
11659c553121L338667O438746L058538j470349j356984O77021n17100l159084
11651C456334k319650J066995K237897Q58746L21582Q46044j5189j461584n98199
11642D392976J375251M47192l021826m280936j515222K037503L484807L072936
11634E992681J598250n08796j684355r15369k13255j425083k251019j77346J893639
11625B309347o265l038004j339263L671628M996880J674073k30919J030886J33490
11616I201853m373699o005803j439319L126269K070842j025003r25768K86408
11608I15780j227263k759665j52616L567278K651462j661451l504804j904844
$$ plain form
11600 -4076123 -4825802 -6070680 -7359243 -8176872 -9377291 -10045045 -6947863 -40697 5250520
11591 5250520 4517444 -14530 -3320334 -3763038 -2367180 563706 4148791 5129528 1725309
11582 1725309 -2670278 -3711738 -2400867 -3160841 -6854056 -9747206 -8942251 -5433287
11574 -5433287 -1996764 -682830 -1840367 -3462449 -2695852 -20311 286045 -3469375
11566 -3469375 -6536818 -4344765 -82087 -139632 -4124612 -6169569 -5260180 -6425070 -10580142
11557 -10580142 -11308636 -5220059 1568349 2392512 -159294 496839 4102987 5009426 2261268
11548 2261268 1016567 3804395 6596616 5309172 1619056 -75637 1447417 3584644
11540 3584644 3480826 697822 -2801632 -4626959 -4424841 -4065798 -4717417 -5110114 -4312831
$$ packed form
11600d076123p49679j244878j288563q17629j200419o67754L097182O907166N291217
11591E250520p33076m531974l305804m42704J395858K930886L585085R80737l404219
11582A725309m395587j041460J310871p59974l693215k893150Q04955L508964
11574e433287L436523J313934j157537j622082P66597K675541L06356l755420
11566c469375l067443K192053M262678n7545l984980k044957R09389j164890m155072
11557a0580142p28494O088577O788408Q24163k551806O56133L606148R06439k748158
11548B261268j244701K787828K792221j287444l690116j694693J523054K137227
11540C584644j03818k783004l499454j825327K02118L59043o51619l92697P97283
$$ plain form
11531 -4312831 -4347671 -7041886 -9715502 -8115489 -3293401 -1039202 -3769784 -7550063
11523 -7550063 -8719071 -8728244 -9623053 -9275278 -5441058 -1168008 -954952 -3561052 -4150141
11514 -4150141 -2651522 -4011097 -9422773 -13141679 -10600906 -5155631 -3266837 -6192243
11506 -6192243 -10185925 -12569442 -13426952 -12537814 -9027399 -4243247 -1218784 -382126 960561
11497 960561 3567438 3893495 -837707 -7567874 -10489565 -8028955 -3795858 -1223573
11489 -1223573 -490946 -884955 -2687581 -5268288 -6238820 -4753711 -3520926 -5075473 -7832887
11480 -7832887 -8684475 -8073052 -9063244 -12117438 -14572452 -15323920 -16100690 -17340389 -16824773
11471 -16824773 -13971182 -11543743 -10787782 -8699968 -3394545 1227788 364957 -4584515
$$ packed form
11531d312831l4840k694215k673616J600013M822088K254199k730582l780279
11523g550063j169008r173q94809L47775L834220M273050K13056k606100n89089
11514d150141J498619j359575n411676l718906K540773N445275J888794k925406
11506f192243l993682k383517q57510Q89138L510415M784152L024463Q36658J342687
11497I60561K606877L26057m731202o730167k921691K460610M233097K572285
11489a223573P32627l94009j802626k580707r70532J485109J232785j554547k757414
11480g832887q51588O11423r90192l054194k455014p51468p76770j239699N15616
11471a6824773K853591K427439P55961K087814N305423M622333q62831m949472
$$ plain form
11463 -4584515 -8230298 -8627020 -7865023 -6849638 -4897624 -3768045 -6132738 -9666119
11455 -9666119 -8813021 -3917915 -2300659 -7338630 -12504101 -10825640 -5289691 -3923116
11447 -3923116 -7868704 -10948215 -9697376 -7386916 -7611545 -9306519 -9703165 -8177044
11439 -8177044 -5417592 -1920897 1065712 1714058 213124 -1044023 -989917 -1075167 -1625569
11430 -1625569 -18940 4984180 9528030 8858210 4213529 1706393 3831938 5590563
11422 5590563 1171309 -7722312 -13236035 -10619102 -3351355 1723100 1990012 -59205
11414 -59205 -1803001 -3215636 -4503254 -4040910 -595091 3830053 5502927 3187126 -570447
11405 -570447 -2580899 -2377640 -1820522 -1890185 -1042088 2415050 6881136 8293719 5238584
$$ packed form
11463d584515l645783l96722P61997J015385J952014J129579k364693l533381
11455i666119Q53098M895106J617256n037971n165471J678461N535949J366575
11447c923116l945588l079511J250839K310460k24629j694974l96646J526121
11439h177044K759452L496695K986609O48346j500934j257147N4106q5250n50402
11430a625569J606629N003120M543850o69820m644681k507136K125545J758625
11422E590563m419254q893621n513723K616933P267747N074455K66912k049217
11414e9205j743796j412635j287618M62344L445819M425144J672874k315801l757573
11405e70447k010452K03259N57118o9663Q48097L457138M466086J412583l055135
$$ plain form
11396 5238584 1370544 775728 2401621 2011757 -1150526 -3468098 -3135320 -3155134 -6247868
11387 -6247868 -10186234 -11019722 -8517031 -5391660 -2900985 -419973 1633439 1664254 -266345
11378 -266345 -1801021 -945001 1757599 3669052 2283927 -2093278 -5734382 -5379615 -3013432
11369 -3013432 -3848145 -8559347 -11325771 -7985930 -2340155 -692584 -3352982 -5936577
11361 -5936577 -6390835 -5693537 -3663868 288124 3458063 2698292 394902 1590952 5146140
11352 5146140 4361031 -2227997 -7212218 -4387648 2983922 7659154 7732612 6283207 4967972
11343 4967972 2555527 -1496508 -5528891 -7470637 -6378333 -2903634 829868 2992148
11335 2992148 4046523 5244869 5365042 1967941 -3829286 -7561759 -7458608 -6506352 -7066923
$$ packed form
11396E238584l868040n94816J625893l89864l162283k317572L32778j9814l092734
11387f247868l938366q33488K502691L125371K490675K481012K053412L0815j930599
11378b66345j534676Q56020K702600J911453j385125m377205l641104L54767K366183
11369c013432q34713m711202k766424L339841N645775J647571k660398k583595
11361e936577m54258O97298K029669L951992L169939p59771k303390J196050L555188
11352E146140p85109o589028m984221K824570P371570M675232P3458j449405j315235
11343D967972k412445m052035m032383j941746J092304L474699L733502K162280
11335B992148J054375J198346J20173l397101n797227l732473J03151R52256n60571
$$ plain form
11326 -7066923 -7550122 -6563105 -6075304 -7236996 -6826598 -1950615 4409247 6776030 4431212
11317 4431212 1493059 920523 1899529 2466653 1677380 -505730 -3147082 -4563680 -4370310
11308 -4370310 -4499676 -6593615 -9418713 -10406103 -8669102 -5255573 -1796995 20128
11300 20128 -606041 -2169379 -2425748 -2109108 -4178084 -8384299 -10425332 -8449998 -6309258
11291 -6309258 -7476051 -9773118 -9776768 -8535469 -8383213 -7561890 -3418990 1617256 3022611
11282 3022611 1468919 1373004 3139256 2677099 -1364897 -5269571 -5858034 -3992370 -1922294
11273 -1922294 -1122854 -2973955 -7473354 -11029617 -9709643 -5021902 -2312252 -3198353
11265 -3198353 -4191701 -3272463 -2590286 -3252659 -2801613 -433764 123700 -3536604 -7683606
$$ packed form
11326g066923m83199R87017M87801j161692M10398M875983O359862K366783k344818
11317D431212k938153n72536R79006N67124p89273k183110k641352j416598J93370
11308d370310j29366k093939k825098r87390J737001L413529L458578J817123
11300B0128o26169j563338k56369L16640k068976m206215k041033J975334K140740
11291f309258j166793k297067l650J241299J52256Q21323M142900N036246J405355
11282C022611j553692r5915J766252m62157m041996l904674n88463J865664K070076
11273a922294P99440j851101m499399l556263J319974M687741K709650q86101
11265c198353r93348R19238O82177o62373M51046K367849N57464l660304m147002
$$ plain form
11256 -7683606 -7515885 -4176533 -2460325 -3480437 -4175517 -3427919 -4002899 -7213771 -9411772
11247 -9411772 -6652355 -1006174 1377555 -1251667 -3312570 161544 5539955 5128800
11239 5128800 -1389245 -5965349 -3950143 -678192 -2628613 -7506180 -8736957 -5718574
11231 -5718574 -2851895 -1092840 2057813 5383897 4569068 321047 -1527163 618157
11223 618157 1749733 -565371 -1718941 1632636 5047967 2907577 -3074248 -6857844
11215 -6857844 -6262043 -3721022 -1659342 -1305547 -3751177 -8024219 -9795173 -5859860
11207 -5859860 1089211 5189877 3947559 -241868 -3594513 -3615867 65041 4998125
11199 4998125 7334919 5936125 3443524 1688952 -1172961 -6376437 -10460289 -9477637
$$ packed form
11256g683606J67721L339352J716208j020112o95080P47598n74980l210872k198001
11247i411772K759417N646181K383729k629222k060903L474114N378411m11155
11239E128800o518045m576104K015206L271951j950421m877567j230777L018383
11231e718574K866679J759055L150653L326084q14829m248021j848210K145320
11223F18157J131576k315104j153570L351577L415331k140390n981825l783596
11215f857844N95801K541021K061680L53795k445630m273042j770954L935313
11207e859860O949071M100666j242318m189427l352645k1354L680908M933084
11199D998125K336794j398794k492601j754572k861913n203476m083852R82652
$$ plain form
11191 -9477637 -5303283 -3372049 -5145050 -7139171 -7114853 -6785259 -7509279 -7196042 -3596452
11182 -3596452 1625940 4279337 2309446 -2151267 -5128382 -4686686 -2504955 -1519980
11174 -1519980 -2253213 -2535887 -1106656 169109 -1211974 -5021639 -8782803 -10505861
11166 -10505861 -9546328 -5905052 -515762 4357464 6658275 6301148 4471864 1860442
11158 1860442 -1393617 -4850083 -7969418 -10280825 -10443497 -6725364 -126439 4532966
11150 4532966 3330153 -1508472 -3807834 -1091876 2596366 2500944 -576864 -1910648
11142 -1910648 417551 3019157 1914001 -2316920 -5748369 -6395862 -5959342 -6282742 -6752332
11133 -6752332 -6544166 -7035309 -9465465 -11741686 -10639649 -6645377 -3633409 -3663418 -4812441
$$ packed form
11191i477637M174354J931234j773001j994121K4318L29594p24020L13237L599590
11182c596452N222392K653397j969891m460713k977115M41696K181731R84975
11174a519980p33233k82674J429231J275765j381083l809665l761164j723058
11166a0505861R59533L641276N389290M873226K300811l57127j829284k611422
11158A860442l254059l456466l119335k311407j62672L718133O598925M659405
11150D532966j202813m838625k299362K715958L688242r5422l077808j333784
11142a910648K328199K601606j105156m230921l431449o47493M36520l23400m69590
11133f752332K08166m91143k430156k276221J102037L994272L011968l0009j149023
$$ plain form
11124 -4812441 -4527910 -2607370 -323594 1067284 368365 -2800408 -6702250 -8868940
11116 -8868940 -8951613 -8168804 -6415698 -2978851 114188 -535534 -4143759 -5542640 -2146465
11107 -2146465 2482173 3923183 2288263 70844 -2050761 -4379589 -5736395 -4736694
11099 -4736694 -1871223 1592335 4831964 6309014 4310213 375294 -1111659 1102993
11091 1102993 3090105 2068924 630886 1203846 694304 -4277604 -10174312 -10544069 -5332640
11082 -5332640 -402420 1096325 1081004 770266 -1339660 -4794809 -5855022 -2802838 1418248
11073 1418248 3680229 4407280 5138309 5428532 4197764 1960989 -56909 -1582573 -3053628
11064 -3053628 -4978149 -7763344 -10556575 -10520812 -5760678 868962 3729039 980629
$$ packed form
11124d812441K84531J920540K283776J390878o98919l168773l901842k166690
11116h868940q2673P82809J753106L436847L093039o49722l608225j398881L396175
11107b146465M628638J441010j634920k217419k121605k328828j356806R99701
11099d736694K865471L463558L239629J477050j998801l934919j486953K214652
11091A102993J987112j021181j438038N72960n09542m971908n896708l69757N211429
11082e332640M930220J498745j5321l10738k109926l455149j060213L052184M221086
11073A418248K261981P27051P31029K90223j230768k236775k017898j525664j471055
11064c053628j924521k785195k793231L5763M760134O629640K860077k748410
$$ plain form
11056 980629 -3430629 -5386133 -5410752 -6175310 -7729367 -7930636 -6365060 -5083472 -5434966
11047 -5434966 -6225480 -5716598 -4186191 -3400959 -3900731 -3989283 -2070207 722770 1514204
11038 1514204 -645119 -3478104 -4501763 -4127518 -4589921 -6522604 -8008177 -7168736 -4843203
11029 -4843203 -3989840 -6126974 -8812952 -8077011 -3862317 -981705 -2861302 -6553388
11021 -6553388 -7168538 -5302593 -5266309 -6906796 -5420934 -245437 2552218 -262304 -3419282
11012 -3419282 -1478683 2494429 2412068 -797765 -1381903 1529408 3357555 2200420 931867
11003 931867 1061316 479574 -1707084 -3310319 -3492368 -4650474 -8129632 -11569385 -12141358
10994 -12141358 -9684868 -5582744 -1116099 2309733 3758452 4089009 4551144 4397167
$$ packed form
11056I80629m411258j955504k4619p64558j554057k01269J565576J281588l51494
11047e434966p90514N08882J530407P85232m99772q8552J919076K792977P91434
11038A514204k159323k832985j023659L74245m62403j932683j485573Q39441K325533
11029d843203Q53363k137134k685978P35941M214694K880612j879597l692086
11021f553388o15150J865945L6284j640487J485862N175497K797655k814522l156978
11012c419282J940599L973112q2361l209833n84138K911311J828147j157135j268553
11003I31867J29449n81742k186658j603235j82049j158106l479158l439753n71973
10994a2141358K456490M102124M466645L425832J448719L30557M62135j53977
$$ plain form
10986 4397167 2552130 797093 1458474 2284809 -1698899 -10337676 -16845028 -16009616 -10186926
10977 -10186926 -5081037 -3006277 -2810478 -3439091 -4380294 -4364463 -2615182 -668058 -789494
10968 -789494 -2950583 -4823357 -4486666 -2222174 -5670 212748 -1780270 -3979693 -3700287
10959 -3700287 96863 5779878 9778651 8702975 2576420 -3584358 -3956368 853126
10951 853126 3545349 -492454 -6565381 -7210399 -2804309 -481514 -3633319 -8170762
10943 -8170762 -9615857 -8464692 -6851304 -4638402 -1543168 237888 -1524293 -5843070
10935 -5843070 -9626903 -10681981 -8777597 -5540169 -3832187 -5090611 -6849149 -5341608
10927 -5341608 -905979 2193619 2031425 1669900 3950716 6849313 6561712 3066026 -57516
$$ packed form
10986D397167j845037j755037O61381Q26335l983708q638777o507352Q35412N822690
10977a0186926N105889K074760J95799o28613r41203J5831J749281J947124j21436
10968g89494k161089j872774L36691K264492K216504K18418j993018k199423K79406
10959c700287L797150N683015L998773j075676o126555o160778l72010M809494
10951H53126K692223m037803o072927o45018M406090K322795l151805m537443
10943h170762j445095J151165J613388K212902L095234J781056j762181m318777
10935e843070l783833j055078J904384L237428J707982j258424j758538J507541
10927e341608M435629L099598j62194l61525K280816K898597k87601l495686l123542
$$ plain form
10918 -57516 -249993 1718118 3484384 3481895 1687233 -942854 -3343332 -4629910 -3948123
10909 -3948123 -1241722 1591296 2220893 1525452 3294862 8560252 13097365 13350797 11721897
10900 11721897 11902043 11955924 7732510 1227066 -1229818 1177683 2577083 6523
10892 6523 -2565938 -1905416 -800637 -2445048 -5031162 -5908203 -6672142 -9824142 -13654055
10883 -13654055 -14531829 -12034567 -8565883 -5848441 -4259004 -3504856 -1986254 2008663
10875 2008663 6797219 8048885 4741226 797343 -1068039 -2780280 -5603395 -6385680
10867 -6385680 -3193600 -178068 -1546792 -4187532 -2219077 3451980 6270011 3610238
10859 3610238 -583547 -2495630 -2412345 -1571082 56426 1658579 1261040 -1114346 -3063605
$$ packed form
10918e7516j92477J968111J766266k489j794662k630087k400478j286578O81787
10909c948123K706401K833018O29597o95441J769410N265390M537113K53432j628900
10900A1721897J80146N3881m223414o505444k456884K407501J399400k570560
10892F523k572461O60522J104779j644411k586114q77041p63939l152000l829913
10883a3654055q77774K497262L468684K717442J589437P54148J518602L994917
10875B008663M788556J251666l307659l943883j865382j712241k823115p82285
10867f385680L192080L015532j368724k640740J968455N671057K818031k659773
10859C610238m193785j912083Q3285Q41263J627508J602153l97539k375386j949259
$$ plain form
10850 -3063605 -3507387 -3827226 -4521717 -3871229 -1181775 1461151 2195714 1709049 952630
10841 952630 -1099385 -5080123 -8186169 -6352277 504176 7452098 9538724 6727460
10833 6727460 2984232 1151432 202629 -2046054 -5040132 -6074220 -4401712 -2682322
10825 -2682322 -3533514 -6155012 -7681184 -7043681 -6090609 -6988146 -9538595 -11465306 -11049169
10816 -11049169 -9013573 -7317243 -6255005 -4083734 -367848 1853276 -539189 -5727359
10808 -5727359 -8032702 -4742571 283319 1211110 -2952208 -7782226 -9133636 -7739360
10800 -7739360 -7404410 -9413468 -10433490 -7041367 -1063905 2090646 384836 -2522424
10792 -2522424 -2877482 -1634120 -1677382 -3156979 -4379687 -5062938 -5775092 -6141312 -6368964
$$ packed form
10850c063605m43782l19839o94491O50488K689454K642926P34563m86665p56419
10841I52630k052015l980738l106046J833892O856453O947922K086626k811264
10833F727460l743228j832800r48803k248683k994078j034088J672508J719390
10825b682322q51192k621498j526172O37503R53072q97537k550449j926711M16137
10816a1049169K035596J696330J062238K171271L715886K221124k392465n188170
10808e727359k305343L290131N025890R27791m163318m830018j351410J394276
10800g739360L34950k009058j020022L392123N977462L154551j705810k907260
10792b522424l55058J243362m3262j479597j222708o83251p12154l66220k27652
$$ plain form
10783 -6368964 -8203151 -11363638 -11933090 -8118995 -4559031 -6105562 -10210747 -11154096
10775 -11154096 -9188150 -8704585 -9271902 -6379653 -586241 2131881 -147249 -3072294
10767 -3072294 -4246659 -5837880 -7465799 -4889760 1353438 4089573 92298 -4938810
10759 -4938810 -6074277 -6250081 -8703486 -9847518 -6139475 -1685573 -1832228 -4203029
10751 -4203029 -3237917 497005 2471250 2062010 1520762 324580 -2743912 -4869416 -3341016
10742 -3341016 -1658759 -4508724 -9179373 -9549088 -6658037 -6999776 -10985726 -11761095 -6643169
10733 -6643169 -1777884 -2719524 -6874863 -8756337 -7759611 -6966596 -7510646 -7500398 -4936864
10724 -4936864 90281 4861940 5406125 497610 -5805703 -8330201 -7378311 -7847804 -11588845
$$ packed form
10783f368964j834187l160487n69452L814095L559964j546531m105185r43349
10775a1154096J965946M83565n67317K892249N793412K718122k279130k925045
10767c072294j174365j591221j627919K576039O243198K736135l997275n031108
10759d938810j135467j75804k453405j144032L708043M453902j46655k370801
10751d203029R65112L734922J974245m09240n41248j196182l068492k125504J528400
10742c341016J682257k849965m670649l69715K891051l41739l985950p75369N117926
10733f643169M865285r41640m155339j881474R96726P93015n44050J0248K563534
10724d936864N027145M771659N44185m908515o303313k524498R51890m69493l741041
$$ plain form
10715 -11588845 -14679596 -13673320 -10658472 -9553975 -10403843 -10632124 -9977179 -10316204 -11127334
10706 -11127334 -9191321 -4172359 -1153128 -4489847 -10786916 -11898971 -5107054 3454786
10698 3454786 6793239 4709150 1160715 -2062209 -5026471 -6212718 -4643600 -3585491
10690 -3585491 -6588281 -10878561 -10350423 -4555506 1128202 3866235 5397594 5726007
10682 5726007 2376712 -2614924 -2762111 2920997 7168955 5206345 1403417 1026302
10674 1026302 2011149 231271 -2756608 -3054676 -1109312 282167 897169 1466175 1016670
10665 1016670 -74850 1171874 4457549 4299663 -1178747 -5229594 -2263453 2768414
10657 2768414 1984488 -3006068 -4446200 -1032178 1336350 -41650 -1532127 -524935
$$ packed form
10715a1588845l090751J006276L014848J104497q49868k28281O54945l39025q11130
10706a1127334J936013N018962L019231l336719o297069j112055O791917Q561840
10698C454786L338453k084089l548435l222924k964262j186247J569118J058109
10690c585491l002790m290280N28138N794917N683708K738033J531359L28413
10682E726007l349295m991636j47187N683108M247958j962610l802928l77115
10674A026302R84847j779878k987879k98068J945364J391479O15002N69006m49505
10665A016670j091520J246724L285675j57886n478410m050847K966141N031867
10657B768414p83926m990556j440132L414022K368528j378000j490477J007192
$$ plain form
10649 -524935 761484 -246775 -3132171 -6224090 -7957696 -6644065 -2185420 2411961
10641 2411961 3860379 1992197 -1495493 -5584044 -9255543 -10980160 -10915464 -10700850 -9815355
10632 -9815355 -6459428 -3262588 -5890518 -13376602 -16884050 -12166103 -6105630 -5697694
10624 -5697694 -7814986 -6411173 -2952879 -1956944 -2168945 -523910 256748 -3336915 -7362156
10615 -7362156 -5915113 -1385779 -829137 -4991539 -8753048 -9672212 -8725208 -5621331 -682020
10606 -682020 1800353 -776630 -3753292 -2262960 282060 -1741151 -6026454 -6487798
10598 -6487798 -3444329 -1232312 366443 3673748 5971244 3583952 -554509 -1871009
10590 -1871009 -2512683 -6091279 -8860003 -5671561 -171973 804208 -1497284 -1915121 -1584949
$$ packed form
10649e24935J286419j008259k885396l091919j733606J313631M458645M597381
10641B411961J448418j868182l487690m088551l671499j724617O4696K14614Q85495
10632i815355L355927L196840k627930p486084l507448M717947O060473M07936
10624e697694k117292J403813L458294R95935k12001J645035P80658l593663m025241
10615g362156J447043M529334N56642m162402l761509r19164R47004L103877M939311
10606f82020K482373k576983k976662J490332K545020k023211m285303m61344
10598f487798L043469K212017J598755L307305K297496k387292m138461j316500
10590a871009o41674l578596k768724L188442N499588R76181k301492m17837L30172
$$ plain form
10581 -1584949 -3408320 -3088794 3287493 8197035 2478078 -8444442 -12023839 -8285824
10573 -8285824 -7557272 -11805908 -13410277 -10471460 -8327944 -7178553 -2927334 859297
10565 859297 -3226275 -11448016 -12607086 -6167044 -2091342 -3506025 -4691550 -5305425
10557 -5305425 -10297861 -15911094 -12750899 -3749839 -2240555 -10500069 -16721499 -15116679
10549 -15116679 -12329598 -11717733 -8294963 -2325811 -1284199 -4773583 -3438833 3874493
10541 3874493 7469002 3833257 -400005 -3242937 -9449582 -16338721 -15152765 -8331093
10533 -8331093 -7373759 -12114711 -11296015 -4980290 -5497937 -14030032 -18089255 -14978671 -15142940
10524 -15142940 -19407363 -17049776 -9944584 -12737420 -24206201 -25562353 -13555176 -7415665
$$ packed form
10581a584949j823371L19526O376287M909542n718957j0922520l579397L738015
10573h285824P28552m248636j604369K938817K143516J149391M251219L786631
10565H59297m085572q221741j159070O440042M075702j414683j185525o13875
10557e305425m992436n613233L160195R001060J509284q259514o221430J604820
10549a5116679K787081O11865L422770N969152J041612l489384J334750P313326
10541C874493L594509l635745m233262k842932o206645o889139J185956O821672
10533h331093R57334m740952Q18696O315725n17647q532095m059223L110584j64269
10524a5142940m264423K357587P105192k792836j1468781j356152J2007177O139511
$$ plain form
10516 -7415665 -15318671 -22372767 -20337965 -19945685 -24500990 -21689196 -11631847 -11589858
10508 -11589858 -22547784 -24434682 -14647110 -14576239 -26949735 -27924872 -14802654 -15770620
10500 -15770620 -35791526 -43553681 -32381410 -36908996 -63365323 -68608162 -43568356
10493 -43568356 -43361202 -85855843 -105751842 -82884513 -123176265 -294438352 -453055854
10486 -453055854 -389578226 -125144984 94799372 117535255 42894923 23442012 54308296
10479 54308296 50502201 15298765 12817250 40756276 43781818 19326465 13798441 32197003
10471 32197003 34788422 14651438 5798716 16749495 19661131 6990289 2818175 13610722
10463 13610722 17411100 7927475 5241173 15916852 21956631 16361816 13759170 18692713
$$ packed form
10516g415665p903006p054096K034802L92280m555305K811794J0057349M1989
10508a1589858j0957926j886898R787572P0871j2373496r75137J3122218r67966
10500a5770620k0020906p762155J1172271m527586k6456327n242839K5039806
10493d3568356K07154m2494641j9895999K2867329m0291752j71262087j58617502
10486d53055854O3477628K64433242K19944356K2735883p4640332j9452911L0866284
10479E4308296l806095l5203436k481515K7939026L025542k4455353n528024J8398562
10471C2197003K591419k0136984q852722J0950779K911636j2670842m172114J0792547
10463A3610722L800378r483625k686302J0675679O039779n594815k602646M933543
$$ plain form
10455 18692713 16658179 4256853 -2250126 3653616 8479254 5251702 4393807 10677625
10447 10677625 13560194 8441079 5513463 9706900 11987595 7802380 5264763 8128796
10439 8128796 8423616 2695514 -1077130 979626 2019658 -715547 141299 7099155
10431 7099155 11276464 7522058 3128983 4931127 9086068 9612077 7069495 3863205
10423 3863205 -43245 -3097409 -2305206 435149 545331 -125903 4165777 11414761 13205865
10414 13205865 8008395 2524593 -304596 -3453356 -5939277 -2929469 3270999 4402902
10406 4402902 44364 -1462502 2508040 5284343 3652165 2106997 1957777 -1563024
10398 -1563024 -8006195 -9487971 -3919848 677412 -546163 -2304682 -32304 2634232
$$ packed form
10455A8692713k034534j2401326o506979N903742M825638l227552q57895O283818
10447A0677625K882569n119115k927616M193437K280695m185215k537617K864033
10439H128796K94820n728102l772644K056756J040032k735205Q56846O957856
10431G099155M177309l754406m393075J802144M154941N26009k542582l206290
10423C863205l906450l054164P92203K740355J10182o71234M291680P248984J791104
10414A3205865n197470n483802k829189l148760k485921L009808O200468J131903
10406D402902m358538j506866L970542K776303j632178j545168j49220l520801
10398a563024o443171j481776N568123M597260j223575j758519K272378K666536
$$ plain form
10390 2634232 2293474 2103817 4377088 5533999 3466717 1811510 2328750 1127012 -3040855
10381 -3040855 -4845656 -1482440 2061292 1607487 191802 1144825 2152114 1153531 977726
10372 977726 2841549 2148670 -3437755 -7956153 -5365850 1293798 4963434 4603171 4441808
10363 4441808 6331301 8014359 7126952 3347172 -1708325 -4574140 -2305579 3579665
10355 3579665 8023845 8177541 5457995 2029333 -853624 -1271552 1748660 4895688
10347 4895688 3805217 -270472 -2123567 -575431 1001698 1623198 3293911 4715184
10339 4715184 2071253 -2983408 -3969976 136742 3038791 1566573 55202 1557004
10331 1557004 2645850 637734 -1371810 -760847 45269 -709817 -303961 2399799 3347828
$$ packed form
10390B634232l40758j89657K273271J156911k067282j655207N17240j201738m167867
10381c040855j804801L363216L543732m53805j415685R53023J007289r98583j75805
10372I77726J863823o92879n586425m518398K590303O659648L669636l60263j61363
10363D441808J889493J683058q87407l779780n055497k865815K268561N885244
10355C579665M444180J53696k719546l428662k882957m17928L020212L147028
10347D895688j090471m075689j853095J548136J577129O21500J670713J421273
10339D715184k643931n054661r86568M106718K902049j472218j511371J501802
10331A557004J088846k008116k009544O10963Q06116p55086M05856K703760R48029
$$ plain form
10322 3347828 119001 -3525527 -4202915 -4235123 -6046824 -6987830 -4499547 -1197550 -107677
10313 -107677 240040 1550680 1659695 -828887 -2875061 -2526031 -2869366 -5608496 -6148139
10304 -6148139 -850024 5701817 6982618 4058111 2606822 3904104 4996544 4916384
10296 4916384 4573828 2850211 -1325199 -5022747 -4984261 -3363806 -4402329 -7171144 -7213323
10287 -7213323 -4117910 -1900975 -2447288 -3645804 -3825163 -3504733 -2806678 -1199454 221846
10278 221846 -158924 -1315180 -987467 150974 -601073 -3102767 -4255483 -3164742 -2684802
10269 -2684802 -4571917 -6266732 -4623641 -891217 587494 -1643652 -3705414 -1299463
10261 -1299463 4048590 6324828 3183302 -506014 175059 2615977 900633 -4404548
$$ packed form
10322C347828l228827l644528o77388l2208j811701r41006K488283L301997J089873
10313a07677L47717J310640J09015k488582k046174L49030l43335k739130n39643
10304f148139N298115O551841J280801k924507j451289J297282J092440q0160
10296D916384l42556j723617m175410l697548L8486J620455j038523k768815m2179
10287g213323L095413K216935n46313j198516j79359L20430O98055J607224J421300
10278B21846l80770j156256L27713J138441p52047k501694j152716J090741M79940
10269b684802j887115j694815J643091L732424J478711k231146k061762K405951
10261a299463N348053K276238l141526l689316O81073K440918j715344n305181
$$ plain form
10253 -4404548 -6856824 -4330469 -1821870 -2407888 -2139303 2483991 7720272 8126630 4649410
10244 4649410 2066732 1483446 529317 -1127114 -1550297 -761730 -764067 -1689880 -1439862
10235 -1439862 1000285 4577660 8071291 10651445 11204418 9356291 6710548 5299317
10227 5299317 5339468 5731140 5741768 5083148 3646868 2205041 1882166 2186849 1554448
10218 1554448 490019 1452027 4492059 6074001 3988143 557070 -1027002 -744913
10210 -744913 -18192 1169788 2871217 3445570 1945163 163175 -97244 198438 -576750
10201 -576750 -1945752 -2795459 -3502225 -4563914 -5158832 -4763342 -3968254 -2449554 853152
10192 853152 4196843 3522507 -1451506 -5645488 -5613773 -3797103 -2817010 -519946 4814999
$$ packed form
10253d404548k452276K526355K508599n86018K68585M623294N236281M06358l477220
10244D649410k582678n83286r54129j656431m23183P88567k337r25813K50018
10235a439862K440147L577375L493631K580154N52973j848127k645743j411231
10227E299317M0151L91672J0628o58620j436280j441827l22875L04683o32401
10218A554448j064429R62008L040032J581942k085858l431073j584072K82089
10210g44913P26721J187980J701429N74353j500407j781988k60419K95682p75188
10201e76750j369002q49707p06766j061689n94918L95490P95088J518700L302706
10192H53152L343691o74336m974013m193982L1715J816670R80093K297064N334945
$$ plain form
10183 4814999 8954263 7294579 2705866 1496408 3612486 3209279 -1913167 -7479957
10175 -7479957 -9492459 -8549475 -6617324 -3907454 -364884 2814832 4414657 4262527
10167 4262527 2978320 1938505 2510454 3872210 3305406 361419 -1698913 -856104 348975
10158 348975 -365034 -192401 4205917 9814233 10226144 4349376 -2614949 -6106360 -5736038
10149 -5736038 -2766515 1309835 3975857 3647374 2229950 2202864 2212516 -381906 -3973253
10140 -3973253 -4738555 -3288245 -3624414 -5557525 -4209619 1772586 7191109 7640283 5120589
10131 5120589 3792376 4145633 4266760 3876630 4244348 5886611 8270227 10406520 10823442
10122 10823442 8663865 5353914 3310741 2835636 2401403 1733225 1797018 1924826 372362
$$ packed form
10183D814999M139264j659684m588713j209458K116078m03207n122446n566790
10175g479957k012502R42984J932151K709870L542570L179716J599825j52130
10167D262527j284207j039815N71949J361756n66804k943987k060332Q42809J205079
10158C48975p14009J72633M398318N608316M11911n876768o964325l491411L70322
10149e736038K969523M076350K666022l28483j417424k7086R652k594422l591347
10140c973253p65302J450310l36169j933111J347906N982205N418523M49174k519694
10131E120589j328213L53257J21127l90130L67718J642263K383616K136293M16922
10122A0823442k159577l309951k043173m75105m34233o68178O3793J27808j552464
$$ plain form
10113 372362 -1916938 -1682727 1608947 4423132 4031274 1664070 -452633 -2193328 -4062311
10104 -4062311 -5241823 -4929503 -3784181 -2674128 -1477475 52379 1634913 2980314
10096 2980314 3593258 2553401 322307 -394892 1647144 3063252 263028 -4012788
10088 -4012788 -3515760 2282339 7116759 6721903 3149275 -846042 -5435649 -9194914
10080 -9194914 -7438150 379479 6764701 5144279 -962395 -3164086 318972 4064159
10072 4064159 4330045 2638053 1171412 48488 -390877 951079 3246853 3865743 1907863
10063 1907863 -950589 -3162229 -4226496 -3332620 -360648 1789520 -558895 -6527459
10055 -6527459 -10725798 -9660298 -5383253 -1834647 -471832 -924224 -3063299 -6108263
$$ packed form
10113C72362k289300K34211L291674K814185l91858k367204k116703j740695j868983
10104d062311j179512L12320J145322J110053J196653J529854J582534J345401
10096B980314O12944j039857k231094p17199K042036J416108k800224m275816
10088d012788M97028N798099M834420l94856l572628l995317m589607l759265
10080i194914J756764P817629O385222j620422o106674k201691L483058L745187
10072D064159K65886j691992j466641j122924m39365J341956K295774O18890j957880
10063A907863k858452k211640j064267Q93876K971972K150168k348415n968564
10055f527459m198339J065500M277045L548606J362815m52392k139075l044964
$$ plain form
10047 -6108263 -7668812 -6152728 -3070726 -1041269 -496331 -181631 98534 -530087 -1744176
10038 -1744176 -2065414 -1430313 -1738571 -4116161 -7143218 -8669481 -8170545 -6390424 -3889179
10029 -3889179 -1346036 -440343 -2589671 -6779338 -10065309 -10512593 -8618264 -5884650
10021 -5884650 -3426695 -2212167 -2926027 -4666101 -5139576 -3247997 -402502 1614341
10013 1614341 2678678 3028495 1690423 -1667464 -4576619 -4237739 -1833540 -1588766 -4969800
10004 -4969800 -8183288 -6667070 -579187 5388891 6875763 3739540 -384149 -1894988
9996 -1894988 -708170 248162 -981496 -3129866 -4256484 -4798054 -6022689 -6809861 -4883198
9987 -4883198 -707793 2921203 5088184 7265124 9335536 8927369 5995682 4275813
$$ packed form
10047f108263j560549J516084L082002K029457N44938L14700K80165o28621j214089
10038a744176l21238O35101l08258k377590l027057j526263M98936J780121K501245
10029c889179K543143R05693k149328m189667l285971m47284J894329K733614
10021e884650K457955J214528p13860j740074m73475J891579K845495K016843
10013A614341J064337L49817j338072l357887k909155L38880K404199K44774l381034
10004d969800l213488J516218O087883N968078J486872l136223m123689j510839
9996a894988J186818R56332j229658k148370j126618n41570j224635p87172J926663
9987d883198M175405L628996K166981K176940K070412m08167k931687j719869
$$ plain form
9979 4275813 5863654 7695330 6548256 4779025 6966391 12209361 14159001 9149492
9971 9149492 965917 -3731784 -2643384 800805 2090742 372320 -1443438 -809517
9963 -809517 1021280 741959 -2197502 -4617253 -4067588 -1888623 -373781 653341 2110192
9954 2110192 2800880 1518794 301301 1738889 4034221 3034522 -1042859 -3554590 -2742349
9945 -2742349 -2191302 -4166189 -5361260 -2572940 1487518 2427855 1283360 2380826 5731481
9936 5731481 6815018 3767935 -57081 -1576530 -1865122 -3001205 -4329215 -3786706 -767638
9927 -767638 3664100 7561976 8519069 5641396 1525621 -526627 -1523383 -5182435 -10511756
9918 -10511756 -11013583 -3962223 4338855 6703963 4407753 3293377 3984207 2461609
$$ packed form
9979D275813J587841J831676j147074j769231K187366N242970J949640n009509
9971I149492q183575m697701J088400L444189J289937j718422j815758O33921
9963h09517J830797k79321k939461k419751N49665K178965J514842J027122J456851
9954B110192O90688j282086j217493J437588K295332r99699m077381k511731Q12241
9945b742349N51047j974887j195071K788320M060458R40337j144495J097466L350655
9936E731481J083537l047083l825016j519449k88592j136083j328010N42509L019068
9927g67638M431738L897876R57093k877673m115775k052248r96756l659052n329321
9918a0511756n01827P051360Q301078K365108k296210j114376O90830j522598
$$ plain form
9910 2461609 -1349644 -2652186 128566 2476787 736596 -2812119 -3800184 -1151102
9902 -1151102 2918173 5466418 4673806 1727956 558054 2623204 3356195 -1648100 -8505322
9893 -8505322 -9444514 -4510404 -1152781 -1847209 -1174446 2671234 3396682 -1816180 -5821174
9884 -5821174 -3142994 586798 -1274702 -4935078 -4236180 -2862408 -7300142 -13519823
9876 -13519823 -13395729 -10209216 -13568023 -20716240 -18243884 -3995822 7568377 6408201
9868 6408201 -12687 -1059033 1678910 1810680 1024533 4291329 8840368 8067788 2601026
9859 2601026 -1303005 -1938431 -3124011 -6521325 -9485289 -9908117 -8288726 -5685753 -3190208
9850 -3190208 -2080491 -1750280 288941 4056481 6135702 5452462 5475981 7511416 7239344
$$ packed form
9910B461609l811253j302542K780752K348221j740191l548715r88065K649082
9902a151102M069275K548245p92612k945850j169902K065150P32991n004295o857222
9893h505322r39192M934110L357623o94428O72763L845680P25448n212862m004994
9884e821174K678180L729792j861500l660376O98898J373772m437734o219681
9876a3519823J24094L186513l358807p148217K472356J4248062J1564199j160176
9868F408201o420888j046346K737943J31770p86147L266796M549039p72580n466762
9859B601026l904031o35426j185580l397314k963964m22828J619391K602973K495545
9850c190208J109717L30211K039221L767540K079221o83240K3519K035435k72072
$$ plain form
9841 7239344 2413542 -1635909 -13272 3527331 3262906 1516705 3846801 8138225
9833 8138225 7735103 3154992 1183182 3184600 3741767 1264662 697270 3969284 6363218
9824 6363218 5173039 4299955 6692754 8852490 6872612 2519255 -643288 -2698900
9816 -2698900 -5321779 -7996383 -9355634 -9086264 -6443108 -634929 5409389 6066205 374306
9807 374306 -5725017 -7113756 -5384725 -4337534 -4054155 -3032613 -2218846 -2684217 -2363096
9798 -2363096 629810 3746233 3159002 -419048 -2690234 -1529761 1031653 1704167 -1107967
9789 -1107967 -5936776 -8494507 -5414603 899863 3982448 1508899 -1642984 -864343
9781 -864343 1522991 648654 -3166554 -5434729 -4105053 -981329 1877125 3392207 2568228
$$ packed form
9841G239344m825802m049451J622637L540603k64425j746201K330096M291424
9833H138225m03122m580111j971810K001418N57167k477105n67392L272014K393934
9824F363218j190179q73084K392799K159736j979878m353357l162543k055612
9816b698900k622879k674604j359251K69370K643156N808179O044318O56816n691899
9807C74306o099323j388739J729031J047191K83379J021542Q13767m65371L21121
9798b363096K992906L116423n87231l578050k271186J160473K561414O72514k812134
9789a107967m828809k557731L079904O314466L082585k473549l151883P78641
9781h64343K387334q74337l815208k268175J329676L123724K858454J515082q23979
$$ plain form
9772 2568228 -25125 -1251702 656598 2686129 1113469 -2665573 -4320923 -3114354
9764 -3114354 -1940666 -1984166 -1905868 -1709293 -2713819 -3778732 -2184960 1395617 3331338
9755 3331338 3019449 3744331 6294344 6495717 1624862 -4574007 -6524712 -4020847 -1675495
9746 -1675495 -2507890 -4792629 -5105960 -2829542 -1065206 -3014989 -7530506 -9636027 -6614939
9737 -6614939 -1718240 470611 238175 558463 624435 -2719882 -7360357 -6648853 -7368
9728 -7368 3868356 -1099395 -8801153 -9492389 -4018179 -1833966 -6317208 -10363347 -8208374
9719 -8208374 -4230143 -5663073 -11564809 -14547021 -11096358 -4923799 -698193 831484
9711 831484 817619 -486484 -2622327 -3781774 -2885077 -1114207 112765 830921 775307
$$ packed form
9772B568228k593353j226577J908300K029531j572660l779042j655350J206569
9764c114354J173688m3500P8298J96575j004526j064913J593772L580577J935721
9755C331338l11889P24882K550013K01373m870855o198869j950705K503865K345352
9746a675495q32395k284739l13331K276418J764336j949783m515517k105521L021088
9737f614939M896699K188851k32436L20288O5972l344317m640475P11504O641485
9728g368L875724m967751p701758o91236N474210K184213m483242m046139K154973
9719h208374L978231j432930n901736k982212L450663O172559M225606J529677
9711H31484j3865j304103k135843j159447Q96697J770870J226972P18156n5614
$$ plain form
9702 775307 -1500765 -5345549 -6457391 -2247709 3275950 4559485 2994347 4523002
9694 4523002 8929639 8623836 471195 -7999390 -8777729 -4157869 -1479917 -1591158 166762
9685 166762 4061585 5006797 1245051 -3050824 -4765575 -5309885 -5825517 -4753791 -2138147
9676 -2138147 -1100195 -2763753 -4469747 -5137519 -7200467 -10486216 -9839379 -3176418 3050226
9667 3050226 2063370 -3163290 -4299653 118041 3622083 2482985 681575 2545815
9659 2545815 6034590 6658884 4341000 2393652 1588030 -619753 -4934175 -7909147 -6614280
9650 -6614280 -3379579 -3019269 -5977619 -7515746 -4606495 -423435 354158 -1983534 -3831280
9641 -3831280 -4438136 -6019222 -8514220 -9079091 -7218701 -5759566 -5582803 -3983271 -106838
$$ packed form
9702G75307k276072l844784j111842M209682N523659J283535j565138J528655
9694D523002M406637l05803q152641q470585p78339M619860K677952j11241J757920
9685A66762L894823R45212l761746m295875j714751n44310n15632J071726K615644
9676b138147J037952j663558j705994o67772k062948l285749O46837O662961O226644
9667C050226r86856n226660j136363M417694L504042j139098j801410J864240
9659B545815L488775O24294k317884j947348q05622k207783m314422k974972J294867
9650f614280L234701L60310k958350j538127K909251M183060P77593k337692j847746
9641c831280o06856j581086k494998n64871J860390J459135J76763J599532L876433
$$ plain form
9632 -106838 2439226 1046822 -1703356 -2292868 -1306634 -1128438 -1761710 -2289624 -3677998
9623 -3677998 -6615722 -8933910 -8488440 -6392161 -4418160 -1906160 1464133 2893227
9615 2893227 518881 -2528414 -2588018 -1399763 -2657006 -5018145 -4215125 -533581 1724075
9606 1724075 1369190 1033399 1191069 -412180 -3021553 -2579782 1650676 5487064 6112517
9597 6112517 5032476 3758259 1797547 151793 1168678 3160708 1080696 -4977711
9589 -4977711 -8066987 -4622521 -360120 -1278371 -4420620 -3730021 -535375 -728499 -4130223
9580 -4130223 -4662640 -719595 2159779 473790 -1812245 54533 4400455 6290755
9572 6290755 4610479 2117993 412645 -1331182 -3415786 -4985261 -6549885 -9925181
$$ packed form
9632a06838K546064j392404k750178n89512R86234J78196o33272n27914j388374
9623c677998k937724k318188M45470K096279J974001K512000L370293J429094
9615B893227k374346l047295n9604J188255j257243k361139Q03020L681544K257656
9606A724075l54885l35791J57670j603249k609373M41771M230458L836388O25453
9597F112517j080041j274217j960712j645754J016885J992030k080012o058407
9589d977711l089276L444466M262401r18251l142249O90599L194646j93124l401724
9580d130223n32417L943045K879374j685989k286035J866778M345922J890300
9572F290755j680276k492486j705348j743827k084604j569475j564624l375296
$$ plain form
9564 -9925181 -14514492 -16454009 -13571494 -9102615 -7631338 -8753640 -8457351 -6282975
9556 -6282975 -6368422 -9999584 -11987853 -7930879 -1297315 1366422 -312962 -1365297 62392
9547 62392 1018619 230233 129523 1328859 881676 -1923363 -3529691 -2673656 -3600130
9538 -3600130 -8719091 -12851150 -10133215 -3273561 -34699 -2490050 -5792368 -6818034
9530 -6818034 -7798376 -10415773 -11912312 -9671973 -5739201 -3834601 -4546921 -6217760 -8324699
9521 -8324699 -10762346 -11225676 -7143034 -414756 3110288 300834 -5414894 -8558899
9513 -8558899 -8007975 -6613678 -5977593 -4870857 -2594141 -525678 528768 1611613 3006024
9504 3006024 3111503 1448850 31401 -25342 -268111 -1189068 -327165 2880133 4280181
$$ packed form
9564i925181m589311j939517K882515M468879J471277j122302K96289K174376
9556f282975q5447l631162j988269M056974O633564K663737j679384j052335J427689
9547F2392R56227p88386j00710J199336m47183k805039j606328Q56035r26474
9538c600130n118961m132059K717935O859654L238862k455351l302318j025666
9530f818034r80342k617397j496539K240339L932772J904600p12320j670839k106939
9521h324699k437647m63330M082642O728278L525044k809454n715728l144005
9513h558899N50924J394297O36085J106736K276716K068463J054446J082845J394411
9504C006024J05479j662653j417449n6743k42769r20957Q61903L207298J400048
$$ plain form
9495 4280181 1434262 -951105 2062285 6550530 5193891 -58904 -49724 6328877 8879737
9486 8879737 1797151 -6361477 -4785025 4182462 9458332 6816969 1876418 -679063
9478 -679063 -2660311 -6020261 -7571808 -3620367 3513986 7319425 4771817 -311196
9470 -311196 -2293025 -526842 815970 -656223 -2286350 -1287146 432698 -183401 -1839247
9461 -1839247 -1804807 -2065667 -6237742 -11499598 -11113247 -5487019 -2748208 -6171929 -9025277
9452 -9025277 -5612698 79482 1780632 314532 -290584 -405395 -2177583 -3982369 -3810052
9443 -3810052 -4103418 -6980950 -8555056 -4581973 1678017 3925392 2012714 -50571
9435 -50571 -2053769 -5969475 -8915480 -6039597 549335 3521160 846697 -2418587 -2802866
$$ packed form
9495D280181k845919k385367L013390M488245j356639n252795R180O378601K550860
9486H879737p082586q158628J576452Q967487N275870k641363m940551k555481
9478f79063j981248l359950j551547L951441P134353L805439k547608n083013
9470c11196j981829J766183J342812j472193j630127R99204J719844o16099j655846
9461a839247L4440k60860m172075n261856L86351N626228K738811l423721k853348
9452i025277L412579N692180J701150j466100o05116j14811j772188j804786J72317
9443c810052k93366k877532j574106L973083O259990K247375j912678k063285
9435e0571k003198l915706k946005K875883O588932K971825k674463l265284l84279
$$ plain form
9426 -2802866 -2047877 -1787291 -1151628 -443535 -1357976 -2890498 -2375756 -743872 -1278322
9417 -1278322 -3288843 -2917375 -243195 604320 -1283987 -2505866 -2004819 -2302257 -3270183
9408 -3270183 -1492570 2669328 4187870 1749250 480912 3413964 6283041 4462266
9400 4462266 19954 -2035312 -740051 998172 706155 -1988736 -5639862 -7623089
9392 -7623089 -6810736 -5526406 -5816955 -5162203 -697191 3897301 2533201 -2821965 -3853609
9383 -3853609 1041993 3982923 282535 -4686137 -5169703 -3489085 -3749268 -4309691 -2449716
9374 -2449716 -512617 -1260092 -2115197 99301 3181770 3836465 3460433 4100017 3228659
9365 3228659 -1276425 -5122428 -3264264 1716141 3523917 1712774 763047 1846108
$$ packed form
9426b802866P54989K60586O35663P08093r14441j532522N14742J631884n34450
9417a278322k010521L71468K674180Q47515j888307j221879N01047k97438r67926
9408c270183J777613M161898J518542k438620j268338K933052K869077j820775
9400D462266m442312k055266J295261J738223k92017k694891l651126j983227
9392g623089Q12353J284330k90549O54752M465012M594492j364100n355166j031644
9383c853609M895602K940930l700388m968672m83566J680618k60183n60423J859975
9374b449716J937099p47475q55105K214498L082469O54695l76032O39584q71358
9365C228659m505084l846003J858164M980405J807776j811143r49727J083061
$$ plain form
9357 1846108 2135452 920069 247172 357386 -136840 -568972 252203 239750 -3051477
9348 -3051477 -7169426 -7870918 -6092354 -6031869 -7484304 -6557146 -3680748 -4097475 -9364228
9339 -9364228 -14576635 -15845298 -14974050 -14364470 -12370860 -7056276 -795452 2489345 2410128
9330 2410128 1421198 649858 -803667 -3131737 -4745284 -4220723 -2073122 -88390 622069
9321 622069 325402 -524815 -2147199 -4195594 -4780110 -2684571 108869 642922 -694848
9312 -694848 -1209670 -950790 -2527917 -5422743 -5515491 -1949299 823466 559020 1306672
9303 1306672 5971886 10023129 8032808 2338126 -796993 -325334 568806 1720935 5101950
9294 5101950 8249466 5961991 -1388156 -7628656 -9313100 -8629022 -7388709 -4382394
$$ packed form
9357A846108K89344j215383o72897J10214m94226m32132Q21175j2453l291227
9348c051477m117949p01492J778564O0485j452435R27158K876398m16727n266753
9339i364228n212407j268663Q71248O09580J993610N314584O260824L284797p9217
9330B410128r88930p71340j453525k328070j613547N24561K147601J984732P10459
9321F22069k96667q50217j622384k048395n84516K095539K793440N34053j337770
9312f94848n14822K58880j577127k894826r2748L566192K772765k64446P47652
9303A306672M665214M051243j990321n694682l135119M71659Q94140J152129L381015
9294E101950L147516k287475p350147o240500j684444O84078J240313L006315
$$ plain form
9286 -4382394 -220191 1085575 -1936183 -5211843 -4837155 -2269394 -1232083 -2301813
9278 -2301813 -3137726 -2217500 -319976 656976 -568575 -3136625 -4319948 -2759541 -826417
9269 -826417 -1720680 -4954425 -7289277 -7556921 -7563087 -8408528 -8979022 -8339573 -6919817 -5036922
9259 -5036922 -2701518 -1104277 -1966098 -5097198 -8406340 -10262832 -10417274 -9403314 -8597019
9250 -8597019 -9468900 -10982107 -9801640 -5423247 -2423084 -4303819 -7916588 -8290017 -6276563
9241 -6276563 -5940548 -6498278 -3520293 2542644 5992087 4769759 3163916 3941791 3987663
9232 3987663 689891 -2614375 -1587723 2126309 2878686 -1396678 -6258775 -5317135 2795558
9223 2795558 11664491 12600985 4460244 -4195492 -5425046 -1486913 247712 -1211414
$$ packed form
9286d382394M162203J305766l021758l275660L74688K567761J037311j069730
9278b301813q35913R20226J897524R76952j225551k568050j183323J560407J933124
9269h26417q94263l233745k334852k67644o166q45441n70494O39449J419756J882895
9259e036922K335404J597241q61821l131100l309142j856492j54442J013960Q06295
9250h597019q71881j513207J180467M378393L000163j880735l612769l73429K013454
9241f276563L36015n57730K977985O062937L449443j222328j605843P77875M5872
9232C987663l297772l304266J026652L714032P52377m275364m862097R41640Q112693
9223B795558Q868933R36494q140741q655736j229554L938133J734625j459126
$$ plain form
9215 -1211414 -818292 2367147 3610726 1730398 1736535 5728161 8517208 6182282 2742626
9206 2742626 3569461 6925658 7059300 2569030 -2618219 -4528684 -2308153 1991785 4665460
9197 4665460 3394357 238270 -873269 123061 -77924 -1864461 -2102089 -548850 -641798
9188 -641798 -2045466 590727 7939892 12003546 7054300 -1272049 -3995435 -1254836
9180 -1254836 -144674 -3572844 -8036044 -10326383 -10204900 -7792718 -3913841 -2019412
9172 -2019412 -4728585 -9319490 -11073550 -9731235 -8028569 -5564429 169879 7348268
9164 7348268 10388992 7793226 4413977 4519491 6671935 7080519 4677248 1073841 -2082924
9155 -2082924 -4048048 -4752158 -4692391 -4259561 -3160523 -1413790 -244938 -565908 -1277198
$$ packed form
9215a211414L93122L185439J243579j880328O137L991626K789047k334926l439656
9206B742626Q26835L356197J33642m490270n187249j910465K220531M299938K673675
9197D665460j271103l156087j111539R96330k00985j786537k37628J553239r2948
9188f41798j403668K636193P349165M063654m949246q326349k723386K740599
9180a254836J110162l428170m463200k290339J21483K412182L878877J894429
9172b019412k709173m590905j754060J342315J702666K464140N734308P178389
9164G348268L040724k595766l379249J05514K152444M08584k403271l603407l156765
9155b082924j965124p04110N9767M32830J099038J746733J168852l20970p11290
$$ plain form
9146 -1277198 -812978 65748 -1260979 -5939107 -11703787 -14249313 -10638253 -2529354 4037984
9137 4037984 4031837 -1033446 -4962330 -4292243 -1123125 1264855 1622422 -878202 -6490695
9128 -6490695 -11596402 -10883943 -5224211 -1753957 -3061675 -2873223 2709063 6724384 1615251
9119 1615251 -7735092 -10657857 -6824557 -5377755 -9326897 -11556651 -7584951 -2275159
9111 -2275159 -579496 -236844 1753449 2647775 -446114 -4069373 -3653184 -1435745 -2929448
9102 -2929448 -7678468 -9637485 -6419300 -2820380 -3752107 -7538613 -8797031 -5959111
9094 -5959111 -2855699 -2814440 -4067198 -3037946 -300602 324408 -1689142 -2356753 27589
9085 27589 1478433 -1064724 -3799569 -1519839 3885168 5980398 3287788 542474 926438
$$ packed form
9146a277198M64220Q78726j326727m678128n764680k545526L611060Q108899O567338
9137D037984o147n065283l928884O70087L169118K387980L57567k500624n612493
9128f490695n105707P12459N659732L470254j307718J88452N582286M015321n109133
9119A615251r350343k922765L833300J446802l949142k229754L971700N309792
9111b275159J695663L42652J990293Q94326l093889l623259M16189K217439j493703
9102b929448m749020j959017L218185L598920r31727l786506j258418K837920
9094e959111L103412M1259j252758J029252K737344O25010k013550o67611K384342
9085B7589J450844k543157k734845K279730N405007K095230k692610k745314L83964
$$ plain form
9076 926438 2536744 2984016 2497610 1538415 -253761 -1665603 -413581 2952380 5204372
9067 5204372 5168626 4797300 5185137 5312622 4999543 4970780 3745395 -832681 -6318403
9058 -6318403 -7060631 -2322234 1953897 1418792 -1416978 -2532445 -2454188 -4029362 -7818131
9049 -7818131 -12342237 -15685205 -14965230 -8150531 1408489 6416556 4216057 -20227
9041 -20227 -1124335 -374983 -920522 -1600661 82418 2524771 2412932 -20686 -2338281
9032 -2338281 -4075780 -5751751 -6292852 -5286464 -5093191 -6793564 -7030915 -3302349 707328
9023 707328 261083 -2736389 -3108322 -1352004 -2528503 -7004476 -9112246 -5888647 -1341007
9014 -1341007 -324647 -2673565 -5093587 -5366580 -3356099 -615072 366111 -1156536 -2683265
$$ packed form
9076I26438J610306M47272m86406r59195j792176j411842J252022L365961K251992
9067E204372l5746l71326L87837J27485l13079k8763j225385m578076n485722
9058f318403p42228M738397M276131n35105k835770j115467P8257j575174l788769
9049g818131m524106l342968P19975O814699R559020N008067k200499m236284
9041b0227j104108P49352n45539o80139J683079K442353j11839k433618k317595
9032b338281j737499j675971n41101J006388J93273j700373k37351L728566M009677
9023G07328m46245k997472l71933J756318j176499m475973k107770L223599M547640
9014a341007J016360k348918k420022k72993K010481K741027R81183j522647j526729
$$ plain form
9005 -2683265 -2180348 -1701285 -3654025 -5516795 -3485413 191623 -39142 -3613959 -4491614
8996 -4491614 -1656304 -859600 -3851718 -4434652 685579 5314996 3989061 1427878 4030477
8987 4030477 7900965 4849214 -3341984 -6923355 -3219604 525807 168050 487067 4773059
8978 4773059 7741391 4556838 -114881 797968 5322641 5756637 929689 -2615573 -1424497
8969 -1424497 143915 -2130511 -5523840 -4893742 -103126 4769234 7217124 7739301 6914082
8960 6914082 4616565 1933644 812966 1176580 644268 -1931692 -4380085 -3894669 -771078
8951 -771078 1796233 1325993 -1398033 -3400044 -2707151 -265416 1454510 1538260 1317543
8942 1317543 1462982 -21525 -4772764 -9851995 -9821746 -3966429 1590714 1166403 -3425697
$$ packed form
9005b683265N02917M79063j952740j862770K031382L677036k30765l574817q77655
8996d491614K835310P96704k992118n82934N120231M629417j325935k561183K602599
8987D030477L870488l051751q191198l581371L703751L745411l57757L19017M285992
8978D773059K968332l184553m671719R12849M524673M33996m826948l545262J191076
8969a424497J568412k274426l393329O30098M790616M872360K447890N22177q25219
8960F914082k297517k682921j120678L63614n32312k575960k448393M85416L123591
8951g71078K567311m70240k724026k002011O92893K441735J719926Q3750k20717
8942A317543J45439j484507m751239n079231L0249N855317N557143m24311m592100
$$ plain form
8933 -3425697 -6072210 -4918244 -3664408 -4439003 -3889562 1334399 8231655 10083097 4675169
8924 4675169 -2957841 -6360419 -4203183 -247360 1604406 687706 -1396548 -3306356
8916 -3306356 -4641599 -5044625 -4108481 -2376343 -1243644 -1198395 -1073256 92183 1314548
8907 1314548 1011144 -544947 -1566547 -1238352 -403603 12811 -295674 -1681327 -4021936
8898 -4021936 -5570421 -4576487 -2372780 -2239646 -4387546 -5083387 -2460851 -43159 -1578154
8889 -1578154 -5040630 -5747979 -3707393 -3120372 -5032254 -5547760 -2427993 1208271 1994124
8880 1994124 1153026 1184686 952118 -2009948 -6220459 -7406818 -4391092 -444926 1124100
8871 1124100 -144186 -3260208 -7006514 -9342986 -8467941 -5409306 -3215606 -2745908 -1712161
$$ packed form
8933c425697k646513J153966J253836p74595N49441N223961O897256J851442n407928
8924D675169p633010l402578K157236L955823J851766r16700k084254j909808
8916c306356j335243m03026R36144J732138J132699M5249J25139J165439J222365
8907A314548l03404j556091j021600L28195Q34749M16414l08485j385653k340609
8898d021936j548485R93934K203707J33134k147900o95841K622536K417692j534995
8889a578154l462476p07349K040586N87021j911882n15506L119767L636264P85853
8880A994124q41098L1660k32568k962066m210511j186359L015726L946166J569026
8871A124100j268286l116022l746306k336472Q75045L058635K193700M69698J033747
$$ plain form
8862 -1712161 1077331 3346312 3179479 2727890 5178166 9506014 11507508 9632886 6632636
8853 6632636 4973968 3620659 772136 -2650352 -4518616 -5021664 -6013479 -7300020 -6414317
8844 -6414317 -2839934 75542 -667658 -3245553 -3343026 -380747 1526270 -461420 -3658037
8835 -3658037 -3486034 329874 3599558 3095596 -42854 -2404358 -2059195 117318 1552995
8826 1552995 135739 -3592615 -6269078 -4971233 -831035 1912966 812503 -2092629
8818 -2092629 -2919849 -153139 4240184 6865814 5733170 2059873 -581705 -34501 1737717
8809 1737717 1441601 -362689 225008 4015927 6238025 2767200 -3932778 -8280679 -8914504
8800 -8914504 -8676955 -8538290 -6316506 -1975914 394873 -1837240 -5565084 -6134982 -3738879
$$ packed form
8862a712161K789492K268981j66833m51589K450276M327848K001494j874622l000250
8853F632636j658668j353309k848523l422488j868264n03048r91815j286541Q85703
8844f414317L574383K915476p43200k577895r7473K962279J907017j987690l196617
8835c658037J72003L815908L269684n03962l138450k361504L45163K176513J435677
8826A552995j417256l728354k676463J297845M140198K744001j100463k905132
8818b092629q27220K766710M393323K625630j132644l673297k641578N47204J772218
8809A737717k96116j804290N87697L790919K222098l470825o699978m347901o33825
8800h914504K37549J38665K221784M340592K370787k232113l727844n69898K396103
$$ plain form
8791 -3738879 -2545727 -4524166 -7152652 -7241800 -4594515 -1418142 13651 -1449074 -5311994
8782 -5311994 -9282280 -10866662 -9820893 -7878948 -5651141 -1708903 3952897 7612221
8774 7612221 5695598 86577 -3513965 -2734879 -1059764 -2200509 -4816518 -4888524 -1297517
8765 -1297517 3364891 6220431 6058826 3027239 -1152585 -3453940 -2536617 -895392 -1580500
8756 -1580500 -3558034 -3368508 -858889 507032 -644950 -1623467 -648383 147391 -1126313
8747 -1126313 -2470446 -1416075 766078 1597963 1845478 3697057 6070009 5810286 2995694
8738 2995694 1080114 1466575 1576837 -610051 -3209400 -3355375 -1197751 1035299 2397384
8729 2397384 3328756 3097385 -194953 -6102098 -10290849 -8892393 -4129389 -2826722 -7839201
$$ packed form
8791c738879J193152j978439k628486q9148K647285L176373J431793j462725l862920
8782e311994l970286j584382J045769J941945K227807L942238N661800L659324
8774G612221j916623n609021l600542P79086J675115j140745k616009p2006L591007
8765a297517M662408K855540j61605l031587m179824k301355R17323J641225o85108
8756a580500j977534J89526K509619J365921j151982r78517R75084P95774j273704
8747a126313j344133J054371K182153Q31885K47515J851579K372952k59723k814592
8738B995694j915580L86461J10262k186888k599349j45975K157624K233050J362085
8729B397384R31372k31371l292338n907145m188751J398456M763004J302667n012479
$$ plain form
8720 -7839201 -13351421 -11673808 -3297002 3812238 4771699 2993298 3405375 5196232 4714480
8711 4714480 2049420 169893 -622841 -2713330 -6069119 -7272083 -4376200 231022
8703 231022 2750193 1788216 -1251563 -3950138 -4627263 -3449120 -1931223 -926450 -31539
8694 -31539 498815 -774139 -3682826 -5351930 -4038031 -2001408 -2042759 -3307801 -3505253
8685 -3505253 -3099996 -3680014 -4204274 -3163913 -2727567 -5709740 -9542347 -8912796 -4223206
8676 -4223206 -1532519 -3314300 -5267102 -4235249 -3570137 -7329343 -13627665 -17508464
8668 -17508464 -17263622 -14579459 -11119693 -8246243 -7935615 -10585400 -13043986 -11490001
8660 -11490001 -5805158 395422 3453178 2750868 1130552 2190125 5704305 6731051
$$ packed form
8720g839201n512220J677613Q376806P109240R59461j778401M12077J790857m81752
8711D714480k665060j879527p92734k090489l355789j202964K895883M607222
8703B31022K519171r61977l039779k698575o77125J178143J517897J004773Q94911
8694c1539N30354j272954k908687j669104J313899K036623m1351j265042j97452
8685c505253M05257n80018n24260J040361M36346k982173l832607O29551M689590
8676d223206K690687j781781j952802J031853O65112l759206o298322l880799
8668a7508464K44842K684163L459766K873450L10628k649785k458586J553985
8660a1490001N684843O200580L057756p02310j620316J059573L514180J026746
$$ plain form
8652 6731051 2039244 -3856439 -3548927 2801269 7332837 5452829 887903 -1897092
8644 -1897092 -3670174 -5608663 -5164093 -1640542 -69800 -3578077 -6904689 -4322263
8636 -4322263 273534 -894313 -6615989 -8357115 -3840145 -217105 -2576532 -7014851
8628 -7014851 -7676134 -4462408 -683752 2097467 3799179 4073145 3421292 3276586 3448713
8619 3448713 2406254 864024 1265157 2713429 981580 -4610680 -9066763 -9159938 -8345957
8610 -8345957 -10509424 -13103452 -11544758 -7319415 -5844953 -7747543 -8218730 -5056343
8602 -5056343 -1664072 -671158 212124 3059969 4637520 842902 -5900507 -8535829 -4670035
8593 -4670035 249850 535598 -2467517 -3553676 -1749243 -1144435 -3946806 -6868689 -6147575
$$ packed form
8652F731051m691807n895683L07512O350196M531568j880008m564926k784995
8644a897092j773082j938489M44570L523551J570742l508277l326612K582426
8636d322263M595797j167847n721676j741126M516970L623040k359427m438319
8628g014851o61283L213726L778656K781219J701712K73966o51853j44706J72127
8619C448713j042459j542230M01133J448272j731849n592260m456083r3175Q13981
8610h345957k163467k594028J558694M225343J474462j902590m71187L162387
8602e056343L392271R92914Q83282K847845J577551l794618o743409k635322L865794
8593d670035M919885K85748l003115j086159J804433O04808k802371k921883P21114
$$ plain form
8584 -6147575 -3046429 -1489209 -1994235 -1316857 2166602 5801044 6275977 3747831 978445
8575 978445 -328823 -816169 -1581210 -2382100 -2120584 -453547 1760861 3633928 5222522
8566 5222522 6868536 8108747 8159999 7293583 6717030 7082436 8018901 8964085 9347464
8557 9347464 8282315 5551831 2546128 480091 -1609800 -4523794 -5456728 -1127687
8549 -1127687 5341155 5936486 -1541291 -9186549 -9032906 -3076369 1295087 1965474 2294073
8540 2294073 3421136 3192407 1775409 1745893 2468040 630908 -2892381 -3008130 1086404
8531 1086404 3384228 -155746 -5512413 -6652869 -3373478 405620 2419422 2420682 -28438
8522 -28438 -4184727 -6917157 -6498281 -5606302 -7210727 -9506156 -8616184 -4812401 -2236309
$$ packed form
8584f147575L101146J557220n05026O77378L483459L634442M74933k528146k769386
8575I78445j307268m87346p65041q00890K61516J667037K214408J873067J588594
8566E222522J646014J240211N1252q66416n76553L65406R36465R45184L83379
8557I347464j065149k730484l005703k066037k089891k913994r32934M329041
8549a127687O468842N95331p477777p645258J53643N956537M371456O70387L28599
8540B294073J127063k28729j416998k9516P22147j837132l523289j15749M094534
8531A086404K297824l539974n356667j140456L279391L779098K013802J260k449120
8522b8438m156289k732430M18876Q91979j604425k295429Q89972L803783K576092
$$ plain form
8513 -2236309 -3109293 -5461417 -6305871 -4505149 -901580 2256321 2685845 740313 -370257
8504 -370257 1190750 3190423 3164232 2730380 4595032 6986478 5511891 117043 -4185666
8495 -4185666 -4073695 -1524364 299256 1082591 1544324 697074 -2508144 -6409730 -7725960
8486 -7725960 -4992241 34125 3873328 3993874 952044 -2028116 -2621142 -2194782 -3560312
8477 -3560312 -6546189 -8198424 -7352391 -6243878 -6846474 -8180311 -8404565 -7258602 -5083676
8468 -5083676 -1676421 2166824 3942239 2305052 -751446 -2332459 -1898952 -501218
8460 -501218 1448263 3357233 2976431 -1235366 -6833935 -9370990 -7742381 -5051350 -3918156
8451 -3918156 -3644273 -2981333 -3036051 -5173447 -7450231 -5915402 146875 6253749 7465466
$$ packed form
8513b236309q72984k352124q44454J800722L603569L157901M29524j945532j110570
8504c70257J561007J999673k6191m33852J864652K391446j474587n394848m302709
8495d185666J11971K549331J823620P83335M61733q47250l205218l901586j316230
8486g725960K733719N026366L839203J20546l041830k980160n93026M26360j365530
8477c560312k985877j652235Q46033J108513o02596j333837k24254J145963K174926
8468e083676L407255L843245J775415j637187l056498j581013M33507J397734
8460e01218J949481J908970l80802m211797n598569k537055J628609K691031J133194
8451c918156K73883O62940n4718k137396k276784J534829O062277O106874J211717
$$ plain form
8442 7465466 4316200 2167600 4379503 8286997 9675163 9256576 11111105 15151983
8434 15151983 15784309 9883388 1997612 -1694080 -1389930 -1472899 -2819990 -2501504 -73763
8425 -73763 1243830 -126678 -2533513 -5250450 -9114828 -12138319 -10198296 -4196466 -847243
8416 -847243 -3217444 -6059875 -4693145 -2804951 -5403407 -8902646 -6271851 625405
8408 625405 2732952 -2303464 -6487672 -3698567 2016056 4006600 2578892 1918017 1912909
8399 1912909 -919368 -6148917 -8592714 -5290204 325861 2627510 272137 -2921253
8391 -2921253 -2904075 200693 3273969 4631147 5037325 4371071 896326 -4169388 -5287413
8382 -5287413 -6653 5254279 2548235 -6098554 -11003394 -8226925 -3508696 -1816674
$$ packed form
8442G465466l149266k148600K211903L907494J388166m18587J854529M040878
8434A5151983O32326n900921p885776l691692L04150q2969j347091L18486K427741
8425g3763J317593j370508k406835k716937l864378l023491J940023O001830L349223
8416h47243k370201k842431J366730J888194k598456l499239K630795O897256
8408F25405K107547n036416m184208K789105N714623J990544j427708o60875n108
8399A912909k832277n229549k443797L302510N616065K301649k355373l193390
8391b921253J7178L104768L073276J357178M06178o66254l474745n065714j118025
8382e287413N280760N260932k706044q646789m904840K776469M718229J692022
$$ plain form
8374 -1816674 -726916 2490164 4290237 795439 -4605936 -5503366 -1537127 1684816
8366 1684816 -57832 -5944870 -11888235 -13162548 -7840733 -201764 2480894 -847619
8358 -847619 -3089543 578579 5350346 4541793 -243739 -2945198 -3034247 -4404783 -6875963
8349 -6875963 -6375218 -2543895 601344 1002752 -408842 -3779392 -8871313 -10688200 -4091901
8340 -4091901 7103150 13041105 10743144 7090744 7638653 9638871 8552748 4931499
8332 4931499 1646984 -473784 -1466823 -1245454 -1735369 -5249025 -9328714 -8698077 -3860233
8323 -3860233 -1484215 -4058869 -5926197 -2782407 1674975 2720700 1688475 1140843
8315 1140843 -831427 -5538650 -8368391 -5262156 -252819 261280 -2784231 -4059087
$$ packed form
8374a816674J089758L217080J800073l494798n401375q97430L966239L221943
8366A684816j742648n887038n943365j274313N321815P638969K682658l328513
8358h47619k241924L668122M771767q08553m785532k701459q9049j370536k471180
8349f875963N00745L831323L145239M01408j411594l370550n091921j816887O596299
8340d091901J1195051N937955k297961l652400N47909K000218j086123l621249
8332D931499l284515k120768r93039K21369m89915l513656m079689O30637M837844
8323c860233K376018k574654j867328L143790M457382J045725j032225n47632
8315A140843j972270m707223k829741L106235N009337N14099l045511j274856
$$ plain form
8307 -4059087 -3377603 -4703507 -7439106 -6489349 -945634 4081174 5125646 4275110 4439569
8298 4439569 5505286 6258611 6155765 4402355 743757 -2548528 -2919273 -1735359 -2639267
8289 -2639267 -5811684 -7817542 -7325548 -6782956 -7619622 -7820178 -5653917 -2367154 393821
8280 393821 2835237 5058549 5505700 3208579 -384357 -3441779 -5975453 -8562466 -10236612
8271 -10236612 -9344656 -6060979 -2922206 -2581814 -4997349 -6978510 -5394695 -1158767
8263 -1158767 1323569 -503540 -4163688 -5638255 -4370927 -2994295 -3557889 -6000637
8255 -6000637 -8992087 -10364290 -8337174 -4379595 -2790165 -4884987 -6087314 -2291996
8247 -2291996 3426597 5188943 3336492 3058116 4822325 3288670 -2852454 -6944540
$$ packed form
8307d059087O81484j325904k735599R49757N543715N026808J044472q50536J64459
8298D439569J065717P53325j02846j753410l658598l292285l70745J183914r03908
8289b639267l172417k005858M91994N42592q36666k00556K166261L286763K760975
8280C93821K441416K223312M47151k297121l592936l057422k533674k587013j674146
8271a0236612Q91956L283677L138773L40392k415535j981161J583815M235928
8263a158767K482336j827109l660148j474567J267328J376632n63594k442748
8255f000637k991450j372203K027116L957579J589430k094822j202327L795318
8247b291996N718593J762346j852451k78376J764209j533655o141124m092086
$$ plain form
8239 -6944540 -3909251 1804156 2631704 -1715644 -5644293 -6800186 -7780440 -9486817 -8793019
8230 -8793019 -4339580 68716 634373 -1068511 -1170966 176861 -516289 -3806727 -5975711
8221 -5975711 -4963444 -3739391 -5267075 -7253699 -5650233 -1459420 316710 -2126148
8213 -2126148 -5594416 -7334229 -7762282 -7026462 -3628584 1630119 4601081 3055261 -706353
8204 -706353 -4438711 -8632447 -12097218 -10307934 -2563426 3980216 2966272 -2221302
8196 -2221302 -4012859 -1785482 -847979 -2864204 -4473857 -4112717 -3254358 -1692425 1543077
8187 1543077 3260594 -533013 -6486997 -6961203 -1877388 755562 -2184469 -4248352
8179 -4248352 -1141028 1458109 -2598702 -9497354 -11211982 -6911749 -2229072 -577660
$$ packed form
8239f944540L035289N713407Q27548m347348l928649j155893r80254j706377O93798
8230h793019M453439M408296N65657j702884j02455J347827o93150l290438k168984
8221e975711J012267J224053j527684j986624J603466M190813J776130k442858
8213b126148l468268j739813m28053P35820L397878N258703K970962j545820l761614
8204g06353l732358m193736l464771J789284P744508O543642j013944n187574
8196b221302j791557K227377R37503k016225j609653L61140Q58359J561933L235502
8187A543077J717517l793607n953984m74206N083815K632950k940031k063883
8179d248352L107324K599137m056811o898652j714628M300233M682677J651412
$$ plain form
8171 -577660 -1051510 -2361378 -3542785 -2742796 132571 1519723 -1034028 -4579448 -5329663
8162 -5329663 -4740650 -6225511 -8390409 -7295555 -3904161 -3183071 -6058971 -8050863 -6622805
8153 -6622805 -4592955 -4555751 -4466479 -1439835 3125501 5119803 3053106 -279225 -1095974
8144 -1095974 1413509 4429709 4741176 2525032 910599 1556705 2624091 2322087 2094255
8135 2094255 3835444 5854153 4921947 1443845 -765350 320794 3032875 5373306
8127 5373306 7182445 8314013 7634306 5248641 3471905 3882485 4891528 3864632 719603
8118 719603 -2138299 -3102321 -3222193 -4483871 -7073610 -9113689 -9040501 -7471330 -6235853
8109 -6235853 -6221805 -7020186 -8043509 -8697812 -8010774 -5862100 -4214432 -4875520 -6118791
$$ packed form
8171e77660m73850j309868j181407P99989K875367J387152k553751l545420p50215
8162e329663N89013j484861k164898J094854L391394P21090k875900j991892J428058
8153f622805K029850L7204Q9272L026644M565336J994302k066697l332331q16749
8144a095974K509483L016200L11467k216144j614433O46106J067386l02004k27832
8135B094255J741189K018709r32206l478102k209195J086144K712081K340431
8127E373306J809139J131568o79707k385665j776736M10580J009043j026896l145029
8118G19603k857902r64022j19872j261678k589739k040079P3188J569171J235477
8109f235853J4048p98381j023323o54303O87038K148674J647668o61088j243271
$$ plain form
8100 -6118791 -4306541 669156 4739087 5581031 5729703 7686361 9394581 7945427 5112713
8091 5112713 4966975 7344017 7985877 4950645 988389 -986967 -1362813 -1619302 -1545363
8082 -1545363 -548425 57756 -1718022 -5341450 -7362657 -4991699 342318 4043018 3491449
8073 3491449 1057369 645478 2443354 3611211 3368855 3669046 4591241 3533800 547949
8064 547949 -152894 3187650 6145505 4819549 2108464 2366445 3459291 421592 -5351227
8055 -5351227 -7586508 -4976869 -2553629 -2906334 -2927277 -772296 577298 -644357 -1354537
8046 -1354537 434141 1191474 -2375105 -7307411 -8707839 -6810768 -5094340 -3983680
8038 -3983680 -1478124 1646700 2512767 1535188 2261212 5341797 6999918 4698579 547349
$$ packed form
8100f118791J812250M975697M069931Q41944J48672J956658J708220j449154k832714
8091E112713j45738K377042O41860l035232l962256j975356l75846k56489P3939
8082a545363R96938O06181j775778l623428k021207K370958N334017L700700n51569
8073C491449k434080m11891J797876J167857k42356L00191R22195j057441k985851
8064E47949p00843L340544K957855j325956k711085K57981J092846l037699n772819
8055e351227k235281K609639K423240l52705k0943K154981J349594j221655p10180
8046a354537J788678P57333l566579m932306j400428J897071J716428J110660
8038c983680K505556L124824Q66067r77579P26024L080585J658121k301339m151230
$$ plain form
8029 547349 -2704655 -5686041 -9744629 -12759505 -11129274 -5191796 462094 2369713
8021 2369713 1404076 28378 -1042622 -1919544 -1627028 267747 1529266 -191238 -3379782
8012 -3379782 -4567769 -3848338 -4315416 -5551258 -2984566 3809367 7596485 3003385 -4693058
8003 -4693058 -6464727 -2352133 -152689 -2639941 -4344497 -2067351 -251662 -2328820
7995 -2328820 -3940497 -301113 5034072 5287143 995015 -1330665 468915 1754149
7987 1754149 -950848 -5412208 -8438191 -10180787 -11354491 -10181389 -5417471 52354
7979 52354 2140235 941874 -53443 178338 -1350067 -6077787 -9952592 -8185361 -2435912
7970 -2435912 710049 -1422283 -4577774 -5081781 -5728715 -10065572 -14475877 -12260226 -4306765
$$ packed form
8029E47349l252004k981386m058588l014876J630231N937478N653890J907619
8021B369713r65637j375698j071000q76922K92516J894775J261519j720504l188544
8012c379782j187987P19431m67078j235842K566692O793933L787118m593100p696443
8003d693058j771669M112594K199444k487252j704556K277146J815689k077158
7995b328820j611677L639384N335185K53071m292128k325680J799580J285234
7987A754149k704997m461360l025983j742596j173704J173102M763918N469825
7979E2354K087881j198361r95317K31781j528405m727720l874805J767231N749449
7970b435912L145961k132332l155491n04007o46934m336857m410305K215651P953461
$$ plain form
7961 -4306765 1138023 41760 -2723132 -2341728 -1013842 -1981628 -2602279 778207 5273187
7952 5273187 5352792 1745825 -92549 1024564 1079190 -1510282 -3734530 -4061850 -4545855
7943 -4545855 -5502459 -3984319 129287 1972735 -1174777 -5242916 -5512620 -3357157 -2715055
7934 -2715055 -3352439 -2542912 -990310 -1694604 -3993442 -3965349 -921671 1198753 -6825
7925 -6825 -1883144 -1288506 348461 -889550 -5724840 -10258676 -10049335 -4684924 1707579
7916 1707579 4512453 3362338 2065025 3272964 5020406 4465615 3087468 4472598
7908 4472598 7813470 8387555 5326189 3870347 7200578 10446386 7233834 -642907
7900 -642907 -5267777 -3300876 351617 733 -3980158 -7220694 -6982072 -3805254 220490
$$ packed form
7961d306765N444788j096263k764892L81404J327886r67786o20651L380486M494980
7952E273187P9605l606967j838374J117113N4626k589472k224248l27320m84005
7943d545855r56604J518140M113606J843448l147512m068139k69704K155463O42102
7934b715055o37384Q09527J552602p04294k298838K8093L043678K120424j205578
7925f825j876319N94638J636967j238011m835290m533836K09341N364411O392503
7916A707579K804874j150115j297313J207939J747442n54791j378147J385130
7908D472598L340872N74085l061366j455842L330231L245808l212552p876741
7900f42907m624870J966901L652493l50884l980891l240536K38622L176818M025744
$$ plain form
7891 220490 2890254 2838078 550761 -2009670 -3116879 -1988215 1532838 6266186 9229431
$$ packed form
7891B20490K669764n2176k287317k560431j107209J128664L521053M733348K963245
$$ [...]
##END NTUPLES=NMR SPECTRUM
##END=
