##TITLE=31Pdec_SR111_rm
 , 124 sc
 14.3.2022
##JCAMPDX= 6.0         $$ Bruker NMR JCAMP-DX V2.0
##DATA TYPE= NMR SPECTRUM
##DATA CLASS= NTUPLES
##ORIGIN= UXNMR, Bruker Analytische Messtechnik GmbH
##OWNER= root
$$ XWIN-NMR		Version 3.5
$$ Mon Mar 14 13:06:31 2022 Russian Standard Time (UT+4h)  she@DPX200
##.OBSERVE FREQUENCY= 81.013821
##.OBSERVE NUCLEUS= ^31P
##.ACQUISITION MODE= SIMULTANEOUS
##.ACQUISITION SCHEME= undefined
##.AVERAGES= 124
##.DIGITISER RES= 16
##SPECTROMETER/DATA SYSTEM= spect
##.PULSE SEQUENCE= zgpg30
##.SOLVENT NAME= CDCl3
##.SHIFT REFERENCE= (INTERNAL, CDCl3, 0, 248.564)
##AUDIT TRAIL= $$ (NUMBER, WHEN, WHO, WHERE, WHAT)
$$ ##TITLE= Audit trail, XWIN-NMR		Version 3.5
$$ ##JCAMPDX= 5.01
$$ ##ORIGIN= Bruker BioSpin GmbH
$$ ##OWNER= she
$$ F:/spectra/data/she/nmr/P31/1/pdata/1/auditp.txt
$$ ##AUDIT TRAIL=  $$ (NUMBER, WHEN, WHO, WHERE, WHAT)
(   1,<2022-03-14 13:04:38.12 +0400>,<she>,<DPX200>,
      <continue with go, POWCHK disabled, PULCHK disabled
       configuration hash MD5:
       00 E9 B6 7A A2 85 ED C7 34 08 36 98 17 FE 4E 26
       data hash MD5: 32K
       41 57 E6 55 1D AD D5 FF 1D 00 BF DC 1D AE BC 5D>)
(   2,<2022-03-14 13:04:39.98 +0400>,<she>,<DPX200>,
      <Start of raw data processing
       efp BC_mod = 2 LB = 1 FT_mod = 6 PKNL = 1 PHC0 = -9201.193 PHC1 = 147.4745 SI = 64K 
       data hash MD5: 64K
       64 30 28 03 F2 8D 0A CB C3 4E 45 C8 D2 D0 7D 09>)
(   3,<2022-03-14 13:05:15.70 +0400>,<she>,<DPX200>,
      <pk PHC0 = 15.54205 PHC1 = -67 
       data hash MD5: 64K
       21 09 1F 68 57 2D 07 12 F4 71 77 BB A7 96 2E D4>)
(   4,<2022-03-14 13:05:18.81 +0400>,<she>,<DPX200>,
      <abs ABSG = 5 
       data hash MD5: 64K
       B6 06 A9 C0 D6 43 D0 B4 36 00 80 25 92 9E DB 9E>)
$$ ##END=
$$ 
$$ hash MD5
$$ 25 1D 51 47 64 5D B3 43 92 CA 66 47 B1 D9 9C BD
##$RELAX= 
##$RELAX= 
##$RELAX= 
##$RELAX= 
##$RELAX= 
##$RELAX= 
##$RELAX= 
##$RELAX= 
$$ Bruker specific parameters
$$ --------------------------
##$DU= <F:/spectra>
##$EXPNO= 1
##$NAME= <P31>
##$PROCNO= 1
##$TYPE= <nmr>
##$USER= <she>
##$AMP= (0..31)
100 100 100 100 100 100 100 100 100 100 100 100 100 100 100 100 100 100 
100 100 100 100 100 100 100 100 100 100 100 100 100 100 
##$AQSEQ= 0
##$AQ_mod= 1
##$AUNM= <au_zg>
##$AUTOPOS= <>
##$BF1= 81.014009
##$BF2= 200.13
##$BF3= 200.13
##$BF4= 200.13
##$BF5= 200.13
##$BF6= 200.13
##$BF7= 200.13
##$BF8= 200.13
##$BYTORDA= 1
##$CFDGTYP= 0
##$CFRGTYP= 5
##$CHEMSTR= <none>
##$CNST= (0..31)
1 1 145 1 1 1 1 1 1 1 1 1 1 1 1 1 1 1 1 1 1 1 1 1 1 1 1 1 1 1 1 1 
##$CPDPRG= <waltz16>
##$CPDPRG1= <>
##$CPDPRG2= <waltz16>
##$CPDPRG3= <>
##$CPDPRG4= <mlev>
##$CPDPRG5= <mlev>
##$CPDPRG6= <mlev>
##$CPDPRG7= <mlev>
##$CPDPRG8= <mlev>
##$CPDPRGB= <>
##$CPDPRGT= <>
##$D= (0..31)
0 1 0 0 0 0 0 0 0 0 0 0.03 2e-05 3e-06 0 0 0 0 0 0 0 0 0 0 0 0 0 0 0 0 
0 0 
##$DATE= 1647248507
##$DBL= (0..7)
120 120 120 11 120 120 24 19 
##$DBP= (0..7)
150 150 150 150 150 150 150 150 
##$DBP07= 0
##$DBPNAM0= <>
##$DBPNAM1= <>
##$DBPNAM2= <>
$$ [...]
##$SUBNAM3= <"">
##$SUBNAM4= <"">
##$SUBNAM5= <"">
##$SUBNAM6= <"">
##$SUBNAM7= <"">
##$SUBNAM8= <"">
##$SUBNAM9= <"">
##$SW= 501.771253377433
##$SWIBOX= (0..15)
0 1 3 0 0 0 0 0 0 0 0 0 0 0 0 0 
##$SW_h= 40650.406504065
##$TD= 32768
##$TD0= 1
##$TE= 0
##$TE2= 300
##$TE3= 300
##$TEG= 300
##$TL= (0..7)
0 120 53 12 22 120 120 120 
##$TP= (0..7)
150 150 150 150 150 150 150 150 
##$TP07= 0
##$TPNAME0= <>
##$TPNAME1= <>
##$TPNAME2= <>
##$TPNAME3= <>
##$TPNAME4= <>
##$TPNAME5= <>
##$TPNAME6= <>
##$TPNAME7= <>
##$TPOAL= (0..7)
0.5 0.5 0.5 0.5 0.5 0.5 0.5 0.5 
##$TPOFFS= (0..7)
0 0 0 0 0 0 0 0 
##$TUNHIN= 0
##$TUNHOUT= 0
##$TUNXOUT= 0
##$USERA1= <user>
##$USERA2= <user>
##$USERA3= <user>
##$USERA4= <user>
##$USERA5= <user>
##$V9= 5
##$VALIST= <valist>
##$VCLIST= <CCCCCCCCCCCCCCC>
##$VD= 0
##$VDLIST= <DDDDDDDDDDDDDDD>
##$VPLIST= <PPPPPPPPPPPPPPP>
##$VTLIST= <TTTTTTTTTTTTTTT>
##$WBST= 1024
##$WBSW= 4
##$XGAIN= (0..3)
0 0 0 0 
##$XL= 0
##$YL= 0
##$YMAX_a= 4005
##$YMIN_a= -16579
##$ZGOPTNS= <>
##$ZL1= 120
##$ZL2= 120
##$ZL3= 120
##$ZL4= 120
##$ABSF1= 248.5645
##$ABSF2= -253.2056
##$ABSG= 5
##$ABSL= 3
##$ALPHA= 0
##$AQORDER= 0
##$ASSFAC= 0
##$ASSFACI= 0
##$ASSFACX= 0
##$ASSWID= 0
##$AUNMP= <proc_1d>
##$AZFE= 0.1
##$AZFW= 0.5
##$BCFW= 0
##$BC_mod= 2
##$BYTORDP= 0
##$COROFFS= 0
##$CY= -3
##$DATMOD= 1
##$DC= 0
##$DFILT= <>
##$DTYPP= 0
##$F1P= 0
##$F2P= 0
##$FCOR= 1
##$FTSIZE= 65536
##$FT_mod= 6
##$GAMMA= 0
##$GB= 0
##$INTBC= 1
##$INTSCL= 5.30512e-09
##$ISEN= 30
##$LB= 1
##$LEV0= 0
##$LPBIN= 0
##$MAXI= 10000
##$MC2= 0
##$MEAN= 0
##$ME_mod= 0
##$MI= 50
##$NCOEF= 0
##$NC_proc= -7
##$NLEV= 6
##$NOISF1= 182.463
##$NOISF2= 159.3651
##$NSP= 0
##$NTH_PI= 0
##$NZP= 0
##$OFFSET= 248.5645
##$PC= 4
##$PHC0= -9185.651
##$PHC1= 80.4745
##$PH_mod= 1
##$PKNL= yes
##$PPARMOD= 0
##$PSCAL= 0
##$PSIGN= 0
##$REVERSE= no
##$SF= 81.014009
##$SI= 65536
##$SIGF1= 159.3651
##$SIGF2= -187.1042
##$SINO= 113.3802
##$SIOLD= 16384
##$SREGLST= <1H.CDCl3>
##$SSB= 0
##$STSI= 65536
##$STSR= 0
##$SW_p= 40650.406504065
##$SYMM= 0
##$S_DEV= 0
##$TDeff= 32768
##$TDoff= 0
##$TI= <>
##$TILT= no
##$TM1= 0
##$TM2= 0
##$TOPLEV= 0
##$USERP1= <user>
##$USERP2= <user>
##$USERP3= <user>
##$USERP4= <user>
##$USERP5= <user>
##$WDW= 1
##$XDIM= 65536
##$YMAX_p= 281143592
##$YMIN_p= -465913188
$$ End of Bruker specific parameters
$$ ---------------------------------
##NTUPLES= NMR SPECTRUM
##VAR_NAME=  FREQUENCY,     SPECTRUM/REAL,   SPECTRUM/IMAG
##SYMBOL=    X,             R,               I
##VAR_TYPE=  INDEPENDENT,   DEPENDENT,       DEPENDENT
##VAR_FORM=  AFFN,          ASDF,            ASDF
##VAR_DIM=   65536,         65536,           65536
##UNITS=     HZ,            ARBITRARY UNITS, ARBITRARY UNITS
##FACTOR=    0.620285442955139, 1,           1
##FIRST=     20137.2065510759, 0,            0
##LAST=      -20513.1999529892, 0,           0
##MIN=       -20513.1999529892, -465913188,  0
##MAX=       20137.2065510759, 281143592,    0
$$ Real data points
##PAGE= N=1
##DATA TABLE= (X++(R..R)), XYDATA
$$ [...]
13013I791306j070748m435830m264183r78410J430653J175418K62023M03346O60442
13004B974017J84532J85689J114430O25208k615868n235964l209587J616721L598237
12995g62585J642230M45605K432354L754370Q72245l583986n103831l539821j068016
12986d911435K386306O693075P628388J759727o255329p885614k335903K395654
12978e25131J212202j688570q55320J824189J314172j698250j919635J835124
12970e01219M388019J638780l530611n047019j470440K561749K635119n0519j238910
12961f15051r0498J05318k001813k881843L47138M754576N778861M013714K943887
12952A2354289J867556k515198p933293p571157j094025L028421J21301l174834
$$ plain form
13013 9791306 8720558 4284728 20545 -957865 472788 1648206 1910229 2313575 2974017
13004 2974017 3158549 3344238 4458668 5083876 2468008 -2767956 -5977543 -4360822 -762585
12995 -762585 879645 1325250 3757604 7511974 8384219 4800233 -303598 -3843419 -4911435
12986 -4911435 -2525129 4167946 11796334 13556061 7300732 -584882 -2920785 -525131
12978 -525131 687071 -1001499 -1856819 -32630 1281542 -416708 -2336343 -501219
12970 -501219 3886800 5525580 1994969 -3052050 -4522490 -1960741 674378 623859 -615051
12961 -615051 -705549 -600231 -2602044 -5483887 -5136749 -382173 5396688 9410402 12354289
12952 12354289 14221845 11706647 3773354 -3797803 -4891828 -1863407 -1742106 -4916940
12944d916940m2261M637585K333576l997977l897181L018083N541076q66466o082179
12935d272684j528018N715249M194790l600422n523754R20478N448605J760362
12927C114606l546911k686564J607588K212961o98737j306127J689888L409076
12919C795780P26141l474010m821024k831754o02329p58232k388334j994792J697932
12910a0650622M676071K374232k706875l019502K861893O962019L441722k524215
12902A414723l081122N09343J963822J373457L001381M520732k95803q286693
12894A119840q256066J503858Q458894M076093l457519k600305L918888M821602
12886I585285j758857o723752m455485P41901L028330K140190N37092o94393j027434
$$ plain form
12944 -4916940 -4959201 -321616 2011960 -1986017 -5883198 -2865115 2675961 1809495 -4272684
12935 -4272684 -5800702 -85453 4109337 508915 -5014839 -4094361 1354244 3114606
12927 3114606 -432305 -3118869 -1511281 701680 2943 -1303184 386704 3795780
12919 3795780 4521921 1047911 -3773113 -6604867 -7207196 -7965428 -10353762 -12348554 -10650622
12910 -10650622 -5974551 -3600319 -6307194 -9326696 -6464803 497216 3938938 1414723
12902 1414723 -1666399 -1157056 806766 2180223 5181604 9702336 9406533 1119840
12894 1119840 -7136226 -5632368 2826526 6902619 3445100 844795 4763683 9585285
12886 9585285 7826428 1102676 -3352809 -2610908 417422 2557612 3094704 2400311 1372877
12877A372877K99087K386701K675657R3209l477111n313563m352599j860294k21758
12868h397794j20575Q15501M120923N957029J345253o548488q060268p44505N795266
12859e837658L754261j380341m30278M726453N451176R64107j958169j568626
12851C720925k378666m259660j561956N201654P476932J995081l522339k607934
12843D064037N41815m02099l439027l203956o48245k77548j537619l67999K705767
12834b564874K985435k82910k186195M31337M310313M384431K30105m055460m976103
12825a723921k778277K22531K592080L843197K931933m70638l297827j561630
12817b42552L101612L881156j265239n136651j735943L688187K334920m059894
$$ plain form
12877 1372877 1671964 4058665 6734322 6827531 3350420 -1963143 -6315742 -8176036 -8397794
12868 -8397794 -8518369 -7702868 -3581945 2375084 3720337 -2828151 -10888419 -11632924 -5837658
12859 -5837658 -2083397 -3463738 -3894016 832437 6283613 7247720 5289551 3720925
12851 3720925 1342259 -2917401 -4479357 722297 8199229 10194310 6671971 4064037
12843 4064037 4605852 4203753 764726 -2439230 -3087475 -3365023 -4902642 -5270641 -2564874
12834 -2564874 420561 137651 -2048544 -1617207 2693106 7077537 7307642 3252182 -1723921
12825 -1723921 -4502198 -4279667 -1687587 2155610 5087543 4616905 1319078 -242552
12817 -242552 2859060 6740216 5474977 338326 -1397617 2290570 4625490 565596
12809E65596n891261p34100M144538M465412L938629M652184K621136l150670
12801A0611464o344995l208634J055749R88537j328419k340171l342774m926734
12793h835977k813428L865947P633033L931460M6604L498104Q407519M672068
12785B0405330m648185p881848l485259p20597k561535j950555L015336L904624
12777F077311k953833q009477k569345P498090J0288433L974272l341399n674698
12769E289354m001407j673142q90060k155262l158267m04804M798084N663499
12761C467995n22395o367386l925295L098093M296994j840389n851358j850775
12753i494516M199181M536519R66952J99392K416968J816700l046979o627723
$$ plain form
12809 565596 -5325665 -6059765 -1915227 2550185 6488814 11140998 13762134 10611464
12801 10611464 4266469 1057835 2113584 3102121 1773702 -566469 -3909243 -8835977
12793 -8835977 -11649405 -7783458 -150425 3781035 3827639 7325743 15733262 20405330
12785 20405330 15757145 7875297 4390038 3669441 1107906 -842649 2172687 6077311
12777 6077311 3123478 -4885999 -7455344 42746 10331179 14305451 10964052 5289354
12769 5289354 1287947 -385195 -1275255 -3430517 -6588784 -6993588 -2195504 3467995
12761 3467995 2945600 -3421786 -7347081 -4248988 48006 -1792383 -7643741 -9494516
12753 -9494516 -5295335 -758816 208136 407528 2824496 4641196 1594217 -5033506
12745e033506n037049j305768M48089J083373K940024M229872J929000j952503
12737b698468k443438O99684K702085J520960M17013J239377P59505k983094n588508
12728f374884k453229L335097M840168J194296j998913j586377m80979j495741
12720e020562k751025j492851J310544K823498K256803P16680p99994j352216
12712d309123L1231K413156K730056l24053l710544l694329r02069R00630M51681
12703f413364M22741K702142M918531L441371j422047n152113m007321Q21246
12695d688814M507038L593838p06787m074375l498628O3624L156598L412428J464518
12686C229440l41798n73650J56500L86078l29676r87838m47341J202905K817412
$$ plain form
12745 -5033506 -10070555 -11376323 -10928234 -9844861 -6904837 -2674965 -745965 -2698468
12737 -2698468 -5141906 -4442222 -1740137 -219177 197836 1437213 2196718 -786376 -6374884
12728 -6374884 -8828113 -5493016 -652848 541448 -1457465 -3043842 -3524821 -5020562
12720 -5020562 -7771587 -9264438 -7953894 -5130396 -2873593 -2156913 -2956907 -4309123
12712 -4309123 -4277892 -1864736 865320 541267 -3169277 -6863606 -7765675 -6865045 -6413364
12703 -6413364 -5990623 -3288481 1630050 5071421 3649374 -1502739 -5510060 -4688814
12695 -4688814 -181776 3412062 2705275 -1369100 -4867728 -4804104 -1647506 1764922 3229440
12686 3229440 2887642 2313992 2470492 2856570 2526894 1539056 1091715 2294620 5112032
12677E112032L465744K976380J255185j893613n454164o706607l943658M32996
12669d755705J913420j89143j450476J118849M029866K278428k753538n102859
12661d911158l007594l95620N95357K321175N141627M928065O71939j778251J231278
12652D796818M178065J025724m318438m393296q88831j137798m373723k755391
12644g866870L834687N853234r7603m723189p59730N495838M728174j104601l513397
12635A846543r58478J159043N13802l11485n0162K63211J108004L062989L145940
12626I779407j255260o280417n917268j397701N48417j480207j757381K417398
12618e343012N886242L923104l98072j281263J119563J558140k333527o586346
$$ plain form
12677 5112032 8577776 11554156 12809341 10915728 5461564 -1245043 -5188701 -4755705
12669 -4755705 -2842285 -3031428 -4481904 -3363055 666811 2945239 191701 -4911158
12661 -4911158 -7918752 -8314372 -7719015 -5397840 -256213 4671852 5343791 3565540 4796818
12652 4796818 8974883 10000607 5682169 1288873 400042 -737756 -5111479 -7866870
12644 -7866870 -4032183 1821051 1723448 -2999741 -3759471 1736367 6464541 5359940 1846543
12635 1846543 888065 2047108 2560910 2249425 2199263 2462474 3570478 6633467 9779407
12626 9779407 8524147 2243730 -3673538 -5071239 -4522822 -6003029 -7760410 -5343012
12618 -5343012 543230 4466334 4068262 2786999 3906562 5464702 3131175 -3455171
12610c455171n784131K07175N364891L958972k305911n625330j719734M594859
12602d764380O137215K837642P325q87087l493236q278413r463557l336304N070392
12593a6170403P866044M259841N15974J196868M293382N139313K009994l163586
12585E947427p301836p806772l430454L965204Q964440O871044l94292n141609
12577A673152k773736K350018K972291j046578l359145j126922J299370J21335
12569A09785k030430j246380J092274J234518n31915j012539K24326P21851k45348
12560a683858q11344q801R79374R99194R2658j165875j762805n27411K059592
12551a829276L501330K248543l64084k371627l368434l197297j159558J714276
$$ plain form
12610 -3455171 -9239302 -9032127 -3667236 291736 -2014175 -7639505 -9359239 -4764380
12602 -4764380 1372835 4210477 4217802 3330715 -162521 -8440934 -17904491 -21240795 -16170403
12593 -16170403 -8304359 -4044518 -3528544 -2331676 1961706 7101019 9111013 5947427
12585 5947427 -1354409 -9161181 -12591635 -8626431 338009 7209053 6814761 1673152
12577 1673152 -1100584 1249434 4221725 3175147 -183998 -1310920 -11550 109785
12569 109785 -1920645 -3167025 -2074751 -840233 -1372148 -2384687 -2160361 -1438510 -1683858
12560 -1683858 -2495202 -2504003 -1524629 -525435 -432777 -1598652 -3361457 -3888868 -1829276
12551 -1829276 1672054 3920597 3556513 1184886 -2183548 -5380845 -6540403 -4826127
12543d826127K563285R54309J02556J588399K476733M80815j934564k038664j418695
12534b051953k115812k288798l23899R18600o79774j241188K748839O674927L961747
12525E602689k813636n253545j962581N29993p54887j539845Q32862K857954J585728
12516i15268p20365j249822n78444J81055J262877J605909q44396m624942n250179
12507a1133575j743164J810172K525324K001075K092200K049412J417442J458979
12499D77865K093120J277827j242097l071320k807792j229929J039210L291533
12491a71583K951489j274433n258868l820262J395527M140774K908585J516745
12483B387974J000705j407984m863937m593425m35141K109698J119427P18777
$$ plain form
12543 -4826127 -2262842 -1308533 -1205977 382422 2859155 3339970 1405406 -633258 -2051953
12534 -2051953 -4167765 -6456563 -6780462 -5861862 -6541636 -7782824 -5033985 1640942 5602689
12525 5602689 2789053 -2464492 -4427073 -3897080 -4651967 -6191812 -5358950 -2500996 -915268
12516 -915268 -1635633 -2885455 -3463899 -3282844 -2019967 -414058 -1258454 -5883396 -11133575
12507 -11133575 -12876739 -11066567 -8541243 -6540168 -4447968 -2398556 -981114 477865
12499 477865 2570985 3848812 2606715 -464605 -3272397 -4502326 -3463116 -171583
12491 -171583 2779906 1505473 -3753395 -7573657 -6178130 -2037356 871229 2387974
12483 2387974 3388679 1980695 -2883242 -7476667 -7911808 -5802110 -4682683 -3963906
12475c963906K415608K332679l36130p77016K147203K798594r13249k979222o6534
12466F58027K115991o08856k764072P29407M498327J746911l392032k488744L160342
12457C655301N224762J674808k237683l942149n107988m789138l67054M948696
12449i40445M455767j322899m318419r53112L005497K292788n447J234860M112105
12440G560695K632506l339795o603824k264969M844609N724409r68474o982944
12432F02213n703241n89939J517782R72729K373359M215787P77611o177649p760710
12423i772058j948022K815040J452940m51483J741086L151825l49725k878932
12415f239329J266691O237602L878535k171983k782306J272103J881215j739035
$$ plain form
12475 -3963906 -1548298 784381 448251 -328765 1818438 4617032 3703783 724561 658027
12466 658027 2774018 2165162 -598910 130497 4628824 6375735 2983703 494959 3655301
12457 3655301 8880063 10554871 8317188 4375039 -732949 -5522087 -5889141 -940445
12449 -940445 3515322 2192423 -2125996 -3079108 -73611 2219177 2213730 3448590 7560695
12440 7560695 10193201 6853406 249582 -2015387 2829222 8553631 7585157 602213
12432 602213 -5101028 -5690967 -4173185 -3200456 -827097 3388690 4166301 -2011348 -9772058
12423 -9772058 -11720080 -8905040 -7452100 -7903583 -6162497 -3010672 -3360397 -6239329
12415 -6239329 -4972638 1264964 5143499 2971516 189210 1461313 3342528 1603493
12407A603493k730859N44171K436735P24446n44430M94932J008193N5777j47337
12398C445121K12423q47226j428065J542766M793313K547899k668794k626634
12390D970803K834455M785415k68735n099071m348011k588488m647235o463137
12382a0824004k436234M244092N903232J626499k116128q04687K885046L487289
12374A965105p2726k996353r15682L137858J840497m903175p378929J28764Q948935
12365b45706P555659j238663n104497j383082P87719k683924m833787j198772
12357h345053K763726K523627J856154L619666L210900j926013n328455j867442
12349c492890K769890J368976k719941j788104L165214M881299J904301o31424
$$ plain form
12407 1603493 -1127366 -583195 1853540 2577986 2033556 2528488 3536681 3592458 3445121
12398 3445121 3657544 2810318 1382253 2925019 7718332 10266231 7597437 4970803
12390 4970803 7805258 12590673 12321938 7222867 2874856 286368 -4360867 -10824004
12382 -10824004 -13260238 -9016146 -3112914 -1486415 -3602543 -4407230 -1522184 1965105
12374 1965105 1892379 -1103974 -2019656 1118202 2958699 -1944476 -9323405 -9194641 -245706
12365 -245706 7309953 6071290 966793 -416289 371430 -2312494 -7146281 -8345053
12357 -8345053 -5581327 -3057700 -1201546 2418120 5629020 3703007 -1625448 -3492890
12349 -3492890 -723000 645976 -2073965 -3862069 -696855 4184444 6088745 5457321
12341E457321l03430L33147k31198p47303q87760j377085j427298m22961l35047
12332E8386k151090k469480J422959N735494N037558P34506j286829J25473P23964
12323G930941j381772l410866l453959k758600j771643J117422N553390P922247
12315I747160N665037K91257m694528o811259n557561k453368O1673J315104K881487
12306D45002M872385M192133o56184n501298n212625p62355K630981L002396K559238
12297E569673J961629q67768n490291p474436m263229R35384L311175K097499
12289d220364N7901r44520j713097l381745m723469k815061K979360Q425579Q057754
12280A722338K009818l299383k814984J249325L207559J233463j792572k925481
$$ plain form
12341 5457321 5153891 5487038 5255840 4508537 3620777 2243692 816394 393433 58386
12332 58386 -2092704 -4562184 -3139225 2596269 7633827 8368333 7081504 7206977 7930941
12323 7930941 6549169 3138303 -315656 -3074256 -4845899 -3728477 1824913 9747160
12315 9747160 15412197 15703454 11008926 4197667 -1359894 -3813262 -3751589 -2436485 445002
12306 445002 5317387 9509520 8853336 3352038 -1860587 -2622942 8039 3010435 5569673
12297 5569673 7531302 6663534 1173243 -6301193 -10564422 -9629038 -6317863 -4220364
12289 -4220364 -4162463 -5106983 -6820080 -10201825 -14925294 -17740355 -14760995 -6335416 1722338
12280 1722338 3732156 432773 -2382211 -1132886 2074673 3308136 1515564 -1409917
12272a409917j815713L8808M81671j508397l693408k572132J065067K303648Q3507
12263g026866p4344M520991P263652K044138n233093m142266L846069O975057
12255H173338J165876m594504l389818k45621j565635l952851j223715M111415
12247a521515M998118J437283l91072J459963K768798J010963j458432k452129
12239E851977k708145k847539k064029o09780J24749L70954J349770J982071J23676
12230A573704k842424k908379L79170K794111J627580r06832j865201j359759
12222c508030m46571J045649K474071J719209r63752j756724J231648M315269
12214D110769L145003j444534n568583p383212o600158k138968N076244R548358
$$ plain form
12272 -1409917 -3225630 -3186822 -2705151 -4213548 -7906956 -10479088 -9414021 -7110373 -7026866
12263 -7026866 -7101210 -2580219 4683433 6727571 1494478 -2647788 1198281 8173338
12255 8173338 9339214 4744710 1354892 1109271 -456364 -4409215 -5632930 -1521515
12247 -1521515 3476603 4913886 4522814 5982777 8751575 9762538 8304106 5851977
12239 5851977 3143832 296293 -1767736 -2377516 -2252767 -1881813 -532043 1450028 1573704
12230 1573704 -1268720 -4177099 -3797929 -1003818 623762 -283070 -2148271 -3508030
12222 -3508030 -3954601 -2908952 -434881 1284328 320576 -1436148 -204500 4110769
12214 4110769 7255772 5811238 242655 -7140557 -13740715 -15879683 -10803439 -1255081
12206a255081O908537O72373k138057p85678j22142j101217L72703M172287L683114
12197A0406839l624064j0240829q325997l08109N426133N351127K035348j815333
12189a094885m643227l909073J249208O474826O587714K531056p78454j943564
12181D473601k975474l167120K03652N023087N147742k51157m377555k547334
12173A529442J196113P36897l284404n524608l845547r33424M85701N13480N80605
12164h545745J398964K384856K186486L23293j535326j218363J046899L141929
12156h17007M181714M674243L819853K6524n293702p884727n834441j690076J514960
12147g302659L134611K971228M19189k777651k819834Q01620L754247L002957
$$ plain form
12206 -1255081 5653456 6325829 4187772 3402094 3279952 2178735 2551438 6723725 10406839
12197 10406839 6782775 -3458054 -11784051 -12092160 -6666027 -1314900 720448 -1094885
12189 -1094885 -5738112 -9647185 -8397977 -1923151 4664563 7195619 6417165 4473601
12181 4473601 1498127 -1668993 -1465341 3557746 8705488 8454331 4076776 1529442
12173 1529442 2725555 3462452 178048 -5346560 -9192107 -10125531 -9639830 -9126350 -8545745
12164 -8545745 -7146781 -4761925 -2575439 -2252146 -3787472 -5005835 -3958936 -817007
12156 -817007 3364707 8038950 11858803 11885327 6591625 -1293102 -7127543 -8817619 -7302659
12147 -7302659 -4168048 -1196820 -777631 -3555282 -6375116 -5573496 -1819249 1183708
12139A183708R57315Q93512J888278J467288m9826j234210k439455l601568k453227
12130c388185J285149L357327R72954k071824j333493O71037r14209l915582k088396
12121g425222L772690N960682J782074k581791k255517l03180q11607k069202
12113c931073j279017m48188k006691k909125O24852N340219M555722j504298
12105a557599n269335k293735L154089M655912J651452j478597j561490N88401
12097b110902K112412J052038j920129l869835k546330P31577K425223J250414
12089b875532m47755l05891J172543K401833L145512L360076J676053k285062
12081E841777n416132m155043K91064K823342R00868k721195m352519l500683
$$ plain form
12139 1183708 2141023 3034535 4922813 6390101 6340275 5106065 2666610 -934958 -3388185
12130 -3388185 -2103036 1254291 2227245 155421 -1178072 -507035 -1421244 -5336826 -7425222
12121 -7425222 -3652532 2308150 4090224 1508433 -747084 -1050264 -1861871 -3931073
12113 -3931073 -5210090 -5658278 -7664969 -10574094 -9949242 -4609023 -53301 -1557599
12105 -1557599 -6826934 -9120669 -5966580 -1310668 340784 -1137813 -2699303 -2110902
12097 -2110902 1510 1053548 -866581 -4736416 -7282746 -6551169 -4125946 -2875532
12089 -2875532 -3323287 -3629178 -2456635 -54802 3090710 6450786 8126839 5841777
12081 5841777 425645 -3729398 -3438334 -614992 285876 -2435319 -6787838 -10288521
12073a0288521j384854J633073M823447N719932L004331o24433j455924J61464
12065A588515O98097j055028k549146j837294k28872N48194J109043K489083L494234
12056D256826K326182j89174j373521n48101j2013j584968l864898m185203k231967
12047g406837R18J416935K774593L999383L124113k73799k814788j427519J793835
12038A186834K429459M34298m31866L74005q30454m674760o207327k581020J971940
12029h328891K793434J609207J894816K057019o18617k971595k19247N055908
12021A272034N791005J367519j822271o73453J117244N65613p22244j591180l378311
12012A925956n039955k973922J956734L874226J077243j049492L69364N68675
$$ plain form
12073 -10288521 -11673375 -10040302 -5216855 503077 3507408 2882975 1427051 1588515
12065 1588515 2286612 1231584 -1317562 -3154856 -3383728 -2835534 -1726491 762592 4256826
12056 4256826 6583008 6393834 5020313 4472212 4460199 2875231 -989667 -5174870 -7406837
12047 -7406837 -7405919 -5988984 -3214391 784992 3909105 3635306 820518 -607001 1186834
12038 1186834 3616293 4050591 3618725 3992730 3162276 -1512484 -7719811 -10300831 -8328891
12029 -8328891 -5535457 -3926250 -2031434 25585 -593032 -3564627 -3783874 1272034
12021 1272034 7063039 8430558 6608287 5934834 7052078 7617691 6895447 5304267 1925956
12012 1925956 -3113999 -6087921 -4131187 -256961 820282 -229210 140154 708829
12004G08829l470865n666381K5760Q421817R330876K140102l887036l117387l008
11995D482707q47834m905400o413204k425262L893211O967813M698364M17165
11987E867560j292959l6489P70432q17091k977044l149344o54587L547859O693838
11978G952175M757344k390850p391497l225648N519239P029352p43007o503778
11970E003330k608454L797495K868014l146201n464359k594622M52450J877587
11962A85240K956220K039641k285932n156605j518190M397649M726474O13089
11954E957586m50333K113907J979742j694325l089062j445252k488089o196274
11946e312100m878001K685582O655740J685955l468572K3021O350208M509473
$$ plain form
12004 708829 -2762036 -8428417 -8402657 19160 9350036 11490138 7603102 4485715 4482707
11995 4482707 3634873 -1270527 -7683731 -10108993 -6215782 752031 5450395 5867560
11987 5867560 4574601 4538112 5308544 4491453 1514409 -1634935 -2289522 1258337 7952175
11978 7952175 12709519 10318669 2927172 -298476 5220763 12250115 11507108 5003330
11970 5003330 2394876 6192371 9060385 5914184 449825 -2144797 -1692347 185240
11962 185240 3141460 5181101 2895169 -2261436 -3779626 618023 5344497 5957586
11954 5957586 5507253 7621160 9600902 7906577 4817515 3372263 884174 -5312100
11946 -5312100 -10190101 -7504519 -848779 837176 -2631396 -2608375 3741833 8251306
11938H251306l712964o537125l53589N816320M675290J47486o99589J737443K092597
11929A1417175q08149k879319j958866r96492k481364l658394r78218L081305
11921G37678K938261p82749j241922L473946O043551J094579n677293o073492
11913E12559j759269L6200r75972M71443L857600L499890j48143o65077K146555
11904F975786J407677l391549l846667K251425N008973j614554q545786n208706
11896f963401M117420P563104K981523k178550l744785l532297k201316J095013
11888b863289L694324K492730M43585K071031M442639J294583n180770o189226
11880B05607k19711M336737K202411j954178k675763j646495k170198k456358
$$ plain form
11938 8251306 4538342 -1998783 -2352372 3463948 8139238 8286724 7587135 9324578 11417175
11929 11417175 10609026 7729707 5770841 4774349 2292985 -1365409 -2343627 737678
11921 737678 3675939 2893190 1651268 5125214 11168765 12263344 6586051 512559
11913 512559 -1246710 -1210510 -2186482 -1715039 2142561 5642451 5494308 4829231 6975786
11904 6975786 8383463 4991914 1145247 3396672 8405645 6791091 -1754695 -6963401
11896 -6963401 -2845981 4717123 7698646 5520096 1775311 -1756986 -3958302 -2863289
11888 -2863289 831035 3323765 3767350 5838381 10281020 11575603 6394833 205607
11880 205607 -14104 4322633 6525044 4570866 1895103 248608 -1921590 -4377948
11872d377948K61284L621616L386675j58741l316434m291280l901675k800385
11864a1576888j096690M51656J235523J854669K823558L300521K248889j73163
11856i31925k876194m253841k656657J419294M141268K400202j219662j362739
11848e340254K105315L770154J344556q15126N81998K080617j80275l203522k020990
11839a677527J472930J357539k127842k399148K781031P013047M325271k503664
11831H241637o368030n189658k756888k022945j750677O2156K644624L752454
11823c387327K891763J639499J125694O28967p02912j812770j019610Q91513J051637
11814A306454j206421k754800j161365J413006J582502J84059N67154K478860
$$ plain form
11872 -4377948 -4116664 -495048 2891627 2732886 -583548 -4874828 -8776503 -11576888
11864 -11576888 -12673578 -12221922 -10986399 -9131730 -6308172 -3007651 -758762 -931925
11856 -931925 -3808119 -8061960 -10718617 -9299323 -5158055 -2757853 -3977515 -5340254
11848 -5340254 -3234939 535215 1879771 1064645 1646643 3727260 3546985 343463 -1677527
11839 -1677527 -204597 1152942 -974900 -3374048 -593017 6420030 10745301 8241637
11831 8241637 1873607 -3316051 -6072939 -8095884 -9846561 -9784405 -7139781 -3387327
11823 -3387327 -495564 1143935 2269629 2898596 2195684 382914 -636696 254817 1306454
11814 1306454 100033 -2654767 -3816132 -2403126 -820624 -636565 -69411 2409449
11806B409449K321585k94391j350442O33027J507624j588941m764593l240682
11798d367364P79620J516922j148238j731735J919153N341807M230200m6505l403310
11789C090550l913901j959202J354450L930441L396938J37208k328786j685686
11781B022012K82135P31170j94546l90798M54740M02481j628187l807980l020790
11772e149763J534833O514699P071832K094758m134042o599493m691370j415559
11764d774105O56947N86864j584548l698590j901069M068416Q306580O056275
11756G716770J134556K38717K306207J239524k414159k196524J555835O59568
11748A0240494o419190j0123584n127269N12349j049181m364075p17041O681261
$$ plain form
11806 2409449 4731034 4436643 3086201 3719228 5226852 3637911 -1126682 -4367364
11798 -4367364 -3587744 -2070822 -3219060 -4950795 -3031642 2310165 6540365 6493860 3090550
11789 3090550 -823351 -2782553 -1428103 2502338 5899276 6036484 3707698 2022012
11781 2022012 2304147 3035317 2840771 2449973 2904713 3307194 1679007 -2128973 -5149763
11772 -5149763 -3614930 2899769 9971601 12066359 7932317 1332824 -3358546 -4774105
11764 -4774105 -4117158 -3530294 -5114842 -8813432 -10714501 -6646085 1660495 7716770
11756 7716770 8851326 9090043 11396250 12635774 10221615 8025091 9580926 10240494
11748 10240494 3821304 -6302280 -11429549 -10917200 -11966381 -16330456 -17047497 -10366236
11740a0366236Q384362L918374L37492l00121j252982k015697M05391L293772
11732B404355J603862k151498j462454K417246K738848k21963k13531K261988
11724G376853M70406m904983n381919J97613L054442J85301l91215M980866P892286
11715A3479650K581128l452510k183170J809569N45724l679331m050181j631956
11707C418923j563968k329171P85723N404188N049958j12149m089315m459926
11699B104263l386486j624270J159734K425085J81795j975052j4868L121791K287473
11690D279465p88118r38766Q32667j89646k624539j001155L502847L935288n76139
11681F431904l131383n36295K268443J463447j3068Q65173J845350J87780k638314
$$ plain form
11740 -10366236 -1981874 1936500 2273992 1973871 720889 -1294808 -889417 2404355
11732 2404355 4008217 1856719 394265 2811511 5550359 5328396 5114865 7376853
11724 7376853 7847259 2942276 -2439643 -2242030 812412 997713 606498 5587364 13479650
11715 13479650 16060778 12608268 10425098 12234667 12780391 9101060 5050879 3418923
11707 3418923 1854955 -474216 311507 5715695 10765653 10653504 6564189 2104263
11699 2104263 -1282223 -2906493 -1746759 678326 860121 -1114931 -1129799 1991992 4279465
11690 4279465 3491347 2552581 3385248 3195602 571063 -430092 3072755 7008043 6431904
11681 6431904 3300521 2764226 5032669 6496116 6483048 7348221 9193571 9381351 6743037
11672F743037m025098l558960j518891J484063K587832l50736l483107j015990
11664c137850M840961N542682m93431m690655j796957K034615O9123l938236k834311
11655d404059J791856K945777j02418j836816k62610J033907N0699j106926j150291
11646c040881j376416j914267j090874P87935J373023N42000N42125J322578J46336
11637b708441l025671m141052r79856L294708M835351M065643L222743J899094
11629F462519j354423m734564m475700l19831L506511L508074P69813j399985
11621A962414j732580j334039r76422j64498R87305P81178j835020m798721m435976
11612a1546359N0129M908134N869951L111082N85349O38086J367597J54720k212301
$$ plain form
11672 6743037 2717939 -841021 -2359912 -875849 1711983 1361247 -2121860 -3137850
11664 -3137850 1703111 7245793 6752362 2061707 264750 2299365 2368488 -1569748 -4404059
11655 -4404059 -2612203 333574 231156 -1605660 -1868270 -834363 -783664 -1890590 -3040881
11646 -3040881 -4417297 -6331564 -7422438 -6634503 -5261480 -4719480 -4177355 -2854777 -2708441
11637 -2708441 -5734112 -9875164 -10855020 -7560312 -2724961 1340682 4563425 6462519
11629 6462519 5108096 373532 -4102168 -4421999 -915488 2592586 3362399 1962414
11621 1962414 229834 -1104205 -2080627 -2245125 -1257820 -476642 -2311662 -7110383 -11546359
11612 -11546359 -11496230 -6588096 -718145 2392937 2978286 3616372 4983969 5138689 2926388
11603B926388k921825j485264j47427q3010J43405J438898J993256J81455k066833
11594b0957j472804J562690K858704k8485m330439n371892k061137K238749L611462
11585c014109J189778k685799m671594k831954J873352N881670N678429J259221
11577B678994l270194l690836m22720J994070O55733k195035k790741j095626
11569h136355K07407O24217J887751L292043J627434k773369m524581p25551L852841
11560d668163L167586j392359l359375m64126L228638L733511J351364j368375
11552B28701k208325j21415L233298L673929k64849l753995j742731L035680L807654
11543E887947L39023j237076P74673J020595k699662m764070j392121K286707
$$ plain form
11603 2926388 4563 -1480701 -1628128 -1711138 -1567733 -128835 1864421 2045876 -20957
11594 -20957 -1493761 68929 2927633 2899148 -1431291 -6803183 -8864320 -6625571 -3014109
11585 -3014109 -1824331 -4510130 -9181724 -12013678 -10140326 -4258656 1419773 2678994
11577 2678994 -591200 -4282036 -4704756 -2710686 -2054953 -4249988 -7040729 -8136355
11569 -8136355 -7928948 -7304731 -5416980 -2124937 -497503 -3270872 -7795453 -8521004 -4668163
11560 -4668163 -1500577 -2892936 -6252311 -6716437 -3487799 245712 1597076 228701
11552 228701 -1979624 -2101039 1132259 4806188 4541339 787344 -955387 2080293 5887947
11543 5887947 6226970 4989894 5764567 6785162 4085500 -678570 -2070691 216016
11535B16016O08368k996561j618837L813447N953806J783162m351890p477838
11527d070327o427973k238749K944429N638058M099075J490718K004541M249488
11519G689260K964921k515316o342779m299467K24804J183569j841283l685368
11511f621659j133132K817946L415244Q42555j88277K579129N449032M083529
11503A1244367k72384l027061k866881k108929j547295K20796K403581K070880
11495F117074n31445j612475L5886J431332J135925J211847J930431N86444k247797
11486H057222j978601J475875J752690l044644n334687j64911N238821K284071
11478H285836m972788o371709j529307J480392M60559R48495M425865N420619
$$ plain form
11535 216016 824384 -2172177 -3791014 22433 5976239 7759401 3407511 -4070327
11527 -4070327 -10498300 -12737049 -9792620 -4154562 -55487 1435231 3439772 7689260
11519 7689260 10654181 8138865 1796086 -2503381 -2278577 -1095008 -2936291 -6621659
11511 -6621659 -7754791 -4936845 -1521601 -679046 -867323 1711806 7160838 11244367
11503 11244367 10971983 7944922 5078041 2969112 1421817 1642613 4046194 6117074
11495 6117074 5585629 3973154 4009040 5440372 6576297 7788144 9718575 10305019 8057222
11486 8057222 6078621 7554496 9307186 6262542 927855 762944 6001765 8285836
11478 8285836 3313048 -3058661 -4587968 -3107576 -2647017 -1698522 2727343 8147962
11470H147962J719429j787760j597319o6314N88192J473313K249132K05661l712646
11461G219650m555487j221854J546964Q58738r84988k336920m304950n253753
11453i032600j273718N089836N345333j417979m617022J850993Q529430M330428
11445H804701n531208o930977J641795P250683K286041n279636m946977J793374
11437i12204N633066K712009k222568l566369r67462J978490K172070k70896k559026
11428A997110k387896n59420M30498R2026K43883J352318J252087r73584k382556
11419i35534j99178L220714L031523r52381l690116k319533j32191r21135k962504
11410e860335k249802Q61086K635504K001521Q39455q14417m347886p257356m406283
$$ plain form
11470 8147962 9867391 8079631 6482312 6415998 7004190 8477503 10726635 10932296 7219650
11461 7219650 2664163 1442309 2989273 3848011 2863023 526103 -3778847 -9032600
11453 -9032600 -10306318 -5216482 128851 -1289128 -5906150 -4055157 4474273 8804701
11445 8804701 3273493 -3657484 -2015689 5234994 7521035 2241399 -2705578 -912204
11437 -912204 4720862 7432871 5210303 1643934 676472 2654962 4827032 4556136 1997110
11428 1997110 -390786 -950206 -519708 -427682 -183799 1168519 2420606 1447022 -935534
11419 -935534 -1134712 2086002 5117525 4165144 475028 -1844505 -1976696 -2897831 -5860335
11410 -5860335 -8110137 -7249051 -4613547 -2612026 -1772571 -2586988 -6934874 -14192230 -18598513
11401a8598513L580167Q929275O729391J272847j145934q64826j634394k941411
11393d673398j357580K729189N131030L671454L6658l066908l576385q64851K255647
11384B84856J225593l357334m493828J180395O738897M619825j335245j766690
11376C096469L088771L916422k397096p864815n858058J85209L878556M261978
11368B307436K938215n77536n449542o555775q32331O412661P067614Q29187m438160
11359A701769k996631J901751L052004r03210l684226k57425N301034M858823
11351H973889j700960n511042j722441L265120K214975j773382j679536J175971
11343C242594N05804k802593k369199J309965J127571l490559m630869N41761
$$ plain form
11401 -18598513 -15018346 -6089071 640320 1913167 767233 -97593 -1731987 -4673398
11393 -4673398 -6030978 -3301789 1829241 5500695 5537353 2470445 -1105940 -1970791 284856
11384 284856 1510449 -1846885 -6340713 -5160318 1578579 6198404 4863159 3096469
11376 3096469 6185240 10101662 7704566 -160249 -6018307 -5833098 -1954542 2307436
11368 2307436 5245651 4668115 -781427 -7337202 -8169533 -1756872 5310742 6139929 1701769
11359 1701769 -1294862 606889 3658893 2755683 -928543 -1185968 4115066 8973889
11351 8973889 7272929 1761887 39446 3304566 5519541 3746159 2066623 3242594
11343 3242594 3748398 945805 -1423394 -113429 1014142 -2476417 -7107286 -6565525
11335f565525M612330K243603j682850j283301J179631J121620l08581j6089Q30121
11326A30959P7050o79935K17246M91226j588379k951571o17686L005256L972892
11317B057058K317318O8793k241530l708200k172767J249165J602262k167354
11309b995255m115101k65411M689701M727450J413636j90662J35459k79803p23151
11300B396863P45105J965124j73189l596280l819013r08615J389508J553191Q48342
11291D01036J61420J53990J844213L626253J631400l284750m203908J319079N455519
11282G104252J528412m800621m396803N09195Q42016l395241l504025K386256
11274c726559N881478K168227l036299l580435j158783L20734J153336K422935
$$ plain form
11335 -6565525 -1953195 290408 -1392442 -2675743 -1496112 -374492 -683073 -699162 130959
11326 130959 208009 -471926 -254680 236546 -1351833 -4303404 -4921090 -1915834 2057058
11317 2057058 4374376 4443169 2201639 -1506561 -3679328 -2430163 -827901 -2995255
11309 -2995255 -7110356 -7375767 -2686066 2041384 3455020 3264358 3399817 3120014 2396863
11300 2396863 3141968 5107092 4933903 1337623 -2481390 -3390005 -2000497 -447306 401036
11291 401036 562456 716446 2560659 6186912 7818312 4533562 329654 1648733 7104252
11282 7104252 8632664 3832043 -564760 -55565 786451 -2608790 -6112815 -3726559
11274 -3726559 2154919 4323146 1286847 -2293588 -3452371 -3131637 -1978301 444634
11266D44634K365836K53000j177879o20470p22223k653329l188836o13654J410572
11257d502349j51818k343901j298176J215949J227109n58743n75493J003816R31399
11248e052207p28589j91832L543756O326816M560306o6320l421165l946221k766169
11239a741625q57394J279078K264792R36824j439587k465801k002257j637265
11231e663235r22342K055917N511459M291476j789598n089591o98467M732013
11223B427632K142224n114055n289717L276353Q474472K428251o747625p291112
11215e693577p7443N075591L951707P27285o03200j28853J170654K458754J812683
11206H693601j304622l631947k237335Q01371J708697N29562p10720k271024m332292
$$ plain form
11266 444634 2810470 3063470 1885591 1265121 542898 -2110431 -5299267 -5912921 -4502349
11257 -4502349 -4654167 -6998068 -8296244 -7080295 -5853186 -6411929 -6987422 -5983606 -5052207
11248 -5052207 -5780796 -5972628 -2428872 3897944 8458250 8391930 4970765 1024544 -1741625
11239 -1741625 -2599019 -1319941 944851 1881675 442088 -2023713 -4025970 -5663235
11231 -5663235 -6585577 -4529660 981799 5273275 3483677 -1605914 -2304381 2427632
11223 2427632 4569856 -544199 -5833916 -2557563 5916909 8345160 1597535 -5693577
11215 -5693577 -5771020 -695429 3256278 3983563 3380363 3251510 4422164 6880918 8693601
11206 8693601 7388979 3757032 1519697 2321068 4029765 4559327 3848607 1577583 -2754709
11197b754709l628841J748001O800393N197078j372989n591211m772054k422957
11189f797289p08878J796495M747161M837231J273543k369815k891146o33322
11181g46020K022615K354235j121654n538334m881479J446794N054063k66956
11173a676736p602642n619351M186278Q946870L113846m542552m993617p07773
11165h895677R81185j075744k660511j298078J860863M319135L861684M79319
11157b427824k503652k196683l73208R1013J018405M978107P658545K879279n485245
11148C638737o841836k72867L501033m42560l635752L99118M887666K381601j688355
11139A926785J078585O472599M374378l887817p486593l214605J239009J016797
$$ plain form
11197 -2754709 -6383550 -4635549 2164844 7361922 5988933 397722 -4374332 -6797289
11189 -6797289 -7506167 -5709672 -962511 3874720 5148263 2778448 -112698 -746020
11181 -746020 1276595 3630830 2509176 -3029158 -7910637 -6463843 -1409780 -1676736
11173 -1676736 -9279378 -14898729 -10712451 -1765581 1348265 -3194287 -8187904 -8895677
11165 -8895677 -7914492 -8990236 -11650747 -12948825 -11087962 -6768827 -2907143 -2427824
11157 -2427824 -4931476 -7128159 -7501367 -7410354 -6391949 -1413842 6244703 9123982 3638737
11148 3638737 -3203099 -3475966 25067 -417493 -4053245 -3654127 1233539 3615140 1926785
11139 1926785 3005370 9477969 13852347 9964530 2477937 -736668 502341 1519138
11131A519138J45091K055715L466042J039391k835213m227458k649513K49373
11123a237434K631452K090527k051303n457217k901848L636110O577427L455617
11115F743331n8697L32209J407589j042165n302846p348459o509657l542174K057516
11106a3263353Q147781Q379600P49164o370978m184870L316429M597019k049791
11098f78999n951294o06413O681141O536946J039568j572608k38295o45820m078038
11089D86188n340667k041316J572166J919932J013127J289144Q60684k183008
11081b423750m687047k314859L437348O370862L348654k133201m396443j671808
11073d470244K702656M301159K443945N50367J149105K035395k38114m273175
$$ plain form
11131 1519138 1664229 3719944 7185986 8225377 5390164 1162706 -1486807 -1237434
11123 -1237434 1394018 3484545 1433242 -4023975 -6925823 -3289713 3287714 6743331
11115 6743331 6684634 7016843 8424432 7382267 2079421 -5269038 -11778695 -15320869 -13263353
11106 -13263353 -5115572 3264028 4013192 -2357786 -6542656 -3226227 1370792 -678999
11098 -678999 -6630293 -7236706 -555565 5981381 7020949 5448341 5210046 4564226 486188
11089 486188 -4854479 -6895795 -5323629 -3403697 -2390570 -1101426 -240742 -2423750
11081 -2423750 -7110797 -9425656 -5988308 382554 3731208 1598007 -2798436 -4470244
11073 -4470244 -1767588 2533571 4977516 5527883 6676988 8712383 8474269 4201094
11065D201094n203360k195831N1354j312288l051177j502989J735717L118860
11057d158620K617983K192211J711879J81288j350810j576249j336411j175181
11049b893910O25283M162999N438848J973005k382170l010405j609820k192812
11041A11018l290046r10276L127937L404222K42539q48573J283912K272504Q89044
11032F282281O46897J495936j374894p544975q764913j239812O836024O258730
11024B595274l41618l504589p08791K204166J352882n07517Q7703K090673K195388
11015E463571o92791m394987n466848k314718K680205N017728L096045L2771o24465
11006B796511Q19063J706546Q77562q86886k594274l311732k295389o32622q78601
$$ plain form
11065 4201094 -1002266 -3198097 -3146743 -4459031 -7510208 -9013197 -7277480 -4158620
11057 -4158620 -1540637 651574 2363453 2544741 1193931 -382318 -1718729 -2893910
11049 -2893910 -2268627 1894372 7333220 9306225 6924055 3913650 2303830 111018
11041 111018 -3179028 -4089304 -961367 2442855 2685394 1836821 3120733 5393237 6282281
11032 6282281 6929178 8425114 7050220 -494755 -9259668 -10499480 -3663456 2595274
11024 2595274 2253656 -1250933 -1959724 244442 1597324 1089807 1177510 3268183 5463571
11015 5463571 4770780 375793 -5091055 -7405773 -4725568 292160 3388205 3420976 2796511
11006 2796511 3615574 5322120 6199682 5312796 2718522 -593210 -2888599 -3521221 -4399822
10997d399822l024667l088843J322259O041463M981492j031743m550919j408116
10989e158896L830818M511519O78954k222716j512508J43908K59467K89888J971507
10980B791941L392521J995123p61226j622788j044116j991330l790567k453016
10972c483458J962424L852188M33913l449311k566942J023293K127337P30049
10964F29493P93643K900833L478823O00386l738451o611971o212925k233453K688384
10955g705238L911482N51185k292208q19281J445174n9530k486866l61500M192232
10946c624550M304239n8796k185556j19820R53030j124471j972603L20183J389173
10937b119171p84394j668266J062315K311552j521000n368404l503746J144638
$$ plain form
10997 -4399822 -7424489 -10513332 -9191073 -3149610 1831882 800139 -3750780 -5158896
10989 -5158896 -1328078 3183441 3862395 1639679 127171 271079 530546 820434 2791941
10980 2791941 6184462 8179585 7418359 5795571 4751455 2760125 -1030442 -3483458
10972 -3483458 -1521034 2331154 2765067 -684244 -3251186 -2227893 -100556 629493
10964 629493 1423136 4323969 7802792 8403178 4664727 -1947244 -8160169 -10393622 -7705238
10955 -7705238 -3793756 -3242571 -5534779 -6354060 -4908886 -4968416 -7455282 -7816782 -3624550
10946 -3624550 679689 620893 -1564663 -1684483 -731453 -1855924 -3828527 -3508344 -2119171
10937 -2119171 -2903565 -4571831 -3509516 -1197964 -2718964 -8087368 -11591114 -10446476
10929a0446476K459570J060033J487088L139095J763376j902985k431698J500327
10921c371670M867979L755419K28541j535831m42042J535304K220105J082173
10913H339978n65354j027550m17509m03133j191297q16453J204958J985493n66611
10904F542522l750064l294378O46441L833523L736345J982074Q37706N530j870277
10895H669422m208914m679896k129770J754366M085573L560956J143121j393415
10887F801443k563932j510950Q47401J380550j798689n384986m106359J295559
10879e039963M081813J578749m65107K389408N135345J406137n208637o295376
10871b417631j895489O47973m67327J38886L553119L800306r55241m059577j362454
$$ plain form
10929 -10446476 -7986906 -6926873 -5439785 -2300690 -537314 -2440299 -4871997 -3371670
10921 -3371670 1496309 5251728 5480269 3944438 3502396 5037700 7257805 8339978
10913 8339978 7774624 6747074 6329565 5926432 4735135 3918682 5123640 7109133 6542522
10904 6542522 2792458 -501920 144521 3978044 7714389 9696463 10534169 10539699 8669422
10895 8669422 4460508 -219388 -2349158 -594792 3490781 7051737 8194858 6801443
10887 6801443 4237511 2726561 3573962 4954512 3155823 -2229163 -6335522 -5039963
10879 -5039963 -958150 620599 155492 2544900 7680245 9086382 3877745 -2417631
10871 -2417631 -4313120 -3665147 -4132474 -3993588 -440469 3359837 2404596 -1654981 -3017435
10862c017435J943842P26468j331018J139207N135480L738731k713208o759918
10854a137851m037792J733179L994760N73917m377633m580744J376105P491087
10846A035028P167987J877690j018482J095508K943558L2158m983973p097771
10838A051703n512795k543959K73105K144358K033353J19161j793233k395683
10830f623990j429381J418223N112669N909302J653916l615542m213819p55969
10822b544591J730997J835795J558662K88519l175743m620764K83694O235325
10814A591894M438912k540368m189801j5035R8576n052224m692842L663972P469190
10805G72274N03865n242005J50422P303466L946716m372946n197117k62339N65415
$$ plain form
10862 -3017435 -1073593 -347125 -1678143 -538936 4596544 8335275 5622067 -1137851
10854 -1137851 -5175643 -3442464 552296 1126213 -3251420 -7832164 -6456059 1035028
10846 1035028 8203015 10080705 9062223 10157731 13101289 13133447 8149474 1051703
10838 1051703 -4461092 -7005051 -6731946 -4587588 -2554235 -2435074 -4228307 -6623990
10830 -6623990 -8053371 -6635148 -1522479 4386823 6040739 2425197 -1788622 -2544591
10822 -2544591 -813594 1022201 2580863 2869382 -306361 -4927125 -4643431 1591894
10814 1591894 6030806 3490438 -699363 -714398 -615822 -5668046 -10360888 -6696916 772274
10805 772274 1276139 -3965866 -3815444 3488022 7434738 3061792 -2135325 -2397664 -1832249
10796a832249j670219J120132O771261O015022m10781l275791j283585j344969
10788D088821l984078k889774J496471J927582j765354k156444J508451J832196
10780E7871k181496k394934L410040O461620J820544l151989j260545L266440
10772F027551K946632j053095k382681J80963K324818J253988j583380l376762
10764D338034k894620j398773j138037j982514j188286J600974K500769R508r83281
10755a136226K757006N601367J470420m867615m360054J546330L394559n31717
10747C874070k392378J000047L623970J850640k12159J9285q71745l809251l818787
10738g36308N42267L281584J199913n55111J730133L534154J149419o59893K514767
$$ plain form
10796 -1832249 -3502468 -2382336 4388925 10403947 9993166 6717375 5433790 4088821
10788 4088821 104743 -2785031 -1288560 639022 -1126332 -3282776 -1774325 57871
10780 57871 -2123625 -4518559 -1108519 5353101 7173645 4021656 2761111 6027551
10772 6027551 8974183 7921088 5538407 5719370 8044188 9298176 7714796 4338034
10764 4338034 1443414 44641 -1093396 -3075910 -4264196 -2663222 -162453 -152945 -1136226
10755 -1136226 1620780 7222147 8692567 3824952 -535102 1011228 4405787 3874070
10747 3874070 1481692 2481739 6105709 7956349 7744190 7763475 6891730 3082479 -736308
10738 -736308 -194041 3087543 4287456 3732345 5462478 8996632 10146051 9486158 12000925
10729A2000925N356734R89396o710961q173847k373655K895561L476870K881845
10721A0342868L430032J598900m545586r308689n996405K888663P293091K091853
10713G794727o055440p148531p10728M425362K878448o29278K8322K788727J986958
10704E358567j465497j606303K423735M850178K218640k240208m356945l994676
10696A187491k884793j810529j237620j248054l38800K342559M044775J876840
10688A931869j574757j344766J663911J806753j500352k230952J928928M921145
10680E601779K016231k121528q25766L666551L643508j831364n269064k038989
10672B841358K949447L007980l62798n14643L091933L220782l604982r969258
$$ plain form
10729 12000925 17357659 18347055 11636094 3462247 1088592 3984153 7461023 10342868
10721 10342868 13772900 15371800 10826214 1517525 -4478880 -1590217 5702874 7794727
10713 7794727 1739287 -5409244 -6119972 -1694610 1183838 554560 582882 3371609 5358567
10704 5358567 3893070 2286767 4710502 9560680 11779320 9539112 5182167 1187491
10696 1187491 -1697302 -3507831 -4745451 -5993505 -6332305 -3989746 55029 1931869
10688 1931869 357112 -987654 676257 2483010 982658 -1248294 680634 5601779
10680 5601779 7618010 5496482 4670716 8337267 11980775 10149411 4880347 2841358
10672 2841358 5790805 8798785 8435987 7921344 11013277 14234059 10629077 659819
10664F59819p362994Q68976L948257m14122l287530Q91165N935838M479677o05914
10655E113172j650024K182387N177994L674413j027391n660215o784628k782218
10647a756510K577665K798036j975816l964672J09168L212271r1988l969153j538694
10638d599693K735345R86286l775580k823401K985186N069411J968689M15225
10630B961468K321020K200021j649562l908327j955097L78022P94451J965467
10622C107463M672202M922341O19796m684939o780716m982683o77007L809821
10614F278M955604J194952l972341n882548m441388k444513q19355M86736L48206
10605a0568369n05720J410265N706788O138449N35539l936586j852734J663594
$$ plain form
10664 659819 -6703175 -5834199 -1885942 -2300064 -5587594 -4696429 1239409 5719086 5113172
10655 5113172 3463148 5645535 10823529 14497942 13470551 7810336 1025708 -1756510
10647 -1756510 821155 3619191 1643375 -2321297 -2212129 1000142 908154 -3060999 -4599693
10638 -4599693 -1864348 -878062 -4653642 -7477043 -4491857 577554 2546243 2961468
10630 2961468 5282488 7482509 5832947 1924620 -30477 347545 1141996 3107463
10622 3107463 7779665 12702006 13321802 8636863 1856147 -3126536 -3803543 6278
10614 6278 4961882 6156834 2184493 -3698055 -8139443 -10583956 -11403311 -10916575 -10568369
10605 -10568369 -11074089 -9663824 -3957036 2181413 2716952 -1219634 -3072368 -1408774
10597a408774Q83105j87059L070942N174372O11908l688883N40999O838041M070979
10588A5905630l878344m923552r1517l63176n636111n317727J347122L882963
10580I25288K6374j057135L280560M793874M87981k649940j915302k818474n891505
10571d818279m297417K242694N269846K377311N33559K042607J027680l363577
10563A014424m099062K85304K562710J02010j215683J277137L334563L209918
10555F471321L233016K178516k138759m703473o64573K965668k099727q264494
10547c022505l246034O873316O415660k639745n149594q60431k522009q220320
10539a2371662l581752Q124250P691283n108108q528260L490756J0944829L287423
$$ plain form
10597 -1408774 -525669 -712728 2358214 7532586 8144494 4455611 4996610 11834651 15905630
10588 15905630 12027286 7103734 7012217 6649041 1012930 -4304797 -2957675 925288
10580 925288 951662 -105473 3175087 7968961 8456942 5807002 3891700 1073226 -4818279
10571 -4818279 -9115696 -6873002 -1603156 774155 1307714 3350321 4378001 1014424
10563 1014424 -3084638 -2799334 -236624 -134614 -1350297 -73160 3261403 6471321
10555 6471321 9704337 11882853 9744094 5040621 4376048 7341716 5241989 -3022505
10547 -3022505 -6268539 604777 7020437 4380692 -768902 -1629333 -4151342 -12371662
10539 -12371662 -15953414 -7829164 -137881 -5245989 -13774249 -10283493 661336 3948759
10531C948759m301466n07646M471007K235158M62560K752044J19186p128939n327343
10522c276680N298150O839617l716379p315566K391129P984242J874414j495462
10514H583465K775699P48430p650286l847753J0328632R285467q462130j3273200
10506a511676J196073N616790p061422o309856J3188495J4602304r169857j3889699
10498c338848J2675443J9950891j0526013k1679254J1942205K4719028j7073169
10491A6670283l2688344K5748007M3174275q8265308k41527811j89024290N4003393
10484d11909795K20141313J55711641P168150l0376691K2821135L4729379q166252
10477i881120k1392768Q389161J8640408k950773r019823Q243437R300385r624145
$$ plain form
10531 3948759 -352707 -860353 3610654 5845812 6308372 9060416 9179602 2050663 -3276680
10522 -3276680 2021470 8861087 5144708 -2170858 220271 8204513 10078927 8583465
10514 8583465 11359164 12107594 4457308 609555 10938187 20223654 11761524 -1511676
10506 -1511676 -315603 5301187 -1760235 -8070091 5118404 19720708 10550851 -3338848
10498 -3338848 9336595 29287486 18761473 -2917781 9024424 33743452 16670283
10491 16670283 -16018061 9729946 52904221 -35361087 -276888898 -465913188 -411909795
10484 -411909795 -191768482 -36056841 -28888691 -59265382 -36444247 -1714868 -9881120
10477 -9881120 -31273888 -22884727 -4244319 -7195092 -16214915 -7971478 1328907 -8295238
10469h295238j1498290P259023J1955936k951721p873898K049928J991188q678241
10461a6041313m855380J1601310J1833897n442218j0505855K989495Q933720j196986
10453b683330n813967K554895M642701n224583p330180M605371J0678420J975485
10445C404812m354554J451778N573541n80722n236733j411852M30136m162651
10437d886245l633910N425387Q974381J099574m563684L72366N061530Q73046
10429H722445m206515l300756k949399o963835o603822K177719Q672133N243700
10421G91670k07004N66475L044756J377403p31022L77635K89442l585903n537430
10412c613978k237996R45152M25051K81594K308615J417155l635911n966662k356732
$$ plain form
10469 -8295238 -19793528 -12534505 -578569 -3530290 -11404188 -9354260 -7363072 -16041313
10461 -16041313 -20896693 -9295383 2538514 -2903704 -13409559 -10420064 -1486344 -2683330
10453 -2683330 -8497297 -5942402 -1299701 -6524284 -13854464 -9249093 1429327 3404812
10445 3404812 -949742 502036 6075577 5494855 258122 -1153730 -723594 -4886245
10437 -4886245 -8520155 -3094768 5879613 6979187 2415503 2787869 7849399 8722445
10429 8722445 4515930 1215174 -1734225 -8698060 -15301882 -13124163 -4452030 791670
10421 791670 584666 1151141 4195897 5573300 4842278 5219913 5509355 1923452 -3613978
10412 -3613978 -5851974 -4906822 -4481771 -4200177 -1891562 -474407 -4110318 -10076980 -12433712
10403a2433712J187287N50684j48873K070238L522009K143664J544384K763992
10395A199673J639105j982627k200991K100110M045827K52045l614384k596411
10387a157653N21927J368927j08466k197534l340707j079797M157406N831312
10379C995415Q557n732771k415204M848725M251269k749606m003876J898439L431085
10370C532033l116570p445580l710144N95915l15161j089321K644944N650372
10362c253512L470071J94828l84360r76612k759369j549776K848457L758529r12906
10353D35350m373283k637185l03831m15969P05711M027738M223345L24514j061000
10344I25390K006548K712455j368467l090490N49908K046499k328485m460719
$$ plain form
10403 -12433712 -11246425 -10695741 -10844614 -8774376 -5252367 -3108703 -1564319 1199673
10395 1199673 2838778 856151 -1344840 755270 4801097 5053142 1438758 -1157653
10387 -1157653 -635726 733201 624735 -1572799 -4913506 -5993303 -1835897 3995415
10379 3995415 4003972 -1728799 -4144003 704722 4955991 2206385 -1797491 100948 3532033
10370 3532033 415463 -7030117 -10740261 -10144346 -10459507 -11548828 -8903884 -3253512
10362 -3253512 216559 411387 27027 -949585 -3708954 -5258730 -2410273 1348256 435350
10353 435350 -3937933 -6575118 -6878949 -7294918 -6589207 -2561469 1661876 1986390 925390
10344 925390 2931938 5644393 4275926 1185436 1735344 3781843 1453358 -3007361
10336c007361R74280N828572K192042m049442l974613m47044j071196m343102
10328g897864l993736o70379J245813K794046O342317P583113J830189n741034
10320A492465o010130O38258N495701M082987j63744l043083l554324j845414
10312b907284J183231L025819K199391L03587j004382k289122l509645k830429
10304e828834n44176J40365j575185k559463j275683L94485K042721N065896O981193
10295B841319L218817l561178m737637Q91875M414928J221654j968743K75726
10287B596761K647144o64722n343536m631755k13928K365389K632999K424410
10279A812762N74109k926428l827627q39308Q67939r80666j043571K895099M004982
$$ plain form
10336 -3007361 -2033081 3795491 5987533 1938091 -2036522 -2483566 -3554762 -7897864
10328 -7897864 -11891600 -12561979 -11316166 -8522120 -2179803 5403310 7233499 1492465
10320 1492465 -4517665 -3879407 1616294 5699281 5535537 2492454 -1061870 -2907284
10312 -2907284 -1724053 1301766 3501157 3804744 2800362 511240 -2998405 -5828834
10304 -5828834 -6373010 -6232645 -7807830 -10367293 -11642976 -11248491 -9205770 -4139874 2841319
10295 2841319 6060136 2498958 -2238679 -1346804 3068124 4289778 2321035 2596761
10287 2596761 5243905 4579183 -764353 -5396108 -5610036 -3244647 -611648 1812762
10279 1812762 2386871 -539557 -4367184 -5206492 -4338553 -5319219 -6362790 -3467691 537291
10270E37291j080550l976954J564446P394284M171260k277310j231357L955742
10262I056852K269997m924631o200460O8088L581675k40586m513290m095162k014444
10253g011961o33635K261153N855743M894042r99245n095483l393266P24917L465074
10244F7339M900845M758667J358349l370687m643525k253351q51601j738248j245286
10235c017498J395313J858836j273533l051782J03428M586728M852854O25104
10227F079450l691304m093604k60273M022628L976081l17444k993824m44135K905204
10218E182779J552335k077476k216637p532q35369l561533j925855L665798N443948
10209E220458O74631m210811m077825j475788j0302R13882J794588P24668j510678
$$ plain form
10270 537291 -543259 -4520213 -2955767 4438517 8609777 6332467 5101110 9056852
10262 9056852 11326849 6402218 201758 269846 3851521 3610935 -902355 -4997517 -7011961
10253 -7011961 -7645596 -5384443 471300 5365342 4366097 -729386 -4122652 -3397735 67339
10244 67339 4968184 9726851 11085200 7714513 3070988 817637 -33964 -1772212 -3017498
10235 -3017498 -1622185 236651 -1036882 -4088664 -3985236 601492 5454346 6079450
10227 6079450 2388146 -1705458 -1965731 2056897 6032978 5715534 2721710 2277575 5182779
10218 5182779 6735114 4657638 2441001 2433469 1598100 -1963433 -3889288 -223490 5220458
10209 5220458 5895089 1684278 -2393547 -3869335 -3879637 -2965755 -1171167 -446499 -1957177
10200a957177p91218K938982M355047J710214j09J803074K379840j614120n470110
10191C354423l892804O91760K781305J800144L11680j155284k555747k032429
10183f96952J62729Q7844k921606l028009K818816P878919M934576k058684l751336
10174C426297M66390K806066j05083l435626l236464j470009p27373n14207l41274
10165c131283q64361o50329K689967O825369N954321k03869m382023j821143K802469
10156G219118K591873j640255l691845j601399M97750l70138j736449j03494L349531
10147D514692L876261o18751o261755p208768k561264K471968L147345Q09972
10139a830300k45036N38863L09943j155479p06525K179263L540591J007146k593828
$$ plain form
10200 -1957177 -2748395 190587 4545634 6255848 6255739 8058813 10438653 8824533 3354423
10191 3354423 -538381 153379 2934684 4734828 5046508 3891224 1335477 -696952
10183 -696952 -534223 -446379 -3367985 -6395994 -3577178 4301741 9236317 7177633 3426297
10174 3426297 3892687 6698753 6593670 3158044 -78420 -1548429 -2275802 -2790009 -3131283
10165 -3131283 -3995644 -4645973 -1956006 4869363 10823684 10619815 6237792 4416649 7219118
10156 7219118 9810991 8170736 4478891 2877492 3375242 3005104 1268655 1165161 4514692
10147 4514692 8390953 7772202 1510447 -5698321 -8259585 -5787617 -2640272 -1830300
10139 -1830300 -2075336 -1536473 -1226530 -2382009 -3088534 -909271 2631320 3638466 1044638
10130A044638l972723l424038j656973K366661O774733N510516k687700r027374
10122e072260n645181K181250L520403j448180k671353K603387N747805K104817
10114A320688j384416Q87834L356528k9011m314938k154536K933801K321537l231914
10105b94427n336519j746253J546979R89492p11439j207437j082828j00942J965652
10096e977722J846059k433020n190500l85471O690785N760780j411396k995592
10088d096077K969437M886968k095951o824005r66404O339171L596233m382321
10080e72949n873641j784641j352211m001522r92115O977768R067534K365571
10072C833794l149942j200658J632500j079332m246639q53429N114261M770455
$$ plain form
10130 1044638 -2928085 -6352123 -8009096 -5642435 1132298 6642814 3955114 -5072260
10122 -5072260 -10717441 -8536191 -5015788 -6463968 -9135321 -6531934 -784129 1320688
10114 1320688 -63728 824106 4180634 4151623 -163315 -2317851 615950 2937487 -294427
10105 -294427 -5630946 -7377199 -5830220 -4840728 -5552167 -6759604 -7842432 -7943374 -5977722
10096 -5977722 -4131663 -6564683 -11755183 -12140654 -5449869 310911 -1100485 -4096077
10088 -4096077 -1126640 3760328 1664377 -5159628 -6126032 213139 3809372 -572949
10080 -572949 -6446590 -8231231 -9583442 -13584964 -14577079 -7599311 1468223 3833794
10072 3833794 683852 -516806 1115694 36362 -4210277 -5063706 50555 4821010
10064D821010j194154l674458N40494M393130K112172k066968r81192M237785
10056H187819N809558P58679n131145o020049l479832k043663j577062Q31915
10048b663780M010190L763396k9679l115324l464425k606640p56881K929732N332205
10039C398794K259217k882284k059044L945626N081896j466506n504262o51919
10031B121518M531344J375592l668123o84404N692210M291591k854260m495086
10023F310382k34667j59198n335808n441140K020402O155201J090870m528147
10015a22105k951573P72773K13412p07185L213753P196522M563151j144205k275777
10006H758766K62362L37019j787016j145948J396481K20760m332663n448039r30913
$$ plain form
10064 4821010 3626856 -47602 492892 4886022 6998194 4931226 3950034 8187819
10056 8187819 13997377 14756056 9624911 3604862 125030 -1918633 -3495695 -2663780
10048 -2663780 1346410 5109806 5080127 1964803 -1499622 -4106262 -4863143 -1933411 3398794
10039 3398794 5658011 2775727 716683 4662309 9744205 8277699 2773437 2121518
10031 2121518 6652862 8028454 4360331 3675927 9368137 13659728 10805468 6310382
10023 6310382 6075715 5916517 580709 -4860431 -2840029 3315172 4406042 -122105
10015 -122105 -3073678 -2300905 -2087493 -2794678 419075 7615597 12178748 11034543 8758766
10006 8758766 9021128 9358147 7571131 6425183 7821664 8042424 3709761 -1738278 -2669191
9997b669191K935243R00589l817637m701071p08577L296380L222495L44743r79991
9988b177017R36183L131003K492089L41978k3817J184992J169446l2696n3112
9979F969049J45813k804440p246264o800047m16466M715861L783383J099279J651198
9970A097366K613119l87515m117195k444763L344564O336030M025010Q7488k337525
9961H216579l237153k776891j076418l8354j031863k097346j218941m6371m31244
9952c738002m81226J311884J840800j044908k784860J076401N975547M414733
9944F570369j848796m633194k334473m81652n81291R80361K947073l30051o635011
9935f346665o116130K275287O509383l071o843541k560813P154423Q542193O67957
$$ plain form
9997 -2669191 266052 1166641 -2650996 -7352067 -8060644 -4764264 -1541769 -1197026 -2177017
9988 -2177017 -1240834 1890169 4382258 4724236 4700419 5885411 7054857 7022161 6969049
9979 6969049 7114862 4310422 -2935842 -9735889 -10152355 -5436494 -1653111 -553832 1097366
9970 1097366 3710485 3322970 -794225 -3238988 105576 6441606 10466616 10554104 8216579
9961 8216579 4979426 2202535 1126117 1087763 55900 -2041446 -3260387 -3306758 -3738002
9952 -3738002 -4219228 -2907344 -1066544 -2111452 -4896312 -3819911 2155636 6570369
9944 6570369 4721573 88379 -2246094 -2727746 -3309037 -2328676 618397 288346 -6346665
9935 -6346665 -12462795 -10187508 -3678125 -3681196 -10524737 -13085550 -5931127 2611066 3279023
9926C279023m980690k712110J490167K182937J809601L392453M392996J789798
9918A0644175k426211m499026l794988j697528J132449L835356M190451Q45917
9910H230595m485254q311387p935969k868891M315575Q522267O230568p5501l835986
9901b13983j788329K637859M299466K380924k98921j948700k952134l134416j077478
9892b095712K824653N017572K731428j752895l392178r81955J374564M82537j398669
9883B809345q57450O46132o01126l503748l194044P00525K584297n17474m349851
9874f283394m386244k243453j032825P69074N014678P358890K491492n809035
9866d120817p756383j218459N080543M152229k76413j211958R70905J031368j583588
$$ plain form
9926 3279023 -1701667 -4413777 -2923610 -740673 1068928 4461381 8854377 10644175
9918 10644175 8217964 3718938 -76050 -1773578 -641129 3194227 7384678 8230595
9910 8230595 3745341 -4566046 -12502015 -15370906 -11055331 -2533064 3697504 3622003 -213983
9901 -213983 -2002312 635547 4935013 7315937 7017016 5068316 2116182 -1018234 -2095712
9892 -2095712 728941 5746513 8477941 6725046 3332868 2350913 3725477 4208014 2809345
9883 2809345 1951895 2598027 1996901 -1506847 -4700891 -4000366 -1416069 -1933543 -6283394
9874 -6283394 -10669638 -12913091 -13945916 -13176842 -8162164 -803274 1688218 -4120817
9866 -4120817 -11877200 -13095659 -8015116 -3862887 -4139300 -5351258 -4380353 -3348985 -4932573
9857d932573k210623Q79257L691033K982796Q54437N19964J052563j87832k055438
9848E93584r73771K445943K850870j863418o106948l890929K289251M814934J716634
9839A876150j615207j419793p4483j29404j9725J345275J419813p49871j484731
9830h51976R54327K186282o39940k679744M59428L962874J584313k752360j291509
9821I31695L392944K456248l043049l334654K475787M187278j401920m722713
9813I41616j075665N93038n082200p907180Q07146J1166267R235117m20930k983135
9804E274074K057374K288999m394541o413365J24185M176872q05021n573720j283581
9795d548724N683291N140459k33621p51602L989238N689209J151669m224929n891567
$$ plain form
9857 -4932573 -7143196 -6263939 -2572906 409890 1264327 1784291 2836854 2649022 593584
9848 593584 -380187 2065756 4916626 3053208 -3053740 -6944669 -4655418 159516 1876150
9839 1876150 260943 -1158850 -1233333 -1362737 -1382462 -37187 1382626 632755 -851976
9830 -851976 102351 2288633 1648693 -1031051 -571623 3391251 4975564 2223204 931695
9821 931695 4324639 6780887 3737838 403184 2878971 7066249 5664329 941616
9813 941616 -134049 458989 -4623211 -12530391 -11723245 -556978 8678139 8257209 5274074
9804 5274074 7331448 9620447 5225906 -1187459 -1063274 3113598 2308577 -3265143 -4548724
9795 -4548724 1134567 6275026 6041405 5289803 9279041 14968250 16119919 11894990 6003423
9786F003423n090880l945866j961000J223945L877682M227874K077421j475693
9778D936906l939832k475702K173014M440218L21618o069510o646025j26919N717376
9769a668856M174965j703817l526837J234082O136916M347814k513842o438945
9761D1480l022384L404559N533912J708650l263946m603072k298052M11601J025193
9752a062059k82066j374488m58868J743716K661236J251998o94743j581827k101446
9743a898547k577343j115718K491390L942593R2868m740740l774758K061936N167652
9734c50667K425330j262554j635405m70672J7558J500181M465592M756245J25874
9725I571482m434565l398818Q20796J754717j371837l596545k423555l14074O91294
$$ plain form
9786 6003423 912543 -3033323 -4994323 -3770378 107304 4335178 6412599 4936906
9778 4936906 997074 -1478628 694386 5134604 5456222 -613288 -7259313 -7386232 -1668856
9769 -1668856 2506109 802292 -2724545 -1490463 4646453 8994267 6480425 41480
9761 41480 -2980904 423655 5957567 7666217 4402271 -200801 -2498853 -2087252 -1062059
9752 -1062059 -1344125 -2718613 -3177481 -1433765 1227471 2479469 1784726 202899 -1898547
9743 -1898547 -4475890 -5591608 -3100218 842375 935243 -3805497 -7580255 -5518319 -350667
9734 -350667 2074663 812109 -823296 -1293968 -1276410 223771 4689363 9445608 9571482
9725 9571482 5136917 1738099 2558895 4313612 2941775 -654770 -3078325 -3392399 -2701105
9716b701105J530160K581502K120087j54822j597795o41959K33408j983169n676762
9707f290455n640753K43099P183663Q186903K319838l923652m487883o43524K227839
9698h24925K450022K694019L852801L214630l56328l790272m282891k969608k078996
9689b091548j381912K63213K164085K758668J703753l95372k716858l864982k708354
9680f269307j84043J650851K355468K631761J916170k41036j413166N82431K588540
9671C617669k03146n612213o230663p88183L583357K690211J233040L648284O309504
9662H247860M155010r32607m047003m557725m075122j839363K318137M656834
9654C926021K575698q55617k097960k403256l218435j762634L095214O017573
$$ plain form
9716 -2701105 -1170945 1410557 3530644 3375822 1778027 1136068 1369476 -613693 -6290455
9707 -6290455 -11931208 -11688109 -4504446 3682457 6002295 2078643 -2409240 -3052764 -824925
9698 -824925 1625097 4319116 8171917 11386547 11030219 7239947 2957056 -12552 -2091548
9689 -2091548 -3473460 -3210247 -1046162 1712506 3416259 3020887 304029 -3560953 -6269307
9680 -6269307 -6453350 -4802499 -2447031 184730 2100900 1859864 446698 1029129 3617669
9671 3617669 3414523 -2197690 -8428353 -9216536 -5633179 -2942968 -1709928 1938356 8247860
9662 8247860 12402870 11470263 7423260 2865535 -1209587 -3048950 -730813 3926021
9654 3926021 6501719 5646102 3548142 1144886 -2073549 -3836183 -740969 5276604
9646E276604K874328j819353k096771j02728q78177k650795r86157J770985N91212
9637A979148k230521q50227L115534L188752m90651k120128r62245j213362k559643
9628b143343j019443J795592O55528k721308j787004K507629K797336j086000
9620a001013j612405K154864K422672k534044m225517J120746N697445L633867
9612E656615j46228p74129j892101n888495o397608N08488O851731M265849k484530
9603c00408l421016J235931L472619Q46284j954358k036792q00855L75549P59951
9594a823095q58279l083654j647043L225871M680953j08325l676184L15300O019905
9585C045449M568095j532207l384200o84364n03990l594208l449924J160375L462449
$$ plain form
9646 5276604 8150932 6331579 4234808 4132080 3253903 603108 -383049 1387936 1979148
9637 1979148 -251373 -1101600 2013934 5202686 4712035 2591907 1629662 416300 -2143343
9628 -2143343 -3162786 -1367194 -711666 -3432974 -5219978 -2712349 84987 -1001013
9620 -1001013 -2613418 -458554 1964118 -569926 -4795443 -3674697 2022748 5656615
9612 5656615 5510387 4736258 2844157 -3044338 -9441946 -8933458 -2081727 2184122 -300408
9603 -300408 -3721424 -2485493 987126 1833410 -120948 -2157740 -2958595 -2583046 -1823095
9594 -1823095 -2681374 -5765028 -7412071 -4186200 494753 386428 -3289756 -2974456 3045449
9585 3045449 7613544 6081337 2697137 2012773 1508783 -2085425 -5535349 -4374974 -912525
9576i12525R6542l777703l203577J27240K579573L585874L708886K710977J315635
9567F230922Q97525P50344n83523j691714l16980J801486J002788k022658l088347
9558B979843j150854Q78462J377763J082538k88711l167410m629613j371910M119607
9549a70285N730108J802301l747674p311234p452884k850225N188291R867653
9541A056051N973863j328972k658027J573118K302198l044434o622414l295084
9533f043701K072718L808342L055311K242953K01830k763711k607170J030290
9525I96862K402149p82752k856621j48803K366816K09890k508876r41078J723921
9516D61508Q70993p88923P81329K342904m25890l735846k147102Q27044j112993
$$ plain form
9576 -912525 -815983 -4593686 -7797263 -7670023 -5090450 -1504576 2204310 4915287 6230922
9567 6230922 7128447 7878791 7295268 5603554 5286574 7088060 8090848 6068190 2979843
9558 2979843 1828989 2707451 4085214 5167752 4879041 1711631 -2917982 -4289892 -170285
9549 -170285 5559823 7362124 3614450 -3696784 -11149668 -13999893 -8811602 1056051
9541 1056051 7029914 5700942 3042915 4616033 6918231 3873797 -2748617 -6043701
9533 -6043701 -3970983 -162641 2892670 5135623 5337453 2573742 -33428 996862
9525 996862 3399011 2616259 -240362 -389165 1977651 2187541 -321335 -1262413 461508
9516 461508 1332501 543578 1324907 3667811 3241921 -493925 -2641027 -1813983 -2926976
9507b926976m560372j450596O176257Q311708K798835k483123l157424k740232
9499c1923k830330m46933L023959J694213l208052l073889K930684M382576l081222
9490f40917q878205m007777M289768M608085p93563k022631J213206J267783k421191
9481g385442k932572P30469J996327p31253j050484L461064O227321K636181k232323
9472G19288j786680K404754M145616J385109k879921n214430l958710K46624L673371
9463a264979K322431k440516m549271j515087K009441J492294r77391j073371
9455e996449O92136Q21785q43941j392266o1977J074953J094924J198641J712721
9446a699473J169795j131807l719276m504161k543952J524451N645919P262182
$$ plain form
9507 -2926976 -7487348 -8937944 -2761687 5550021 8348856 5865733 2708309 -31923
9499 -31923 -2862253 -3309186 -285227 1408986 -1799066 -4872955 -1942271 2440305 -640917
9490 -640917 -9519122 -13526899 -9237131 -4629046 -5422609 -7445240 -6232034 -4964251 -7385442
9481 -7385442 -10318014 -9587545 -7591218 -8322471 -9372955 -5911891 315430 2951611 719288
9472 719288 -1067392 1337362 5482978 6868087 3988166 -1226264 -5184974 -4938350 -1264979
9463 -1264979 1057452 -1383064 -5932335 -7447422 -5437981 -3945687 -4923078 -5996449
9455 -5996449 -5304313 -4482528 -5326469 -6718735 -6780712 -5705759 -4610835 -3412194 -1699473
9446 -1699473 -529678 -1661485 -5380761 -9884922 -12428874 -10904423 -5258504 2003678
9438B003678N161779N36989l873567n406983l125919P10557J844945r96764l430924
9429f576209r85196L849937M847546J710967K85642K300852K221153k660153o290514
9420a295975l176960K494714L352431m34661l571647m520119m775251k975131
9412a4902599K266687O357290M000943j265812j483183K852830L619968j128609
9404C17515m075739j309996J542658l10681k871231r86006K948721L674796J218592
9395A48629j055816k215640k603466q69666K891770M564884J574520j980554q07275
9386c52614L411721M487298Q18359k903208k590937O35796K859116J678615j798644
9377F245502l753441j433242K853084L727014M9585k966014j283970J879214J227598
$$ plain form
9438 2003678 7165457 7702446 3828879 -1578104 -4704023 -3993466 -2148521 -3145285 -6576209
9429 -6576209 -7561405 -3711468 1136078 2847045 3132687 5433539 7654692 4994539 -1295975
9420 -1295975 -4472935 -1978221 1374210 939549 -2632098 -7152217 -11927468 -14902599
9412 -14902599 -12635912 -6278622 -2277679 -3543491 -5026674 -2173844 1446124 317515
9404 317515 -3758224 -5068220 -3525562 -3836243 -6707474 -7693480 -4744759 -1069963 148629
9395 148629 -907187 -3122827 -5726293 -6595959 -3704189 860695 2435215 454661 -352614
9386 -352614 3059107 7546405 8364764 5461556 2870619 3506415 6365531 8044146 6245502
9377 6245502 2492061 1058819 3911903 7638917 7688502 4722488 3438518 5317732 6545330
9368F545330k312117l248854J13L133673K433365p49694k706793j777582P37980
9359B055421K220064Q35022k698241n305971m377047k81914M115408N669655K901960
9350E134357k400398n432286k761382K883217M985328J347270l238695l686983
9342c169572n88565K291420K920803J095967k716517n708965l525751L569406
9334e831774Q505179N642650j363866m449090j746382J608162J857150M58461
9326D680490m07012j247442k901667m236280l792011j831340J16923O78797k98946
9317i238488j225619j71247K331193L464584K171899P42407Q37658Q49414m10163
9308f48362n94860K102836M604577L051920p78061j940727L1631R09549j161857
$$ plain form
9368 6545330 4233213 984359 984472 4118145 6551510 5801816 3095023 1317441 2055421
9359 2055421 4275485 5110507 2412266 -2893705 -7270752 -7552666 -3437258 2232397 5134357
9350 5134357 2733959 -2698327 -5459709 -2576492 2408836 3756106 517411 -3169572
9342 -3169572 -3758137 -1466717 1454086 2550053 -166464 -5875429 -9401180 -5831774
9334 -5831774 2673405 8316055 6952189 2503099 756717 2364879 4222029 4680490
9326 4680490 4273478 3026036 124369 -4111911 -7903922 -9735262 -9618339 -8939542 -9238488
9317 -9238488 -10464107 -10635354 -8304161 -4839577 -2667678 -1925271 -1087613 -238199 -648362
9308 -648362 -1243222 859614 5464191 8516111 7738050 5797323 5828954 6738503 5576646
9299E576646l218523k716152r77817j34636J2321M94448R24130L04470j146543
9290h81656j931316p42265J753873K638998r0000l705072k959447K479168O295633
9281B857916L870765j175670k550799j53811J443865Q10575K32785q8623k302332
9272B944671n384266n109049o80810L406008L700242K007549J534367K109968
9264D528680J288895j786743n103262n463529j491862M060846O177392L325166
9256E535583m30458j161029l88816j447406l247212k300897Q26897K175365N98109
9247A60136j417380k335289k347811o59050K930377M874384K042541j964445j181552
9238A01911K645442J989747l855895o521504j486322M736375M629633J25106k173652
$$ plain form
9299 5576646 2358123 -358029 -1335846 -1470482 -1458161 -963713 -39583 264887 -881656
9290 -881656 -2812972 -3555237 -1801364 837634 747634 -2957438 -5916885 -3437717 2857916
9281 2857916 6728681 5553011 3002212 2848401 4292266 5102841 5335626 5247003 2944671
9272 2944671 -2439595 -7548644 -8229454 -4823446 -1123204 884345 2418712 4528680
9264 4528680 5817575 4030832 -1072430 -6535959 -8027821 -3966975 2210417 5535583
9256 5535583 5105125 3944096 3555280 2107874 -1139338 -3440235 -2613338 -437973 160136
9247 160136 -1257244 -3592533 -5940344 -6599394 -3669017 1205367 3247908 1283463 101911
9238 101911 2747353 4737100 881205 -5640299 -7126621 -2390246 2239387 2364493 190841
9229A90841q09700J032423J756451J730521N19292j518552j607673J136572K602569
9220E032744o02428n019032m908523q55740J595233P28430M14611K786236M378672
9211C550203J568265l694579o230015m086105m15752Q87487j13260j01186K406585
9202f228357M528203L076165l85638j449938P27971K494926J563161m3024k05244
9193D078225K3940m15188J46229K548826L627861M80207m212677n230280k003105
9184i55962J168399J519433N90538M37060P31432O87605Q47907J290341K88557
9175F605310l153109o660835o530425k231418K774234N057816M717982M004761
9167D584316L618127K197011n84671k468357j345536J636687L085765J040228
$$ plain form
9229 190841 -618859 413564 2170015 3900536 4419828 2901276 1293603 2430175 5032744
9220 5032744 4430316 -588716 -5497239 -6352979 -4757746 -4029316 -3614705 -828469 3550203
9211 3550203 5118468 1423889 -4806126 -8892231 -9307983 -8420496 -8533756 -8634942 -6228357
9202 -6228357 -1700154 1376011 990373 -459565 268406 2763332 4326493 4283469 4078225
9193 4078225 4102165 3686977 3833206 6382032 10009893 10490100 6277423 1047143 -955962
9184 -955962 212437 1731870 2322408 2759468 3490900 4178505 5026412 6316753 6605310
9175 6605310 3452201 -3208634 -9739059 -11970477 -9196243 -4138427 579555 4584316
9167 4584316 8202443 10399454 9814783 7346426 6000890 7637577 10723342 11763570
9159A1763570l150091o057206m911731k41309L808041L429606m5622j663213O694
9150B938739P51442k036937m116152q48330M297828L903098j961239n235186j746404
9141d053141K796798J627534l240817m366448N09765N534413M235458k757752
9133B85810q387056o831057K48183N831052N697345K517267R43761J364809J077127
9124B747241n71685j726562j503455o77091J90164N58863o90865k881828k732213
9115g287431P42184L291115J604590p96213O78046L314762J548423k858059l512724
9106c275307p60278q86574m089444l492088K132063N042783J524462j630324J226602
9097d208105N297529M019332m37789k230425j236386n38082J97366K057109K246195
$$ plain form
9159 11763570 8613479 2556273 -2355458 -2596767 1211274 4640880 4595258 2932045 2938739
9150 2938739 3690181 1653244 -2462908 -3311238 986590 4889688 2928449 -2306737 -4053141
9141 -4053141 -1256343 371191 -2869626 -7236074 -6726309 -1191896 3043562 285810
9133 285810 -8101246 -14932303 -14684120 -8853068 -3155723 -638456 305305 1670114 2747241
9124 2747241 2175556 448994 -1054461 -1731552 -1541388 -982525 -1673390 -4555218 -7287431
9115 -7287431 -6545247 -3254132 -1649542 -2445755 -1767709 1547053 3095476 237417 -3275307
9106 -3275307 -4035585 -4922159 -9011603 -12503691 -10371628 -5328845 -3804383 -5434707 -4208105
9097 -4208105 1089424 5108756 4670967 2440542 1204156 666074 863440 2920549 5166744
9088E166744j160412l872043j459170K700173K203309k393388m820633k470085
9080f105505J214274K536486J201770p69871p63732J929798L683095M23873m665261
9071a315073l636963L382084O084474k04457n707162j336569N872866L673033
9063F812233n412112q170513j489973M468227L429236N01001P16742J577154M60036
9054B892031j14317J428509K237561J170288J330935L353112L040019j040817
9046A4297321m183633l179623j164961j400639k148401j360957p78401j508828
9038a428122r58166J776117K701184m25564l216301j457781J627523O50331k838179
9029c568958k754962J837123N433067M166079K71692k086708j721954k13857N84404
$$ plain form
9088 5166744 4006332 134289 -1324881 1375292 3578601 1185213 -3635420 -6105505
9080 -6105505 -4891231 -2354745 -1152975 -1922846 -2686578 -756780 2926315 3350188 -1315073
9071 -1315073 -4952036 -1569952 4514522 4310065 -1397097 -2733666 3139200 6812233
9063 6812233 1400121 -6770392 -8260365 -3792138 -362902 138099 854841 2431995 2892031
9054 2892031 2777714 4206223 6443784 7614072 8945007 12298119 15338138 14297321
9046 14297321 10113688 6934065 5769104 4368465 2220064 859107 80706 -1428122
9038 -1428122 -2386288 -610171 2091013 1665449 -1550852 -3008633 -1381110 -730779 -3568958
9029 -3568958 -6323920 -4486797 946270 5112349 5384041 3297333 1575379 1361522 1945926
9020A945926j70222j975382l289533k958887j382988K45496J391983K193063K474930
9011a525614J587531n93004k676063k374799P99661L650702K305860k079537l525935
9002d431198P20287N370939L920773k176500n824964m217316j089100M35004J420725
8993e871350K654154K192102l50984j626633M32364K812380J619317k234067m232651
8984d605368j904261K547784M695130K492079j053999q91388L086501M532101
8976H898579p02475p221294o750795k52782L560500J411832q07170R92837K725945
8967A855177N57830j828272p3771K687182J137221k979273l815861r40391Q01395
8958b598763m37298j523101l21371J647913K795037L234111K507443n23732m676197
$$ plain form
9020 1945926 1775704 -199678 -3489211 -6448098 -7831086 -7585590 -6193607 -4000544 -1525614
9011 -1525614 61917 -531087 -3207150 -5581949 -4782288 -1131586 1174274 -905263 -4431198
9002 -4431198 -3710911 1660028 5580801 3404301 -2420663 -6637979 -7727079 -7292075 -5871350
8993 -5871350 -3217196 -1025094 -1376078 -3002711 -2570347 242033 1861350 -372717 -4605368
8984 -4605368 -6509629 -3961845 733285 3225364 2171365 1279977 4366478 8898579
8976 8898579 8196104 974810 -5775985 -6028767 -2468267 -1056435 -1863605 -870768 1855177
8967 1855177 2413007 584735 510964 3198146 4335367 1356094 -2459767 -3400158 -2598763
8958 -2598763 -3036061 -4559162 -4880533 -3232620 -437583 2796528 5303971 4780239 104042
8949A04042o479511m192178K89738L814156M503234K292749j001495k509052j131970
8940d310287Q82436Q60834p17549j436605n48289R03326K360285L503050K778078
8931D275279p29934m452849m542006j064315J782300J076884j542455k505488
8923g702584l49704L180771M640078J785108l513182o155263l611252M56377J192351
8914a0077300k93220R41180M881316N407205l52143o543491n980663M28236N604079
8905e984801N424849J945291j173859k423544j847124j02491J412755J825826
8897i23098K120268L084646K790352p39386m901435m641784K25777M022420K965632
8888D003392j75034j272673m49126N83447K557354N596724N710105p110o973126
$$ plain form
8949 104042 -6375469 -10567647 -10277909 -6463753 -1960519 332230 -669265 -3178317 -4310287
8940 -4310287 -3427851 -2567017 -3284566 -4721171 -5269460 -4366134 -2005849 1497201 4275279
8931 4275279 3545345 -907504 -5449510 -6513825 -4731525 -3654641 -5197096 -7702584
8923 -7702584 -8052288 -4871517 -231439 1553669 -1959513 -8114776 -11726028 -11269651 -10077300
8914 -10077300 -10370520 -9429340 -4548024 859181 507038 -6036453 -12017116 -11588880 -5984801
8905 -5984801 -559952 1385339 211480 -2212064 -4059188 -4161679 -2748924 -923098
8897 -923098 1197170 4281816 7072168 6332782 1431347 -3210437 -2984660 1037760 4003392
8888 4003392 3828358 2555685 2106559 2690006 5247360 10844084 16554189 16547079 9573953
8879I573953q056112l631100l42003m95453J04719L072931L938034L76155l088873
8870A452251k497935m42075k37684P3585K649296M122516J221587k311681j296605
8861B733255J944923J540383j818656k565374k41804M90535q65725J08091L595569
8852D921197M102263J06563k823824j510444k13563k241603l653617p66548K086617
8843G041r07345o791806p353447j039772N234665N876873K469540q99259l060034
8834f463544m368630l683775r4803L949767M615242K015605P33230L348728N792928
8825E844748K567642m452772p303237k997637K071875J824280q25701j16186K499610
8816h87378J690406j514621j360250K005604K497190r41279k398398J89241J354077
$$ plain form
8879 9573953 1517841 -2113259 -2455262 -2950715 -2845996 226935 4164969 4541124 1452251
8870 1452251 -1045684 -1487759 -1725443 -1651858 997438 5119954 6341541 4029860 2733255
8861 2733255 4678178 6218561 4399905 1834531 1592727 2083262 1217537 1325628 4921197
8852 4921197 9023460 9130023 6306199 4795755 4582192 2340589 -1313028 -2079576 7041
8843 7041 -900304 -7692110 -15045557 -16085329 -10850664 -4973791 -2504251 -3403510 -6463544
8834 -6463544 -10832174 -14515949 -14610752 -10660985 -6045743 -4030138 -3296908 51820 5844748
8825 5844748 8412390 3959618 -3343619 -6341256 -4269381 -2445101 -3270802 -3386988 -887378
8816 -887378 803028 -711593 -2071843 -66239 2430951 1489672 -908726 -719485 634592
8807F34592j535321l062450L55195L585403J791695j064856J36959K011675r94533
8798A858359n602913m379254J489171L547893n09883l498663m5271N838085O904441
8789E601965J600053n327679q081392m536170J998572N481713L313487j039795
8781i89246l049958k359438p09661J930836N252332N860488J807413k509768j621127
8772C611871K478565K930346j783148o155088o010074k954027j46617J283401
8764f744771J087176l08818n76476J806749M034689K578683o56368j040626R33526
8755A113764P61045j629667j620447J440283K715887M35566j382181q29245j265675
8746b60670l737412l787829L21902L500253K509378J568275L795510M275419j214328
$$ plain form
8807 634592 -900729 -3963179 -3607984 -22581 1769114 704258 841217 2852892 1858359
8798 1858359 -3744554 -8123808 -6634637 -3086744 -3596627 -7095290 -7140561 -1302476 5601965
8789 5601965 7202018 1874339 -6207053 -10743223 -8744651 -3262938 50549 -989246
8781 -989246 -4039204 -6398642 -7108303 -5177467 74865 5935353 7742766 5232998 3611871
8772 3611871 6090436 9020782 7237634 1082546 -4927528 -7881555 -8028172 -6744771
8764 -6744771 -5657595 -5966413 -6542889 -4736140 -701451 1877232 1220864 180238 1113764
8755 1113764 1874809 245142 -1375305 64978 2780865 3216431 1834250 1005005 -260670
8746 -260670 -3998082 -7785911 -7464009 -3963756 -1454378 113897 3909407 8184826 6970498
8737F970498o922754n211982P58456J798718k781992n047139j741515J721220
8729a0456490J427346O17689K673170N168169M164549j05220m337331n699839
8721f547957l249702R63996K285345j173962m287968j111950N453158O813893
8713h55147J755623j464495J735900N138017K186935l586648m816159j538382
8705a444356P87491P55342J328101K796982K250270n97257k738584k790073j918512
8696a570596o23962Q14613k6557m224459o756526j773009P301061J0070330L358016
8687F568911l832743k997697K367795L069845k390656o858417n096214K29555
8679h939621L300819K034864p43504j060579J856131M481663L000459j390633
$$ plain form
8737 6970498 47744 -5164238 -4405782 -2607064 -5389056 -10436195 -12177710 -10456490
8729 -10456490 -9029144 -8411455 -5738285 -570116 3594433 3489213 -848118 -6547957
8721 -6547957 -9797659 -8833663 -6548318 -7722280 -12010248 -13122198 -7669040 -855147
8713 -855147 900476 -564019 1171881 6309898 8496833 4910185 94026 -1444356
8705 -1444356 -656865 98477 1426578 4223560 6473830 5876573 3137989 347916 -1570596
8696 -1570596 -2194558 -1379945 -1406502 -5630961 -12387487 -14160496 -6859435 3210895 6568911
8687 6568911 2736168 -261529 2106266 5176111 2785455 -4072962 -9169176 -8939621
8679 -8939621 -5638802 -3603938 -4347442 -5408021 -3551890 929773 3930232 2539599
8671B539599l324261l86294L382965L236469L07579q20227O19332P29067k669312
8662C614917o188882m802282J844193Q212861Q150859J609023m574223m204418
8654C662048N92971K374446q88992l022847R2496L018087r77330p996357p567372
8645a0712850K042345J0340726Q611563Q82292l242138j885458j234429m619072
8637A82979p501041m750175J479304M501749J968175j608015j452752J548663
8629e631113L334418K544895R14310o19436k373388l067354p94194K763131L466205
8620E37474J049212l44865O11191J26162l147611m199760K20556M957255L778680
8611C588294r51504k447144J08913K268894K578281K714831J572291k808663o718903
$$ plain form
8671 2539599 -784662 -1170956 2212009 5448478 5756057 4935830 5555162 6284229 3614917
8662 3614917 -2573965 -7376247 -5532054 2680807 10831666 12440689 7866466 3662048
8654 3662048 4255019 6629465 5740473 2717626 2810122 5828209 4850879 -3145478 -10712850
8645 -10712850 -8670505 1670221 10281784 11164076 7921938 6036480 4802051 182979
8637 182979 -7318062 -12068237 -10588933 -6087184 -4119009 -5727024 -7179776 -5631113
8629 -5631113 -2296695 248200 1162510 543074 -1830314 -4897668 -5691862 -2928731 537474
8620 537474 1586686 1241821 1853012 1979174 -1168437 -5368197 -5147641 -190386 3588294
8611 3588294 2636790 189646 298559 2567453 5145734 7860565 9432856 6624193 -94710
8602i4710m534850J377539K910191j307601m207201k039710R83277J663047K384175
8593b865843L793771K009350k727120l496093J862673N277603R96914m405749
8585D45506k695437K372769J850428l095775l673351J211794L333134o87723l827059
8576d765714m14058M676067L580102k911826o687783l214261L317249N880567
8568e39657K854279j189563k053544q99652j199549k726560k157310Q42420K561279
8559d507857J264906j18220P28156J760382P48333o98155l92932O25632P76938
8550A87183J024844J902240R67619k801739n318378k627625K625417M509221J799518
8541B268300j465475j951696J02320K622417L246120P43936k625922k559154J149359
$$ plain form
8602 -94710 -4629560 -3252021 -341830 -1649431 -5856632 -7896342 -6913065 -5250018 -2865843
8593 -2865843 927928 2937278 210158 -3285935 -1423262 3854341 4851255 445506
8585 445506 -2249931 122838 1973266 -1122509 -4795860 -3584066 -250932 -938655 -4765714
8576 -4765714 -5179772 -503705 3076397 164571 -6523212 -9737473 -6420224 -539657
8568 -539657 2314622 1125059 -928485 -1828137 -3027686 -5754246 -7911556 -7069136 -4507857
8559 -4507857 -3242951 -3361171 -2633015 -872633 -124300 -822455 -1215387 -589755 187183
8550 187183 1212027 3114267 4081886 1280147 -4038231 -6665856 -4040439 468782 2268300
8541 2268300 802825 -1148871 -1046551 1575866 4821986 5565922 2940000 380846 1530205
8532A530205L298727J027266j364184N28773L628466K340685k310508m626126
8524D053304k984669o77983L49097R35669J113667L05876O3403J905104L667204
8515H730672K359706r65592l327353m449070m919258k818344K507154O342545
8507C460460M232216r36271l338289k666287j981638q36091K063995L008309j339340
8498A667064n946781m160909N85819L20287k982775q24258N311404M932657k859861
8489c957353o287610j29786N914283L807266r79891j490381q93377l189459l454827
8480a0661135K150593O165270J306297n486930l022008N665758P785996O75755
8472D579596n452070m006055K32773J227771q9800m06266L95825J068639J461074
$$ plain form
8532 1530205 4828932 5856198 4492014 5020787 8649253 10989938 8679430 4053304
8524 4053304 1068635 390652 739749 1675418 2789085 3094961 3158364 5063468 8730672
8515 8730672 11090378 10124786 6797433 2348363 -2570895 -5389239 -2882085 3460460
8507 3460460 7692676 6756405 3418116 751829 -1229809 -2065900 -1905 3006404 1667064
8498 1667064 -4279717 -8440626 -7854807 -7534520 -10517295 -11341553 -6030149 -1097492 -3957353
8489 -3957353 -10244963 -10374749 -4460466 -653200 -1633091 -3123472 -4016849 -7206308 -10661135
8480 -10661135 -8510542 -2345272 -1038975 -6525905 -9547913 -3882155 3903841 4579596
8472 4579596 -872474 -4878529 -4645756 -3417985 -3507785 -3914051 -3518226 -2449587 -988513
8463i88513J389713O68724N05691J484071J218498k019454n052008l922102m47283
8454g162663P79390J33633J330195L349731J464424l477868m554192M70376M958663
8445b708311L329516q25691r75766K518208L908903Q50987l149907m241571k323578
8436c617210N07031K657494L257041J681858j427380l281570j062366M087092
8428B801990O716105K978846l708993n955333j738265K972499K359739k090628
8420D335960n104596m829385k848670K13242M411224P249898N595062P62869k375640
8411G409964j795834l13570n73760j407646n78639J304305J486052j192341m431287
8402i2756m687795j476803J309105J50017k683330j935636K214710L692188N18973
$$ plain form
8463 -988513 401200 1069924 1575615 3059686 4278184 2258730 -2793278 -6715380 -7162663
8454 -7162663 -6383273 -6249640 -4919445 -1569714 -105290 -3583158 -8137350 -7666974 -2708311
8445 -2708311 621205 -204486 -1180252 1337956 5246859 6097846 2947939 -1293632 -3617210
8436 -3617210 -3110179 -452685 2804356 4486214 3058834 -222736 -1285102 2801990
8428 2801990 9518095 12496941 8787948 2832615 1094350 4066849 6426588 4335960
8420 4335960 -768636 -5598021 -8446691 -8233449 -3822225 3427673 9022735 9785604 7409964
8411 7409964 5614130 5300560 4726800 3319154 2740515 4044820 5530872 4338531 -92756
8402 -92756 -4780551 -6257354 -4948249 -4798232 -7481562 -9417198 -7202488 -3510300 -2991327
8393b991327r15829L691779P799476L298327n622982p434789n13953M838914K639176
8384D788792q66191O74020L127280Q3595n297159m887536J580348O107467L758940
8375I069556j883168m737113k978380P37388K485221L10367l406677l602489J135133
8366b870162N555584M253575o36350k581857k97071J109415j098188l049122j011653
8357f25829K412154K453847o03774k368854r16879J197061J089656j004614k526937
8348h94169j229937K630977N715779M483598q0394k749491j157118K77904k602412
8339D394737n569381j403531P369728R259377p7187j0135542r349587n07668M781811
8330a237243K683067m94470m45139J68128l66318R07643M279349M265060j451064
$$ plain form
8393 -2991327 -3907156 -215377 7584099 10882426 5259444 -2175345 -2689298 2149616 4788792
8384 4788792 3922601 4596621 7723901 7807496 2510337 -2377199 -796851 5310616 9069556
8375 9069556 7186388 2449275 -529105 208283 2693504 3003871 -402806 -4005295 -2870162
8366 -2870162 2685422 6938997 6302647 3720790 3423719 4533134 3434946 385824 -625829
8357 -625829 1786325 4240172 3636398 1267544 350665 1547726 2637382 1632768 -894169
8348 -894169 -2124106 506871 6222650 10706248 10625854 7876363 6719245 6997149 4394737
8339 4394737 -1174644 -2578175 4791553 14050930 13973743 3838201 -5511386 -6019054 -1237243
8330 -1237243 1445824 951354 506215 674343 308025 1215668 5495017 9760077 8309013
8321H309013o492387m809241J37244J496565j28959P03919L823525L762044k93548
8312F508175k734306o82789J993189J762867L64758m5373j065671l726811m784627
8303b410588j810631J669419J058492j890756j835342J435423K666753l48139
8295a465369l282292k058292J211733J943766j77710j532272k09381J846030K142793
8286a580994O68513q34805j041972k449J113741J041866j08384o98569J94464
8277a248589R69418m94909l325955m173208j589078K039420L644225K800768J142301
8268b35607K96992J230294L505545M240331O30319m815249n149922J544190P032053
8259H278946K729338p315448j0183226j421392Q454673Q058857j45665m643363
$$ plain form
8321 8309013 1816626 -2992615 -2855371 -1358806 -1487765 -783846 3039679 6801723 6508175
8312 6508175 3773869 3091080 5084269 6847136 7211894 7166521 6100850 2374039 -2410588
8303 -2410588 -4221219 -2551800 -1493308 -3384064 -5219406 -3783983 -1117230 -1465369
8295 -1465369 -4747661 -6805953 -5594220 -3650454 -3828164 -5360436 -5569817 -3723787 -1580994
8286 -1580994 -912481 -1747286 -2789258 -2791707 -1677966 -636100 -744484 -1443053 -1248589
8277 -1248589 -279171 -774080 -4100035 -8273243 -9862321 -7822901 -4178676 -1377908 -235607
8268 -235607 61385 1291679 4797224 9037555 9667874 4852625 -297297 1246893 8278946
8259 8278946 11008284 3692836 -6490390 -7911782 542891 8601748 8456083 3812720
8251C812720q16234M406826L348019k745830o870064n490742j470623J076216
8243d749712J833076K940946M204524K571442k550777o226560l589050K718854
8235b847257N072575J210244k736613j560838J502388O33882k966959l138344
8227d830922J173128M159808K139944j337236j728097k44115o69987k543827k094830
8218e976134J171511L354064K162078J77513L56207J346058J47233k466797k772252
8209b500519M6517K426781J748965K5934L12412J788308J187092k016102m646424
8200a627036m027331j022211J505713J818627M32064r69903j275498p24495M1029
8191e849041J064418K122159J537168j566119m111781j842144L913981O504195
$$ plain form
8251 3812720 2996486 7403312 10751331 8005501 1135437 -4355305 -5825928 -4749712
8243 -4749712 -2916636 24310 4228834 6800276 4249499 -1977061 -5566111 -2847257
8235 -2847257 2225318 3435562 698949 -861889 640499 1274381 -1692578 -4830922
8227 -4830922 -3657794 502014 2641958 1304722 -423375 -667490 -1337477 -3881304 -5976134
8218 -5976134 -4804623 -1450559 711519 889032 1245239 2591297 2738530 271733 -2500519
8209 -2500519 -2454002 -27221 1721744 1747678 2060090 3848398 5035490 3019388 -1627036
8200 -1627036 -5654367 -6676578 -5170865 -3352238 -2920174 -3890077 -5165575 -5890070 -5849041
8191 -5849041 -4784623 -2662464 -1125296 -2691415 -6803196 -8645340 -4731359 1772836
8183A772836L021002j436816j768702l36602j626538l879434k509062J311141
8175e452175K773595K127045L459465N784123L653259k844214o793023m736926
8167b028851p97358J332523K989766M715507L482003q03910l109822j429556l37337
8158D012965k337650k703126K009335O940774O336292K225101l40962j439612
8150A4703117l436357m885479l728501k228678k471606j409998L135229O247002
8142E924729L021747k376260k717855R26881K186283N45124N30669K055331R07081
8133A1003730k289344k741241p08426j166364m095895l898969N82110L842513
8125E28114K883449O91306q68338l606340o554211n049159Q92025M689108K781329
$$ plain form
8183 1772836 4793838 3357022 1588320 1251718 -374820 -4254254 -6763316 -5452175
8175 -5452175 -2678580 -551535 2907930 8692053 12345312 9501098 2708075 -2028851
8167 -2028851 -2826209 -1493686 1496080 6211587 9693590 8889680 5779858 4350302 4012965
8158 4012965 1675315 -1027811 981524 7922298 14258590 16483691 16142729 14703117
8150 14703117 11266760 6381281 2652780 424102 -2047504 -3457502 -322273 5924729
8142 5924729 8946476 6570216 3852361 4779242 6965525 7510649 8041318 10096649 11003730
8133 11003730 8714386 5973145 5264719 4098355 2460 -3896509 -3314399 528114
8125 528114 3411563 4102869 3234531 -371809 -6926020 -11975179 -11083154 -6394046 -3612717
8116c612717p81658k176231k924530l770954j194291N038271P936913L083547
8108A598350l424951l489739J247654L296931J313274L12418J610295O51258m138354
8099a022864p126794l317612L779511O111940J448341l772446k698570L266533
8091c331961O506963L189661k136260l175575J46058L127571L071681R35173j853410
8082F479901m069703l589740J9432K949241J776127n95275J011520M991941M453924
8073A3427368j892726p084996n834874r26320K598555L762098L254029L23679
8065G626813m054338n464323j741798K882565L091748n87242l289521k113302
8057c649398J619372M575305M138391O89963k106856j520584N4555j406303m538905
$$ plain form
8116 -3612717 -4394375 -6570606 -9495136 -13266090 -14460381 -9422110 -1485197 1598350
8108 1598350 -1826601 -5316340 -4068686 -771755 541519 853937 2464232 3115490 -1022864
8099 -1022864 -8149658 -11467270 -7687759 -1575819 -127478 -3899924 -6598494 -3331961
8091 -3331961 3175002 6364663 4228403 1052828 1198886 4326457 7398138 8333311 6479901
8082 6479901 2410198 -1179542 -1160110 1789131 3565258 2969983 3981503 8973444 13427368
8073 13427368 11534642 4449646 -1385228 -2311548 287007 4049105 7303134 7626813
8065 7626813 3572475 -1891848 -3633646 -751081 2340667 1753425 -1536096 -3649398
8057 -3649398 -2030026 2545279 6683670 7373633 5266777 3746193 3800748 2394445 -2144460
8048b144460m212072k59446J668863o27637k344272J8740L098129K886332P57896
8039a157927m93023j204675j605250L83791L897491L577311j683968m398217Q53416
8030a831051P801271O964920m51550n254732m060877j973221k508615k870631
8022d184486j29433M122936O676046N929018J790671l857663o884381m866288
8014a403580p58621R75352O44791J552663L319792K154998k466077o321850o174111
8005h476643k963184R96327M152332M804195J986851j964989l031484m91043K282935
7996b704703K275714k73094l146697l824473n49686N312955Q573286N177265k234545
7987H606022o775426n256540q12660K141947K347130R16938o52779q35824J107331
$$ plain form
8048 -2144460 -6356532 -6615978 -4947115 -5574752 -7919024 -7900284 -4802155 -1915823 -1157927
8039 -1157927 -1650950 -2855625 -4460875 -4077084 -179593 3397718 1713750 -2684467 -1831051
8030 -1831051 5970220 12935140 12483590 7228858 3167981 1194760 -1313855 -4184486
8022 -4184486 -4313919 -190983 6485063 12414081 14204752 10347089 3462708 -1403580
8014 -1403580 -2162201 -1186849 -542058 1010605 4330397 6485395 4019318 -2302532 -8476643
8005 -8476643 -11439827 -10443500 -6291168 -1486973 499878 -1465111 -4496595 -4987638 -2704703
7996 -2704703 -428989 -702083 -3848780 -7673253 -8222939 -2909984 5663302 10840567 8606022
7987 8606022 1830596 -3425944 -4238604 -2096657 250473 1167411 514632 -321192 786139
7978G86139L714953M354370K162882j171820l378185l243486j015646J447351
7970C656558J689448q11336l800924m787668l308576l01238K697173L287171J78205
7961a501187l655797l426013N81747K918254J449614M11517K163280K405362j555287
7952b08510m347702j178499K979333J399932k100671P66296P469792P118745k075547
7943I823169r279540p037584m71422K877933L064539L114865K532123O77221L9347
7934E340651J123554P14m273071n802987q67919M784644L951714j234257l253236
7925b30193o14002J516598J01386k768592m697170n087406k839543K735974Q328207
7916c554741Q542071K523766m529744p249057m995495p12250K509637L237353
$$ plain form
7978 786139 4501092 8855462 11018344 9846524 6468339 3224853 2209207 3656558
7970 3656558 5346006 4534670 733746 -4053922 -7362498 -7663736 -4966563 -1679392 -1501187
7961 -1501187 -5156984 -8582997 -8001250 -5082996 -3633382 -3221865 -1058585 1346777 -208510
7952 -208510 -4556212 -5734711 -2755378 -1355446 -3456117 -2689821 4779971 11898716 9823169
7943 9823169 543629 -6493955 -6965377 -4087444 -1022905 2091960 4624083 5301304 5340651
7934 5340651 6464205 6464919 2191848 -3611139 -4479058 305586 4257300 3023043 -230193
7925 -230193 -844195 672403 773789 -1994803 -6691973 -11779379 -14618922 -11882948 -3554741
7916 -3554741 4987330 7511096 2981352 -4267705 -9263200 -9975450 -7465813 -4228460
7908d228460K195533J522597K222912K573543N03439k993793m683494l129351
7900f017074j85093J581463J506812O95193L16925L41577k69852j812496k533413
7891f375958n25729K834249L485151q4298m247106m706362j741327J265126K815101
7882g281153L710924L581036R81334k588056k712512J830032N949810M259668
7874G731083j527327m689963k406187J158461J336421j153723k771347k363440
7866d686022p66118K112459N710902O256631R96803n666392o093524j42709M133336
$$ plain form
7908 -4228460 -2032927 -510330 1712582 4286125 4789564 1795771 -2887723 -6017074
7900 -6017074 -6202167 -4620704 -3113892 -2418699 -2101774 -1760197 -2030049 -3842545 -6375958
7891 -6375958 -6901687 -4067438 -582287 -666585 -4913691 -9620053 -11361380 -10096254 -7281153
7882 -7281153 -3570229 10807 992141 -1595915 -4308427 -2478395 3471415 7731083
7874 7731083 6203756 1513793 -892394 266067 1602488 448765 -2322582 -4686022
7866 -4686022 -5452140 -3339681 2371221 8627852 9624655 3958263 -2135261 -2277970 1855366
$$ [...]
##END NTUPLES=NMR SPECTRUM
##END=
