##TITLE=31Pdec_SR111_k2
 CDCl3, 124 sc
 16.3.2022
##JCAMPDX= 6.0         $$ Bruker NMR JCAMP-DX V2.0
##DATA TYPE= NMR SPECTRUM
##DATA CLASS= NTUPLES
##ORIGIN= UXNMR, Bruker Analytische Messtechnik GmbH
##OWNER= root
$$ XWIN-NMR		Version 3.5
$$ Wed Mar 16 13:30:01 2022 Russian Standard Time (UT+4h)  she@DPX200
##.OBSERVE FREQUENCY= 81.013821
##.OBSERVE NUCLEUS= ^31P
##.ACQUISITION MODE= SIMULTANEOUS
##.ACQUISITION SCHEME= undefined
##.AVERAGES= 124
##.DIGITISER RES= 16
##SPECTROMETER/DATA SYSTEM= spect
##.PULSE SEQUENCE= zgpg30
##.SOLVENT NAME= CDCl3
##.SHIFT REFERENCE= (INTERNAL, CDCl3, 0, 248.564)
##AUDIT TRAIL= $$ (NUMBER, WHEN, WHO, WHERE, WHAT)
$$ ##TITLE= Audit trail, XWIN-NMR		Version 3.5
$$ ##JCAMPDX= 5.01
$$ ##ORIGIN= Bruker BioSpin GmbH
$$ ##OWNER= she
$$ F:/spectra/data/she/nmr/P31/1/pdata/1/auditp.txt
$$ ##AUDIT TRAIL=  $$ (NUMBER, WHEN, WHO, WHERE, WHAT)
(   1,<2022-03-16 13:28:58.89 +0400>,<she>,<DPX200>,
      <continue with go, POWCHK disabled, PULCHK disabled
       configuration hash MD5:
       00 E9 B6 7A A2 85 ED C7 34 08 36 98 17 FE 4E 26
       data hash MD5: 32K
       48 52 B2 44 BD E4 C6 12 1A B2 4D CA 14 0E 8C 2F>)
(   2,<2022-03-16 13:29:15.95 +0400>,<she>,<DPX200>,
      <Start of raw data processing
       efp BC_mod = 2 LB = 1 FT_mod = 6 PKNL = 1 PHC0 = -9210.565 PHC1 = 112.6757 SI = 64K 
       data hash MD5: 64K
       43 DB B0 A4 50 14 15 53 08 0A CA 68 40 8F BD FB>)
(   3,<2022-03-16 13:29:34.28 +0400>,<she>,<DPX200>,
      <pk PHC0 = 19.10152 PHC1 = 0 
       data hash MD5: 64K
       5D A3 86 B4 AB 99 4D AA 7A C7 C0 06 D5 39 88 80>)
(   4,<2022-03-16 13:29:38.71 +0400>,<she>,<DPX200>,
      <abs ABSG = 5 
       data hash MD5: 64K
       36 7D EB E3 95 C9 8A 16 56 4A F8 EF 1D EE 10 99>)
$$ ##END=
$$ 
$$ hash MD5
$$ DA 8D D9 C0 14 7B C0 E6 D9 4F 47 AF A6 FF 23 53
##$RELAX= 
##$RELAX= 
##$RELAX= 
##$RELAX= 
##$RELAX= 
##$RELAX= 
##$RELAX= 
##$RELAX= 
$$ Bruker specific parameters
$$ --------------------------
##$DU= <F:/spectra>
##$EXPNO= 1
##$NAME= <P31>
##$PROCNO= 1
##$TYPE= <nmr>
##$USER= <she>
##$AMP= (0..31)
100 100 100 100 100 100 100 100 100 100 100 100 100 100 100 100 100 100 
100 100 100 100 100 100 100 100 100 100 100 100 100 100 
##$AQSEQ= 0
##$AQ_mod= 1
##$AUNM= <au_zg>
##$AUTOPOS= <>
##$BF1= 81.014009
##$BF2= 200.13
##$BF3= 200.13
##$BF4= 200.13
##$BF5= 200.13
##$BF6= 200.13
##$BF7= 200.13
##$BF8= 200.13
##$BYTORDA= 1
##$CFDGTYP= 0
##$CFRGTYP= 5
##$CHEMSTR= <none>
##$CNST= (0..31)
1 1 145 1 1 1 1 1 1 1 1 1 1 1 1 1 1 1 1 1 1 1 1 1 1 1 1 1 1 1 1 1 
##$CPDPRG= <waltz16>
##$CPDPRG1= <>
##$CPDPRG2= <waltz16>
##$CPDPRG3= <>
##$CPDPRG4= <mlev>
##$CPDPRG5= <mlev>
##$CPDPRG6= <mlev>
##$CPDPRG7= <mlev>
##$CPDPRG8= <mlev>
##$CPDPRGB= <>
##$CPDPRGT= <>
##$D= (0..31)
0 1 0 0 0 0 0 0 0 0 0 0.03 2e-05 3e-06 0 0 0 0 0 0 0 0 0 0 0 0 0 0 0 0 
0 0 
##$DATE= 1647422769
##$DBL= (0..7)
120 120 120 11 120 120 24 19 
##$DBP= (0..7)
150 150 150 150 150 150 150 150 
##$DBP07= 0
##$DBPNAM0= <>
##$DBPNAM1= <>
##$DBPNAM2= <>
$$ [...]
##$SUBNAM3= <"">
##$SUBNAM4= <"">
##$SUBNAM5= <"">
##$SUBNAM6= <"">
##$SUBNAM7= <"">
##$SUBNAM8= <"">
##$SUBNAM9= <"">
##$SW= 501.771253377433
##$SWIBOX= (0..15)
0 1 3 0 0 0 0 0 0 0 0 0 0 0 0 0 
##$SW_h= 40650.406504065
##$TD= 32768
##$TD0= 1
##$TE= 0
##$TE2= 300
##$TE3= 300
##$TEG= 300
##$TL= (0..7)
0 120 53 12 22 120 120 120 
##$TP= (0..7)
150 150 150 150 150 150 150 150 
##$TP07= 0
##$TPNAME0= <>
##$TPNAME1= <>
##$TPNAME2= <>
##$TPNAME3= <>
##$TPNAME4= <>
##$TPNAME5= <>
##$TPNAME6= <>
##$TPNAME7= <>
##$TPOAL= (0..7)
0.5 0.5 0.5 0.5 0.5 0.5 0.5 0.5 
##$TPOFFS= (0..7)
0 0 0 0 0 0 0 0 
##$TUNHIN= 0
##$TUNHOUT= 0
##$TUNXOUT= 0
##$USERA1= <user>
##$USERA2= <user>
##$USERA3= <user>
##$USERA4= <user>
##$USERA5= <user>
##$V9= 5
##$VALIST= <valist>
##$VCLIST= <CCCCCCCCCCCCCCC>
##$VD= 0
##$VDLIST= <DDDDDDDDDDDDDDD>
##$VPLIST= <PPPPPPPPPPPPPPP>
##$VTLIST= <TTTTTTTTTTTTTTT>
##$WBST= 1024
##$WBSW= 4
##$XGAIN= (0..3)
0 0 0 0 
##$XL= 0
##$YL= 0
##$YMAX_a= 3142
##$YMIN_a= -3902
##$ZGOPTNS= <>
##$ZL1= 120
##$ZL2= 120
##$ZL3= 120
##$ZL4= 120
##$ABSF1= 248.5645
##$ABSF2= -253.2056
##$ABSG= 5
##$ABSL= 3
##$ALPHA= 0
##$AQORDER= 0
##$ASSFAC= 0
##$ASSFACI= 0
##$ASSFACX= 0
##$ASSWID= 0
##$AUNMP= <proc_1d>
##$AZFE= 0.1
##$AZFW= 0.5
##$BCFW= 0
##$BC_mod= 2
##$BYTORDP= 0
##$COROFFS= 0
##$CY= -3
##$DATMOD= 1
##$DC= 0
##$DFILT= <>
##$DTYPP= 0
##$F1P= 0
##$F2P= 0
##$FCOR= 1
##$FTSIZE= 65536
##$FT_mod= 6
##$GAMMA= 0
##$GB= 0
##$INTBC= 1
##$INTSCL= 5.30512e-09
##$ISEN= 30
##$LB= 1
##$LEV0= 0
##$LPBIN= 0
##$MAXI= 10000
##$MC2= 0
##$MEAN= 0
##$ME_mod= 0
##$MI= 50
##$NCOEF= 0
##$NC_proc= -7
##$NLEV= 6
##$NOISF1= 182.463
##$NOISF2= 159.3651
##$NSP= 0
##$NTH_PI= 0
##$NZP= 0
##$OFFSET= 248.5645
##$PC= 4
##$PHC0= -9191.464
##$PHC1= 112.6757
##$PH_mod= 1
##$PKNL= yes
##$PPARMOD= 0
##$PSCAL= 0
##$PSIGN= 0
##$REVERSE= no
##$SF= 81.014009
##$SI= 65536
##$SIGF1= 159.3651
##$SIGF2= -187.1042
##$SINO= 113.3802
##$SIOLD= 16384
##$SREGLST= <1H.CDCl3>
##$SSB= 0
##$STSI= 65536
##$STSR= 0
##$SW_p= 40650.406504065
##$SYMM= 0
##$S_DEV= 0
##$TDeff= 32768
##$TDoff= 0
##$TI= <>
##$TILT= no
##$TM1= 0
##$TM2= 0
##$TOPLEV= 0
##$USERP1= <user>
##$USERP2= <user>
##$USERP3= <user>
##$USERP4= <user>
##$USERP5= <user>
##$WDW= 1
##$XDIM= 65536
##$YMAX_p= 186285121
##$YMIN_p= -377102709
$$ End of Bruker specific parameters
$$ ---------------------------------
##NTUPLES= NMR SPECTRUM
##VAR_NAME=  FREQUENCY,     SPECTRUM/REAL,   SPECTRUM/IMAG
##SYMBOL=    X,             R,               I
##VAR_TYPE=  INDEPENDENT,   DEPENDENT,       DEPENDENT
##VAR_FORM=  AFFN,          ASDF,            ASDF
##VAR_DIM=   65536,         65536,           65536
##UNITS=     HZ,            ARBITRARY UNITS, ARBITRARY UNITS
##FACTOR=    0.620285442955139, 1,           1
##FIRST=     20137.2065510759, 0,            0
##LAST=      -20513.1999529892, 0,           0
##MIN=       -20513.1999529892, -377102709,  0
##MAX=       20137.2065510759, 186285121,    0
$$ Real data points
##PAGE= N=1
##DATA TABLE= (X++(R..R)), XYDATA
$$ [...]
42610E297616l027718Q22137M481852R42308n404772m983338J964133N391288
42602E483506L97750n981050n460938M86892M446863L412355M82981j321347k048158
42593a01146k134769q64918J519516K794529J299807j672441l107512j528742
42585c795676J468246K932284J745538j87153m09072R04984J501257N46197m28680
42576D277925m60883n59370j038195k63711J830720J949377j468336m043925j180808
42567i57206L780482L290158k682577n643015j258805L973136K954772j337649
42559B119296j642985J726829K491962n33664k095365L2815J879389Q40327n44308
42550D274296n96597j771565m763136n426679j765311J495970L56399j488948
$$ y = [5297616, 2269898, 3092035, 7573887, 8516195, 3111423, -1871915, 92218, 5483506, 5881256, -99794, -5560732, -5073840, -626977, 2785378, 3268359, 1947012, -101146, -2235915, -3100833, -1581317, 1213212, 2513019, 840578, -2266934, -3795676, -2327430, 604854, 2350392, 2163239, 1754167, 2659151, 4160408, 4706605, 4277925, 3817042, 3257672, 2219477, 1955766, 3786486, 5735863, 4267527, 223602, -957206, 2823276, 6113434, 3430857, -2212158, -3470963, 502173, 3456945, 2119296, 476311, 2203140, 4695102, 4161438, 2066073, 2098888, 3978277, 4818604, 4274296, 3677699, 1906134, -2857002, -8283681, -10048992, -8553022, -8196623, -9685571]
42542i685571O53689L250966N9967n788140m735935L876376Q994349L650750m738294
42533d461843n483286M59447M006711K181987L19410J348318J508593j437415
42525a558078l024165P63130O157667O473654J492995k920711l219471j482409
42517B682612n29971k22855J83125l12527k207988l296489j284434K454471L961254
42508A427198J436784k510203l700129r71959K351939J993593k023099m748677
42500f744553k310611K648758M190593J224686j218215L87504L191910K959253
42492D329325L07912j390368j511235j593819j362472K45760J468963j35356k644683
42483b285973j837314J749611L063516N49316j578912p66669j52253k140714l327565
$$ y = [-9685571, -9031882, -5780916, -5720949, -11509089, -16245024, -12368648, -3374299, 276451, -4461843, -9945129, -9485682, -5478971, -3296984, -2977574, -1629256, -120663, -1558078, -4582243, -3819113, 2338554, 8812208, 10305203, 7384492, 4165021, 2682612, 2152641, 1929786, 2112911, 1800384, -407604, -3704093, -4988527, -2534056, 1427198, 2863982, 353779, -3346350, -4318309, -1966370, 27223, -1995876, -6744553, -9055164, -6406406, -2215813, -991127, -2209342, -1821838, 1370072, 4329325, 4637237, 3246869, 1735634, 141815, -1220657, -974897, 494066, 358710, -2285973, -4123287, -2373676, 689840, 1239156, -339756, -1106425, -1258678, -3399392, -6726957]
42474f726957m13530L123120J959250k218570k895448J376744N127046M164083
42466C495738M08727k411409l261905k471363j4626K770664L089043N60470j535520
42457F29819r41930L63520j25082j355227j248355p35806j555561j979191P94386
42448f153427M901132N363046J687743r97646J51695J539468l61531k895400j963669
42439A271411O58255L83593j865123r08572L389306M934073J140979k778721k587735
42430C637466j803032m501607o798259k897659L757534M188024j971136n040201
42422a1428870L8693N962870M338083k095606m516091o84495L980909N311325
42414I06818L986369J425874j984774m522288l976139j406546N4268L36195K131913
$$ y = [-6726957, -7140487, -4017367, -2058117, -4276687, -7172135, -5795391, -668345, 3495738, 3904465, 1493056, -1768849, -4240212, -4254838, -1484174, 1604869, 2165339, 629819, -312111, 51409, -73673, -1428900, -2677255, -3413061, -4968622, -6947813, -6153427, -1252295, 4110751, 5798494, 4800848, 4952543, 6492011, 6130480, 3235080, 1271411, 1929666, 2313259, 448136, -460436, 2928870, 7862943, 9003922, 6225201, 3637466, 1834434, -2667173, -9465432, -12363091, -8605557, -4417533, -6388669, -11428870, -11390177, -5427307, -1089224, -3184830, -7700921, -8385416, -4404507, 906818, 4893187, 6319061, 4334287, -188001, -4164140, -5570686, -5516418, -5180223, -3048310]
42405c048310N274645O214751M029090J941499J136018j657561p347161j0292009
42397c749038n686316K428576N930833L251364j74474p72091k92045l77534M24033
42388I83308K482329K879447J24720k679573k364383m28049j74018j542113k086457
42379b804789j328135p71642p02162j42844O45574M73543m48524j038343j535462
42370g652784k518351k552484L0477L516805M420016K587465J148044J304123
42362B83311J127568K4031l5972R73019J2807l407952n018483k334753P72622
42353g603802J74883j478061R71733O210621P520542K342442m294508o540170
42345b696320l987984k56447J593139J116180k3692P1044J188434J176819n54485
$$ y = [-3048310, 2226335, 8441086, 12470176, 14411675, 15547693, 13890132, 6542971, -3749038, -9435354, -7006778, -1075945, 2175419, 2000945, 1228854, 936809, 559275, 983308, 3465637, 6345084, 6469804, 3790231, 1425848, 997799, 823781, -718332, -2804789, -4132924, -4904566, -5606728, -5749572, -5103998, -4630455, -5078979, -6117322, -7652784, -10171135, -12723619, -12693142, -9176337, -4756321, -2168856, -1020812, 283311, 1410879, 1434910, 1398938, 2371957, 2384764, -1023188, -6041671, -8376424, -7603802, -7428919, -8906980, -7935247, -1724626, 5795916, 8138358, 3843850, -2696320, -6684304, -6940751, -5347612, -4231432, -4255124, -4184080, -2995646, -1818827, -2373312]
42336b373312j593835l79069J028990P06240M89415K114563K834887J7887k602586
42327B43180J47145N305364M755645k159607o897944m299388N87803J302049j142651
42318b158404k197528j004413P22158K522500L751362K260381j650237l666504
42310a420685j373887J939564K562123J340739K49052j232422k632862p21190
42302a289568M146618N379595l98370o401176m894576J255049L753403J569989
42294C120964Q8383O92141K41553r71219Q1747J565493q92667m788175l392425
42285d254205J806899J777597m939828q425687k746976M717008N058062N11520
42277f495610j400431N16336K552603L616457M157247K087076l101885n907858
$$ y = [-2373312, -3967147, -4346216, -3317226, -2610986, -2121571, -7008, 2827879, 2845766, 243180, 390325, 5695689, 10451334, 8291727, 1393783, -2905605, -2317802, -1015753, -2158404, -4355932, -5360345, -4638187, -2115687, 1635675, 3896056, 2245819, -1420685, -2794572, -855008, 1707115, 3047854, 3296906, 2064484, -568378, -1289568, 2857050, 8236645, 7838275, 1437099, -3457477, -2202428, 1550975, 3120964, 3209347, 3901488, 4143041, 3171822, 3253569, 4819062, 3926395, -861780, -4254205, -2447306, -669709, -5609537, -14035224, -16782200, -12065192, -7007130, -6495610, -7896041, -7379705, -4827102, -1210645, 2946602, 5033678, 1931793, -3976065]
42269c976065j744373M638319M985156k77841l171055n30885K286212P78157k396228
42260E91397k733238m12142J360434J244281L49849k15751l20783n4283P34676
42251E44440J902141K163222j99216m281682n407273n23761N616592M927687k082791
42242B659359n297037N50258P220433N033670k486342m837550j146953K78472
42234A974310k560156k310447L428296O440394J626837l729118j929809K088685
42226E028992p28707p494612p004164K232396Q539881L809239n207742o943348
42218g768065k46144O151843O072130J933251r90666j343656j066249j046667
42210A695777k00099J708091K683585R96686k122219l824000l271708k081729
$$ y = [-3976065, -5720438, -1082119, 3903037, 3625196, 454141, -76744, 2209468, 2987625, 591397, -2141841, -2553983, -1193549, 50732, 400581, 184830, -135953, -190236, 544440, 2446581, 4609803, 4410587, 128905, -5278368, -5802129, -185537, 4742150, 2659359, -2637678, -2087420, 5133013, 10166683, 7680341, 2842791, 1695838, 1974310, -585846, -2896293, 532003, 6972397, 8599234, 4870116, 2940307, 5028992, 4300285, -3194327, -10198491, -7966095, 573786, 4383025, -824717, -7768065, -8014209, -1862366, 4209764, 6143015, 5152349, 3808693, 2742444, 1695777, 1495678, 3203769, 5887354, 6884040, 4761821, 937821, -2333887, -4415616]
42202d415616r72839J524063N421305O693807J718025o346229r468094m327344
42194a0172922L097121M881383Q28694k525104j424023Q27978K2260k470619k366577
42185i301809O98917K874007K121185P64363J085919J656766K18244j998523j718828
42176c599759J356223L637001K194479j549583l613636k128995P31370J616647
42168a356253J72145p66997M46284J441065n18722l343285k271950K610213N409096
42159A821596K819020q70278m74945K324682K603515L85687o72358p33701l029865
42150D173353o197920m817018J138797M690309K431046k75175J219461K867100
42142E229953n94975n745956n682054j498266j58719k503641k150028K981674
$$ y = [-4415616, -5388455, -3864392, 1556913, 8250720, 9968745, 3622516, -5845578, -10172922, -7075801, -2194418, -1365724, -3890828, -5314851, -4486873, -4464613, -6935232, -9301809, -8602892, -5728885, -3607700, -2843337, -1757418, -100652, 117592, -1880931, -3599759, -2243536, 1393465, 3587944, 2038361, -1575275, -3704270, -2972900, -1356253, -1184108, -1951105, -1504821, -63756, -582478, -3925763, -6197713, -3587500, 1821596, 4640616, 3770338, 3295393, 5620075, 8223590, 8609277, 7936919, 7203218, 4173353, -2024567, -6841585, -5702788, -1012479, 1418567, 1143392, 2362853, 5229953, 4634978, -1110978, -6793032, -8291298, -8450017, -10953658, -13103686, -10122012]
42134a0122012O419421L324740j993009l012538j66586J860302K085588K880287
42126A276193L819924J683160l377001o427156l999002J363104M521881L713079
42118B574182J383731L23923Q17873J452420J283876N32056k81356j050493j802551
42109E233661k193764j679411j38687J712390K457684R75202j988062l665866
42101G13147k077823J091347K257871Q26863k00432N60040L19240k789657n243504
42092d542908k830692K275009M061450J395893j029819m90663O03980M56270J060885
42083I59405L154039L330633j09709l024091j643296Q74692o23153m597879m962707
42074f642066n47990L453791L449692J447686J77274r26025k883527m082182k635201
$$ y = [-10122012, -3702591, -377851, -2370860, -5383398, -5549984, -3689682, -1604094, 1276193, 5096117, 6779277, 3402276, -3024880, -7023882, -5660778, -1138897, 2574182, 3957913, 4281836, 5099709, 6552129, 7836005, 8368061, 8086705, 7036212, 5233661, 3039897, 1360486, 1221799, 2934189, 5391873, 6367075, 4379013, 713147, -1364676, -273329, 1984542, 2811405, 2610973, 3171013, 3490253, 700596, -4542908, -7373600, -5098591, -1037141, 358752, -671067, -1161730, -557750, -101480, 959405, 4113444, 7444077, 7334368, 4310277, 2666981, 3541673, 2918520, -1679359, -6642066, -7190056, -3736265, -286573, 1161113, 1338387, 412362, -2471165, -6553347, -9188548]
42065i188548L28226J958024J261893M8044P20335L519249N779461M664157J080823
42056A0171664r19712J33620O19532k452823o007745n185771r08342J773654J511518
42047a264405J243223J592306O0060k580364j807177K638521M650277R43387l389590
42038B086238k612865J389279L281699K373764J342327M35975j440403k487731
42030D368283n22262K036547J056214k635790m458110k951117o40922J048241
42022b698916K855602M250457L671789J787746J89715k083827n817957p034775
42014d880166j702385N670663N930492j250709n946616k638787K007128P45916
42006b064464k660475p00940M759639N452308J19129l740675j427540L119721
$$ y = [-9188548, -8860322, -6902298, -5640405, -5592361, -4872026, -1352777, 4426684, 9090841, 10171664, 9251952, 9385572, 10005104, 7552281, 1544536, -3641235, -4549577, -2775923, -1264405, -21182, 1571124, 1631184, -949180, -2756357, -117836, 4532441, 5475828, 2086238, -526627, 862652, 4144351, 6518115, 7860442, 8296417, 6856014, 4368283, 3846021, 5882568, 6938782, 4302992, -155118, -3106235, -3747157, -2698916, 156686, 4407143, 8078932, 9866678, 10056393, 7972566, 2154609, -4880166, -6582551, -911888, 5018604, 3767895, -2178721, -4817508, -2810380, -2064464, -4724939, -5425879, -666240, 4786068, 4905197, 1164522, -263018, 2856703]
41998B856703M470112K607663L80857j189086k218652j999730n70523N9692j275683
41989C121353k608617j625070O50757J362705K11670k39265J183739K132978K24520
41980D414770k947738l509194o24135K371993K817446K060002K151321J880608
41972H615073n49684k865322j436369K043847K113021j545738k893727L97686
41964C878787K225867j885719n981727k173694N976323P352086n35246q016304
41956H40373p141544j162907K667961K742257J336357r44533l641625l551067
41948h854728R46137N317422M160631n30134j774973K214611N464766K747536
41940I691268l578676p157194n359604j352276L70532r56517j829398J013521
$$ y = [2856703, 7326815, 9934478, 10315335, 9126249, 6907597, 4907867, 4337344, 4397036, 3121353, 512736, -1112334, -461577, 901128, 1112798, 873533, 2057272, 4190250, 4414770, 1467032, -2042162, -2666297, -294304, 2523142, 4583144, 6734465, 8615073, 8065389, 5200067, 3763698, 5807545, 7920566, 6374828, 3481101, 3878787, 6104654, 4218935, -1762792, -3936486, 2039837, 9391923, 8856677, 840373, -6301171, -7464078, -4796117, -2053860, -717503, -1662036, -5303661, -8854728, -7908591, -2591169, 1569462, 1039328, -735645, 1478966, 6943732, 9691268, 6112592, -1044602, -6404206, -7756482, -7385950, -8342467, -10171865, -9158344]
41932i158344N804136P170472L274043q90954M0141L915700L629464k748746q670762
41923B365150p424023n41100M465300L001346k252768n227443k977987J822090
41915f769435M157459K121380j216204j617044J456733M703872M912285J695364
41907I444410k914700n873501m784627k77978L586223L427186P19263m81016N94352
41898C439612J064201j68619o73235O80460J232207q25061k870995k018979K4900
41889a15509j11359j808767j749369L27178J284106j29555j418434n29119J110298
41880c140530J062784o17267j765882j010451O97894J281136Q7943j023461o9503
41871d497337J775315J334688j544855k880350j49621L808826N008898L640677
$$ y = [-9158344, -3354208, 3816264, 7090307, 6199353, 6239494, 10155194, 13784658, 11035912, 2365150, -5058873, -5599973, -1134673, 1866673, -386095, -5613538, -8591525, -6769435, -2611976, -490596, -1706800, -3323844, -1867111, 2836761, 7749046, 9444410, 6529710, 656209, -4128418, -4406396, -820173, 2607013, 3326276, 2845260, 3439612, 4503813, 4335194, 3661959, 4342419, 5574626, 4749565, 1878570, -140409, -115509, -226868, -2035635, -3785004, -3457826, -2173720, -2303275, -3721709, -4250828, -3140530, -2077746, -2695013, -4460895, -5471346, -4773452, -3492316, -3404373, -4427834, -4497337, -2722022, -1387334, -2932189, -5812539, -5962160, -2153334, 2855564, 6496241]
41863F496241J876282p68221n189250p951297m704364K126267N022331J543459
41855a548552k673994k513107L39356J845906J367530J69816j367964k020195
41847f401204N47360M935913N198761r42871o972408n702208N91755L793943J536038
41838c414921r49378K80182L143726M214447L009561N09097k339258l545290j448710
41829e40544J715641J496958k248893m510222k502841L26729L88342m7910K847863
41820c074877P016232O659925J099738l626065l044702J40533R98959m31168m77602
41811E260973J401184J550188j748551m946087m128587n55916J528025Q85432
41803g53339j38764n0913L26761O00041J334158J509100o63271l516971k845311
$$ y = [6496241, 8372523, 7604302, 2415052, -5536245, -10240609, -8114342, -3092011, -1548552, -4222546, -6735653, -6396297, -4550391, -3182861, -3013045, -4381009, -6401204, -5853844, -917931, 4280830, 3337959, -3634449, -9336657, -8744902, -4950959, -3414921, -4364299, -4084117, -940391, 3274056, 6283617, 6792714, 4453456, 908166, -540544, 1175097, 2672055, 423162, -4087060, -6589901, -6263172, -5874830, -5922740, -3074877, 3941355, 10601280, 11701018, 8074953, 5030251, 5170784, 6169743, 5738575, 5260973, 6662157, 8212345, 6463794, 1517707, -2610880, -3166796, -1638771, -753339, -892103, -943016, -616255, -16214, 1317944, 2827044, 2163773, -1353198, -4198509]
41794d198509J251563L103311k9449k926291l36047M272078L964454n27160k212785
41785B361165N76185J835437j520219m127122r65568M105697L935852j189559
41777E011868m115427j122495L403883L660551J70037j652370P63902L695219
41769I815168K325630k523435n398509l612317m64703J24918j002674q13519O45039
41760i04402J075279K43973k97568n36357j295703j472338j6846O94396j764666
41751d274232m322910j974730L613611N555270K268529m73038M01696O48914k608374
41742a165264m846613j773092L022800L842746J522360L42019L63011q70915k241426
41733a804374j132521Q12713L10017j155027J36765K783765K135247j240556j756171
$$ y = [-4198509, -2946946, 156365, 126916, -2799375, -3135422, 1136656, 5101110, 4573950, 2361165, 2937350, 4772787, 3252568, -874554, -1840122, 2265575, 6201427, 5011868, 896441, -226054, 3177829, 6838380, 7008417, 5356047, 6119949, 9815168, 12140798, 9617363, 4218854, 606537, 141834, 266752, -735922, -1549441, -904402, 170877, 414850, 117282, -419075, -1714778, -3187116, -3203962, -2509566, -4274232, -8597142, -10571872, -6958261, -1402991, 865538, 392500, 794196, 1443110, -1165264, -6011877, -7784969, -4762169, -919423, 602937, 944956, 1307967, 437052, -1804374, -2936895, -2124182, -1814165, -2969192, -2832427, -48662, 2086585, 846029, -910142]
41724i10142K148155N372504L712443j191983n548604p314764n530304m49352
41716i712047M572291N544985K983056O49613n90886k625985m136965j444946
41708d760884L621438M006744j633008n403026j956006K763053O99825n479322
41700h141186o305996K65768O101062M430866j848941m998961j659399M560582
41692g596205P693322N364345O64304j890941j811257k105146l440684k593323
41684e715585J698065N408853M826965J931993M45200k07252k444421m865209
41676A078609m401955k278158k159662l383790j809682K795469N927127N392667
41668A160625L758808K857483J273762j183497j885631n76545j154739n161361
$$ y = [-910142, 1238013, 6610517, 10322960, 9130977, 3582373, -3732391, -9262695, -9712047, -5139756, 405229, 3388285, 4037898, 3447012, 821027, -3315938, -4760884, -1139446, 2867298, 1234290, -4168736, -6124742, -3361689, -2661864, -8141186, -14447182, -14181414, -8080352, -3649486, -5498427, -10497388, -12156787, -7596205, 97117, 5461462, 6125766, 4234825, 2423568, 318422, -3122262, -5715585, -4017520, 1391333, 6218298, 8150291, 8595491, 8388239, 5943818, 1078609, -3323346, -5601504, -7761166, -11144956, -12954638, -10159169, -4232042, 1160625, 4919433, 7776916, 9050678, 7867181, 5981550, 5405005, 4250266, -911095]
41660i11095p831780m470736K412003O254227M711897J326334P9569J051758J241258
41651C863435j501534n055043m289657K197428Q077129O311211o31570l633745
41643E337654m44653J294647k781018n952888j524934N527773N995172L51355
41635G803108l518947l018226k148416k167492k13378L166107L743488J296968
41627D943212k29427m36554k299869m176633j094253M940714N794681O18670k064874
41618E995667O73023M91782o717318j0995364l489440P914933R796261L172101
41610F841645n28635J107781Q0884n348754o730282n99478M671017K131741l229263
41601a603344l209571J553281M517098L284338Q96842J08670R31228J929619J045940
$$ y = [-911095, -8742875, -13213611, -10801608, -4547381, 164516, 1490850, 1570419, 2622177, 3863435, 2361901, -2693142, -6982799, -4785371, 3291758, 9602969, 8971399, 5337654, 4893001, 6187648, 3406630, -2546258, -4071192, 1456581, 7451753, 7803108, 4284161, 1265935, -882481, -3049973, -3263351, -97244, 3646244, 4943212, 4713785, 4277231, 1977362, -2199271, -3293524, 1647190, 7441871, 8060541, 5995667, 6668690, 7160472, 443154, -10552210, -14041650, -6126717, 3669544, 6841645, 6313010, 7420791, 7501675, 2152921, -4577361, -5176839, -505822, 1625919, -1603344, -4812915, -3259634, 1257464, 4541802, 5438644, 5547314, 6478542, 8408161, 9454101]
41592I454101k657011o114141m276566K715770P846222N639958q15897m519429
41584G273007l512762j502200j439690k421655k420277r45135J226824K993357
41576g48531L425142K444638Q54533p85229k467834l515705k491751O58303L525512
41567H99078L481929N05437k811046l655820j417119J676005K727520J641180
41559C047164J210380K542846K529994j304932n380075l951560K057441N153949
41551E905207J334647m539732n687686j965449J523096J799601P29385J322055
41543D21124L644499M586596J391314m153082o239707j949317L639692L067999
41535D409118l120426o431116j998729M823019O136900J653220k487782k236170
$$ y = [9454101, 6797090, 682949, -3593617, -877847, 6968375, 12608333, 11792436, 7273007, 3760245, 2258045, 818355, -1603300, -4023577, -4968712, -3741888, -748531, 2676611, 5121249, 5975782, 5190553, 2722719, -792986, -3284737, -2626434, 899078, 4381007, 4886444, 2075398, -1580422, -2997541, -1321536, 1405984, 3047164, 4257544, 6800390, 9330384, 8025452, 2645377, -1306183, 751258, 5905207, 7239854, 2700122, -2987564, -4953013, -3429917, -1630316, -900931, 421124, 4065623, 8652219, 10043533, 5890451, -349256, -2298573, 1341119, 4409118, 1288692, -5142424, -7141153, -2318134, 3818766, 5471986, 2984204, 748034]
41527G48034Q43763L038064K204321j239764m644816m949876j793623J859701
41519c934196L255464K828545K518038K473238J095528k093705m829691l878629
41511b565408J062333N470489M112784j891178n084999j329388L878521L073892
41503F727046k185238m116529p65594J944283J99258k886933l723395k834568
41495g641670j165227J891516M627720L292179j359885l581055r76557K422257
41487b490722L286079K770932J401959k283633n543261k407586N474826Q000234
41479H208828J651340l910466r23833M068784J660066m750652n397751l64586
41471B41730J955734q30848l052661j652555L61389O00012p9062j002868j762203
$$ y = [748034, 1591797, 4629861, 6834182, 5594418, 949602, -4000274, -5793897, -3934196, -678732, 2149813, 4667851, 7141089, 8236617, 6142912, 1313221, -2565408, -1503075, 3967414, 8080198, 6189020, 1104021, -225367, 3653154, 6727046, 4541808, 425279, -340315, 1603968, 1803226, -1083707, -4807102, -7641670, -8806897, -6915381, -2287661, 1004518, -355367, -3936422, -4912979, -2490722, 795357, 3566289, 4968248, 2684615, -2858646, -5266232, 208594, 8208828, 9860168, 5949702, 5025869, 9094653, 10754719, 6004067, 606316, 241730, 2197464, 1366616, -1686045, -3338600, -2977211, -2377199, -2456261, -3459129, -5221332]
41462e221332m62253K848379L841917K92676l116033k079531J07594q27640j942598
41453f558821N93637K787869k47662m023990j724414L177136K480054k547990
41445f064181m058832j170295J127583K948594O811931P774919M13349p580939
41437B02129m585933M396546L985700n351430o953644L627000J0490405M128273
41429I939046l596880j258635L378303n28633p141579n338410J582876K960625
41421c287p13133j040615K270469K356934j384088k912649o10383J252799P53067
41412c0886K2130J65807O94574J894210K934423J014350l411281n257735k699416
41403d673824m75104j098443j58635M391746O546015K407921k325801k408625
$$ y = [-5221332, -5683585, -2835206, 1006711, 1299387, -1816646, -3896177, -3788583, -4616223, -6558821, -5965184, -3177315, -3424977, -7448967, -9173381, -5996245, -3516191, -6064181, -10123013, -11293308, -10165725, -7217131, -405200, 7369719, 7783068, 202129, -4383804, 12742, 3998442, -1352988, -8306632, -4679632, 5810773, 9939046, 6342166, 5083531, 8461834, 7933201, 791622, -4546788, -2963912, -3287, -716420, -1757035, 513434, 2870368, 1486280, -1426369, -2036752, -783953, -30886, -8756, 157051, 851625, 2745835, 5680258, 6694608, 3283327, -1974408, -4673824, -5148928, -6247371, -6406006, -2014260, 4531755, 6939676, 4613875, 2205250]
41395B205250j830161m265046m180930K303224O979324K247147m131069j060032
41387a732293O175335M240480m969237o788882J866133P830827L271970l635488
41379F258845l860148j43502J058722k31013j011805j051708o74827Q26116J907698
41370C078378N2572k498904j120908K647515K729920r03918k034968N34036J062928
41361C546651j877489k229772K140822M518712N26423m344676l817360o1340J716418
41352A18389J414772J137009j46441l263016m782437j760945L010887N038740
41344G66958M184284K919137J795309J85401j352104k306656l108729l087063
41336c463j034525J049055m96092m252824m214802P14830L926939J216601k544506
$$ y = [2205250, 375089, -3889957, -8070887, -5767663, 1211661, 3458808, -672261, -1732293, 4443042, 8683522, 3714285, -3074597, -1208464, 6622363, 9894333, 6258845, 2398697, 2255195, 3313917, 3082904, 2071099, 1019391, 344564, 1170680, 3078378, 3130950, 632046, -488862, 2158653, 4888573, 3984655, 1949687, 2483723, 3546651, 1669162, -560610, 1580212, 6098924, 6625347, 2280671, -1536689, -1598029, 118389, 1533161, 2670170, 2523729, -739287, -5521724, -7282669, -4271782, 766958, 4951242, 7870379, 9665688, 9851089, 8498985, 6192329, 3083600, -3463, -1037988, 11067, -485025, -4737849, -8952651, -8237821, -4310882, -3094281, -5638787]
41327e638787j493549K110936K547847r0610j420007l89449N21362N86821J033977
41318b231459J539517J086174P82522J732277J924579n03000k773970r89809L164761
41309C731592M185566P54661k718915k744493n83636J285864K504971L172960
41301I588570K208444n63774k984491l291520k717651l339382m413716l228679
41293h742199M69436L290064K621133M33383M67750K552083K763085l77450l249885
41284B27400k510010o0589M08558m89191O95574L753972M309392L61003m465445
41275B230664n669061l126997n582J531077J792868J887911K118500K015774J444216
41266D219370J227149J949033K338645N26757k697011m111103k523461m92882
$$ y = [-5638787, -7132336, -5021400, -2473553, -2564163, -3984170, -4373619, -3852257, -3265436, -2231459, -691942, 394232, 1176754, 2909031, 4833610, 4330610, 1556640, 566831, 3731592, 7917158, 8671819, 5952904, 3208411, 2624775, 3910639, 6415610, 9588570, 11797014, 11233240, 8248749, 4957229, 2239578, -1099804, -5513520, -8742199, -8272763, -4982699, -2361566, -1928183, -1460433, 1091650, 3854735, 3477285, 227400, -2282610, -2343199, -1934641, -2423832, -1728258, 2025714, 6335106, 6696109, 2230664, -3438397, -6565394, -6570976, -5039899, -3247031, -1359120, 759380, 2775154, 4219370, 5446519, 7395552, 9734197, 10260954, 7563943, 3452840, 929379, 436497]
41258D36497k04801n30582j17834j23007j169950r67219J593734L206385J052949
41249C176172k068775j965903M39092J560275J242868J218203M41153k099810
41241A943275k816302J344682N630533L149136l776824o347077k765609p5772
41233c713958j873886l254303k97740L614466M255825K473688M95731j581275
41225A18548k862102j138235K187910K564790j40934r21469J296252J090357l665163
41216a470046o837403l481833K286506M127531K573987J781616J925810N62257
41208A468425j833101k727373j514924R00730L821913N504006L624530p63655
41200H480551l630007l932559m233403m034137N93410P996588R507460J941498
$$ y = [436497, 231696, -298886, -416720, -539727, -1709677, -2676896, -1083162, 2123223, 3176172, 1107397, -858506, -419414, 1140861, 2383729, 3601932, 4043085, 1943275, -873027, 471655, 6102188, 9251324, 5474500, -872577, -3638186, -3713958, -5587844, -8842147, -9139887, -5525421, -1269596, 1204092, 1699823, 118548, -2743554, -3881789, -1693879, 870911, 729977, -191492, 1104760, 2195117, -1470046, -8307449, -11789282, -9502776, -5375245, -2801258, -1019642, 906168, 1468425, -364676, -3092049, -4606973, -3706243, 115670, 5619676, 9244206, 8480551, 4850544, 917985, -3315418, -7349555, -6756145, 1240443, 10747903, 12689401]
41192A2689401n816723m994425P76261K479883o34778k580276j646830j332456
41184a059943k470113k228743k01294Q16977j71927j312051j124405O67569L735896
41175c348034N679158L167516k274365m022290J37153L551456R87357k520149
41167A357802k52227M263179L030338k664229m534048j251662M97037j368141
41159i21951j329534K391169L633703q25508m913522k934398J332228J178769
41151b389044k473192l454928k01088L015512L496737L145641L613250L124735
41143G877623K05743k645230k099228P13947J525932o28257k108698r95399m46464
41134A399969k683064l812319J37852N178417M223637j579747m112928p88133
$$ y = [12689401, 6872678, 1878253, 2654514, 5134397, 4499619, 1919343, 272513, -1059943, -3530056, -5758799, -5960093, -5143116, -5315043, -6627094, -7751499, -7083930, -3348034, 2331124, 5498640, 3224275, -798015, -660862, 2890594, 3877951, 1357802, 1105575, 5368754, 8399092, 5734863, 1200815, -50847, 446190, -921951, -2251485, 139684, 3773387, 2947879, -1965643, -4900041, -3567813, -2389044, -4862236, -8317164, -8518252, -5502740, -2006003, 1139638, 4752888, 7877623, 8083366, 5438136, 3338908, 4052855, 5578787, 4950530, 2841832, 1846433, 1399969, -1283095, -5095414, -4957562, 220855, 4444492, 2864745, -1248183, -2036316]
41126b036316K376294J435934j25609O90647J387102M80706J006694L192784J707968
41117A0116204m495162p603083k594216M081333M658432J670930J293069J880111
41109I007618j375405n758383n048606n12514J538446K38154m80314j12015p07489
41100c210508p11073J958501L757273Q98946k561109j002167K165079K68697l781790
41091b218151j928393M083236M609635j570371n285225k471613K00918k145187
41083f725151n021172l145559K027798O585338Q763028P258073J782141l575225
41075G949271m143185j698289q58667m34404K845968M729426q25849p980822m866186
41066e282737O436112J0612562K556453n144640l181355J220985l28588l017175
$$ y = [-2036316, 339978, 1775912, 1650303, 2340950, 3728052, 4208758, 5215452, 8408236, 10116204, 5621042, -1982041, -4576257, -494924, 4163508, 5834438, 7127507, 9007618, 7632213, 1873830, -3174776, -3687290, -2148844, -1910690, -2391004, -2503019, -3210508, -3921581, -1963080, 1794193, 2693139, 132030, -870137, 1294942, 1563639, -2218151, -4146544, -63308, 4546327, 2975956, -2309269, -4780882, -4579964, -6725151, -11746323, -14891882, -12864084, -6278746, 2484282, 9742355, 11524496, 7949271, 3806086, 2107797, 1249130, 814726, 3660694, 8390120, 7564271, -416551, -5282737, 1153375, 11765937, 14322390, 9177750, 5996395, 7217380, 6888792, 3871617]
41058C871617j07931L400524K55135n025209l643273K520034M691677J217975
41050G180549k206083k656140j645735J21925K173142J634536k305546m919300
41042b622652k799365J62521m76507k017877j48873K930999K941308J321318J406665
41033F97537J442874j122176k900931n9338L597133K294767j674588k130982J61318
41024C05614q4170k117070o62727L449870L859076j85624k347479J34832K590747
41015D943069J504307m27437l01190J33656j454384l714363m087456k314639K12589
41006e505848K069810K089947M10629p76504K35244K080906K535008J880673J463478
40997F483343P87115q58572j943112j299825r95959k872202m535943k972360Q2466
$$ y = [3871617, 3763686, 7164210, 7419345, 2394136, -1249137, 1270897, 5962574, 7180549, 4974466, 2318326, 672591, 794516, 2967658, 4602194, 2296648, -2622652, -5422017, -5259496, -5736003, -7753880, -7902753, -4971754, -2030446, -709128, 697537, 2140411, 1018235, -1882696, -1942034, 1655099, 3949866, 2275278, 144296, 305614, 221444, -1895626, -2558353, 891517, 4750593, 4564969, 2217490, 2352322, 4943069, 6447376, 6019939, 5718749, 5852405, 4398021, 683658, -3403798, -5718437, -5505848, -3436038, -1346091, -935462, -1711966, -1476722, 604184, 3139192, 5019865, 6483343, 7270458, 6411886, 4468774, 3168949, 2172990, -699212, -5235155, -8207515, -8125049]
40988h125049Q89851k05509j35038J304321K021419K043750K486452J917345j062592
40979A134950l366443j232805K893251L342576K20481r29022J661961L543276
40971G268225J667218j546653l299330m146843m621023k964141J109164M171988
40963b361395L414308O08281o14434M47428J492312P19329j185006k183222j280032
40954i42431L15904O68397m25191j442016j378402l75260J438838L275529K580631
40945C715999j668366n129924k717665K889930L829631q74117l618037r87556
40937d560105Q21579k089203l558571J290671N879013K812995k797878j654881
40929c856380L918032M349833j072685m558276l572942k326638j343877K546688
$$ y = [-8125049, -7235198, -7440707, -7575745, -6271424, -4250005, -2206255, 280197, 2197542, 1134950, -2231493, -3464298, -571047, 2771529, 2992010, 2062988, 3724949, 7268225, 8935443, 7388790, 4089460, -57383, -4678406, -7642547, -6533383, -2361395, 1052913, 1661194, 1046760, 1494188, 2986500, 3705829, 2520823, 337601, -942431, -626527, 41870, -383321, -1825337, -3203739, -3578999, -2140161, 1135368, 3715999, 2047633, -3082291, -5799956, -2910026, 919605, 45488, -3572549, -4560105, -3738526, -5827729, -9386300, -8095629, -2216616, 596379, -2201499, -3856380, 61652, 4411485, 3338800, -1219476, -4792418, -7119056, -8462933, -5916245]
40921e916245O871930N885452J518292L06320O57289l707840q571773l034301
40913e990876R995884J3835589L251028o683733m270428J885219k88608o618216
40905E115859o578621j813493p38228k507124k92537M651285N227553J435057
40897D499751o45803k84848j621027l695067j569526L457540M596793N46200k895489
40888B388524k347883k69459J064612J783840R97087j870638l181625J88254L507250
40879B259962n7556p160302p308347J110465P712922N483964j77464j662216L01572
40870E03000J549642K394505M272648M308447m1224n010122n429487k469785p77466
40861f99842p68148K79504J715048N40091k020805j334322K758129M558489P62318
$$ y = [-5916245, 955685, 6841137, 8359429, 8665749, 9323038, 5615198, -2956575, -5990876, 4005008, 17840597, 21091625, 14407892, 10137464, 12022683, 11734075, 5115859, -1462762, -3276255, -4014483, -6521607, -6814144, -2162859, 3064694, 4499751, 3853948, 3569100, 1948073, -1746994, -3316520, 141020, 4737813, 5284013, 2388524, 40641, -228818, 835794, 2619634, 3616721, 1746083, -1435542, -1247288, 2259962, 2202406, -4957896, -12266243, -11155778, -3442856, 2041108, 1863644, 201428, 503000, 2052642, 4447147, 8719795, 13028242, 12987018, 7976896, 2547409, 77624, -699842, -1467990, -1188486, 526562, 1066653, -954152, -2288474, 469655, 5028144, 5790462]
40852E790462m446670n131156j355633J628080M43350k603203k761833J256304
40844g180299N345676M660026l7933k809770m16322L071532K320799j395216k946716
40835F11777j898759j972990k566306J185217P889576Q212580r99191q899072
40827A562832n187749L815040M391124l206652n608399J712967P294868K593110
40819G367141m849594m776654p6860P13056j472422j94303L019313J643847k398929
40810a025405j005591M984859N619144j312230n393002p6359O626238M668398
40802A3086052l189103o979171m159996m90496L03815O9710O37969R27253j20823
40793H5210j783801k898350k459309K78956M073508N461730K680230j444153k702783
$$ y = [5790462, 1343792, -3787364, -5142997, -3514917, -3071567, -5674770, -8436603, -7180299, -1834623, 2825403, 2787470, -22300, -438622, 2632910, 4953709, 3558493, 611777, -1286982, -3259972, -5826278, -4641061, 3248515, 11461095, 10461904, 1562832, -3624917, 190123, 4581247, 1374595, -4233804, -2520837, 4774031, 7367141, 2517547, -2259107, -2335967, -1622911, -3095333, -3289636, -270323, 1373524, -1025405, -2030996, 2953863, 8573007, 7260777, 1867775, 1791416, 8417654, 13086052, 9896949, 2917778, -1242218, -1732714, -1428899, -1359189, -721220, 206033, 85210, -1698591, -4596941, -7056250, -6777294, -2703786, 2757944, 5438174, 3994021, 1291238]
40784A291238l78224K835238M174683K411028j876807n661935n117357r3145M778169
40775B362888N361802K499166n64515k677116m086121l602341l4002M518156O012192
40766I790109L173041j190575l586945l140460j505311m23786K60207J729394
40758E105674L247742K034060k153003m741083k241812J713445J363106j723247
40750B604882r88109L554777M370981r63870m796144j462145L569006K912511
40742H801889r63291q54779L061030M462982J490635j562472j788560l75693J233918
40733A3505659K340428J373111j696162l109876m70071K326013Q02800k364506
40725A2707396j904799O02958l18265l642825l213239J091367K688534l67349
$$ y = [1291238, 913014, 3748252, 7922935, 10333963, 8457156, 2795221, -2322136, -2415281, 2362888, 7724690, 10223856, 9659341, 6982225, 2896104, -706237, -740239, 3777917, 9790109, 12963150, 11772575, 8185630, 5045170, 3539859, 3116073, 3376280, 5105674, 8353416, 10387476, 8234473, 3493390, 1251578, 2965023, 4328129, 2604882, 1616773, 5171550, 9542531, 8578661, 3782517, 2320372, 5889378, 8801889, 7838598, 6983819, 10044849, 14507831, 15998466, 14435994, 12647434, 12271741, 13505659, 15846087, 17219198, 15523036, 12413160, 11943089, 14269102, 15071902, 12707396, 10802597, 11405555, 11087290, 7444465, 4231226, 5322593, 8011127, 7643778]
40717G643778k266420K73283K899872J793179n28208j030133j082841j929901
40709E772609j432947R43392J726365l08453j293252N17233Q55975k609679m637729
40700d66486o67175M602816L818980j734417m641691k572137J30434P08380R61368
40691A40072J920148J534554j141166l799958m131623k296155K23375J789046
40683e761707R96939j587695k796720n55069K756435L371792J390541n5865L89684
40674a851665J686447L274441M764689L947822m18465m523121l238867J899595
40666E540876L785333m2705l740101k200890J385205J108323k420187l646204
40658b30350r50828J491673P47221q39622k99072R78238j65986l023525l306386
$$ y = [7643778, 5377358, 5650641, 8550513, 10343692, 9815484, 8785351, 7702510, 5772609, 4339662, 5283054, 7009419, 6700966, 5407714, 5924947, 6780922, 4171243, -466486, -1133661, 3469155, 7288135, 5553718, 912027, -1660110, -1529676, -821296, 140072, 2060220, 3594774, 2453608, -1346350, -5477973, -7774128, -7550753, -5761707, -4764768, -6352463, -9149183, -9704252, -6947817, -3576025, -2185484, -2241349, -1851665, -165218, 3109223, 7873912, 11821734, 11403269, 6880148, 3641281, 5540876, 9326209, 9283504, 5543403, 3342513, 4727718, 5836041, 3415854, -230350, -1181178, 310495, 1057716, 218094, -80978, 897260, 731274, -2292251, -5598637]
40649e598637R53552O370703Q095511N107572L50749l138825m437280l788569
40641C914776j770815K42588P16748j64968o93661k15602J92634J45287P11645
40632C078632J654795O86551k404863l705053o07350K987383J477210l510624
40624c43319m399921J368183O971218N451751q97670m280021j877623J771071
40616C763669J927675q90894l171368l066846j375247M66911J875044K986238
40608B515182L806033L736207K187477l66745k568284l517233l165268j550494
40600A076875P94112J680746q59097m552883l979987J866313O346285L596068
40592E968432k368580k707250L104059O139622J366131m987649n231067j198987
$$ y = [-5598637, -4645085, 1725618, 9821129, 14928701, 15279450, 12140625, 7703345, 3914776, 2143961, 2386549, 3103297, 2938329, 2244668, 2029066, 2221700, 2366987, 3078632, 4733427, 5419978, 3015115, -689938, -1297288, 1690095, 3167305, -343319, -4743240, -3375057, 3596161, 9047912, 8150242, 3870221, 1992598, 3763669, 5691344, 4800450, 1629082, -1437764, -2813011, -2346100, -471056, 2515182, 6321215, 10057422, 12244899, 11878154, 9309870, 5792637, 2627369, 1076875, 1870987, 3551733, 2692636, -1860247, -5840234, -3973921, 2372364, 5968432, 3599852, 892602, 3996661, 10136283, 11502414, 6514765, 1283698, 84711]
40584H4711M48600o50184M27790M006734M903826J583883j102845j51250J056232
40575A0607497o92442k961812k489008p53494m78871o30123L91685K47511l029752
40566B11191n182049r35534O358910P615788R99297n082454m013581N84435J980002
40557B536005J35875o73282J51932j27006j505466j277714O12602J395982N90782
40548A839710N60959J557314Q99209j750998k860888p77310J174662J16858j548541
40539g89025k99415K436922K554543k65240k571505k456145p76299J897919M998166
40530D729921N262822j97777p464450q175718n38802P237476P636294L066888
40522A1556654L05100L30323n84297k889522l491910k079151j422829j727057
$$ y = [84711, 533311, -116873, 310917, 4317651, 9221477, 10805360, 9702515, 9551265, 10607497, 9915055, 6953243, 4464235, 3710741, 3231870, 2601747, 2993432, 3240943, 211191, -4970858, -5906392, 452518, 8068306, 9067603, 3985149, -28432, 556003, 2536005, 2671880, 1998598, 2150530, 2023524, 518058, -759656, -147054, 1248928, 1839710, 2400669, 3957983, 4857192, 3106194, 245306, -532004, 642658, 759516, -789025, -1088440, 1348482, 3903025, 3637785, 1066280, -1389865, -2166164, -268245, 4729921, 9992743, 9794966, 2330516, -5845202, -6384004, 853472, 8489766, 11556654, 11861754, 12192077, 11607780, 8718258, 5226348, 3147197, 1724368, -2689]
40514b689n64447J456622Q95446j975704k819996o94340K80374j366609j566877
40505f358220J397691K718844o31636l506435n65977M364567M174312J13284n52361
40496A154069L219906M766377Q80510l257177k526347R53085K210818N02872j183909
40487F720204p17400J573517L752890L307723m98172m497103m438219o57455J934089
40478F480074L50668k998357m356872l082068p81029J106873J445582k24155k100005
40469d159289j413549J537266L211763J709227q59780j836101j000968P61427
40461b050004K684121L165047J001421j660932j495063K67042p87118m034871
40453b910357l257291L009072P332721M259689r99159j077055J819268O55449
$$ y = [-2689, -567136, 889486, 1784932, -190772, -3010768, -3705108, -3424734, -4791343, -6358220, -4960529, -2241685, -2873321, -6379756, -6945733, -2581166, 1593146, 1706430, 1154069, 4373975, 9140352, 10020862, 6763685, 4237338, 5190423, 7401241, 7904113, 6720204, 6002804, 7576321, 11329211, 14636934, 14138762, 9641659, 5203440, 4545985, 6480074, 6830742, 3832385, -524487, -3606555, -4387584, -3280711, -1835129, -2059284, -4159289, -5572838, -4035572, -823809, 885418, 25638, -1810463, -2811431, -2050004, 634117, 3799164, 4800585, 3139653, 1644590, 1911632, 1124514, -2910357, -6167648, -3158576, 4174145, 8433834, 7434675, 6357620, 8176888, 8832337]
40445H832337l786475m141551J014356M732201K504862k061079m064571l392079
40437c61999j887417P5885J795866J406842r72648k677947k419855j586451j132565
40428g760289o84235p48843j826492j705805J603225M794171K937755j978154
40420e368667l013208P05055K672026L18947q74520K213833M466962J900159j223816
40411A796771o43691K61184j843799k393822K594879O805356K605390n260618
40403C921650o071694J45010L824489J865094M34455K028797J877150j049053
40395F975898j094253K714144L169715k682367p417422m979494K16970J871283
40387a225526J364130K133149J910173j884540n076264k898527J471903J926349
$$ y = [8832337, 5045862, 904311, 1918667, 6650868, 9155730, 7094651, 3030080, -361999, -2249416, -2173531, -377665, 1029177, 56529, -2621418, -5041273, -6627724, -7760289, -8444524, -9193367, -11019859, -12725664, -11122439, -6328268, -3390513, -5368667, -8381875, -7676820, -5004794, -4685847, -5560367, -3346534, 1120428, 3020587, 1796771, 1153080, 1414264, -429535, -2823357, -228478, 6576878, 9182268, 3921650, -2150044, -2005034, 1819455, 3684549, 4119004, 6147801, 8024951, 6975898, 5881645, 8595789, 11765504, 9083137, 1665715, -3313779, -3096809, -1225526, 138604, 2271753, 4181926, 2297386, -2778878, -5677405, -4205502, -2279153]
40379b279153j011045k554732j849911j046199J88468K511274K928454j55456
40371c268300j839786J789539N199950J373460n246761m272860L851877P822607
40363E409726K748824l453018l385704J01015J459912J100402J540903J758269
40355G280329M00242o56943j84387l16462j912345k024246O96141K940424K303733
40346H526486Q42289j06458k946985p677752q661976k862310L855446M675643
40338d355617J753556J640638M285145L884041j020172n250925m707671q60644
40330d631649K735881M031813K422516j189304m131757m485136l234624j718657
40322a0200917R71715M886990O157099J717041m626765o050354j913917J936310
$$ y = [-2279153, -3290198, -5844930, -7694841, -8741040, -8552572, -6041298, -3112844, -3268300, -5108086, -3318547, 1881403, 3254863, -1991898, -6264758, -2412881, 5409726, 8158550, 4705532, 1319828, 1420843, 2880755, 3981157, 5522060, 7280329, 7680571, 7023628, 6839241, 6522779, 4610434, 2586188, 3282329, 6222753, 8526486, 9368775, 9262317, 6315332, -1362420, -10024396, -12886706, -9031260, -4355617, -2602061, -961423, 3323722, 7207763, 6187591, 936666, -3771005, -4631649, -1895768, 2136045, 4558561, 3369257, -762500, -5247636, -8482260, -10200917, -9229202, -4342212, 1814887, 3531928, -1094837, -7145191, -9059108, -7122798]
40314g122798J840818J13822m43221o74857j815489k175411K85090M460898P248876
40305A717728O752521L248321j566974n358258o327981m422422j126926J586333
40297e497658J947199l33774k519214q47251M067715O406425K586144k979918
40289B829668l535462N62786K991031J163529q34953J91481J478611n63610m069178
40280B13903m205338k26540L158257J606051l370797n765398k097654L876246
40272f811270N430336J794491o39831K199428N497681K712915l894199o058236
40264B31315j666391K708683K317821N45433J751805L639102J713890k340520
40256H901138k550875K255889O415318N072933j30667m472427o004747n610823
$$ y = [-7122798, -5281980, -5168158, -5611379, -6286236, -8101725, -10277136, -9992046, -5531148, 1717728, 8470249, 11718570, 10151596, 4793338, -1534643, -5957065, -7083991, -5497658, -3550459, -3884233, -6403447, -7250698, -3182983, 3223442, 5809586, 2829668, -705794, -143008, 2848023, 4011552, 3176599, 3368080, 4846691, 4283081, 213903, -3991435, -4217975, -1059718, 546333, -2824464, -8589862, -10687516, -6811270, -1380934, 413557, -226274, 1973154, 7470835, 10183750, 6289551, 231315, -1435076, 1273607, 3591428, 4136861, 5888666, 9527768, 11241658, 8901138, 6350263, 8606152, 15021470, 20094403, 19963736, 15491309, 9486562, 3875739]
40248C875739l590352K50392L810459L900466J117502j65958J425823J429751
40240A2053822l106534p300218m908574J655624M661528K875324J994316L479730
40232A1405018K270221k497905m331742r13030R12691k678047m927522n30673
40224a290989M178889K445955m02619K788000O163355K78099r421240r255560
40216d516110N19669O385103L622497J184744L128307K104245m315879o938934
40208A173642j319718L639738J455547r76494K574985N248375k05280p065785
40200D525010n355812J565738L667503P28705m08077L73488j704551m415497j325366
40191b348859N227874O004533m07505n485043m098140k53893J765444L049082
$$ y = [3875739, 285387, 535779, 4346238, 8246704, 9364206, 9198248, 10624071, 12053822, 8947288, 1647070, -3261504, -1605880, 3055648, 5930972, 7925288, 11405018, 13675239, 11177334, 6845592, 5932562, 6845253, 4167206, -760316, -1290989, 2887900, 5333855, 4931236, 7719236, 13882591, 14160690, 4739450, -4516110, -3996441, 2388662, 6011159, 7195903, 10324210, 12428455, 8112576, 1173642, -146076, 3493662, 4949209, 3972715, 6547700, 11796075, 11590795, 4525010, -830802, 734936, 4402439, 5131144, 4723067, 5096555, 3392004, -1023493, -2348859, 2879015, 8883548, 8476043, 2991000, -1107140, -1361033, 404411, 3453493]
40183C453493M595238L856185k17305m175427m596856j854250J592135L405254
40175F058467K208471n76698j183478Q85985P05316m056376o996231j696645O827817
40166B176628Q023056J329634l560672j784146J137790N12978l92324J562541
40158I005485K467953j583571o329333m772406K229834O656447L854724j935131
40150I594002l416287P41412M528117K433354l105896m944452j480653J223456
40142E573053o07497k310555Q46781M741018K894338k173686k628576J832852
40134H167728L883180Q59194j865249q78541M17446p33871j787571q03707l73251
40125F885358k179111l267031j191534J832439K912640K450241J794946R75294
$$ y = [3453493, 8048731, 11904916, 11687611, 7512184, 2915328, 1061078, 2653213, 6058467, 8266938, 7690240, 6506762, 7392747, 8098063, 4041687, -2954544, -4651189, 2176628, 10199684, 11529318, 7968646, 6184500, 7322290, 7835268, 7442944, 9005485, 11473438, 9889867, 3560534, -1211872, 1017962, 7674409, 11529133, 9594002, 6177715, 6919127, 11447244, 13880598, 10774702, 5830250, 4349597, 5573053, 4965556, 2655001, 3501782, 8242800, 11137138, 8963452, 6334876, 8167728, 12050908, 12910102, 11044853, 10166312, 10583758, 9849887, 8062316, 7258609, 6885358, 4706247, 1439216, 247682, 2080121, 4992761, 7443002, 9237948, 10213242]
40117A0213242N24013J400272J920883n44279l999406l464719Q77746L452475
40109A0380227K440256K023821L571552K623248k008371m409789j564131R04622
40101A3961435j079698k087233K912104P902175M733705k566608l185147L560616
40093B4151349P569624L752638j808745l055359k067134k595377l031205o00297
40085B2315494K618832K923386J286671J946253N815302Q719758O572918O37381
40077E2835995l331682j431780L510325N209051K359651O58794M293594Q971793
40069G3075741P868335K185372q7994M399376J0232392J1884119J0802201J0894091
40061A31253633J1727845J0597890Q248437P650683Q407904O844807J553922m748196
$$ y = [10213242, 10737255, 12137527, 14058410, 13514131, 9514725, 6050006, 6927752, 10380227, 12820483, 14844304, 18415856, 21039104, 19030733, 14620944, 13056813, 13961435, 12881737, 10794504, 13706608, 21608783, 26342488, 23775880, 20590733, 24151349, 31720973, 35473611, 33664866, 30609507, 28542373, 25946996, 22915791, 22315494, 24934326, 27857712, 29144383, 31090636, 36905938, 45625696, 52198614, 52835995, 49504313, 48072533, 51582858, 56791909, 59151560, 59810354, 64103948, 73075741, 80944076, 83129448, 83041454, 87440830, 97673222, 109557341, 120359542, 131253633, 142981478, 153579368, 161827805, 169478488, 177886392, 184731199, 186285121, 181536925]
40053A81536925r086446j0791446j0122262p902998p168312j1141414j7709140
40046A07614907j9678520j3464246m462556m17284k245888n387679p366174q658135
40038D5934425q154388m341552l62462j028951m527807m307916n715J800405l96143
40029B4609896M7076M940188N730328j970077q455517m581255K430974M96215
40021B3247828o792608o144250K613789O062280m75566o238255l791530M66094
40013H947782J6611j096321J393371K778921q50956l565899M03889N737447M488758
40004A8253603j139603l638881k244139j240492r41229R37464K672029J384229
39996A4042981p91831o27057j76916k085316k785285J569047O396817M835599
$$ y = [181536925, 172450479, 161659033, 151536771, 143633773, 136465461, 125324047, 107614907, 87936387, 74472141, 70009585, 69592301, 67346413, 61958734, 54592560, 45934425, 37780037, 33438485, 33076023, 32047072, 27519265, 23211349, 23205634, 25006039, 24609896, 24656972, 29597160, 35327488, 33357411, 24901894, 20320639, 22751613, 23247828, 16455220, 10310970, 12924759, 18987039, 18511473, 12273218, 8481688, 8947782, 8964393, 7868072, 9261443, 12040364, 11189408, 7623509, 8027398, 13764845, 18253603, 17114000, 13475119, 11230980, 9990488, 9049259, 9986723, 12658752, 14042981, 13251150, 12624093, 12447177, 10361861, 7576576, 9145623, 15542440, 20378039]
39988B0378039n77288j738597J747319K812391o20246l056530j568135M13369
39980A7790322N69859R52825K217165J783318m95999j196281N78315J771863J303369
39971B5274756J760216L993436N461851N074959M549871M203656K589983P77555
39963E3686283J470758L443309K718098j63100l65863K782586M205373J595460
39955F9372904j127683j228187j509762m100787n903630m193837j748190k194274
39947D7366554m194652m234040k163114n93215j147586l666914o711691p346688
39939A7308654l462660K375546M797047K461894p49184k171512l163615m177949
39931A3218221k727660J050869K291929j405254n320408m217442L26401L212033
$$ y = [20378039, 19800751, 18062154, 19809473, 22621864, 22001618, 18945088, 17376953, 17790322, 18360181, 19313006, 21530171, 23313489, 22817490, 21621209, 22199524, 23971387, 25274756, 27034972, 31028408, 36490259, 41565218, 46115089, 50318745, 52908728, 53686283, 55157041, 58600350, 61318448, 61155348, 60789485, 63572071, 67777444, 69372904, 68245221, 67017034, 65507272, 61406485, 55502855, 51309018, 49560828, 47366554, 43171902, 38937862, 36774748, 36181533, 35033947, 31367033, 24655342, 17308654, 13845994, 16221540, 21018587, 23480481, 22731297, 20559785, 17396170, 13218221, 10490561, 11541430, 13833359, 12428105, 7107697, 2890255, 3216656, 6428689]
39923F428689K865099R81334j404595l395951k755293P72791L140402J040917
39915G673393k997193m339977k619177m33100J691518M356682N409594K289524
39907A1031264k640560m128226j360459J214565Q19707j04933J432157M193314
39899A0456829M668702J903477j555277k954363k357088k016928l001134l496787
39891A647431j624257J092712J567638J31633K73106K722142L671960Q48179k308514
39882H022030j527358K079989M074597K838666K86085j915475l413981l575811
39874F868742k074763n57059j063108l120891m333965l187877J69359M539896
39866b759666P497707O485645K014323k181858l939796m931287o078474m586316
$$ y = [6428689, 9293788, 10275122, 8870527, 5474576, 2719283, 3492074, 6632476, 7673393, 4676200, 336223, -2282954, -2716054, -1024536, 3332146, 8741740, 11031264, 8390704, 4262478, 2902019, 4116584, 4936291, 4831358, 6263515, 10456829, 15125531, 17029008, 15473731, 12519368, 10162280, 8145352, 5144218, 1647431, 23174, 1115886, 2683524, 2815157, 3088263, 5810405, 9482365, 10330544, 8022030, 6494672, 8574661, 12649258, 15487924, 15774009, 13858534, 10444553, 6868742, 4793979, 4236920, 3173812, 52921, -4281044, -7468921, -7299562, -2759666, 4738041, 11223686, 13238009, 11056151, 7116355, 2185068, -3893406, -8479722]
39858h479722O77399M663508K532741k133400k028634K447863L779918m73490
39850I86183l785422j299530K710632K324020o65213n42753K676365L597392K56881
39841F258555l059623k494383K64288J332563J29065q72899m27953n9091j168841
39832i8319k391292j177443K325271M470408K190264k732182m897154j262137
39824c572584M989281P470054L455642k992743n402753k143673J929545J755365
39816E488134j584168k989867r46557N10258j718822m955090m851250j534405
39808a2581767J630648L327898M476585M536758K135921r18825q96754J919335
39800C629799L041554Q08278j058463j16610M89387j868782l423369J90165N401006
$$ y = [-8479722, -7802323, -3138815, -606074, -2739474, -4768108, -2320245, 1459673, 986183, -2799239, -4098769, -1388137, 935883, 270670, -272083, 2404282, 6001674, 6258555, 3198932, 704549, 968837, 2301400, 2430465, 1557566, 1129613, 1070522, -98319, -2489611, -3667054, -1341783, 3128625, 5318889, 2586707, -2310447, -3572584, 1416697, 8886751, 12342393, 9349650, 3946897, 1803224, 3732769, 5488134, 3903966, 914099, -32458, 477800, -1241022, -6196112, -11047362, -12581767, -10951119, -7623221, -3146636, 1390122, 3526043, 2607218, 1710464, 3629799, 6671353, 7479631, 6421168, 6304558, 6793945, 4925163, 1501794, 1691959, 7092965]
39791G092965M914637o68660l032778R09591L828715n72086p394298p701264j502525
39782d125703L243325K416156l53955j053477m0206J303924K732331K581188j239022
39773E464561n891093n217073O60391L668650l14669m372844j210490N009827
39765b202740N379788M58796j539207J463235L338085J336017j10862J143168
39757I266280J107361j541113j682231K686202N376288K336986n03745K947791
39749A9993819P666170M829429l896117q706681o057323j748004m23401o05201
39741A1052691p73909k338740m612962l774250N29103L324816J701963j181875
39733C926837k061070k230897l063519k075098K161955N475161L609514p35222
$$ y = [7092965, 12007602, 11338942, 8306164, 9215755, 13044470, 12472384, 5078086, -2623178, -4125703, -882378, 1533778, 1179823, 126346, 86140, 1390064, 4122395, 6703583, 5464561, -426532, -5643605, -4983214, -1314564, -1629233, -6002077, -7212567, -2202740, 3177048, 3635844, 2096637, 3559872, 6897957, 8233974, 8123112, 9266280, 10373641, 8832528, 7150297, 9836499, 15212787, 17549773, 17046028, 19993819, 27659989, 32489418, 28593301, 19886620, 13829297, 12081293, 11657892, 11052691, 10278782, 7940042, 3327080, -447170, 81933, 3406749, 5108712, 3926837, 1865767, -365130, -3428649, -5503747, -3341792, 2133369, 5742883, 5007661]
39725E007661j714010Q62028K085501L24653p81603P67587J959019M02388j288260
39716G624964j26732J576750n14524n460428p528464m045466J195097L470443
39708c808360K636134J229983J38378r76613j149722M66590J839412L53375k548919
39699a819742k671250P73083L858542L526289J046305j135185k546401l168147
39691b136506k120406J17570J134257K76362N5699J898437L627499L351743K352484
39682H557139J552919p87039m395073m532032P95363N315623K687845k949012
39674F245733k460397L819894N954309l76077p143691n892453O24299L710011
39666D481628Q92461k547244j826818K059910M650954K910267j899545n216455
$$ y = [5007661, 3293651, 4155679, 6241180, 6565833, 5784230, 6551817, 8510836, 8913224, 7624964, 7498232, 9074982, 8560458, 3100030, -4428434, -8473900, -7278803, -3808360, -1172226, 57757, 196135, -780478, -1930200, -1463610, 375802, 729177, -1819742, -4490992, -3717909, 140633, 3666922, 4713227, 3578042, 1031641, -2136506, -4256912, -4139342, -3005085, -2728723, -2673024, -774587, 2852912, 6204655, 8557139, 10110058, 9323019, 4927946, 395914, 1191277, 6506900, 9194745, 6245733, 3785336, 7605230, 13559539, 13183462, 6039771, 147318, 771617, 4481628, 5374089, 2826845, 1000027, 3059937, 7710891, 10621158, 8721613, 3505158]
39658C505158l889900J37366K523264K121356R78130k74435k580620m257102k112562
39649c849345K286184L315561J55031j256189J899638M057118N75592l873164
39641C310426k662036J956092K897608k73559j998659r05315r44956k716556j979508
39632c316463J841843L322319o6026l223574j209582L392753M813709J919128
39624G474107j951228l916070l145642j82310K568081K190242n58064j267400
39616A211716J638702L885513J760654k045043k823103q07704P16645J347383
39608D884763K369957K006868j946201n921489l781566L335518O879281K411399
39600A0238530m450542o218252k690716J217322K553776J642236m38503k252070
$$ y = [3505158, -384742, -247376, 2275888, 4397244, 5375374, 5100939, 2520319, -1736783, -3849345, -1563161, 1752400, 1907431, 651242, 2550880, 6607998, 7183590, 3310426, 648390, 2604482, 5502090, 5228531, 3229872, 2324557, 1379601, -1336955, -3316463, -1474620, 1847699, 1781673, -1441901, -2651483, 741270, 5554979, 7474107, 5522879, 1606809, -1538833, -1721143, 846938, 3037180, 2479116, 1211716, 2850418, 6735931, 8496585, 6451542, 3628439, 2820735, 3537380, 4884763, 7254720, 9261588, 7315387, 1393898, -2387668, 947850, 7827131, 10238530, 5787988, -430264, -3120980, -1903658, 650118, 2292354, 1853851, -398219]
39592c98219k264572j141901j099281j370261J380929N904179N538332j092536
39584E456670m913678R96665R048990O905138l759897r468186n231651n27135
39576a493084k485040n084682j189329M697835M276141j011617l471895j578853
39568g340524N5825J53494J486213L552927K634605r82048k750741j010103J562392
39559b637960L296039M332691K835147k697809p543509m905349L092779O492499
39551B264528J620365l920161l555534p62866p65849j050900K537780O229705
39543B597068L559089l229455n635607j424453L160406L545030J832763O62596
39535E067437j117784m205437n751055l711523m70569P70208K68229m9475J5544
$$ y = [-398219, -2662791, -3804692, -4903973, -6274234, -4893305, 1010874, 6549206, 5456670, 542992, 1539657, 10588647, 17493785, 13733888, 4265702, -965949, -1493084, -3978124, -9062806, -10252135, -5554300, -1278159, -2289776, -5761671, -7340524, -7284699, -7131205, -5644992, -2092065, 542540, -439508, -3190249, -4200352, -2637960, 658079, 4990770, 7825917, 5128108, -2415401, -7320750, -4227971, 2264528, 3884893, -35268, -3590802, -4353668, -5119517, -6170417, -3632637, 2597068, 6156157, 2926702, -2708905, -4133358, -972952, 2572078, 4404841, 5067437, 3949653, -255784, -6006839, -9718362, -10188931, -9418723, -9150494, -9199969, -9184425]
39526i184425j89352q6452R15158J818215J747644J696774K636092L438776K637973
39517E430403P53549r99904k544503l336679j196440L961627P140682L547868
39509A2756603l825688p008160l920022q43224k046309l094224Q67316N459571
39501a654137L102714l906437n084301K667781R445080N988633l583413q131168
39493a155248m154105K015408M151319K086948j429754m132553m021050n16589
39485g155624L124201K533386j514385l331520k05228L666767L292268k82041
39477A27824k169432n12129J997591K513402J184958j21717l38414R4207J34826
39468B911116o53779j659050j951965j240422J92473J956056L284084L025770
$$ y = [-9184425, -9373777, -9460229, -8545071, -6726856, -4979212, -3282438, -646346, 2792430, 5430403, 6183952, 5184048, 2639545, -697134, -1893574, 2068053, 9208735, 12756603, 8930915, 1922755, -1997267, -2840491, -4886800, -7981024, -7113708, -1654137, 1448577, -2457860, -7542161, -4874380, 4570700, 10559333, 6975920, -1155248, -5309353, -3293945, 857374, 2944322, 1514568, -2617985, -6639035, -7155624, -4031423, -1498037, -3012422, -6343942, -6549170, -2882403, 409865, 127824, -2041608, -2553737, -556146, 1957256, 3142214, 3020497, 2682083, 2776290, 2911116, 2257337, 598287, -1353678, -2594100, -2401627, -445571, 2838513, 5864283]
39460E864283J029835j080703j776147j567147j705751j964044j611923j505512
39452d317109k618418l307968j161768K735090M718864L802895K440206J653608
39444C945400l96734l546580l690025J244544O562980N871326o20182o236509
39436C134220n869592j273801J935047R04086j660239j255380K254512L811307
39428A980160r2076n676203o150609q43969M128500M488311K397933J196387M90801
39419A919235p98941q90127J547389L646513J835640k988203p019131q295555
39411a1043180p012479l392600J529469M999915N488052M590927L472253M51672
39403i15971m502463o559025k323986L563385M069703P268j846099L28972J613984
$$ y = [5864283, 6894118, 5813415, 4037268, 2470121, 764370, -1199674, -2811597, -4317109, -6935527, -10243495, -11405263, -8670173, -3951309, -148414, 2291792, 3945400, 3548666, 2086, -3687939, -2443395, 4119585, 9990911, 9370729, 3134220, -2735372, -4009173, -2074126, -1170040, -2830279, -4085659, -1831147, 1980160, 1888084, -3788119, -9938728, -10782697, -6654197, -2165886, 232047, 1428434, 1919235, 1120294, 230167, 1777556, 5424069, 7259709, 4271506, -2747625, -11043180, -18055659, -21448259, -19918790, -14918875, -9430823, -4839896, -1367643, -915971, -5418434, -11977459, -14301445, -10738060, -6668357, -6661089, -8507188, -8178216, -6564232]
39394f564232k31560j093878J650453M383819L684323J760135J432327P14044
39386E735431k734888n745948l843690J204668L670969K338013J147249J762516
39378C534320J175808k099251m590963l228731k23671O93405M5639Q27008K792791
39369a073645K806552L88193j289422n61669M33324j8446l77970N53470O56519
39360A516906j739924l945667k601324Q01627K218299J197681K36117n55376k787076
39351e658737m544368j969877L376750N036140J153184k622122k004942L44145
39343f889827J154169K003234M113684L961118j72640k808971O66482N148262
39335G175511K929069l684812n630801j261210J860364m68492l547854k880240
$$ y = [-6564232, -6795792, -7889670, -6239217, -1855398, 1828925, 3589060, 5021387, 5735431, 3000543, -2745405, -6589095, -5384427, -1713458, 624555, 1771804, 3534320, 4710128, 2610877, -1980086, -5208817, -5432488, -4739083, -4693444, -3866436, -1073645, 1732907, 2121100, 831678, 270009, 703333, 684887, 306917, 860387, 1516906, -223018, -4168685, -6770009, -5968382, -3750083, -2552402, -2316285, -2871661, -5658737, -10203105, -12172982, -8796232, -3760092, -2606908, -5229030, -7233972, -6889827, -5735658, -3732424, 381260, 4342378, 4169738, 1360767, 2027249, 7175511, 10104580, 6419768, 788967, -472243, 1388121, 919629, -2628225, -5508465]
39327e508465r85128j485433k549241o89426L043436M878043L741298J512075
39319A957159l25619j596426k194732j955649j187776l05238O54036J945870L841693
39310H33318N653846M840396m94332o947535p299186J19012P045452N117645k653628
39301F214988o120840j915527L510641M174344J002175k638163n182986n041108
39293e996476o69763N142030O344211J540553l635175m201462j514275P50420
39285b239937J816240K552620K829446K413089J503591o18052m047346n498998
39277a289347k057745K437946J264950m231360n299107M57679M529938R71984
39269c215062l939577j981454M053773N633059J835673r35942J83142J744007
$$ y = [-5508465, -6493593, -7979026, -10528267, -11217693, -8174257, -3296214, 445084, 1957159, 1631540, 35114, -2159618, -4115267, -5303043, -5608281, -4954245, -3008375, 833318, 6487164, 11327560, 10833228, 3885693, -3413493, -3294481, 3750971, 8868616, 6214988, 94148, -1821379, 1689262, 5863606, 6865781, 4227618, -955368, -5996476, -6666239, -1524209, 4820002, 6360555, 2725380, -1476082, -2990357, -2239937, -423697, 2128923, 4958369, 7371458, 8875049, 8256997, 4209651, -1289347, -3347092, -909146, 355804, -3875556, -9174663, -8716984, -4187046, -3215062, -7154639, -9136093, -5082320, 550739, 2386412, 1450470, 1633612, 3377619]
39261C377619R66973r53069k249107k459296j374650L01467N78410n36480Q3782
39252b264351L237737M372244L73082m337698l959450k77855Q08540r08511o43721
39243c599983K381001L943357K723429K304705M203374M901384J754292k794825
39235A5816734m909145l887436j596793q8242n94086k618845l778467k455801
39227d112081o1631J225942J548344J888818J511165j76052j324310n41034K10659
39218A69820p95055j324817O06707J881475q48315m161032k376642K735794M057208
39209e4857K60075k663718j503472l4633j371523k855002j388649J469254K675064
39200e467461J935644N83934l89685O9433K092429L102838Q33451k122533j470355
$$ y = [3377619, 4344592, 3391523, 1142416, -1316880, -2691530, -2390063, -1811653, -2348133, -2264351, 973386, 5345630, 5718712, 1381014, -2578436, -2856291, -2047751, -2956262, -3599983, -1218982, 2724375, 5447804, 7752509, 11955883, 16857267, 18611559, 15816734, 10907589, 7020153, 5423360, 5335118, 4741032, 2122187, -1656280, -4112081, -4173712, -2947770, -1399426, 489392, 2000557, 1824505, 500195, -40839, 169820, -625235, -1950052, -1343345, 538130, -310185, -4471217, -6847859, -4112065, -54857, 205218, -2458500, -3961972, -3996605, -5368128, -8223130, -9611779, -8142525, -5467461, -3531817, -2947883, -3337568, -3268135, -1175706, 1927132, 2760583, 638050, -832305]
39191h32305J490900J475855j903430l508062j707399p50348k204747j616179
39183i555715K943091O127223L601988j085546k787626k340298k622035k146310
39175g865228J400075N155114M709315J010889j684680k297261k444584k075516
39167d091876o78837m67126k964834m381612j76992O808118Q626397K869951l983743
39158A559446m941434l82214L729391K893710j797008n252231l858699K61278
39150g787761J865931q1122q60014K392373N458187L202623k339728n002309l330307
39141f482127q88324P95215L385316N954355M506275r62282m478358k110857K292230
39132B011443K805361l57146k197051n75590J524641J085434r04408j442374L92483
$$ y = [-832305, 658595, 2134450, 231020, -3277042, -4984441, -5734789, -7939536, -9555715, -6612624, -485401, 3116587, 2031041, -756585, -3096883, -5718918, -7865228, -6465153, -1310039, 3399276, 4410165, 2725485, 428224, -2016360, -4091876, -4770713, -5237839, -8202673, -12584285, -12761277, -5953159, 2673238, 5543189, 1559446, -3381988, -3764202, -34811, 2858899, 1061891, -4190340, -8049039, -7787761, -5921830, -6002952, -6862966, -4470593, 987594, 4190217, 1850489, -3151820, -6482127, -7370451, -6575236, -3189920, 2764435, 7270710, 6308428, 1830070, -280787, 2011443, 4816804, 4459658, 2262607, 1687017, 3211658, 4297092, 3392684, 1950310, 2342793]
39123B342793K594230K729751L70335k767687m441557l535264p08751K027898
39115a388252K668056R27203j289909j777496m57059P63291N29985n49252j235945
39106a809378j248829r45422l99879L79013R43586R47335Q68470J429568K243825
39097B408289J720144r09018l529425k610589J967294N109876K460501k721363
39089C895709l086998J951095M632317N89633m198181l174616J83951r17633m140843
39080d265566k084666L904937N159121O33130j285552K099956K864628k793462
39072D232526o496379j662048M617818L089690k363785j806846L984285N392412
39064H987673j91128n332148m871535j845977l50736k80506m00436m66026M95177
$$ y = [2342793, 4937023, 7666774, 8037109, 5269422, 827865, -2707399, -3416150, -1388252, 1279804, 2207007, 917098, -860398, -1317457, -554166, -24181, -573433, -1809378, -3058207, -4003629, -4403508, -4024495, -3080909, -2133574, -1265104, 164464, 2408289, 4128433, 3219415, -310010, -2920599, -953305, 4156571, 6617072, 3895709, 808711, 2759806, 7392123, 7981756, 3783575, 608959, 792910, -124723, -4265566, -6350232, -2445295, 2713826, 3346956, 2061404, 4161360, 7025988, 4232526, -2263853, -3925901, 691917, 3781607, 1417822, -389024, 3595261, 8987673, 8796545, 3464397, -1407138, -3253115, -3603851, -3884357, -4284793, -4750819, -4255642]
39055d255642K825556L408204m83937n259018m804016L21730L587609K127268
39047b532246n34273j398177j285223p70351Q90680K023916l8287k871270q14355
39038g329586N544483Q380215L686993k792104m036648r02190J026156l91985
39030C185334k736411l360803j750554O68785J467557j58285j425177M86601L278340
39021c44613K215918k045404l710167r05391J354880n55273l293560k457876Q19376
39012h922110K846668K881505K109617P24621o45373o4268K030834J965726j120661
39003A806559k526845O34822L520396M59076n427190n966034J02394N393653M506161
38994B502992N66529q16373M97838O81265j217694j987273K15304K400088R06185
$$ y = [-4255642, -1430086, 1978118, 1494181, -3764837, -8568853, -8247123, -4659514, -2532246, -3066519, -4464696, -5749919, -6520270, -5629590, -3605674, -3643961, -6515231, -7329586, -1785103, 6595112, 10282105, 7490001, 3453353, 2551163, 3577319, 3185334, 448923, -2911880, -4662434, -3993649, -2526092, -2684377, -4109554, -3622953, -344613, 1871305, -174099, -3884266, -4789657, -3434777, -3990050, -7283610, -9741486, -8922110, -6075442, -3193937, -1084320, -359699, -1005072, -1069340, 961494, 2927220, 1806559, -720286, -85464, 3434932, 3894008, -1533182, -7499216, -7396822, -2003169, 2502992, 3069521, 2253148, 2750986, 3432251, 2214557, 227284, 442588, 2842676, 3748861]
38985C748861k745886l496214k39914K288456R52688o34103J725750N071702L437193
38976A0108533k359792n697193m202566j880511r77294P36007L052329J661422
38968D40935l359518m921653N25872O416097N466861j73385m038248m997117n016021
38959i656177k511722L710274P681883K920467n765967o735151J732877Q274899
38951c48617M529274l767081o190504j762560K261392J947530N57365J564617
38943a208584L246303K114322j354796l280786j866116M00318P89672J45952N33070
38934d80645J065986l94123k379622j142678K821683M389184J491214j512667
38926C858332o11723K133207K796876J436739J03836j230923k840477k923375
$$ y = [3748861, 1002975, -2493239, -2733153, -444697, 507991, -126112, 1599638, 6671340, 10108533, 7748741, 2051548, -2151018, -4031529, -5008823, -4272816, -1220487, 440935, -2918583, -7840236, -7314364, -898267, 4568594, 4395209, 356961, -4640156, -9656177, -12167899, -8457625, -775742, 2144725, -3621242, -10356393, -8623516, -348617, 4180657, 413576, -5776928, -7539488, -5278096, -3330566, -2773201, -1208584, 2037719, 4152041, 2797245, -483541, -2349657, -1949339, -1159667, -1013715, -480645, 585341, 191218, -2188404, -3331082, -509399, 3879785, 5370999, 3858332, 3246609, 5379816, 8176692, 9613431, 9717267, 8486344, 5645867, 2722492]
38918B722492j242025j323514m407065n281217L137O040872M889884j642004m465034
38909d704474o29680L968380N122867M965815M777844J760773l829003o043420
38901E389102k327097J172463j248170n727321n147983o28918N16314l354753
38893a1356363n614650j535383M820465O581272L110668l43903j90919J747377
38885b781436J966613q054j934044k229204j233275J66873J285258J259051j19337
38876c627555j214241l79169R82993Q9946j989286o52392M757388P916168L757373
38867I641225l407896n057781j64544L788573J653815k818726l285522L45213
38859F94357K689676O33675l013446l732992q63961K400039L511534K930130J719089
$$ y = [2722492, 1480467, 156953, -4250112, -9531329, -9528192, -3487320, 1402564, -239440, -4704474, -5334154, -1365774, 3757093, 8722908, 13500752, 15261525, 11432522, 5389102, 3062005, 4234468, 2986298, -2741023, -7889006, -8517924, -8001610, -11356363, -16971013, -18506396, -13685931, -7104659, -3993991, -4337894, -4528813, -2781436, -814823, -822877, -2756921, -4986125, -6219400, -6052527, -4767269, -3508218, -3627555, -4841796, -5220965, -4237972, -4148026, -6137312, -6789704, -2032316, 5883852, 9641225, 6233329, 1175548, 1011004, 4799577, 6453392, 3634666, 349144, 694357, 3384033, 4017708, 1004262, -2728730, -3592691, -1192652, 2318882, 5249012, 6968101]
38850F968101n61617l642230m727641k260267M42895l23093k150148j42158M029807
38841b366351L938545m58492j959886J516899K918635j417323m559854p24014
38833c111841M420218L348036r64074j603786J892j229199k793066M66745M672496
38824C207421K429501l213988l162283J501052J269545m394539n498981J211791
38816f650481O961660N797936K187711L58187j855389m651713l552375P92634
38808f11830J643007j138084J48356N540787M897062l388268o687863M19938N049963
38799E873068k038906r037078k910172P192928M999274n073699o109027K125940
38791d977672M373398k372402m642801K293243O144532J23170n083229m92342
$$ y = [6968101, 6406484, 2764254, -1963387, -4223654, -3780759, -4103852, -6254000, -6396158, -2366351, 1572194, 1113702, -846184, 670715, 3589350, 2172027, -2387827, -3111841, 1308377, 4656413, 3692339, 2088553, 2090445, 861246, -1931820, -1465075, 3207421, 5636922, 2422934, -739349, 761703, 2031248, -2363291, -7862272, -6650481, 311179, 6109115, 8296826, 8655013, 6799624, 2147911, -1404464, -611830, 1031177, -106907, 41449, 5582236, 10479298, 7091030, 403167, 823105, 5873068, 3834162, -5202916, -8113088, -920160, 4079114, -994585, -7103612, -4977672, -604274, -2976676, -7619477, -5326234, 818298, 941468, -4141761, -4634103]
38783d634103N872157L567219k880704l010040K109441L369004r02603l784090
38775b93719j496640K377015L492555J422512j637599k800081m23317L107293
38767C748019K932031j541503m858517l210643J78790Q81669J54316J325407L055935
38758B665504J831427j353948k570686j609401j364163j567295P86623M657160
38750A475221M857098L37417l281078k368099j022922l593818o139718k170654
38742a1906553N536436P161688N68173m604637j284139M238888K442897m398909
38734b246156o258425j152765L199990K915949K638699M774219M324904j109208
38726G087207n305626l404399q1066r14734k680201q8434L986508L738546P30969
$$ y = [-4634103, 1238054, 4805273, 1924569, -1085471, 1023970, 4392974, 3490371, -293719, -1790359, 586656, 4079211, 5501723, 3864124, 1064043, 640726, 3748019, 6680050, 5138547, 280030, -2930613, -2751823, -1870154, -1715838, -390431, 2665504, 4496931, 3142983, 572297, -1037104, -2401267, -3968562, -3181939, 1475221, 6332319, 6669736, 3388658, 1020559, -2363, -3596181, -9735899, -11906553, -6370117, 791571, 1359744, -3244893, -4529032, -290144, 2152753, -2246156, -8504581, -9657346, -6457356, -3541407, -902708, 3871511, 8196415, 7087207, 1781581, -1622818, -1703884, -2618618, -5298819, -5387253, -1400745, 2337801, 3068770]
38717C068770j78836n87001m223925o928302k298095N269238N537330n24530j778235
38708b643586M000889N944445j072258o909914k683072M705764M116454k403520
38700C055202m537973n07272K044558l60570k579130n18395K547828J696716k451168
38691a610204m881988k463400K499247M739420K049727j885456k258400M00498
38683c410556J831246J196334J602884L265979K245833k126924m651953k141197
38675b188354J686303K677410K056438J791083K6096l718623m471318O11223N416149
38666C886407L037155k999091l819192R56219L194761n64094m474380l245837
38658d028052P06832K528268J700623O79435O49993R30662J08485k823306n896669
$$ y = [3068770, 2889934, 2302933, -1920992, -8849294, -11147389, -5878151, -340821, -865351, -2643586, 1357303, 7301748, 6229490, -680424, -3363496, 1342268, 5458722, 3055202, -1482771, -1990043, 54515, -306055, -2885185, -3403580, -855752, 840964, -1610204, -6492192, -8955592, -6456345, -1716925, 332802, -1552654, -3811054, -3410556, -1579310, -382976, 1219908, 4485887, 6731720, 4604796, -47157, -2188354, -502051, 2175359, 4231797, 6022880, 6048976, 2330353, -2140965, -1529742, 3886407, 6923562, 3924471, 105279, 1061498, 4256259, 3692165, -782215, -4028052, -3321220, -792952, 907671, 1587106, 2237099, 3167761, 3276246, 452940, -5443729]
38649e443729l892092M895225J2675334R379392l366504j2315246r171353n43725
38641g782698K730615J00608j087868J709613L623365J433103j757131k179735
38633c210128m30369J275540K725161L902745K843757j210356m489901k519517
38625a113068L072785N379714J045315m782231m707883J555250P044468O171582
38617A3665932M97978m558086n926186m242018j277096J426427K278820N79074
38609B444845k041158k912679j462554M13872J399916K292911L501791L038187
38601F675131o34598m817245m906987r86162J341217j286665m560497k582818
38593a1758624K814941M247328N9575k762173P66818N869138N373272M21054k167051
$$ y = [-5443729, -9335821, -4440596, 8234738, 17614130, 14247626, 1932380, -7238973, -7782698, -5052083, -4951475, -6039343, -4329730, -706365, 726738, -1030393, -3210128, -3640497, -2364957, 360204, 4262949, 7106706, 5896350, 1406449, -1113068, 1959717, 7339431, 8384746, 3602515, -1105368, 449882, 7494350, 13665932, 14163910, 9605824, 3679638, -562380, -1839476, -413049, 1865771, 2444845, 403687, -2508992, -3971546, -3557674, -2157758, 135153, 3636944, 6675131, 6040533, 1223288, -3683699, -4669861, -3328644, -4615309, -9175806, -11758624, -8943683, -4696355, -4636780, -7398953, -6632135, -762997, 4610275, 5031329, 2864278]
38584B864278o64423J00014k415143m539283k703376J358042L828296L543469
38576A371874J591079q17792k381940k103584r44201r31376k000971k142093q77436
38567i236440L32501J235782K843847M143114K802601k72044j521545p21908j379377
38558a773469l709382k977470K298574O136515L351318k633128n094315l280809
38550g682166j147795k5429J666837L389146K888847P94283j35800J52325o52026
38541g51778k485962k797215j037441O73787J352753J908078K122426O23238j863624
38532b255738k782163j706593o98757l20585J130181L550389L875709Q02342k278557
38523f83772j420247K635950N528931M531361R46490k137510k948677j962209
$$ y = [2864278, 2199855, 2299869, -115274, -4654557, -7357933, -5999891, -2171595, 1371874, 2962953, 2145161, -236779, -2340363, -3284564, -4215940, -6216911, -8359004, -9236440, -8903939, -7668157, -4824310, -681196, 2121405, 1849361, 327816, -394092, -1773469, -5482851, -8460321, -6161747, -25232, 3326086, 692958, -4401357, -7682166, -8829961, -8855390, -7188553, -3799407, -910560, -116277, -252077, -99752, -751778, -3237740, -6034955, -7072396, -6398609, -5045856, -3137778, -1015352, -392114, -2255738, -5037901, -6744494, -7443251, -7763836, -6633655, -3083266, 792443, 1594785, -683772, -2104019, 531931, 6060862, 10592223, 11538713, 9401203, 6452526, 4490317]
38515D490317q25804p16503j417294j802951j206394j71229L49204M79735J431871
38506F10952L271379L427803m39799n808895o530751o81528N619589N504309K44639
38497E217698l292886k384979n11953l48082l92837O55210J369763Q06683j34147
38488I84470j301181k718272j617500L853114Q027253K998031p919786j1418575
38480i112446k767605O504877N615124k49202m23276L736174L151871k465136
38472C990381m617492n29096L471113L044985Q81368k1943q4172M30150J689035
38463H254329J167901k850331n646492j741182M861753N130225o11817k873447
38455E690939J302286L696122o78767n145184l117844Q40107o52046n169240m675805
$$ y = [4490317, 3664513, 2948010, 1530716, -272235, -1478629, -1649858, -1300654, -820919, 610952, 3882331, 7310134, 6870335, 1061440, -5469311, -6150839, -531250, 4973059, 5217698, 1924812, -460167, -972120, -1320202, -1713039, -1057829, 311934, 1118617, 984470, -316711, -3034983, -4652483, -799369, 7227884, 10225915, 2306129, -9112446, -11880051, -5375174, 239950, -9252, -432528, 3303646, 6455517, 3990381, -627111, -1156207, 2314906, 5359891, 6241259, 6219316, 6135144, 6565294, 8254329, 9422230, 6571899, 925407, -815775, 4045978, 9176203, 8564386, 5690939, 6993225, 10689347, 10010580, 4865396, 1747552, 2587659, 1935613, -3233627, -7909432]
38446g909432J594955O381293M876123m05862m697276n842980l943056j23394
38438a0069629L309185L797176R03934k664962l040018Q85788N198838M485045
38430B805357j107799m973735k700154J635783J900671p11796o99069J836027
38422b014715J780973j286201k000567J262191L359109J028930k115097j906516
38414a891893P49580L030544L870420K597037r93152l775614j942085K387875
38406D032712L131498l31681k496852j408922j041072k366722r98789L332901
38398A853073M267858n3753k687187J18247K142799j108492l524933N09375N001548
38389F518535K282426l449611l546289K01790k1668l246773j934825L390018M365743
$$ y = [-7909432, -6314477, 66816, 4942939, 4537077, -160199, -6003179, -9946235, -10069629, -6760444, -2963268, -2059334, -4724296, -7764314, -6878526, -1679688, 2805357, 1697558, -3276177, -5976331, -4340548, -2439877, -3151673, -3850742, -2014715, -233742, -1519943, -3520510, -2258319, 1100790, 2129720, 14623, -1891893, -1142313, 1888231, 5758651, 8355688, 7362536, 3586922, 1644837, 4032712, 7164210, 6832529, 4335677, 2926755, 1885683, -481039, -1479828, 1853073, 6120931, 6067178, 3379991, 3498238, 5641037, 4532545, 1007612, 1516987, 6518535, 8800961, 5351350, 1805061, 2006851, 1985183, -1261590, -3196415, 193603, 4559346]
38380D559346n89843l726066j398650P52736j269833l345466j437301J770271
38372d684806K616874K243665K470466J537224j655126l535160o74229M216044
38364B534952N120345K61930n882502p573935l529735J970676L561292P30442
38356b806535j853505p73696J758973K035676N76375K66178J001646M30310j295549
38347f60127j755556o07241J21921k74538m75317K59701J420854K411183K299225
38338B740105R6652k706837k588393O07086K250987l6953k266135r52228Q94475
38329a961241m4842n91384K562431M805253P02611n018134l793304K211763L078715
38320A951868k414248n149976j315434K134956M22916j754381j11067K069834
$$ y = [4559346, 3969503, 243437, -1155213, -402477, -1672310, -5017776, -6455077, -4684806, -2067932, 175733, 2646199, 4183423, 2528297, -1006863, -1681092, 2534952, 7655297, 7917227, 2034725, -5539210, -9068945, -7098269, -3536977, -2806535, -4660040, -5433736, -3674763, -1639087, -1062712, -796534, 205112, 635422, -660127, -2415683, -3022924, -2901003, -3175541, -3650858, -3391157, -1970303, 440880, 2740105, 2836757, 129920, -2458473, -1851387, 399600, 362647, -1903488, -2855716, -1961241, -2006083, -2597467, -35036, 4770217, 5472828, 454694, -3338610, -1126847, 1951868, -462380, -5612356, -6927790, -4792834, -4369918, -6124299, -6235366, -4165532]
38312d165532J787795K270019N298867N770545L06480n691354o017106k606399
38304c046685m34853N97954K379225K804720P8362k044637q0911K448458Q18780
38295C520413k483459k163569O97380J124759j069080k313323k400656l296240
38287h383775l144948Q69492N427781M809961O51883k55084K514809K510778j772788
38278C228109l739450m1144L537889J870867j385235r82267R63454j85971k675475
38269E90777j699500J447865J300539k002774k541490J273876L599729M60050
38261B429072l939341l790347O1223K621299K132314N84109p35311j809112j747068
38252d193162l38566j62348k604251l502511J478898Q235779Q117435Q61956m296037
$$ y = [-4165532, -2377737, -107718, 5191149, 10961694, 11268174, 5576820, -440286, -3046685, -3481538, -2883584, -504359, 2300361, 2378723, 334086, 253175, 2701633, 3520413, 1036954, -1126615, -429235, 695524, -373556, -2686879, -5087535, -8383775, -11528723, -10659231, -5231450, -421489, 230394, -24690, 2490119, 5000897, 3228109, -511341, -552485, 2985404, 4856271, 3471036, 2488769, 3452223, 3266252, 590777, -1108723, 339142, 1639681, -363093, -2904583, -1630707, 1969022, 2429072, -1510269, -5300616, -5239393, -2618094, -485780, 98329, -636982, -2446094, -4193162, -4531728, -4694076, -7298327, -10800838, -9321940, -1086161, 7031274, 7893230, 3597193]
38243C597193k630717n24281l601490o740063l204109L204631M338177J138760
38235d421899P18883L141282K101020k309293k930873J259196K435715k385914
38227b391883n345684n88163N787458N161671j062395n065024l579124Q66873
38219f216271N219611O741178K793682m593979p850144l063586L768006N151668
38211A950165K448526J439468J889374m07567m067056l546091P42553K380579
38203B829951m08116k155259N5073J797563n18871l261752j779150J946832K853577
38194A359848P64240l33169N68756K7151l699526o829546m515053K487751P933627
38185b235921P102630K004806j668507j567098l55638p07392j700158j321835
$$ y = [3597193, 966476, 442195, -3159295, -9899358, -13103467, -9898836, -5560659, -4421899, -3703016, -561734, 1539286, -770007, -3700880, -2441684, -5969, -2391883, -7737567, -8325730, -2538272, 2623399, 1561004, -3504020, -7083144, -6216271, -996660, 5744518, 8538200, 3944221, -3905923, -6969509, -3201503, 1950165, 4398691, 5838159, 7727533, 7319966, 3252910, -293181, 449372, 2829951, 2421835, 266576, 321649, 2119212, 1600341, -1661411, -3440561, -1493729, 1359848, 2124088, 1790919, 2359675, 2386826, -1312700, -8142246, -12657299, -10169548, -2235921, 4866709, 6871515, 5203008, 3635910, 3280272, 2572880, 872722, -449113]
38177d49113J77372J376378K024156K263512J387878n60330j789612j498637j611694
38168A319910l291859l879961o48352L943471M612231M77399l533450k904130
38160c904741J409924M693161L554118r44758m244659k796283J759537M192280
38152C718579K123831j324207k509651j995455k103338k635754k076040p42494
38144g544529L30652J506939K689718K060123j33735P1258L982167N948447J203148
38135A0114188n225909m724785J752545M990780J596075k018966j270153k92366
38127D921409l422026p213526o253895j587805K033792L344579L964951L848804
38119c63717K298512J138716K218730L518276J970586j370787l051223k713928
$$ y = [-449113, -271741, 1104637, 3128793, 5392305, 6780183, 6219853, 4430241, 2931604, 1319910, -1971949, -5851910, -6500262, -2556791, 2055440, 2532839, -1000611, -3904741, -2494817, 2198344, 5752462, 4807704, 563045, -2233238, -473701, 3718579, 5842410, 4518203, 2008552, 13097, -2090241, -4725995, -6802035, -7544529, -7213877, -5706938, -3017220, -957097, -1090832, -1019574, 2962593, 8911040, 10114188, 4888279, 163494, 1916039, 6906819, 8502894, 6483928, 5213775, 4921409, 1499383, -5714143, -11968038, -13555843, -11522051, -8177472, -4212521, -363717, 1934795, 3073511, 5292241, 8810517, 10781103, 9410316, 6359093, 3645165]
38111C645165k675697l011507j555651J339576K448406Q51768m44171M63435J172906
38102B234230q87796l738569l347115L66805L251098K791400J291126J714076
38094C675255K715913P19866l909230o277642l488744J264424L144800J805472
38086c49886L75499J89923l385m76898J16240J688678K346177J604968R44895
38077F436211N35655j326542m365445n221424k164248J867522L267172K448076
38069A476977J919888J799735O19229o43981O61541L761768L940995r15828o015250
38060F605074n095462R10813M405219J093159m240462m622336o39486J282035
38052c01446q78143j998830J507757N926799O254344L276921N64772j508969l770788
$$ y = [3645165, 969468, -2042039, -3597690, -2258114, 190292, 1042060, 597889, 1061324, 2234230, 1346434, -2392135, -5739250, -5372445, -2121347, 670053, 1961179, 3675255, 6391168, 7111034, 3201804, -3075838, -6564582, -5300158, -2155358, -349886, 25613, 215536, 212151, -264747, -148507, 1540171, 3886348, 5491316, 6436211, 6971866, 5645324, 1279879, -3941545, -6105793, -4238271, -971099, 1476977, 3396865, 5196600, 5815829, 5171848, 5833389, 9595157, 13536152, 12620324, 6605074, 1509612, 2420425, 6825644, 7918803, 3678341, -943995, -1583481, -301446, -1179589, -3178419, -1670662, 4256137, 10510481, 13787402, 14352174, 12843205, 9072417]
38043I072417l859484L8641L582350J254775m361006n463400r26971K145198l10920
38034A171600l992984m332034k721727j400802J117354N117276O157564J792345
38026B908592k943524k380824J247886J866063q25090j779418J043810M323138
38018C460633M732506K216533j541624m265699l619433n6934K041062m36261m394630
38009a863847m552051r46383J832406J798465J171187J114992j21740k805867
38001d372838l764649q49565L454802M861824K239151j453962k398056J69038
37993b114255K765923J226878l762638o428628k859327L764313P258879N842255
37985E693400K478354l56530k401423l086421j451230J213998K079552O47443
$$ y = [9072417, 5212933, 5251574, 8833924, 10088699, 5727693, 264293, -662678, 1482520, 1171600, -2821384, -7153418, -9875145, -11275947, -10158593, -5041317, 1116247, 2908592, -34932, -2415756, -1167870, 698193, -126897, -1906315, -862505, 3460633, 8193139, 10409672, 8868048, 4602349, 982916, 925982, 2967044, 2530783, -1863847, -6415898, -7362281, -5529875, -3731410, -2560223, -1445231, -1566971, -4372838, -8137487, -8987052, -5532250, -670426, 1568725, 114763, -2283293, -2114255, 651668, 1878546, -1884092, -8312720, -11172047, -7407734, -148855, 5693400, 8171754, 7815224, 5413801, 2327380, 876150, 2090148, 4169700, 4817143]
37977D817143q00571q66952n54674q32457j050735k63193J478977L125516K862828
37968G915882n29155n193231o926749m327842r68534j04473j21972J509209L059318
37959e687547J872574r9228L69443J387056p45813l723987j997251L480372N912974
37950G68593L249053L63096k03064j549477m526253m739104o69275K788967K665642
37941a851822K481752M326454L971923p67983m199032j891056J090143j121506
37933B038873m245337q88219N775521N741559k106354q089212o106815r93326
37925h873310P11703j29070R04192L851415M415046N9341o196751p866454j477751
37916a4601639Q195203J1704638N821868k157980m063695j062403L88853r86188
$$ y = [4817143, 4016572, 3149620, 2594946, 1762489, 711754, 448561, 1927538, 5053054, 7915882, 7386727, 2193496, -4733253, -9061095, -10029629, -10134102, -10256074, -8746865, -5687547, -3814973, -3914201, -3544758, -2157702, -2903515, -6627502, -8624753, -5144381, 768593, 4017646, 4380742, 4177678, 2628201, -1898052, -6637156, -7306431, -4517464, -1851822, 629930, 4956384, 8928307, 8160324, 3961292, 2070236, 3160379, 2038873, -2206464, -3094683, 2680838, 8422397, 6316043, -1773169, -7879984, -8873310, -8161607, -8290677, -7386485, -3535070, 879976, 939317, -5257434, -13123888, -14601639, -6406436, 5298202, 11120070, 8962090, 4898395, 3835992, 4224845, 3238657]
37908C238657j411330k26891n11026k273057k130121q609L99125j492691k031978
37899f447921Q7245K009672K290198K407464K075499n79144l273058j081759M501801
37890A989997N432436q36307o203009l253510M135688O667008J785778m931605
37882D786476p546647m862199N1612K601515Q30000j972258j426973J398839K077978
37873d061657Q54432J952670M526092K624881l695202o284098j813481K313288
37865c583075L51546k494123j15237L719857L053455N27690J027569J445752k707802
37856A225632o528333l123037L132513L167041q15516N47137O047470N044035
37848H696942l421623p512125j673740M853803L672855p28044r81492J449959
$$ y = [3238657, 1827327, 1600436, 1089410, -1183647, -3313768, -3322377, -2923252, -4415943, -6447921, -6360676, -4351004, -2060806, 346658, 2422157, 1843013, -1430045, -2511804, 1989997, 7422433, 6586126, 383117, -2870393, 1265295, 7932303, 9718081, 4786476, -2760171, -7622370, -7570758, -4969243, -4139243, -6111501, -7538474, -6139635, -4061657, -3207225, -1254555, 3271537, 5896418, 2201216, -4082882, -5896363, -3583075, -3231529, -5725652, -5840889, -2121032, 932423, 1460113, 2487682, 3933434, 1225632, -5302701, -8425738, -5293225, -2126184, -2941700, -2394563, 3652907, 8696942, 5275319, -2236806, -3910546, 943257, 4616112, 3888068, 2906576, 4356535]
37840D356535J784862P22663N71245m76579l520631m503709q30181L093473K730127
37831C927805M49863Q5520l9165k516917m383477j904423K194386K763200L07609
37822H84401q79665J45103J154188J527141J945054J704186M71776n3850L28364
37813G226698r59014l536056k351876L622119O999316K572843l657602l863657
37805F052771j069083k656195n899181k149413O460406P804394j032088p866820
37797c55209l515305M905496N776803k11543l675534j695797p7292k203145m043301
37788e094827j684438K244079K794377j8802j666213K05063K676588K053033p30720
37779G78140j513032R47981L020179J242671k918695m954237k631052J874634
$$ y = [4356535, 6141397, 6864060, 7435305, 6958726, 3438095, -1065614, -1895795, 1197678, 3927805, 4377668, 4463188, 4424023, 1907106, -2476371, -4380794, -2186408, 576792, 884401, 4736, 149839, 1304027, 2831168, 4776222, 6480408, 6952184, 6898334, 7226698, 6267684, 2731628, 379752, 4001871, 11001187, 13574030, 9916428, 6052771, 4983688, 2327493, -3571688, -5721101, 739305, 8543699, 7511611, -355209, -3870514, 1034982, 6811785, 6600242, 2924708, 1228911, 1151619, -1051526, -5094827, -6779265, -4535186, -1740809, -1759611, -3425824, -3220761, -544173, 1508860, 778140, -734892, 213089, 3233268, 4475939, 1557244, -3396993, -6028045, -4153411]
37771d153411M293229K173798k401514m230057j002942K928665K089948j743506
37763b045790j934724K132517L465701r66902m508167j319726M070885M092675
37755B986469l72335k947779j988373m69527Q40938K564014K168148j904964m435839
37746c559248k31352N741721M423907k770278n711500j533085J994332L88407
37738a257096j159731J419701L948388K351568m63921j124642j515940k911723
37730g13396j804348K734870M580193o537m681628k122155M210746N330880K51029
37721G779654l767096k671688J99337J160540R11582J151854J275866J14568j824647
37712D329970k944887k002036Q48962L338052K515675j645112n325632n093643
$$ y = [-4153411, 139818, 2313616, -87898, -4317955, -5320897, -2392232, -302284, -2045790, -3980514, -1847997, 1617704, 650802, -3857365, -5177091, -1106206, 2986469, 2614134, -333645, -2322018, -2791545, -1950607, 613407, 2781555, 876591, -3559248, -3790600, 1951121, 6375028, 3604750, -2106750, -3639835, -1645503, -1257096, -2416827, -997126, 2951262, 5302830, 4838909, 3714267, 2198327, -713396, -2517744, 217126, 4797319, 4790782, 109154, -2013001, 2197745, 7528625, 7779654, 4012558, 1340870, 1540207, 2700747, 3612329, 4764183, 6040049, 6154617, 4329970, 1385083, -616953, 232009, 3570061, 6085736, 4440624, -885008, -5978651]
37704e978651j934228L61023j17053j495952m74208L672021P247984N726506J79494
37695G186936k812563l51384J670684k220915o897099l806217M264751O114698
37687C148891j57588l922450O44438N560567K933943k673312l379048n58256M03524
37678B000709M49888K579602L448782q74242n648550l950824J395481K310411
37670A711257j264344k722159j011959r07759k329733k44567M537797N003278
37662B771811k8144l235500o72349K620681K019467O5270q196k5306j748623k518859
37652g59748o87348K76256k016418l572374k63395M545677M279186j231595n517965
37643d947724l910497J703845O168712O258938K753101q47840j788899q65714
$$ y = [-5978651, -7912879, -7551856, -7668909, -9164861, -9639069, -5967048, 1280936, 7007442, 7186936, 4374373, 4022989, 5693673, 3472758, -3424341, -7230558, -2965807, 3148891, 2991303, -931147, -286709, 5273858, 8207801, 5534489, 2155441, 1597185, 2000709, 2450597, 5030199, 8478981, 7604739, 1956189, -1994635, -599154, 1711257, 446913, -2275246, -3287205, -4194964, -6524697, -6769264, -2231467, 2771811, 2743667, -491833, -1164182, 1456499, 3475966, 3541236, 3533040, 3507734, 1759111, -759748, -1447096, -1170840, -3187258, -6759632, -7023027, -2477350, 1801836, 570241, -4947724, -8858221, -7154376, -985664, 5273274, 8026375, 7178535, 5389636, 4523922]
37635D523922q77843k351186k982833j743493o10786q34642l87713K437513N069964
37626B242903L492387j672203m925810k503775K746655M633699J039828l749583
37618A304101m612729j660520J032820J431398J347464K485230L929529M244722
37610I502015L063306p6447m997230q185402n295922J783643N194715J418865
37602B407543l413224k432812K359087M422677K632453Q93885N47480n57892k635938
37593D223259l083716p47503K653841M507739K431772l782166r075491o780332
37585i652597J251446M550839q21567m755462J319524R317672O540022l421533
37577D328344o157809M90891M537565Q40004k058176R25088K738770j521239n210249
$$ y = [4523922, 3646079, 1294893, -1687940, -3431433, -4042219, -4876861, -5264574, -2827061, 2242903, 5735290, 4063087, -862723, -3366498, -619843, 4013856, 5053684, 1304101, -3308628, -4969148, -3936328, -2504930, -1157466, 1327764, 5257293, 9502015, 12565321, 12488874, 7491644, -693758, -5989680, -4206037, 988678, 2407543, -1005681, -3438493, -1079406, 3343271, 5975724, 6869609, 7417089, 6859197, 4223259, 1139543, 392040, 3045881, 7553620, 9985392, 6203226, -2872265, -9652597, -8401151, -3850312, -4671879, -9427341, -8107817, 1209855, 7749877, 4328344, -1829465, -1338574, 3198991, 4038995, 1980819, 2905907, 5644677, 4123438, -1086811]
37568a086811k562939J049128l55962k617595j85441K983965Q75144l109244j865636
37559f875391L191123M803233J387901k124247k537367q45444J424780K977624
37551A402212K195399J7595J91461L018024L234501j762484o519983n194596N9633
37542c358238L328675L065942J200590j251150k989685j589906J805027K188522
37534B399777j040288k087907Q44559J516222k482184l453398K975998Q068453
37526F741232L854228k610502j297804K982850l85515p688778o579882J959640
37518c024531M919360o02155m009382j066304Q1614l860028m618097J468853N626238
37509e084432K190459j474061J342914N244141L695413M93133R79473J693270
$$ y = [-1086811, -3649750, -2600622, -2956584, -5574179, -5759620, -2775655, -1900511, -5009755, -6875391, -3684268, 1118965, 2506866, 382619, -2154748, -3000192, -1575412, 1402212, 3597611, 3615206, 3806667, 6824691, 10059192, 8296708, 1776725, -3417871, -3358238, -29563, 3036379, 4236969, 2985819, -3866, -1593772, 211255, 2399777, 1359489, -728418, 116141, 1632363, -849821, -4303219, -1327221, 6741232, 10595460, 7984958, 6687154, 9670004, 9284489, 1595711, -4984171, -3024531, 1894829, 1292674, -2716708, -3783012, -3701398, -7561426, -12179523, -10710670, -5084432, -2893973, -4368034, -3025120, 2219021, 5914434, 6407567, 7387040, 9080310]
37501I080310j440280l602138j64771K797369j696977q031408o243179J377889
37493g923185M308505J042107j99915L309248N051723J673463j758974j480034
$$ y = [9080310, 7640030, 4037892, 3873121, 6670490, 4973513, -3057895, -9301074, -7923185, -3614680, -2572573, -2772488, 536760, 5588483, 7261946, 5502972, 4022938]
$$ [...]
##END NTUPLES=NMR SPECTRUM
##END=
