##TITLE=31Pdec_SR111_k1
 D2O, 124 sc
 15.3.2022
##JCAMPDX= 6.0         $$ Bruker NMR JCAMP-DX V2.0
##DATA TYPE= NMR SPECTRUM
##DATA CLASS= NTUPLES
##ORIGIN= UXNMR, Bruker Analytische Messtechnik GmbH
##OWNER= root
$$ XWIN-NMR		Version 3.5
$$ Tue Mar 15 13:07:32 2022 Russian Standard Time (UT+4h)  she@DPX200
##.OBSERVE FREQUENCY= 81.013821
##.OBSERVE NUCLEUS= ^31P
##.ACQUISITION MODE= SIMULTANEOUS
##.ACQUISITION SCHEME= undefined
##.AVERAGES= 124
##.DIGITISER RES= 16
##SPECTROMETER/DATA SYSTEM= spect
##.PULSE SEQUENCE= zgpg30
##.SOLVENT NAME= CDCl3
##.SHIFT REFERENCE= (INTERNAL, CDCl3, 0, 248.564)
##AUDIT TRAIL= $$ (NUMBER, WHEN, WHO, WHERE, WHAT)
$$ ##TITLE= Audit trail, XWIN-NMR		Version 3.5
$$ ##JCAMPDX= 5.01
$$ ##ORIGIN= Bruker BioSpin GmbH
$$ ##OWNER= she
$$ F:/spectra/data/she/nmr/P31/1/pdata/1/auditp.txt
$$ ##AUDIT TRAIL=  $$ (NUMBER, WHEN, WHO, WHERE, WHAT)
(   1,<2022-03-15 13:06:36.56 +0400>,<she>,<DPX200>,
      <continue with go, POWCHK disabled, PULCHK disabled
       configuration hash MD5:
       00 E9 B6 7A A2 85 ED C7 34 08 36 98 17 FE 4E 26
       data hash MD5: 32K
       43 6C 90 1A B6 8B 48 27 01 B0 9A 5E A6 27 10 74>)
(   2,<2022-03-15 13:06:43.95 +0400>,<she>,<DPX200>,
      <Start of raw data processing
       efp BC_mod = 2 LB = 1 FT_mod = 6 PKNL = 1 PHC0 = -9214.347 PHC1 = 162.6757 SI = 64K 
       data hash MD5: 64K
       F5 6C ED 7F E7 04 5B FA 33 8B 0B 3A 61 1D 2F 7D>)
(   3,<2022-03-15 13:06:57.57 +0400>,<she>,<DPX200>,
      <pk PHC0 = -9.803423 PHC1 = 0 
       data hash MD5: 64K
       98 83 20 5E B4 50 F6 6B 23 00 8E 89 B9 38 DF A2>)
(   4,<2022-03-15 13:07:03.53 +0400>,<she>,<DPX200>,
      <abs ABSG = 5 
       data hash MD5: 64K
       41 FD C0 F4 CD 25 D7 04 52 30 85 06 EF 02 3E 8A>)
$$ ##END=
$$ 
$$ hash MD5
$$ 18 8A 34 8B 21 BB 32 ED CE 1F 08 D4 00 8B 25 25
##$RELAX= 
##$RELAX= 
##$RELAX= 
##$RELAX= 
##$RELAX= 
##$RELAX= 
##$RELAX= 
##$RELAX= 
$$ Bruker specific parameters
$$ --------------------------
##$DU= <F:/spectra>
##$EXPNO= 1
##$NAME= <P31>
##$PROCNO= 1
##$TYPE= <nmr>
##$USER= <she>
##$AMP= (0..31)
100 100 100 100 100 100 100 100 100 100 100 100 100 100 100 100 100 100 
100 100 100 100 100 100 100 100 100 100 100 100 100 100 
##$AQSEQ= 0
##$AQ_mod= 1
##$AUNM= <au_zg>
##$AUTOPOS= <>
##$BF1= 81.014009
##$BF2= 200.13
##$BF3= 200.13
##$BF4= 200.13
##$BF5= 200.13
##$BF6= 200.13
##$BF7= 200.13
##$BF8= 200.13
##$BYTORDA= 1
##$CFDGTYP= 0
##$CFRGTYP= 5
##$CHEMSTR= <none>
##$CNST= (0..31)
1 1 145 1 1 1 1 1 1 1 1 1 1 1 1 1 1 1 1 1 1 1 1 1 1 1 1 1 1 1 1 1 
##$CPDPRG= <waltz16>
##$CPDPRG1= <>
##$CPDPRG2= <waltz16>
##$CPDPRG3= <>
##$CPDPRG4= <mlev>
##$CPDPRG5= <mlev>
##$CPDPRG6= <mlev>
##$CPDPRG7= <mlev>
##$CPDPRG8= <mlev>
##$CPDPRGB= <>
##$CPDPRGT= <>
##$D= (0..31)
0 1 0 0 0 0 0 0 0 0 0 0.03 2e-05 3e-06 0 0 0 0 0 0 0 0 0 0 0 0 0 0 0 0 
0 0 
##$DATE= 1647335028
##$DBL= (0..7)
120 120 120 11 120 120 24 19 
##$DBP= (0..7)
150 150 150 150 150 150 150 150 
##$DBP07= 0
##$DBPNAM0= <>
##$DBPNAM1= <>
##$DBPNAM2= <>
$$ [...]
##$SUBNAM3= <"">
##$SUBNAM4= <"">
##$SUBNAM5= <"">
##$SUBNAM6= <"">
##$SUBNAM7= <"">
##$SUBNAM8= <"">
##$SUBNAM9= <"">
##$SW= 501.771253377433
##$SWIBOX= (0..15)
0 1 3 0 0 0 0 0 0 0 0 0 0 0 0 0 
##$SW_h= 40650.406504065
##$TD= 32768
##$TD0= 1
##$TE= 0
##$TE2= 300
##$TE3= 300
##$TEG= 300
##$TL= (0..7)
0 120 53 12 22 120 120 120 
##$TP= (0..7)
150 150 150 150 150 150 150 150 
##$TP07= 0
##$TPNAME0= <>
##$TPNAME1= <>
##$TPNAME2= <>
##$TPNAME3= <>
##$TPNAME4= <>
##$TPNAME5= <>
##$TPNAME6= <>
##$TPNAME7= <>
##$TPOAL= (0..7)
0.5 0.5 0.5 0.5 0.5 0.5 0.5 0.5 
##$TPOFFS= (0..7)
0 0 0 0 0 0 0 0 
##$TUNHIN= 0
##$TUNHOUT= 0
##$TUNXOUT= 0
##$USERA1= <user>
##$USERA2= <user>
##$USERA3= <user>
##$USERA4= <user>
##$USERA5= <user>
##$V9= 5
##$VALIST= <valist>
##$VCLIST= <CCCCCCCCCCCCCCC>
##$VD= 0
##$VDLIST= <DDDDDDDDDDDDDDD>
##$VPLIST= <PPPPPPPPPPPPPPP>
##$VTLIST= <TTTTTTTTTTTTTTT>
##$WBST= 1024
##$WBSW= 4
##$XGAIN= (0..3)
0 0 0 0 
##$XL= 0
##$YL= 0
##$YMAX_a= 8584
##$YMIN_a= -5461
##$ZGOPTNS= <>
##$ZL1= 120
##$ZL2= 120
##$ZL3= 120
##$ZL4= 120
##$ABSF1= 248.5645
##$ABSF2= -253.2056
##$ABSG= 5
##$ABSL= 3
##$ALPHA= 0
##$AQORDER= 0
##$ASSFAC= 0
##$ASSFACI= 0
##$ASSFACX= 0
##$ASSWID= 0
##$AUNMP= <proc_1d>
##$AZFE= 0.1
##$AZFW= 0.5
##$BCFW= 0
##$BC_mod= 2
##$BYTORDP= 0
##$COROFFS= 0
##$CY= -3
##$DATMOD= 1
##$DC= 0
##$DFILT= <>
##$DTYPP= 0
##$F1P= 0
##$F2P= 0
##$FCOR= 1
##$FTSIZE= 65536
##$FT_mod= 6
##$GAMMA= 0
##$GB= 0
##$INTBC= 1
##$INTSCL= 5.30512e-09
##$ISEN= 30
##$LB= 1
##$LEV0= 0
##$LPBIN= 0
##$MAXI= 10000
##$MC2= 0
##$MEAN= 0
##$ME_mod= 0
##$MI= 50
##$NCOEF= 0
##$NC_proc= -6
##$NLEV= 6
##$NOISF1= 182.463
##$NOISF2= 159.3651
##$NSP= 0
##$NTH_PI= 0
##$NZP= 0
##$OFFSET= 248.5645
##$PC= 4
##$PHC0= -9224.15
##$PHC1= 162.6757
##$PH_mod= 1
##$PKNL= yes
##$PPARMOD= 0
##$PSCAL= 0
##$PSIGN= 0
##$REVERSE= no
##$SF= 81.014009
##$SI= 65536
##$SIGF1= 159.3651
##$SIGF2= -187.1042
##$SINO= 113.3802
##$SIOLD= 16384
##$SREGLST= <1H.CDCl3>
##$SSB= 0
##$STSI= 65536
##$STSR= 0
##$SW_p= 40650.406504065
##$SYMM= 0
##$S_DEV= 0
##$TDeff= 32768
##$TDoff= 0
##$TI= <>
##$TILT= no
##$TM1= 0
##$TM2= 0
##$TOPLEV= 0
##$USERP1= <user>
##$USERP2= <user>
##$USERP3= <user>
##$USERP4= <user>
##$USERP5= <user>
##$WDW= 1
##$XDIM= 65536
##$YMAX_p= 292519028
##$YMIN_p= -15769743
$$ End of Bruker specific parameters
$$ ---------------------------------
##NTUPLES= NMR SPECTRUM
##VAR_NAME=  FREQUENCY,     SPECTRUM/REAL,   SPECTRUM/IMAG
##SYMBOL=    X,             R,               I
##VAR_TYPE=  INDEPENDENT,   DEPENDENT,       DEPENDENT
##VAR_FORM=  AFFN,          ASDF,            ASDF
##VAR_DIM=   65536,         65536,           65536
##UNITS=     HZ,            ARBITRARY UNITS, ARBITRARY UNITS
##FACTOR=    0.620285442955139, 1,           1
##FIRST=     20137.2065510759, 0,            0
##LAST=      -20513.1999529892, 0,           0
##MIN=       -20513.1999529892, -15769743,   0
##MAX=       20137.2065510759, 292519028,    0
$$ Real data points
##PAGE= N=1
##DATA TABLE= (X++(R..R)), XYDATA
$$ [...]
##PAGE= N=2
##DATA TABLE= (X++(I..I)), XYDATA
15309 -538054 -152539 -722174 -1378374 -763792 225007 -162802 -1195044 -709279 897759
15300 897759 979029 -874326 -1921148 -638612 1096152 1500099 1666800 2924120 3828371
15291 3828371 2327432 -563094 -1826562 -563914 1149297 1353616 271155 -918818
15283 -918818 -1788142 -2504369 -2944819 -2724092 -1799879 -653271 53780 -42077 -632581 -782459
15273 -782459 336752 2479971 4276783 4599643 4008620 4163181 5382271 5630390 3067045
15264 3067045 -911123 -2863223 -1656618 221000 368951 -419754 -58846 1532238 2866667
15255 2866667 3366732 3337291 2359642 -50484 -2639927 -3462817 -2573631 -1670589 -1247379
15246 -1247379 -327245 925176 808913 -1022791 -2456077 -1720038 416393 2193523 3015664
15237 3015664 3061457 2235935 722025 -490901 -662526 -82803 776291 1795057 2366494
15228 2366494 1464428 -532528 -1426357 216009 3098748 4921019 5076301 4466545 3585947
15219 3585947 2263896 823117 71558 111738 72023 -857952 -2564592 -4113326 -4541527
15210 -4541527 -3828493 -3054443 -3078405 -3267672 -2449320 -889403 46789 175644 654927
15201 654927 1466871 763803 -2224719 -5416268 -6380852 -5130991 -3034766 -576198 1975670
15192 1975670 3160879 1992016 167866 160928 1486719 1334195 -1099941 -3421470 -3707522
15183 -3707522 -2962361 -2746596 -2394505 -451976 2245732 2990346 683395 -2522113 -3547662
15174 -3547662 -1666032 996880 1945589 891758 -258392 200006 1823739 2818221 2500168
15165 2500168 2166969 3144730 4652192 4619459 2653814 1050506 2023538 4670050 5999266
15156 5999266 4760894 2679459 1586972 1117321 260072 -497885 -300031 73954 -576722
15147 -576722 -1468114 -915417 656382 1222580 491398 68503 108509 -1249887 -4191416
15138 -4191416 -5778333 -3820125 -78716 2012339 1145265 -1620038 -4546919 -5810574
15130 -5810574 -4352440 -1647714 -692935 -1797720 -1718178 1205245 3761510 2457810 -987226
15121 -987226 -2169082 -304694 1686713 2278530 2635098 3293755 3388362 3337461 4725248
15112 4725248 6864191 6684763 3076298 -1234404 -3069739 -1956128 576088 2615359
15104 2615359 2464757 44599 -1907224 -540289 2845496 4018599 1784519 -452297
15096 -452297 -117656 921583 67268 -1645723 -1455053 872666 3185183 4039896 3578093
15087 3578093 2286396 607767 -855669 -1783552 -2059735 -1069312 1303508 2874307 914270
15078 914270 -3580755 -6249428 -5150086 -3043235 -2321371 -1325694 1651768 4292853 3898707
15069 3898707 2178570 2104850 2359144 -182914 -4026847 -4523669 -1287342 1158844 530868
15060 530868 -505363 190978 990117 567816 703466 2455747 3436076 1894217 259052
15051 259052 1312668 3493159 3490483 1430663 -124719 -745012 -1897060 -3116634 -2364519
15042 -2364519 -123675 608331 -838396 -1254490 1717227 5832219 7053369 4460463
15034 4460463 622249 -1837293 -2394605 -1930553 -1380229 -1118841 -819476 176850 1928053
15025 1928053 3481672 3799641 2891054 1620831 614928 -131855 -655829 -656742 9259
15016 9259 893476 1494687 2094906 3435294 5312124 6109777 4493013 1377644 -718969
15007 -718969 -580385 284488 -230937 -1878061 -2242791 97817 3501964 4914601 3292722
14998 3292722 767088 144700 1620855 2638578 1145598 -1860803 -3835267 -4061580
14990 -4061580 -4063853 -4657112 -4396669 -1971075 1238769 2626881 1819198 1054649 2122121
14981 2122121 4276649 5525994 4960134 3357177 2161694 2212101 3041470 3368408 2685843
14972 2685843 2027543 2345285 2581369 845447 -2430313 -4296977 -3050732 -630478 44536
14963 44536 -1074412 -1662286 -650093 598613 757583 369862 539698 1112193 1169775
14954 1169775 634935 352494 745404 1191914 945739 201237 -208532 -115087 -445027 -1856189
14944 -1856189 -3328991 -3094219 -1059395 813967 1049480 390357 142172 63082 -660066
14935 -660066 -1423662 -1134292 -395031 -484067 -548759 1440154 4733933 5887031 3862169
14926 3862169 2011031 3032145 4704073 3428460 -25550 -1651639 -8211 2371416
14918 2371416 2971834 1724679 -447143 -2664720 -3523972 -2212928 -487083 -854004 -2471746
14909 -2471746 -1789577 2097599 5880030 6935958 6635866 7104885 7756658 7270163 6295421
14900 6295421 5639445 4186291 1407504 -338314 819335 2623912 1985418 162789
14892 162789 586138 2764828 2989386 702759 -689414 112433 286257 -1566574 -2467185
14883 -2467185 -173959 2631170 2471880 382736 -436316 -10226 -792924 -2771501 -3239584
14874 -3239584 -1306342 660835 649966 -465018 -829404 -154868 594424 799575 543808
14865 543808 27197 -664687 -1303275 -1288999 -2048 2142680 3287613 1944088 -653747
14856 -653747 -1487384 384249 2509775 2539623 1316155 983615 1555620 1358965 -95712
14847 -95712 -1698536 -2574160 -2522204 -1193672 1375435 3848948 4889289 4917584 5012626
14838 5012626 4792566 3296533 1306173 596673 1253204 1889506 2154370 2674417 2814111
14829 2814111 1178576 -1581266 -3218139 -3467792 -4295275 -5900660 -5581027 -2008946 2100236
14820 2100236 3521341 2566631 1630523 1532420 1452046 1137915 1033562 1019170 780630 800756
14810 800756 1589756 2573852 2870113 2385073 1214805 -934253 -3620362 -5150482 -4492372
14801 -4492372 -2708001 -1359832 -658620 -302547 -621846 -1333475 -675163 2211829 5190164
14792 5190164 5530268 3548757 1789276 1351056 1213794 653689 73144 -346863 -765323
14783 -765323 -620351 607553 1790766 1346365 -99128 -357999 981420 2057770 1823182
14774 1823182 1397198 1757205 2175039 1853557 1347182 1350817 1551042 1655033 2259337 3687617
14764 3687617 4998113 5046919 3734102 1585943 -990967 -3425054 -4826116 -4797813 -3862990
14755 -3862990 -2796072 -2119844 -2162964 -2642314 -2341733 -517907 1462710 1546608 170869
14746 170869 9000 1943911 3453423 2271731 -254589 -1238538 -229716 936710 1340981
14737 1340981 1800113 2726557 3224475 2692559 1748372 950312 -167155 -1962009 -3461265
14728 -3461265 -3332192 -1793385 -521462 -385791 -154580 1679151 4233872 4795660 2446322
14719 2446322 -226539 -212064 2078576 3630078 2978356 1668050 1485194 2171630 2608543
14710 2608543 2634515 2554095 2021113 698623 -670975 -1010464 -312248 606117 1344364
14701 1344364 2044490 2636147 2892843 3054128 3480025 3742123 3025886 1626549 1010716
14692 1010716 1717928 2079586 334928 -2257309 -2209112 1514781 5250668 4839419 1052739
14683 1052739 -1549026 -837417 655795 296579 -896354 -733445 468950 1065192 1086046
14674 1086046 1554608 2156817 1992622 1453939 1112389 181011 -1484348 -1657042 893089
14665 893089 3144553 1839797 -799307 -127436 3064695 3285396 -837220 -4260108 -3461948
14656 -3461948 -1096594 -368841 -35817 1664859 2737272 1188896 -538638 761846
14648 761846 3611153 4168700 1945172 -586190 -2267256 -3528322 -4006097 -3380857 -3168991
14639 -3168991 -4422990 -5145074 -3241833 -431684 281118 -555614 -336829 667164 127531
14630 127531 -1359113 -467305 3593274 7785620 9531275 9018788 7069544 3975515 928781
14621 928781 -308442 207172 777378 746754 884016 1357050 1572416 1636813 1860545 1626898
14611 1626898 934620 1586430 4052234 5000705 1692056 -2803009 -3223876 234709 2791431
14602 2791431 2733989 2711762 3627206 3279233 1847403 2597438 5435759 5687427 1744462
14593 1744462 -1653588 -781705 1710508 2301719 2364932 4131823 5433667 3526895 650877
14584 650877 552332 2173629 1969404 288271 67448 726629 -982261 -4477771 -5124463
14575 -5124463 -1222126 3304810 4487917 2972949 1664569 1682167 2314345 2832640 2711355
14566 2711355 1392844 -850930 -2544069 -2349661 -578768 844937 -19324 -3014710
14558 -3014710 -5324871 -4206897 -630506 1448907 183600 -1827615 -1616673 -37017
14550 -37017 304161 -539086 -311095 1584145 3443633 4090941 3957707 3513242 2714703
14541 2714703 2028879 2266188 3341559 4426522 5009337 4779497 3312512 1141213 75510
14532 75510 946019 2174797 2227820 2089658 3236816 4600428 4189474 2652013 2277611
14523 2277611 3127189 3234093 2345831 2230577 3060061 2731792 614471 -987739 -435721
14514 -435721 649283 28642 -1806607 -2700629 -1971182 -787575 -115011 230309 616137
14505 616137 765054 230494 -683981 -954237 -95258 924475 872846 274139 865237 2664306
14495 2664306 3342705 1566129 -795988 -1362300 -513264 -18754 97816 873599 1706544
14486 1706544 1107011 -420809 -959903 -388357 -369298 -1207086 -1408227 -610997 -255731
14477 -255731 -703266 -228373 2048297 4327055 4484091 2703993 657489 -676254 -1351265
14468 -1351265 -1609875 -1639271 -1650445 -1670209 -1510487 -940882 298217 2067863 3122526
14459 3122526 2111247 80790 192121 3343203 5975644 4673341 1261831 144409
14451 144409 1754404 2487124 816158 -602137 362319 2188803 2696583 2153683 1731927
14442 1731927 1225726 1173 -1502775 -2586470 -3309401 -3890641 -4311446 -4793670 -5266995
14433 -5266995 -4529356 -1807776 1160407 1933783 983919 826636 1769962 1711263 306116
14424 306116 -133373 1473447 3525441 4841239 5782858 5688130 3128883 -282885 -639238
14415 -639238 2195932 3687739 1724034 -153246 720022 1372048 -1119541 -3691634 -2009881
14406 -2009881 2283641 4315210 3517588 3178465 4225429 4659543 4123777 4123151 4261348
14397 4261348 2789070 570768 260203 1716209 2260293 1348596 1044566 1890855 2186324
14388 2186324 1441893 811822 66300 -2030407 -4236390 -3703889 -666152 1622399 1933182
14379 1933182 2049928 2486792 1761260 581705 1794656 4768348 4860804 591600 -3576810
14370 -3576810 -4328089 -4457768 -7132253 -9731476 -8111808 -3542566 -352568 752535
14362 752535 1899914 2669577 1124896 -876226 730011 5127500 6673348 3276152
14354 3276152 -289002 463547 3650118 4989457 4258456 4105871 4807920 4292377 2516952
14345 2516952 2049306 3860247 5411119 4032547 347444 -2831318 -3783940 -2961132 -1655684
14336 -1655684 -842177 -1040946 -2172887 -3231166 -2786245 -394403 2612491 4126284 3190516
14327 3190516 830329 -1085459 -1631250 -1268748 -695505 96796 1197223 1776391 759770
14318 759770 -1414891 -2816344 -2372655 -1201485 -684276 -281877 1160951 2727852 2363857
14309 2363857 545889 451377 3457928 6801366 7383748 5913940 5055793 5111509 4380412
14300 4380412 2856778 2367124 3066339 2884008 1129275 -111696 690142 2169161 2490316
14291 2490316 2044216 2040732 2132634 1329410 29575 -678451 -799238 -914923 -874706 -616130
14281 -616130 -1190592 -3037611 -4258484 -2960849 -637707 -510701 -2668751 -3745157 -1872338
14272 -1872338 992534 2743687 4110135 5961072 6317172 3183961 -1166854 -2306406
14264 -2306406 241174 2343037 1280971 -722630 -511536 1129811 1048088 -1408203 -3780455
14255 -3780455 -4176074 -3042928 -1229214 1315307 4086057 5229314 3615710 612949
14247 612949 -1489078 -2084275 -2126869 -2110909 -1693474 -1197071 -1916489 -4269278 -6585496
14238 -6585496 -6644832 -4150227 -1014447 805026 1254703 1783812 3352661 5267454 5996485
14229 5996485 4792964 2375096 299572 -181428 947555 2324188 2374031 1052086 34720
14220 34720 699986 2494020 4037083 5057302 5835376 5315716 1973095 -2968765 -5356572
14211 -5356572 -2705494 2219323 4106131 984965 -3865871 -5770953 -3399263 488810
14203 488810 2422535 1936031 1579484 3091767 4624915 3305420 -54089 -1347812 1182264
14194 1182264 4375101 4714404 2991757 2097680 2185761 1112283 -1417500 -3393198 -3897174
14185 -3897174 -3939635 -3740513 -2071648 1041379 3568048 4403859 4796123 5753146 6187872
14176 6187872 5089685 3695396 3701636 4569414 4400113 2742697 882174 -349085 -1635153
14167 -1635153 -3885564 -6653798 -8071159 -6292600 -1387290 4054071 6784684 5788253
14159 5788253 3040761 1333191 1744383 3185870 3815466 2844478 1388627 1319559 2830386
14150 2830386 3806304 2503899 67784 -988304 -133100 1076120 1736907 2372021 3100958
14141 3100958 3276591 3175211 3860322 4959504 4791348 3242415 2179768 2243244 1723400
14132 1723400 -188998 -1479455 -260707 2396019 4242860 4649386 4061658 2561798
14124 2561798 663420 -260832 -28411 -252908 -1271871 -792771 2212488 4659301 3257490
14115 3257490 -713980 -3609147 -4540530 -4858484 -4240949 -1506490 1611863 1998066 397956
14106 397956 811592 4143381 6673801 5955902 4186225 3928601 4111185 2671555 304024
14097 304024 -1042649 -1263072 -1218897 -495309 1509531 3488690 3577930 2177118 1547010
14088 1547010 2927356 5407105 7343881 7910469 7483239 7004794 6653660 5372897 2684029
14079 2684029 367483 413689 1695866 1401466 -142742 463885 3813357 5697421 3212354
14070 3212354 -627178 -1454240 209603 936710 192764 -107939 -186434 -1848000 -3983914
14061 -3983914 -3283728 247500 2700076 2013346 505139 535713 1292627 1521514 2190062
14052 2190062 4306781 6568096 7197306 6191111 4226530 1461276 -1082448 -1293882
14044 -1293882 1014828 3060262 2975303 2471980 3421292 4235903 2683305 306527 392939
14035 392939 2660768 3720420 2465718 1360095 2037127 3004887 2685345 1878523 1868858
14026 1868858 2335765 2577582 3048916 4234667 5249551 4847928 3090193 1238824 600560
14017 600560 1663227 3489009 4033661 2293524 -40798 -603310 299825 464228 -298336
14008 -298336 103489 1859097 2088277 -520432 -2861003 -1612765 1993578 4288201 4210986
13999 4210986 3372514 2529256 1189693 -76254 -121986 236127 -881598 -2952035 -3342078
13990 -3342078 -1405869 458175 508871 -163180 -128719 120244 -223532 -398797 557947
13981 557947 1896117 2120236 1079385 -13391 -95121 819956 1620508 826593 -1760929
13972 -1760929 -4180334 -4334121 -2768604 -1783037 -1905667 -1497738 -87802 628997 34707
13963 34707 17569 1596712 2796788 2003347 974454 1840327 3187138 2296863 -211593
13954 -211593 -1427510 -955670 -1103400 -2465441 -2871580 -1322825 130108 -485775 -2515828
13945 -2515828 -4306327 -5257881 -5290411 -4297360 -3142843 -3236563 -4068222 -3222392 -160729
13936 -160729 2124346 1092860 -1501445 -2114261 -602306 -249016 -2773072 -5691803 -5387617
13927 -5387617 -1362073 3375761 5421937 3933998 933617 -868016 -514618 880744
13919 880744 1966408 2569286 3063889 3249154 2720348 1894998 1700548 2276310 2716422
13910 2716422 2212735 936647 -352429 -1183222 -1626992 -1847906 -1682685 -869075 375104
13901 375104 1431347 2168293 3210337 4751571 5652977 4721666 2628958 1368861 1761541
13892 1761541 2676731 2922089 2615625 2236825 1600058 531437 -461097 -976300 -1296972
13883 -1296972 -1492100 -900499 689609 2233952 2623375 1878306 517312 -1194385 -2608922
13874 -2608922 -2611399 -1261389 -257224 -536369 -812265 -26385 341707 -1341292 -3448777
13865 -3448777 -2913238 80449 2157541 1563763 80795 -337043 -79499 -86540 -48980
13856 -48980 271758 31472 -967252 -1386979 -654083 -380315 -1831696 -3540567 -3288747
13847 -3288747 -1231707 818928 2189750 3444815 4371122 3839984 1589761 -1183106
13839 -1183106 -2863905 -2302861 492323 3567210 4086350 1534128 -1324563 -2134413 -2049134
13830 -2049134 -3082434 -4069373 -2458505 741232 1539467 -1201425 -3950354 -3558690 -1142551
13821 -1142551 534599 974968 1390596 2166752 2748784 2760488 1854704 -263609 -2588689
13812 -2588689 -3187065 -2003892 -1493274 -2968324 -4212606 -2684816 547112 2357460
13804 2357460 1792072 409126 -572235 -985941 -331172 1720956 3733367 3847603 2614748
13795 2614748 2210439 3003885 3457695 3508553 5076497 8251661 9708452 6780000 1390776
13786 1390776 -2000996 -1492698 804871 1925817 1295063 645664 1374616 2526434 1908089
13777 1908089 -755121 -2968510 -2789328 -1778313 -2694808 -5006864 -5311668 -2358214 1007978
13768 1007978 1810514 582683 -216852 456855 1959216 3574792 4888635 5448559 5201669
13759 5201669 4593578 3698482 2289440 1071607 1262595 2422994 2560999 1203630 385465
13750 385465 1516191 3297709 4026206 3847673 3243454 1571848 -957769 -2103500 -683543
13741 -683543 1196186 1402076 1061050 1823404 2262437 637570 -882574 774289 3779060
13732 3779060 3572476 217472 -1683147 -587470 -14462 -1797040 -2894362 -1252523
13724 -1252523 288142 -786468 -2000947 -404074 2008412 1917319 762704 2177411
13716 2177411 5334703 6161902 4275791 3408776 4797002 5263472 3119382 1359383 2657139
13707 2657139 4766785 3880706 270752 -2382292 -2032017 -3943 1783002 3024245
13699 3024245 4173785 4927616 4341283 2107240 -582789 -1675907 -220248 2367352
13691 2367352 3739616 3420899 3230918 4569099 6323228 6288424 4011203 1347531 434241
13682 434241 1686613 3637698 4370567 3254129 1461269 609586 981058 1542451 1577962
13673 1577962 1498269 1941139 2915643 4018972 4617814 3689484 705831 -2915912 -4653931
13664 -4653931 -3981959 -3235480 -4278627 -5789701 -5490793 -3684517 -2306007 -1478820 96572
13655 96572 1675362 787229 -2251703 -3536979 -1118427 1570607 525261 -2787775 -3565005
13646 -3565005 -647448 2250273 2153070 256868 -927451 -878028 -297488 465218 743521
13637 743521 -591613 -2956117 -3591797 -1183817 1597968 1303414 -1683902 -3969347 -3810310
13628 -3810310 -2584853 -1877750 -1507388 -876691 -288631 -58327 275698 895769 756917
13619 756917 -1343781 -4972156 -7834924 -7542064 -3886249 558897 2763974 2475829 2225644
13610 2225644 3659955 5302179 5101174 3623358 2737714 2355712 1045157 -780314 -1208393
13601 -1208393 -372554 -661124 -2719727 -4059836 -2826363 -415583 1171041 2253238
13593 2253238 3831700 4969615 4092176 1637633 -704184 -2439525 -3955069 -4584700
13585 -4584700 -3169534 -297583 1834013 1791353 -143816 -3002820 -5631597 -6493301 -4670502
13576 -4670502 -1261916 1445007 2312089 1902212 945184 -425653 -1865603 -2572317 -2283309
13567 -2283309 -1685124 -1522778 -1857062 -2205865 -1865591 -343733 1762265 2606825 814994
13558 814994 -2703715 -5579512 -6572594 -6409456 -6091151 -5520534 -4172381 -2233526 -537380
13549 -537380 184397 -246659 -1268280 -1702600 -680634 1212252 2153742 894190 -1776194
13540 -1776194 -3677620 -3404077 -1664736 -306194 -158921 -397498 -185432 -25792 -600395
13531 -600395 -1115198 -382497 843534 628206 -881856 -1219018 572217 2155448 1432211
13522 1432211 -246334 -484552 227519 -412066 -2484982 -3603450 -2454782 -242466 1481200
13513 1481200 2396395 2684177 2539574 2594974 3197620 3240182 1435916 -1222445 -2200478
13504 -2200478 -898282 502533 164346 -1223770 -2071407 -2050931 -1724698 -1264428 -432046
13495 -432046 942847 2852171 4697558 5121241 3501800 1421937 957270 1559571 746438
13486 746438 -1779926 -3101150 -1189139 2101799 3607892 2734724 1251411 636778 1193396
13477 1193396 2632931 4007290 4014887 2757155 2215176 3600415 5281745 4937117 2806576
13468 2806576 964033 76678 -993940 -2567218 -3263580 -2197150 -344540 1020607
13460 1020607 1974367 3124531 4068498 3786792 2310279 1062584 1282433 2572540 3423960
13451 3423960 3045096 2181499 1938857 2273566 2166063 1051851 -492509 -1433911 -1229464
13442 -1229464 -193315 777630 1103488 1284506 2023081 2354046 173101 -4250985 -7008330
13433 -7008330 -5003261 -502939 1585833 381900 -363348 1501254 3391780 2480319
13425 2480319 53628 -860668 187587 1564366 2600330 3711447 4602169 4414749 2922535
13416 2922535 284243 -3104963 -5354995 -3715299 1585852 6021250 5652776 1814091
13408 1814091 -1379101 -2398599 -2354314 -1462585 769473 2651883 1506117 -2122173 -4761596
13399 -4761596 -4787677 -3818763 -3150819 -2149724 -835179 -703311 -1794966 -1968549 -482860
13390 -482860 502087 -482827 -1880131 -2154049 -2488437 -4185581 -5741775 -5193470 -3550563
13381 -3550563 -3041912 -3274169 -2112388 390693 1946055 1786503 1709864 2899745 4029882
13372 4029882 3464082 1677046 426328 499069 1098345 927366 -510554 -2276041 -2681683
13363 -2681683 -1218466 442551 311640 -1224880 -1809835 -334843 1671315 2458229 2413498
13354 2413498 2747852 2859031 919501 -2905402 -5665089 -5018498 -2290453 -831445 -1882860
13345 -1882860 -3543363 -3791384 -2892486 -2145447 -1726767 -1137274 -804184 -1413244 -1899549
13336 -1899549 -74015 4105434 7427674 6824445 3132260 265557 838465 3595809
13328 3595809 5334199 4571061 2730969 1966951 2543043 2837794 1628679 -421546 -1773985
13319 -1773985 -1758773 -765008 627863 1795522 1790830 152959 -1901436 -2203391 -64658
13310 -64658 2700327 3713787 2570470 954342 452279 752006 240326 -1716717 -3587630
13301 -3587630 -3365773 -1220395 625424 905160 800089 1552646 2089825 764085 -1531079
13292 -1531079 -2214211 -719612 846048 929546 310762 170608 421059 754580 1427461
13283 1427461 1970429 1007828 -1297706 -2436927 -949394 958632 402721 -1724811 -1909135
13274 -1909135 804499 3517517 3757173 2528483 1975063 2107744 1691440 1011751 1422256
13265 1422256 2450082 1706640 -1554826 -4695396 -5075552 -3942738 -4720630 -7744497 -9299137
13256 -9299137 -6773042 -2401091 -33286 -38749 -42462 453116 -431834 -2755155 -3480879
13247 -3480879 -790826 2981188 4637683 4332731 4297334 4844185 4234592 1943187 -402911
13238 -402911 -1529624 -2003163 -2608022 -2672859 -983968 2158142 4494687 3665193 -231456
13229 -231456 -4025589 -4317072 -1379310 786718 -822144 -4444348 -5883855 -3867303
13221 -3867303 -1261461 -1043873 -2913325 -4509836 -4536296 -3573691 -2542037 -1473429 159429
13212 159429 2402277 4274890 4357167 2202220 -832583 -2565188 -1976182 25748 1888350
13203 1888350 3062559 4030287 4952212 4994977 3476471 1320758 443390 1381392 2438491
13194 2438491 1991543 857225 1012593 2366328 2622065 725258 -1325879 -1194780 551620
13185 551620 1345828 95839 -1663279 -1967863 -633088 971209 1634326 1394773 1104470
13176 1104470 1199145 1235923 802545 339256 421618 734338 747273 973272 2190864 3634405
13166 3634405 3581022 1804472 -251814 -1877171 -3651778 -5186567 -4640087 -1568571 1815774
13157 1815774 3522237 4009312 4270180 3855458 2520029 1757370 2577639 3520457 3024927
13148 3024927 2037780 1997492 2090167 1173359 596545 1942525 3544638 2881298 1269262
13139 1269262 2144761 5219716 6543636 4531611 1915658 1132888 1636250 2633302 4572970
13130 4572970 6497908 5631986 1592588 -2062317 -2469072 -890615 273326 945610 1648681
13121 1648681 1206462 -1023845 -2836484 -1968555 456711 1918002 2391485 3528677 5140481
13112 5140481 5276704 3226100 225271 -2237018 -3010791 -1181453 2521334 5052432
13104 5052432 3960948 439638 -2318985 -2965134 -2268457 -640933 2034648 4548798
13096 4548798 4912844 2953620 437058 -1433531 -2917354 -4285965 -5256932 -5773735 -5690798
13087 -5690798 -3998321 -261535 3445967 4254792 2263866 473114 672816 1558781 1501095
13078 1501095 958419 959185 983026 -16761 -1460524 -1559890 304196 2585089 3112876 1342743
13068 1342743 -1039577 -1891502 -959679 85652 50449 -381410 -129171 756887 2040824
13059 2040824 4248807 7044326 8072946 5668385 1744968 -449176 -720541 -1362101
13051 -1362101 -2742928 -2672456 -302964 2552003 4569693 6174600 6814406 4591465 338420
13042 338420 -1469865 1386669 4932629 4284860 697303 -578711 1737127 3428574
13034 3428574 1501501 -1451369 -1267894 1982796 4440542 3630316 1317617 1119799 4240074
13025 4240074 8097774 9150345 6626552 2854191 142176 -1379630 -2480053 -3058231
13017 -3058231 -2937619 -3147334 -4636302 -6414604 -6762460 -5843856 -5244383 -5122088 -3913116
13008 -3913116 -1212483 1036781 1095852 -371153 -1665730 -2335370 -2827128 -2791768 -1313437
12999 -1313437 1278168 3133502 2947281 1631704 1209274 2151568 2646270 1087322 -1340205
12990 -1340205 -1822388 378019 2972592 3971803 4109365 4550635 4055696 995398 -2880751
12981 -2880751 -3956284 -2108308 -1269892 -3587096 -6086845 -5179876 -2015715 -584124
12973 -584124 -1941888 -3301641 -2406677 -104496 1688359 2332310 2073627 1049844 -306336
12964 -306336 -941297 -220704 1175542 1965937 1642756 943797 1133576 2701922 4576678
12955 4576678 5052962 3832274 2418204 1933524 1615171 562698 -232206 525308 1651499
12946 1651499 766963 -1717371 -2524800 -119101 2974271 3616894 1800043 -461243 -2116317
12937 -2116317 -3162082 -3185386 -1892456 -328610 209408 271 253473 1248697 2385219
12928 2385219 3273653 3431399 1937833 -898123 -2584632 -1284163 1268860 2138183 1729483
12919 1729483 2882225 5575725 6216738 3340757 634126 2020333 6149727 8412272
12911 8412272 6913300 3836531 1735028 990922 764492 354073 -582690 -1631321 -1415725
12902 -1415725 780585 3257970 3394393 1089923 -988030 -1170319 -1032024 -2610002 -4796703
12893 -4796703 -4574437 -1485471 1326179 1274085 -249639 -149456 1867624 3306055 3135200
12884 3135200 3359041 5328360 6913902 5536625 2490071 1525693 3625613 5805908
12876 5805908 5327664 2811707 614866 81116 1113024 2804028 3828016 3597295 3271947
12867 3271947 3990130 4286842 1847273 -1944021 -2566260 1213867 4854652 4222822 1194843
12858 1194843 46076 862816 472900 -1606182 -2414674 -533214 1857082 2413021 1283067
12849 1283067 -268431 -1550764 -2181411 -2005997 -1663557 -1774323 -1765885 -1051493 -646242
12840 -646242 -1521470 -2178446 -555508 2177692 2808026 983570 -266987 741267 2293627
12831 2293627 2637506 2296531 2023220 1363087 443148 462855 1222712 887840 -602558
12822 -602558 -804512 1156870 2843389 2572724 2113227 3167342 4279668 3924978 3737757
12813 3737757 5413804 6887776 5284493 1863744 298009 1339676 2843082 4030000
12805 4030000 5931355 8142855 8896867 8319381 8179324 8293223 6570295 3021351 394795
12796 394795 54293 303559 -218241 -456249 443745 1238692 1057977 1400757 3552053
12787 3552053 5729443 5101988 1829292 -825776 -237546 2883014 5416496 4886170 1867083
12778 1867083 -461562 262554 2695436 3404144 1413946 -458553 453351 2898214 3354010
12769 3354010 763288 -1971096 -1535032 1740379 4272204 3605791 1367642 893477 2597520
12760 2597520 3600291 2177391 222051 -31330 520344 -97147 -1195800 -673577 1055921
12751 1055921 1583323 581246 206198 1332378 2408559 2435538 2131426 1593662 -191868
12742 -191868 -2724313 -3910013 -3629334 -4270877 -6406559 -7210974 -5025290 -2261899 -1373108
12733 -1373108 -1000920 837226 2441163 1059453 -1946420 -2493200 429257 3797741
12725 3797741 5050745 4501590 3447478 2733390 3227203 5062461 6229274 4422365 622869
12716 622869 -1499785 -226234 2322927 3463251 3010538 2242063 1612374 669400 -793356
12707 -793356 -2334439 -3086263 -2298015 -360367 1034658 783803 -29943 306217 1546862
12698 1546862 2063916 1523250 1098464 1299651 1619654 2194277 3563902 4655792 3429377
12689 3429377 146822 -2222356 -1719148 426609 2101787 2715838 2309099 437832 -2471211
12680 -2471211 -4348149 -3809099 -2097501 -1187970 -991348 37906 2314630 4615652 5694624
12671 5694624 5252233 3671980 1708730 178496 -566637 -515567 624989 2898019 4852810
12662 4852810 4423274 1735544 -449173 -40425 1948223 3204335 2944097 1789596 186324
12653 186324 -1649828 -3222367 -4407901 -5623966 -6371637 -5037953 -1455652 1871670
12645 1871670 2773537 2211366 2184810 2318688 984519 -1268959 -2267206 -1809943 -1944349
12636 -1944349 -3471586 -4636120 -3752977 -1040658 2578867 6370737 8832025 8020950
12628 8020950 4143683 336210 -512972 1076733 2180709 1031193 -1271824 -2355370
12620 -2355370 -1300368 395688 667211 -560311 -1530543 -1442537 -1466609 -2103853 -1476547
12611 -1476547 1770541 5364542 5797120 2989354 -42284 -1505701 -1954635 -1620887 -42187
12602 -42187 1510926 803406 -1374543 -1408047 1722889 4505786 3963458 1497755 -242624
12593 -242624 -1191748 -2094051 -1768523 801073 3766461 4822569 4602905 4841051 4900633
12584 4900633 3282985 1136942 877545 2221734 2802901 2003591 1072770 175017 -1337895
12575 -1337895 -2238912 -587363 2493491 3728382 2574878 1639415 1792113 725898 -2455040
12566 -2455040 -4935465 -4382099 -2343789 -1339204 -1208967 -644973 -37834 -315608 -759946
12557 -759946 -426576 -292277 -1634549 -3470956 -3888289 -2911786 -1820810 -521135 1970473
12548 1970473 4901002 6045206 4678062 2383919 751224 -134269 -796277 -1498632 -2489630
12539 -2489630 -3799042 -4565275 -3726940 -1598723 271625 972973 988274 993762 950716 662226
12529 662226 334415 236513 453556 1138613 2313556 3271713 2969002 1385901 -85577
12520 -85577 -50684 1426445 3086570 3929099 4031582 3955742 3701341 2676920 825076
12511 825076 -760763 -1023793 -505237 -749050 -2019293 -2679607 -1372872 1111875 2909803
12502 2909803 3292376 2954737 2639325 2421771 2172862 2009098 2276837 3293360 4748711
12493 4748711 5325134 3785126 776669 -1499097 -2003196 -2038977 -2855659 -3493251 -2530982
12484 -2530982 -785133 -163162 -443276 416629 2653836 3770039 2136433 -401005 -995250
12475 -995250 364501 1211060 288901 -884830 -532223 693773 709174 -809164 -1729649
12466 -1729649 -521827 1221688 733232 -1974719 -3878891 -2900677 -335229 1459597
12458 1459597 2148173 2818672 3557223 3433072 2442626 1888950 2758473 4612378 5964129
12449 5964129 5262765 2163563 -1537849 -3177246 -2274255 -1206467 -1834059 -2920430 -2480332
12440 -2480332 -1168676 -1031199 -1922860 -1810997 -186839 1421169 2207989 2836432 3339473
12431 3339473 2802047 1495631 936325 1304619 1073792 -262320 -1374328 -1570726 -1673726
12422 -1673726 -1697999 -237001 2685890 4598765 3871248 1922611 774397 528275 732251
12413 732251 1978371 4238227 5592694 4704762 2960651 2291550 2555711 2952270 4032114
12404 4032114 5853446 5955699 2230378 -3215809 -6020577 -4881318 -2349220 -820784
12396 -820784 -354206 -251907 -237237 186664 1509510 3142222 4138814 4710247 5411656
12387 5411656 5499045 4114887 2419078 2179452 2805925 2406998 1346289 1727901 3409081
12378 3409081 3815365 2222173 957600 1417660 2075219 1726889 1496150 1808422 541286
12369 541286 -3250853 -6405485 -5502428 -1766438 949596 1560572 1809110 2019103 625317
12360 625317 -1999349 -2888510 -792311 1638892 1495330 -636342 -2137867 -1928751 -829150
12351 -829150 434848 1664935 2240666 1614023 680902 979367 2236258 2308591 326255
12342 326255 -1539228 -838616 1494297 2077422 -332836 -2986093 -2672752 213442 2414436
12333 2414436 1904545 -97678 -1038653 223800 2741699 4621267 4487965 2431995 -30955
12324 -30955 -1089775 24448 2587783 4882570 5206929 3184608 465405 -605012 499004
12315 499004 2073442 2720023 3025743 3790700 4101883 2921085 1428135 1533355 2704365
12306 2704365 2715600 1317485 575914 1380911 2267296 2310244 2551706 3516726 3845921 2821021
12296 2821021 1927074 2232556 2422640 1399086 700030 1884908 3350098 2694625 987096
12287 987096 1388558 3984551 5266326 3187115 3939 -826559 1392999 4522625 5839957
12278 5839957 3803440 -847061 -5140407 -6433114 -5379636 -4920430 -6040941 -6452787
12270 -6452787 -4252793 -905296 835342 475186 -359256 -524505 -133175 575534 1426165
12261 1426165 1614350 344500 -1734383 -2877802 -2201909 -454541 1154932 2035100 2177812
12252 2177812 2031785 2493549 4005237 5461990 5148035 3217988 2033109 3119849 4875153
12243 4875153 4710549 2788176 1758545 2742036 3544646 1788683 -1701419 -4023255 -3728506
12234 -3728506 -1737513 583851 2490825 3193099 2002873 -346391 -1954458 -1962165 -1348003
12225 -1348003 -971422 -145455 1893668 4213794 5167787 4569483 3745220 3663140 3877343
12216 3877343 3246317 1249634 -1167635 -1977845 -101901 2727115 3405057 1436325 9945
12207 9945 1849226 5357159 6729707 4939620 2390061 1009704 152476 -1186997 -2245188
12198 -2245188 -1745745 6336 1425957 1438653 307398 -875396 -1173681 -689651 -498147
12189 -498147 -1216652 -1922629 -1338188 193489 1054649 574603 -331746 -798545 -1015838
12180 -1015838 -1422280 -2107777 -3200720 -4602000 -5199548 -3803646 -1155393 534851 448150
12171 448150 -99943 -243866 -872236 -2379889 -3239485 -2449960 -1595367 -2388055 -3584418
12162 -3584418 -2764644 -232037 1532366 1905871 2761604 4745596 5757853 4397107 2554083
12153 2554083 2566135 3370832 2029566 -1407253 -3202132 -895516 3046290 4230747 1926607
12144 1926607 -411226 -47560 1865029 2917603 3122948 3881890 4581212 3125610 -101983
12135 -101983 -1676985 304237 3350719 4016693 2582095 2179235 4167986 6599646 7143683
12126 7143683 5653294 3464852 1548521 -9172 -1396599 -2412671 -2323686 -717690
12118 -717690 1248375 1361024 -968314 -3313711 -2835870 189764 2837301 3225103 2224310
12109 2224310 1550589 1810247 2772403 4012557 4603099 3492401 1107215 -438577 245000
12100 245000 1898067 2113658 348486 -1574120 -1887827 -918932 -393008 -1237121 -2616005
12091 -2616005 -3163152 -2700979 -2232873 -2308050 -2118525 -651481 1785656 3851849 4757228
12082 4757228 4963090 5366744 6220097 6817076 6068068 3668037 842972 -606662 -259346
12073 -259346 620460 980031 1092139 1197409 480028 -1271657 -2190286 -404127 2984739
12064 2984739 4838949 3680224 838385 -1784797 -3335410 -3570197 -2712547 -1907940 -2168571
12055 -2168571 -2799479 -2481485 -1672076 -1863287 -2654167 -2232635 -1087577 -2167066 -6088419
12046 -6088419 -9028334 -7427460 -2733253 724413 1121974 345292 842493 3124634 5806898
12037 5806898 6885214 5585061 3551441 3030555 3557067 2533066 -221878 -1356124
12029 -1356124 955135 3791448 3804975 2021843 1194398 853627 -1053471 -3428178 -3414864
12020 -3414864 -1572357 -1031572 -1727572 -206715 4156208 7258772 6093340 2681721
12012 2681721 461872 101597 795191 2590422 5075771 6160422 4474332 1324875
12004 1324875 -1291103 -2806863 -3079198 -1671162 406902 807024 -557670 -658006 1880036
11995 1880036 3938912 2462842 -750204 -1953042 -949030 -180134 -66313 885675 2364873
11986 2364873 2511805 1487408 1225385 1732800 1042893 -983844 -2100741 -1392900 -532517
11977 -532517 -710405 -1168072 -1470941 -2376366 -3487223 -2826276 -54368 2345222 2511204
11968 2511204 1597139 1239248 818516 -858937 -2860493 -3188511 -1567981 502163 1806822
11959 1806822 2263281 2341808 2607457 3231872 3369634 1907887 -678885 -2402294 -2287946
11950 -2287946 -1540139 -1483844 -1727819 -1254894 -14189 1529271 3182950 4436771 4355001
11941 4355001 3009964 1794036 1473381 1334410 1062866 1693804 3528115 4944752 4787373
11932 4787373 4200126 4442255 4666266 3832359 3091678 3907324 5271284 5374347 4852990
11923 4852990 5635030 7474306 8472747 8368488 8378856 8270406 6711731 4359981 3300253
11914 3300253 3192601 1435540 -2017882 -3482635 -836886 2940261 3754813 1815808
11906 1815808 707270 2327361 4904431 5548494 3323107 7921 -1553307 -380021
11898 -380021 1231003 271655 -3002628 -5287590 -4590315 -2299236 -354304 1219298 2729763
11889 2729763 3133424 1805250 206218 -122474 285549 459535 1091087 2819510 3994394
11880 3994394 2835202 785480 850394 3064796 4424860 3308142 1274760 103495
11872 103495 -399433 -801686 -546086 610820 1321303 327858 -1526891 -2286524 -1405170
11863 -1405170 -277861 -389295 -1579179 -2268461 -1303898 511126 1171490 76457 -821620
11854 -821620 617308 3717791 5661516 5111153 3771401 3861447 5172265 5565161 3915546
11845 3915546 1636173 1016419 2400530 3600790 2515967 -126131 -1682372 -1224356
11837 -1224356 -765897 -2187565 -4485254 -5471276 -4958706 -4336440 -3762769 -2116080 255605
11828 255605 1067977 -696427 -2736206 -1867417 2219990 6672560 8724312 8504994 8305578
11819 8305578 9233528 9386237 6344967 1105567 -2373664 -2120209 -491208 -159379 -51338
11810 -51338 2144742 5244501 5932847 4184852 3478039 5202758 6524688 5080182 2573434
11801 2573434 1737893 2234379 1915388 524595 -157494 940285 2979708 4323059 3923845
11792 3923845 2283354 1496189 3188934 5989113 6652501 4388960 2215046 2939634 5639396
11783 5639396 7484103 7341269 5975377 4211883 2690853 2242511 2819452 3067224 2384461
11774 2384461 2227126 3904726 6372677 7800880 8012940 7678651 6523605 4364752 2643232
11765 2643232 2690470 3478757 3290761 2634537 3167301 4632967 5410633 5419834 5805577 6146100
11755 6146100 4742034 1714196 -697012 -1133779 -260090 1103250 2755372 3992728
11747 3992728 3917030 2918632 1820834 -37910 -3321142 -5821317 -4479418 -450680 1569631
11738 1569631 -2269 -1440031 184653 2413763 1583812 -1431929 -2960463 -1975623
11730 -1975623 -462490 364846 918769 909997 -757681 -3633139 -5670211 -5854805 -5010804
11721 -5010804 -3836355 -1986727 517689 2599389 3420833 3200360 2352316 940412 -591634
11712 -591634 -1216885 -519847 546985 646259 -540338 -2110803 -2771093 -1772712 509197
11703 509197 2780134 3998847 4440424 5172212 6405897 6982193 5886723 3789555 2382705
11694 2382705 2321278 2616723 2273668 1620884 1298870 771541 -753170 -2256451 -1593939
11685 -1593939 1332015 3869456 4005111 2756899 1893489 1067423 -731810 -2304734 -1504492
11676 -1504492 1244519 3271185 3209959 1751075 -717618 -4069657 -5976950 -3311647
11668 -3311647 2629064 5897615 3359507 -513021 464878 5544284 8212998 5342820
11660 5342820 1056653 367467 2302952 2044336 -1630442 -4326377 -2152653 2626053
11652 2626053 4364432 1490096 -1753647 -1492518 907501 1988280 1467929 1310805 1540848
11643 1540848 862163 347154 2139665 4684006 3854569 -462650 -3484714 -2591746 -742620
11634 -742620 -848864 -1340493 -258801 559738 -761211 -1818479 237032 3345953 3568454
11625 3568454 1269488 -310325 -809430 -2157941 -3489362 -1863505 2075545 3914018
11617 3914018 1502315 -2661553 -5448032 -5937301 -4089032 -335599 2935821 2939590 245757
11608 245757 -1893920 -2110303 -1736540 -1270700 261419 2226365 2556617 1540879 1655509
11599 1655509 3091966 3462282 2566628 2977623 4797951 4652786 1746118 109876 2164728
11590 2164728 4469621 3148803 -284861 -2068936 -1859772 -1626497 -1663967 -1260621 -974854
11581 -974854 -1064951 -84861 2001298 2235884 -473344 -2179525 291937 3513967 2443499
11572 2443499 -1363951 -2240160 612902 2718032 2177803 1777388 2933396 3392665 2119411
11563 2119411 1220222 1435266 525802 -2008946 -3136503 -1375940 495024 192684 -558812
11554 -558812 80680 451057 -1140275 -2618472 -1385018 1199352 2123985 1440467 1218894
11545 1218894 1625742 1577933 1801052 3573620 5472174 4961489 2499661 581736 -596231
11536 -596231 -2696123 -4854707 -4078848 -566477 1665767 842138 23600 1526160 2661492
11527 2661492 294069 -3460946 -4177414 -1824103 -159047 -320349 385862 2978164 4565101
11518 4565101 3235559 1378178 1620178 2510279 1414394 -598119 -610922 649958 -549075
11509 -549075 -4696813 -7448495 -5576335 -1203197 1719183 2324366 1953057 852897 -1253251
11500 -1253251 -2940078 -2676239 -1832819 -2886840 -4843383 -3687556 2022343 8811221
11492 8811221 12461906 12093746 9076732 4523992 -286806 -3105073 -2808259 -1349129
11484 -1349129 -1527660 -3364852 -4449253 -3450055 -1508171 -190836 350433 852964 1666166
11475 1666166 2374906 2140659 449815 -1993110 -3480155 -3079653 -1770285 -1041041 -961680
11466 -961680 -713327 -428316 -937435 -1808209 -1318632 1143232 3990709 5436885 5560464
11457 5560464 5600852 5947007 5723949 4145662 1697464 -95684 -78043 1242601 2170396
11448 2170396 2020317 2180326 3947936 5936455 5400199 2130166 -983634 -1857244 -1617791
11439 -1617791 -1966114 -2217013 -958496 906908 1389369 965776 2127630 5183181 7029556
11430 7029556 5083866 661672 -2677323 -2959361 -1078239 726641 818833 -645980 -1867793
11421 -1867793 -1398098 -135939 -186958 -1586610 -1926258 29589 2344786 2986831 3040715
11412 3040715 4614594 6830564 6719174 3797325 988713 503832 1203977 1015685 -122918
11403 -122918 -1158777 -2155721 -3791701 -5431517 -5489165 -3659698 -1513405 -645190 -1038929
11394 -1038929 -1478720 -1005750 305555 1728736 2761544 3496926 4068632 4048557 2971644
11385 2971644 1410969 713524 1293512 1887318 1109038 -773547 -2335763 -2898740 -3062481
11376 -3062481 -3416818 -3654179 -3322053 -2760642 -2647602 -2927758 -2893973 -2306605 -1710654 -1374014
11366 -1374014 -643597 984496 2727105 3434729 3315767 3459708 3687656 2536024 -64992
11357 -64992 -1857517 -1225381 436840 1003827 904202 1855048 3281294 2921562 940997
11348 940997 340679 2349480 4217483 3310013 1152621 1100567 3384136 4961544 3843383
11339 3843383 1429925 377056 1654818 4101507 5932886 6298396 5708666 5005217 4040291
11330 4040291 2090955 -365573 -1597307 -1012210 -291657 -1035249 -2453701 -2787489 -2000048
11321 -2000048 -1428353 -1531420 -1747191 -2020756 -2589603 -2557429 -636217 2645127 5191334
11312 5191334 5833597 4932516 2712977 -818830 -4127726 -4809507 -2848387 -963588 -637371
11303 -637371 -162235 1803865 3248300 1917658 -538684 -853645 486669 -71181 -3057101
11294 -3057101 -4513253 -2005498 1374660 1532457 -697032 -1390699 258869 1324257
11286 1324257 399798 -310942 872174 2158013 1425594 -38549 671103 3940052 7438324
11277 7438324 9055170 8109012 4773633 597708 -1330651 567287 3582189 3727670
11269 3727670 1258587 64826 1486757 2506729 1210525 126363 1746203 4104268
11261 4104268 4133511 2879040 3430173 5211909 4632406 1120093 -1516847 -514549 2311761
11252 2311761 3658906 2831752 1405737 721798 1017797 1669128 1320096 -1013466 -4230884
11243 -4230884 -5697016 -4139185 -1002249 1348464 1612579 -203593 -2799093 -3643300
11235 -3643300 -1098471 2861263 4083047 1331976 -1999415 -2369621 -198935 1970824
11227 1970824 3291223 4399936 5026378 4402355 3255114 3020608 3472634 3193239 2056688
11218 2056688 1271487 1269972 1554209 2292614 3795335 4598950 2797130 -347313 -1076297
11209 -1076297 1414514 3087793 678167 -3275300 -3916925 -932671 1600190 1624912 1476607
11200 1476607 2997500 3912447 1467090 -2708774 -4434002 -2631590 -172377 751823
11192 751823 1130739 2220624 2815327 1309797 -1216830 -2279759 -1626681 -1329688 -2195819
11183 -2195819 -2215915 493985 4688557 7281281 6947033 5134698 3672270 2685006 1427058
11174 1427058 239047 482337 2445605 4272116 3718671 731328 -2356616 -3179595 -1446801
11165 -1446801 1174360 2661340 2131538 428255 -633389 -155241 778991 723111 328387
11156 328387 1687258 4880949 7023456 5982968 3502345 2740085 3726753 3568741 906436
11147 906436 -2207165 -3428148 -3120991 -3105197 -3771191 -3860262 -2553793 -555565 983611
11138 983611 1916092 3075680 4846786 6127581 5369491 2775285 535878 230195 949769
11129 949769 1111757 1178021 2776111 5531345 6914416 5616209 3197141 1639594 939150
11120 939150 198742 -346514 73822 973505 984230 -160242 -1243529 -1310672 -864094 -874212
11110 -874212 -1120354 -255316 2249135 4770500 5004710 2753726 171741 -1109237 -1698693
11101 -1698693 -2429801 -2369153 -734108 639144 -482003 -2694290 -2339528 908820 3126880
11092 3126880 1736623 -1163611 -2613477 -2840045 -3194364 -2848707 -742125 1157499 206651
11083 206651 -2282438 -2442383 307235 2406565 1714498 497231 1364484 3086596 2835827
11074 2835827 831749 37849 1704434 3620703 3424753 2043282 2480642 5558276 8219528
11065 8219528 6926120 2184615 -1715065 -1875804 -278628 -774465 -3591600 -4977252
11057 -4977252 -2410587 1968417 4218858 3300414 1288143 -122131 -1178019 -2099380
11049 -2099380 -1697686 770572 3630707 4387092 2947089 1608216 1625637 1408381 -1015820
11040 -1015820 -4995666 -7902357 -7917464 -5004976 -64715 5193715 8166195 7272529 4077639
11031 4077639 1689796 924560 37175 -1575452 -2098171 -841418 -365113 -2848789 -6266261
11022 -6266261 -6848401 -4206485 -1256130 316171 1550593 3093245 3565823 2190387
11014 2190387 774912 1406180 3508634 4826029 4590655 4210368 4984506 6356057 6745662
11005 6745662 5473615 3420789 1904075 1201588 463915 -926776 -2388221 -2891590 -2278668
10996 -2278668 -1220249 -86616 1405432 3346353 5001131 5235595 3416283 89904
10988 89904 -2968992 -3910315 -2723021 -1601523 -2427755 -4123556 -3792891 -682479 2407824
10979 2407824 2467361 -78460 -2255281 -2384571 -1542326 -1246319 -1278603 -590152 709370
10970 709370 1490885 1325599 866846 547185 102395 -299638 283513 1985053 3284907
10961 3284907 2957993 2084836 2579212 4083635 4129363 1674144 -1133687 -1476977 989088
10952 989088 4247452 6175352 5928962 4030208 2091779 1892570 3777239 6180630 7288040
10943 7288040 6879373 6159028 6177138 6781101 6787300 5084862 2038867 -380460 -703201
10934 -703201 119892 246704 95715 1839491 5399991 7512062 6112643 3334182 2173744
10925 2173744 2231078 1299453 -411472 -747984 462294 1106237 375335 -210055 240872
10916 240872 621245 139359 -330787 -179405 -327881 -1439088 -2479626 -2121472 -259462
10907 -259462 2566919 5724207 7760011 6979776 3895576 1436535 1446175 2598451 3177826
10898 3177826 3999903 6367982 8642628 7755293 3722675 -23776 -1015832 -146907 766508
10889 766508 1580619 2924444 4417478 5127785 4814472 3723091 2047381 464722 223247
10880 223247 1616844 3139947 3230308 2162922 1130975 247800 -1057283 -2196294 -1789128
10871 -1789128 72290 1593058 1707261 1278262 1309889 1366288 656422 -417808 -801121
10862 -801121 -117083 1325610 3082483 4380126 4218551 2518294 418657 -1268251 -2883241
10853 -2883241 -4364978 -4234465 -1611781 1832785 3711371 3957187 4237835 5004919 5186132
10844 5186132 4449668 3574672 2541862 398820 -2614900 -4719957 -4849412 -3593783 -1614172
10835 -1614172 1045035 3629593 4625158 3868140 3115457 3716344 5072567 5938385 5773021
10826 5773021 4359810 1768820 -691679 -1145501 519872 2394039 2953095 2164169 253039
10817 253039 -2359050 -3757853 -1996777 1497548 2939559 1543249 663550 2297927
10809 2297927 4035818 3502507 2160670 1852878 1062808 -1702281 -3767728 -1834816 2464681
10800 2464681 4947384 5171532 5835266 7145617 6668089 4321503 2697083 2259840 902048
10791 902048 -1167285 -829867 2364932 4542008 3444691 2054468 3693883 6845771
10783 6845771 7858182 6330125 4696683 4075546 3433029 2057328 565025 -128527 646526
10774 646526 3068496 5893414 6837828 5274291 3451794 3542995 4647832 4580038 3606220
10765 3606220 3984958 6024685 7117396 5433818 2593608 1306501 1658682 1492709 -6743
10756 -6743 -1042854 -61791 1700647 1911796 598418 216659 2226245 5082879 6176719
10747 6176719 4714070 2139485 532618 935022 2414305 2669041 658440 -1469560
10739 -1469560 -775824 2062938 3098315 622550 -2261336 -2103751 363893 2365497
10731 2365497 3517390 5208196 6975513 6675326 3893081 691264 -956655 -743674
10723 -743674 407610 746515 -1385809 -5205421 -7140305 -4875824 -627654 1819301
10715 1819301 2124775 2923800 5436726 8327502 10154811 10233125 7811749 3252630 -577408
10706 -577408 -970769 988472 2076580 1480874 900018 1053443 1351884 2226527 4206173
10697 4206173 5339974 3461952 611253 918998 4067296 5363525 2895597 13209
10689 13209 -503960 -242986 -1262463 -2473891 -2306689 -1688985 -1963954 -2500886 -2475984 -2646140
10679 -2646140 -3551148 -4211377 -4082482 -3913881 -3382404 -628528 4273567 8127943 8728780
10670 8728780 7673473 7282751 7202081 6060943 4236319 2799469 1527228 -60467 -1179253
10661 -1179253 -965269 65380 882314 990021 59570 -1762384 -2855729 -1610696 840437
10652 840437 1952287 1976933 3558951 6597708 7393856 4327120 631801 -437302 244387
10643 244387 488111 367320 483512 -156540 -1689654 -1658794 1194724 3824359 2828658
10634 2828658 -330183 -1290969 1183530 3996383 3944234 1085480 -1673713 -1187359 2849697
10625 2849697 6789312 6563768 2886204 741906 2874936 6342025 6869235 4159485
10617 4159485 1188890 246832 1253549 2500050 2170321 562270 607616 3889919 6936124
10608 6936124 5170551 126766 -2014934 641455 3643517 4085274 4504666 6626182
10600 6626182 7407339 5020369 3259549 5420136 8401288 7829341 5200694 4825768 6751448
10591 6751448 7728986 6779275 5131898 2768138 -523966 -2510115 -1156157 1621657
10583 1621657 2600896 2044449 2319620 3451764 3700562 3175297 3422552 4421500 4862685
10574 4862685 4484956 3950666 3579620 3760093 4894925 5819181 4697963 2404417 1804207
10565 1804207 2817422 2315753 125322 144248 3513644 6034458 5086629 3702647 4577708
10556 4577708 5570964 4855225 4936367 7302266 8543579 6464558 4800456 6937368 9970544
10547 9970544 9990274 8343876 7721330 7088686 5457621 5366593 7562037 7873664 4608087
10538 4608087 2917372 6159205 9490152 8367599 6566683 8612157 11109207 9565561
10530 9565561 7292015 8998368 11648225 10416048 7895599 8601464 10098695 8383853
10522 8383853 6188762 7229638 8514899 7024446 6840018 10604268 12168163 7716332
10514 7716332 5050269 10528672 16481185 14243835 9654038 11676944 16091233 15699396
10506 15699396 15706524 22185126 26957136 22403718 18633110 25436195 31494036 25240314
10498 25240314 20232717 31231124 42705955 36328655 31211943 52193166 75941305
10491 75941305 67168102 56864162 107266936 189364804 182774167 40014346 -124324028
10484 -124324028 -171683583 -110070847 -53698433 -55533807 -67440463 -49532085 -28243595
10477 -28243595 -31690690 -40382418 -31259607 -18635647 -21412075 -28442526 -24015423 -17068679
10469 -17068679 -20137426 -24459021 -18624673 -10847435 -12320928 -16660954 -14125002 -9862307
10461 -9862307 -11375009 -12977974 -8293867 -4167757 -7548290 -11789077 -9847392 -8157414
10453 -8157414 -13554602 -18804847 -15359952 -9293246 -10276730 -14649862 -13537514 -9080863
10445 -9080863 -8781357 -11105562 -9883174 -6722849 -6785074 -7832205 -4966133 -1108830 -1976374
10436 -1976374 -5429361 -5980222 -5189315 -7662299 -11071466 -9903388 -5522949 -3558099
10428 -3558099 -4567741 -5345244 -5939305 -7755398 -8433672 -5971209 -4021295 -6011249 -8325042
10419 -8325042 -6563048 -3939045 -5657442 -9313994 -9072286 -5608586 -3784643 -3824615 -2816204
10410 -2816204 -1869299 -3789793 -6322166 -5444399 -2945070 -3277693 -5333322 -4826717 -2589060
10401 -2589060 -2887133 -5277511 -5515614 -3208707 -1667932 -1440540 -528160 331764 -1041854
10392 -1041854 -3136962 -3047671 -2247999 -3877923 -6135798 -4963440 -1648131 -865909 -2403990
10383 -2403990 -1837370 1244254 2536864 411930 -2223253 -3375470 -3580554 -2513807
10375 -2513807 341979 2265316 291627 -3080562 -3044625 -396221 98810 -1640512 -1227081
10366 -1227081 1374445 973762 -3563187 -6483806 -4091830 -203965 349339 -1642173
10358 -1642173 -2858277 -2814813 -2876072 -3110486 -2894012 -2386435 -1663413 -381964 883537
10349 883537 1153211 982272 1279821 592154 -3050246 -7809631 -9395107 -6923017 -3660849
10340 -3660849 -1716268 30557 2209415 3274260 2586048 1659930 1370616 1028811 715276
10331 715276 1226783 1421180 -732622 -4053980 -4933239 -2835681 -1184857 -1992996 -3459553
10322 -3459553 -3800284 -3582797 -3197654 -1856165 -288196 -653474 -2572844 -3095641 -1801604
10313 -1801604 -1745399 -3803285 -4588178 -2272065 -132686 -1284616 -3652342 -3596175 -1408861
10304 -1408861 322576 1207458 2297146 2924560 1874911 212913 -353499 -716858 -2825487
10295 -2825487 -5839573 -6928700 -5389438 -3124689 -1339988 389234 1645162 649482
10287 649482 -2699327 -5377482 -4510680 -1229444 227217 -2694410 -7877810 -10812475
10279 -10812475 -9377073 -5572577 -2611036 -1503880 -1165008 -669527 -35698 575684 992702
10270 992702 693697 -411604 -1265729 -998479 -466201 -1010792 -2172474 -2245173 -746009
10261 -746009 1255169 2854755 3709552 3216090 1167504 -1130796 -2211868 -2413781 -2646954
10252 -2646954 -2139582 22846 1930994 770912 -2364182 -3183169 -466697 1853778
10244 1853778 409862 -2829667 -3658871 -1366944 949192 680187 -1533751 -2934735
10236 -2934735 -1618558 1355944 2888517 1601923 -76703 774245 3099088 3292055
10228 3292055 564326 -2362017 -3941062 -5392697 -6770924 -5561120 -1260243 2317241
10220 2317241 2218794 890286 2172074 5062601 5346242 2158097 -1061262 -2015522 -2330788
10211 -2330788 -4003818 -5902822 -5514748 -2726319 -189397 -138681 -1819517 -2517526 -1002703
10202 -1002703 723731 -161173 -3567003 -6462540 -6646732 -5022757 -3600128 -2864098 -2239609
10193 -2239609 -1822874 -2083301 -2500902 -1957217 -368179 1052987 1179960 72079 -1221282
10184 -1221282 -1644275 -1081860 -390436 -233716 -183491 385279 947210 538276 -365787 -106729
10174 -106729 1792382 3793592 4206404 2784282 301678 -2218499 -3662971 -3543316 -2842146
10165 -2842146 -2928475 -3560398 -3387556 -2376910 -1872008 -2062734 -1548200 -9246 842753
10156 842753 -84660 -1635748 -2427339 -2590169 -2485219 -1723733 -651284 -660772 -1594146 -1098329
10146 -1098329 1583943 3450030 1783205 -1549415 -2640673 -918218 1040636 1996207
10138 1996207 3002447 4198190 3933905 1570267 -1516162 -4239066 -6636437 -7904125
10130 -7904125 -6410673 -2886363 -951433 -2481003 -4475050 -3021238 925570 2578516
10122 2578516 -127490 -3803499 -4260886 -1728689 149348 -746810 -2919610 -3756691 -2560246
10113 -2560246 -832227 -531466 -2245520 -4375768 -4283094 -1216299 2172781 2678456 766920
10104 766920 -34437 1763346 3706127 3716207 3427683 4837270 6134612 4362704 730748
10095 730748 -707037 779979 1731987 158545 -1759345 -1722066 -631145 -236591 -350718
10086 -350718 -209183 -178680 -371944 197552 1425365 1367487 -578618 -2126603 -1729321
10077 -1729321 -1297428 -2832026 -4675811 -4164112 -2152318 -1473490 -2135926 -1700116 95221
10068 95221 760530 -555863 -1381691 266327 2799085 3192534 793996 -2131175 -2967855
10059 -2967855 -1320923 695912 906858 -41789 658866 3801578 6397281 5669837 3064232
10050 3064232 1879352 2347735 2153061 978779 909867 2212251 2360179 282645 -1627824
10041 -1627824 -1318369 -190616 -466095 -1555367 -1242274 876086 3125936 4093763 3658718
10032 3658718 2357222 965603 125640 -493843 -1862307 -3704369 -4138357 -2193673 514214
10023 514214 1819948 1598309 1056778 623550 70074 -324011 -453621 -1284397 -3115516
10014 -3115516 -3792686 -1082070 3454731 5548355 3582437 500895 -469253 189409 -60792
10005 -60792 -1874440 -3501406 -3339487 -1545312 470292 1161220 -84034 -2224814 -3431670
9996 -3431670 -3186251 -2703793 -2773127 -2471313 -996511 596614 967446 670238 1068133
9987 1068133 2004486 2413596 2418937 2726588 2622683 969405 -1220882 -1768094 -668880
9978 -668880 239846 734265 2036455 3080866 1009477 -3419580 -5139399 -1787213 2443586
9969 2443586 2968069 1216749 1048717 1981563 886443 -1707841 -2384596 -930137 -314679
9960 -314679 -745139 869554 4654254 6122676 2792531 -1736602 -2756718 -306559 2243829
9951 2243829 2830482 1772682 322830 -115993 908213 1603378 -117510 -2929333 -3381497
9942 -3381497 -1544948 -1426145 -4227438 -5609645 -2453487 1781394 2281320 93578 -324314
9933 -324314 1700854 3035884 2403846 1472315 972524 -142306 -1883813 -3062681 -3643372
9924 -3643372 -4155754 -3483942 -648188 2021136 1409338 -1163999 -1553545 351311 63707
9915 63707 -4183177 -8109137 -7467289 -3745872 -1279973 -1578757 -3163344 -4759798 -5853027
9906 -5853027 -5495247 -3144013 -140720 1336394 380327 -2443979 -5984749 -8631393 -8751507
9897 -8751507 -6310876 -3378428 -2040497 -2311596 -2639443 -1798387 90498 1702603 1571840
9888 1571840 -129005 -1121817 351532 2761430 2956478 488355 -1862007 -2082588 -1147650
9879 -1147650 -706947 -880597 -1103265 -826946 1434331 7042150 13788209 16205345 11518215
9870 11518215 3360188 -2504680 -4405047 -4641510 -4995141 -5083853 -4261932 -2708855 -948834
9861 -948834 122686 -552360 -2530937 -3452066 -1833704 844967 2422074 2993367 3656794
9852 3656794 3811406 2169754 -574721 -2590224 -3630189 -4523032 -4802171 -3514352 -1762821
9843 -1762821 -1617421 -2791204 -3160301 -2378721 -2087411 -2533530 -2045810 -329673 625145
9834 625145 -290202 -1755798 -2330751 -1931640 -591047 1558281 2600565 293944 -3867531
9825 -3867531 -5357557 -2774608 66907 60645 -670083 1108114 4231253 5281499 4016106
9816 4016106 2923359 2761327 2138511 745387 -302526 -936806 -2024000 -3083777 -2787308
9807 -2787308 -1435229 -443335 201495 1400656 2362295 1357910 -1229226 -3357239 -4475894
9798 -4475894 -5346730 -5245228 -2847561 223177 636972 -1421205 -2273803 -808976 -182920
9789 -182920 -1946542 -2997278 -952848 1610413 1651425 738562 1638746 2925289 1644474
9780 1644474 -867697 -907151 1089144 1125412 -1506123 -3002818 -1387737 592599 449304
9771 449304 -268544 559325 1672578 714373 -1745602 -3162463 -2624861 -1229514 171175
9762 171175 1530881 2537085 2828460 3014541 3908168 4788081 3863600 866614 -1878113
9753 -1878113 -1809385 746265 2676828 1740335 -540388 -787108 1556427 3195248 1469831
9744 1469831 -1872628 -3148487 -1732496 -298814 -652762 -1758169 -1999859 -1232876 -186878
9735 -186878 337229 -615103 -3175106 -5280328 -4283683 -492397 2816234 3548534 2997304
9726 2997304 3082026 3435217 2560791 365916 -1770099 -2431494 -979129 1774815 3258885
9717 3258885 1340731 -2410473 -3708948 -961010 2360166 2310341 -445736 -2110045 -829585
9708 -829585 1851982 3699380 3941804 3178947 2666487 3371109 4755544 5145530 4058489
9699 4058489 3103267 3719874 5344323 6779451 7772462 7958543 6061525 2019175 -1566148
9690 -1566148 -2148062 -329648 1508778 2356184 2453954 1588224 -33720 -446018 1748469
9681 1748469 4492183 4492799 1810554 -547114 -1196926 -1448336 -1740342 -387265 2950841
9672 2950841 5251684 3460402 -1515831 -5528050 -5264855 -1085734 3476669 4834328
9664 4834328 2692999 170099 -87359 956341 813815 -373474 -140060 2151757 4100517
9655 4100517 3807487 2455600 2308650 3653884 4806083 4290481 2330819 616682 660798
9646 660798 2011689 2721898 2242240 2539556 4865554 6891757 5507306 1538752 -1174540
9637 -1174540 -1009887 131561 702178 1442145 2828492 3718204 3693734 4024447 4945889
9628 4945889 4520290 1813268 -1030642 -1666280 -653383 63045 154902 568448 1413109
9619 1413109 1924340 1754816 1030473 -166561 -1460657 -2116714 -1952858 -1464376 -805906
9610 -805906 82312 280915 -1297496 -3549669 -3807792 -1564607 614232 820479 146996
9601 146996 136436 307537 -154395 -467262 82841 454156 -259097 -997125 -679005 -238200
9591 -238200 -734827 -1085434 263948 2866479 5328309 7163747 7760760 5627667 1131114
9582 1131114 -2050813 -1183176 1450997 1831041 79356 -350243 1751986 4205822 5257317
9573 5257317 5069502 3829503 1775523 694223 1812504 2611141 -165396 -4388128 -4191564
9564 -4191564 1314612 5878666 4774820 1153508 592010 3037197 4202977 2524060
9556 2524060 406644 -359220 -547863 -967886 -1097385 -660262 -331184 -463345 -709037
9547 -709037 -974335 -1345382 -1264667 -242495 925426 1259723 1563113 3321161 5674352
9538 5674352 5746412 2697885 -538638 -795776 1565772 3863578 4832436 5259449 5454631
9529 5454631 4334636 1661274 -498653 56100 2746348 4859608 4996286 4548656 5303272
9520 5303272 6663026 6246101 2840490 -2120147 -5963022 -7043445 -5719677 -3752619
9512 -3752619 -2839003 -3224328 -3613653 -2759077 -1089164 -357424 -1672572 -4224657 -5928275
9503 -5928275 -5081490 -1682992 2405874 4844565 4889207 3836526 2946393 1649147 -1063845
9494 -1063845 -4095735 -4975798 -3342553 -1744244 -2016955 -2596560 -1061001 1870208 3038016
9485 3038016 1229425 -1282395 -2051001 -1452152 -1247516 -1545397 -939280 795186 1995283
9476 1995283 1577286 775069 1353933 2976343 3745908 3055272 2314818 2562458 2955510
9467 2955510 2584193 2336339 3268327 4023945 2162556 -1869993 -4419379 -3281314 -776712
9458 -776712 -498454 -2325084 -2893822 -571875 2426977 3394205 2545502 1838250 1831229 1522903
9448 1522903 751166 852187 2532346 4473333 4949942 4094680 3576435 4254345 5024860
9439 5024860 4210407 1566929 -1443464 -3176669 -3292264 -2716895 -2404699 -2456972 -2517705
9430 -2517705 -2589559 -2901067 -3107760 -2447215 -1022331 -154365 -706912 -1600034 -1077777 683055
9420 683055 1522876 341719 -961834 246300 3632426 5883844 4762278 2013434 1186756
9411 1186756 3085105 4812990 3680451 694061 -1002804 -321275 853582 848278 417894
9402 417894 996250 2274594 2869124 2464184 1896329 1673164 1702593 2046984 2651596 2684433
9392 2684433 1489939 -50705 -475843 102725 161098 -1055410 -2878328 -4511927 -5399902
9383 -5399902 -4537144 -1413862 2206314 3565238 2493607 1719421 2972742 4895003 5679154
9374 5679154 5493803 4952843 3458970 1002501 -296399 1204677 3775198 4317275 2427872
9365 2427872 341448 -518662 -799293 -1320704 -1836990 -1770318 -900276 552664 1684388
9356 1684388 1438744 274767 163804 1785442 3220902 2943787 2244582 2477470 1913651
9347 1913651 -1401646 -5128793 -5018115 -1339456 1297114 899810 573539 2759733 5134035
9338 5134035 4651598 2406075 1466713 2108180 2209619 991091 -449277 -1529013 -2639219
9329 -2639219 -3522957 -3224815 -1714345 -185002 304451 -315277 -1321319 -1693707 -1033251
9320 -1033251 -385836 -1136194 -2684722 -2728997 -553134 1810350 2827476 3734112 5693760
9311 5693760 6783497 4669908 976554 -356305 1235486 2148291 20937 -3026829
9303 -3026829 -3811571 -2347946 -913558 -458703 33565 1268908 2503383 2802484 2321729
9294 2321729 1910603 1904097 1709488 669766 -816538 -1489401 -838981 -20472 -429873 -1643564
9284 -1643564 -1777315 -58853 1894350 1941858 57203 -1528234 -757706 2005384 4249950
9275 4249950 3799239 985211 -1752350 -2368834 -994943 748782 1515591 899790 -929754
9266 -929754 -3293289 -4886052 -4589769 -2718691 -902849 -396888 -800718 -693392 683284
9257 683284 2658543 4041874 4514061 4725084 4984266 4554202 2915928 1175377 978643
9248 978643 2092967 2499851 1293936 4267 175901 1067569 1139983 736833 1482183
9239 1482183 3455417 4706420 3676595 850211 -2024659 -3264949 -1983591 1138131
9231 1138131 3707189 3571518 1276408 -441831 165176 2182184 3644233 3631950 2447520
9222 2447520 897195 -57840 102741 690985 430174 -858007 -2087550 -2600240 -2814564
9213 -2814564 -2876144 -2147376 -720400 113098 -52117 284268 2016011 3382338 2485098
9204 2485098 749165 1200133 3574160 4106108 994867 -2633515 -3012437 -936724 -137063
9195 -137063 -1537302 -2180943 -188576 2085347 1540874 -888928 -1374355 1470461 4771373
9186 4771373 5321890 3299643 1003971 -475522 -1642808 -2593192 -2614757 -1724526 -917428
9177 -917428 -517028 360513 2128538 3638922 3521761 1874019 -14194 -1018967 -792443
9168 -792443 322946 1436641 1676667 1028868 162707 -612026 -1287500 -999494 1491058
9159 1491058 5370530 7434090 5658654 1953668 -349191 -786214 -1488520 -3243421 -4315489
9150 -4315489 -3392415 -1380459 473999 2200006 3733434 3757466 1525884 -1324683 -2426759
9141 -2426759 -1494829 -111417 728940 1422736 2397342 3363091 3994754 4238992 3815772
9132 3815772 2418918 628967 -302336 35009 635757 464521 -153042 -80714 974956
9123 974956 1937529 1604812 145553 -948240 -514748 902702 1693759 1077968 -204578
9114 -204578 -1149532 -1656516 -2044292 -2174771 -1822783 -1417075 -1547439 -1977412 -1928093 -1196811
9104 -1196811 -300885 334205 661190 691733 604048 933923 1859655 2533808 2024516 680234
9094 680234 -468208 -1349265 -2485090 -3126441 -1678356 1392993 2970070 1009387 -2420867
9085 -2420867 -3513330 -1440017 1010169 1303446 -21373 -830911 -367625 228520 -141588
9076 -141588 -1053901 -1347657 -979006 -1293026 -2974325 -4371865 -3109125 564906 3400416
9067 3400416 2772787 -472638 -3617996 -5218506 -5337276 -3927293 -1163212 1082848 529421
9058 529421 -2316172 -4308106 -3784163 -2588233 -2762288 -3099876 -1057361 2995060 5863876
9049 5863876 5777169 4371067 3919559 4462361 4760275 4645845 4840721 5146339 4481198 2735451
9039 2735451 1259054 1135088 1933625 2601959 2745098 2494353 1892885 1157825 961898
9030 961898 1583784 2150110 1634420 434229 56276 1241233 3212282 4827849 5689851
9021 5689851 6025387 6260170 6823688 7591417 7490472 5671801 3194006 2205215 2903564
9012 2903564 2745172 -169623 -4036068 -5262335 -2959633 100730 1078760 180460 -349241
9003 -349241 721050 2510999 3635510 3974958 4387158 5000792 4655661 2571186 -25513
8994 -25513 -1002701 21592 1246690 1102550 -45161 -945085 -979434 -122567 1274414
8985 1274414 1985364 762465 -1318704 -1181629 1978186 4556246 3032270 -845597 -2391281
8976 -2391281 -710551 430039 -1296566 -3374091 -2512312 790723 3720705 5012220
8968 5012220 5186989 4537160 3175362 2155021 2410667 3071031 2629685 1365222 770939
8959 770939 821442 -159697 -2514920 -3944958 -2228016 1804334 5103700 5740462 4489054
8950 4489054 3263750 2879792 2715102 2043335 1004742 187489 -222354 -485467 -736120
8941 -736120 -760370 -322236 484113 1135887 940568 -211379 -1270032 -869973 901276
8932 901276 2315472 2086835 774264 -574733 -2006781 -3622670 -4064315 -1978983 1487717
8923 1487717 3666083 3744155 3260190 3164434 2464649 314192 -2379387 -4144952 -4323056
8914 -4323056 -2883731 -462469 1167456 619148 -601920 757206 5198691 9208964
8906 9208964 9572210 6959916 4044979 2091375 887247 197541 -310638 -1031506 -1135475
8897 -1135475 738392 3414956 3450103 139986 -2687877 -2224569 -865038 -1649061 -2703225
8888 -2703225 -676475 2756382 3208916 1023497 572941 2418705 2299229 -1000084 -2767510
8879 -2767510 168487 4266640 4942461 3174920 2496477 2697373 1015797 -2375005 -4418297
8870 -4418297 -3886181 -2400880 -1097538 545622 2456525 3252922 2314448 757427 -20928
8861 -20928 400449 1470041 1862915 301463 -2640083 -4465169 -3891127 -2882079 -3686267
8852 -3686267 -5079478 -4133416 -981327 1182769 857145 -50055 71917 35725 -1448415
8843 -1448415 -2937529 -2207558 346350 2265369 2245156 1067530 -260020 -1592590 -2729812
8834 -2729812 -2793411 -1228372 1157544 2781337 2886075 2286381 2385138 3547529 4778906
8825 4778906 5155882 5085015 5571317 6562907 6877880 5814888 4022468 2517234 1550122
8816 1550122 819536 187472 -319073 -769035 -1062760 -741651 331084 1203283 383459
8807 383459 -2482501 -5651247 -6439859 -3776869 324151 2274309 339471 -3548278 -5717077
8798 -5717077 -4328241 -761647 2122147 2444345 372268 -2267049 -3311785 -2056772
8790 -2056772 8781 892735 541623 624729 1782523 2545236 1767927 717901 1253247
8781 1253247 2826933 3124550 1417449 -500491 -903041 -31957 1044383 1911463 2330350
8772 2330350 1631769 -266572 -2155056 -2912318 -2784818 -2269578 -741101 2256438 5051264
8763 5051264 5148148 2544590 34359 -188700 1202107 2245300 2119932 1261406 237652
8754 237652 -576777 -988547 -1326395 -2073362 -2761626 -2302839 -948158 -545041 -1855417
8745 -1855417 -2970633 -1852552 600146 1763433 911759 -212516 -225006 288567 183025
8736 183025 -671882 -1577003 -1703198 -460457 1818795 3540851 3288251 1652218 549867
8727 549867 724460 1164799 1104454 1174261 2039020 3025148 2863243 1273661 -563357 -905235
8717 -905235 869178 3015593 2694591 -506922 -3362282 -2928189 -611280 27468 -1303434
8708 -1303434 -1577826 217770 1359451 77955 -1462221 -835602 840254 1165841 265065
8699 265065 -225251 -229625 -779409 -1799628 -2573200 -3166184 -3432588 -2188502 450236 1717106
8689 1717106 -169544 -2738332 -2691010 -1027459 -1156557 -3011317 -3073098 46395 3875693
8680 3875693 5984078 6019382 3878371 -191668 -3304748 -1992101 2444101 4745271 3162706
8671 3162706 1785442 3537049 5478542 4218244 1879530 2473446 5293945 6467509
8663 6467509 5159050 3754649 3032038 1568381 -419237 -797067 580820 1290423 379203
8654 379203 -135542 1215320 3055877 3621370 3272221 3127243 2858544 1400644 -973212
8645 -973212 -2471989 -1600152 1101562 3121877 2393392 -2647 -772016 1081899 2505611
8636 2505611 1033875 -767115 1287602 6270879 8830766 6691056 3387355 2461265
8628 2461265 2938683 2728164 2927328 5414337 8463488 8442546 4932910 1033181 -1011970
8619 -1011970 -1674919 -1756335 -974908 369233 648540 -904999 -2724342 -2860985 -1494442
8610 -1494442 -331907 -58175 368352 1777707 3159302 2744802 456294 -1629539 -1676791
8601 -1676791 -263466 657831 501444 508249 1460040 2362524 2036716 853117 -76800 -585546
8591 -585546 -1212893 -1826823 -1688996 -786412 -56633 -76184 -242842 385975 1790332 2853561
8581 2853561 2580366 1389669 902551 2078486 3815741 4144610 2811135 1707250 2326243
8572 2326243 3726859 3853549 2299634 768159 891312 2407085 3723792 3794425 3002793
8563 3002793 2254411 1685874 841379 -25352 104995 1212558 1483200 -387850 -2891202
8554 -2891202 -3350814 -1564149 -11309 -376530 -1669959 -2174715 -1530260 -322237 798025
8545 798025 1032547 104198 -493230 1219960 4525890 6208671 4861844 2749476 2155351
8536 2155351 2346002 1909274 1596166 2412313 3067712 2205905 1414238 2845937 5154591
8527 5154591 5145814 2679260 649572 570742 1346780 2069158 2805344 2806902 1267624 -152670
8517 -152670 965354 3401363 3333366 307232 -1843507 -1183028 -608209 -2596129 -4966739
8508 -4966739 -4795223 -3284245 -3227949 -3989205 -2783372 351224 2406075 1785115 -5416
8499 -5416 -946972 -572462 531160 1610128 2248849 3040923 4991620 7243151 6896353
8490 6896353 2854690 -1557597 -2067831 1416791 5391213 7548738 8424581 8787279 8243330
8481 8243330 6767507 5324833 4375888 3421244 2288547 1304105 200546 -1308293 -1802548
8472 -1802548 821344 5934096 9661201 8852588 4370490 -298356 -2556932 -2214167 -767829
8463 -767829 -153558 -1440830 -3945671 -5991507 -6800100 -7047474 -7496128 -7985484 -8002868
8454 -8002868 -7324561 -5797417 -3456435 -1248475 -582050 -1464357 -1983101 -602626 1572362
8445 1572362 1918644 -392952 -3228522 -4059429 -2930802 -1961875 -2230722 -2571831 -1951158
8436 -1951158 -1412296 -2083063 -2506335 -500351 2771662 3739570 1969544 1312882 3822631
8427 3822631 5913157 3572809 -1239308 -3210567 -1025432 1986745 3634206 4889093
8419 4889093 6084753 5506415 2953536 985787 985092 1085023 -291128 -1752665 -1743506 -1336052
8409 -1336052 -1973230 -2736081 -2309478 -1697334 -2347039 -3166355 -2211785 -232374 324865
8400 324865 -742012 -1192522 -27184 1115144 690454 -559997 -861881 358522 1963791
8391 1963791 2098179 -237885 -3797673 -5585364 -3746359 262770 3236064 3474299 1570626
8382 1570626 -1191745 -3625966 -4310357 -2445239 625464 2250998 1398007 -251183 -463374
8373 -463374 1177526 3301660 4242635 3195214 683798 -1756037 -2848164 -2630459 -1901395
8364 -1901395 -1058753 -297492 -396187 -1845569 -3274110 -2420404 818682 3809927 4484081
8355 4484081 3851423 4006264 4770345 4122032 1595707 -637147 -569567 1142136 2303000
8346 2303000 1842952 415422 -922515 -1449624 -641767 1309968 2881216 2593697 1308548
8337 1308548 1524305 3657808 4792859 2566169 -1266216 -3170420 -2537813 -1538572 -1075122
8328 -1075122 10820 1656756 1841965 147957 -940061 117989 1391638 733120 -822753
8319 -822753 -1201572 -725565 -742861 -537172 1420508 4262150 5652909 5142326 3971708
8310 3971708 2536584 922388 854847 3553559 6342058 5462072 2141244 1362727 3977068
8301 3977068 4988238 1554176 -2205166 -1676327 1098491 1151315 -1373655 -1914951 1034412
8292 1034412 3920265 3618224 1000498 -1527652 -2782382 -2331655 -115510 2443681 3193400
8283 3193400 2006833 911754 942952 950279 150562 -399475 123269 839735 951357 1092005
8273 1092005 1648344 1613912 598533 172976 1425104 2781718 2329612 982725 1039623
8264 1039623 2576716 3773330 4207492 5080441 6154996 5268584 1769305 -1764052 -2479538
8255 -2479538 -454027 2088002 3490326 3636208 3310846 3503332 4422373 4619957 2375529
8246 2375529 -1313268 -2779281 -138679 3724672 4517440 1906993 -594462 -565781 878500
8237 878500 1685762 1558768 1201708 743757 179468 135418 905545 1503536 822615 -770323
8227 -770323 -1971871 -2278807 -2284893 -2479453 -2571308 -2030729 -853416 187544 -19614 -1761154
8217 -1761154 -3645622 -3749234 -2024346 -542165 -581265 -684180 967126 3236317 3226741
8208 3226741 578041 -1780390 -1807456 -1071490 -1857629 -3338964 -2857198 -213862 1749008
8199 1749008 1074312 -859793 -1641861 -943507 -41884 631244 1757907 3281254 3905029
8190 3905029 2811619 792144 -802292 -1406906 -1098586 43614 1724897 3154185 3668371
8181 3668371 3232582 1877751 -554408 -3309262 -4354395 -2613106 12379 670104 -587593
8172 -587593 -1095596 70140 627248 -883623 -2271672 -1208102 526294 -467539 -3568034
8163 -3568034 -4685623 -2475053 -233312 -506231 -1380757 -342437 1190533 368769 -2022004
8154 -2022004 -2654499 -1008215 32753 -899028 -1581081 -171380 1615262 1140419 -1269714
8145 -1269714 -2986634 -2440705 -188254 2451975 4275726 4334847 2604143 209462 -1872725
8136 -1872725 -3723760 -5328894 -5609468 -3898611 -1453020 28232 650214 1500003 2350738
8127 2350738 2127457 1142872 675181 505375 -750145 -2655271 -2848707 -729942 1129107
8118 1129107 581814 -1084124 -1349060 -61781 962324 798014 103408 -290194 37926
8109 37926 1305845 2986665 3647741 2538560 749606 -226895 -235903 322230 1822433
8100 1822433 4349361 6264351 5746393 3288530 1052125 306212 1024695 3031219 5434755
8091 5434755 5811170 2662111 -1585539 -2822295 -585301 1716028 2208575 2820393 4897312
8082 4897312 5944367 3296758 -1249744 -3426974 -1959754 553389 1599152 1209907
8074 1209907 574254 220076 -18641 -471693 -1303396 -1944094 -1128829 1540209 4394323
8065 4394323 5164610 3540924 1362288 431823 1016926 2302033 3374683 3790611 3863992
8056 3863992 4253333 4769292 4226877 2335718 904162 1661850 3354111 2905868 -357530
8047 -357530 -3579829 -4225022 -3299802 -3315865 -4319460 -4000081 -1542898 628183 -117118
8038 -117118 -2898922 -3909096 -708177 4836928 8338400 7412777 4009347 2022184 2886219
8029 2886219 4251146 3312742 606189 -707731 861590 3162684 3456682 2003823 1100894
8020 1100894 1479010 1687202 864259 -27221 -209302 -345458 -858654 -758256 552859
8011 552859 1730664 1224142 -509982 -1862531 -2105106 -1303535 556696 2814938 3710407
8002 3710407 2461665 679780 -25778 -481522 -1877043 -2834391 -1462217 856282 1212870
7993 1212870 136561 1033157 4543695 7238519 6678002 4238666 1870873 -441905 -2527391
7984 -2527391 -2717328 -688002 1196605 1297145 857028 1032365 678636 -818743 -1514798
7975 -1514798 -340181 215803 -2032557 -4769329 -4274837 -969478 1581455 1909856 1519100
7966 1519100 1402610 926026 -198902 -1489003 -2827281 -3846012 -3110317 -297736 1947920
7957 1947920 1094892 -1332917 -1815760 8302 1362309 886383 -88396 -595682 -1200803
7948 -1200803 -2020583 -2388783 -2530613 -2982097 -2690956 -589750 1445621 700218 -1515061
7939 -1515061 -1081894 2404141 4554993 2911701 621541 1214614 3314035 3513344 1854315
7930 1854315 1126910 2263518 3500646 3424668 2303650 615981 -1612780 -3732446 -4266568
7921 -4266568 -2483206 415237 2212587 1903608 806480 920547 2168461 2434263 884516
7912 884516 -436207 229123 1314376 378868 -1791656 -2501142 -1689456 -1743809 -3013501
7903 -3013501 -3183581 -1583185 -448026 -763586 -338068 2199614 4477367 3664623 421722
7894 421722 -2569434 -4228673 -5228142 -5934548 -6058598 -5509436 -4437213 -3221116 -2777710
7885 -2777710 -3463095 -3565482 -1050910 2820753 4229579 1955672 -890544 -1345701 51530
7876 51530 1656598 3268661 4368465 3025426 -742466 -3220923 -1639869 1643069 2693072
7867 2693072 1732585 1877773 3634551 4395599 2889658 810649 -63079 185466 646446
7858 646446 598059 -365461 -1673174 -1911876 -1134827 -1771997 -5168890 -8548339 -8063727
7849 -8063727 -3947968 143153 2169052 3082694 3647255 3244399 2191370 2132185 3216971
7840 3216971 3477465 2053519 743639 1101830 1975662 1414083 -466528 -2041487 -2579662
7831 -2579662 -2640072 -2653041 -2437955 -2057811 -2123011 -2854859 -3334282 -2292887 221035 2494960
7821 2494960 3019196 2288189 1855659 1973012 1588049 659768 630478 1981827 3108167
7812 3108167 2668104 1512086 1095600 1407519 1721228 1998382 2206463 1624211 230590
7803 230590 -621558 -366609 -488998 -1948077 -3051794 -2068938 -460103 -925871 -3235418
7794 -3235418 -4617787 -3720269 -1706139 236834 2111128 3860301 4905304 5055792 4515239
7785 4515239 3308678 1883344 1385963 1942212 1890553 426414 -515836 781997 2597123
7776 2597123 2302326 745934 779956 2354875 2765705 1481153 957588 2256813 3335953
7767 3335953 2563810 964058 -4253 -325068 -237384 456464 1160518 799719 -71103 308874
7757 308874 1983441 3091285 2818739 1966913 447829 -2653939 -5987792 -6369700 -3562010
7748 -3562010 -1387407 -2408350 -4470009 -4505651 -3015272 -2330555 -2621041 -2287309 -982811
7739 -982811 62217 7935 -815052 -1403797 -626081 1527323 2857382 1096280 -2266656
7730 -2266656 -2838398 778386 4562759 4328523 974454 -1645768 -1886218 -836472 515454
7721 515454 1901973 2662866 2424957 2122183 2483155 2552488 1467741 329463 308456 400669
7711 400669 -579951 -1279540 40532 1786610 835993 -2356503 -3895916 -2066939 337046
7702 337046 291739 -1570298 -2836135 -2931907 -2958884 -3189276 -2687609 -1150702 275312 289068
7692 289068 -1071366 -2449925 -2487946 -1022416 989791 2591696 3619353 4435746 5320533
7683 5320533 6236415 6785408 6361957 4887506 3356912 2892060 3251700 3219328 2440120
7674 2440120 1578396 554246 -1574370 -4271536 -4999839 -2503717 882732 2043877 1173457
7665 1173457 1060434 2865229 4749311 4806147 3422233 2030559 978186 -225094 -1293340
7656 -1293340 -1154428 261421 1263534 380239 -1314317 -1262244 885846 2344126 1142734
7647 1142734 -697949 -111325 2146509 2517807 65123 -2449444 -3218852 -3636863 -4742571
7638 -4742571 -4794298 -2387199 773333 2487701 3134581 3819671 3670977 1669683 -568560
7629 -568560 -624757 1316915 3248676 4222429 4212887 2698489 6750 -1388533 213889
7620 213889 2733331 3049465 1474713 438414 79526 -1206051 -2813554 -2571748 -940210
7611 -940210 -484731 -1195588 -552816 1374415 1387398 -1202378 -2864393 -1614854 -259057
7602 -259057 -1331108 -2683247 -1501228 410633 -610292 -3971841 -5519854 -3510884
7594 -3510884 -308855 1708988 2770333 3827415 4710546 5082749 5373790 5729536 5241787
7585 5241787 3214997 544525 -1050240 -1074895 -912742 -1975728 -3389754 -2500220 1643738
7576 1643738 6292121 7939022 6650114 5482410 5810730 5765648 3914187 1803164 1272192
7567 1272192 1442382 482359 -1217530 -1913225 -1485136 -1277958 -1598000 -1547551 -1067713 -1090082
7557 -1090082 -1602188 -1387065 5769 1545535 2394185 3072655 4454259 6419511 7882917
7548 7882917 7684460 5492823 2330087 -63198 -966671 -1370619 -2310043 -3232522 -3045663
7539 -3045663 -2095758 -1696043 -2033859 -2028585 -1252099 -643696 -1102546 -2361411 -3348574 -2933243
7529 -2933243 -665900 2294215 3640381 2627933 1551058 2694229 4601053 4009231
7521 4009231 1231430 274154 2768773 5184497 4024646 851421 -617148 -88312 55436
7512 55436 -379496 810986 3785153 5668297 4783729 2909764 2212867 2468177 2654119
7503 2654119 3003084 3748555 3688200 1931952 -234865 -1054454 -778594 -701148 -769263 -146409
7493 -146409 647273 358928 -629185 -793836 -294865 -1012062 -3293139 -4815978 -3702047
7484 -3702047 -1099627 522571 415937 -301791 -590177 -355172 92268 460025 615157
7475 615157 829466 1478226 2204913 2089975 973957 -272151 -1167973 -2207099 -3482429
7466 -3482429 -4060616 -3644278 -3526699 -4610703 -5651680 -5007702 -3159423 -1797141 -1248134
7457 -1248134 -682158 -117820 -38266 448215 2502353 4732422 4348191 1641277 320221
7448 320221 2115691 3936673 2489890 -703869 -1705829 87548 1753206 1614530 963072
7439 963072 920202 599184 -687344 -1757512 -1365356 -10011 1134424 1627558 1162070
7430 1162070 -802250 -3524919 -4649400 -3044747 -780115 -445884 -1522797 -1546669 -169609
7421 -169609 522139 -235970 -482255 1220733 3365312 3781421 2700253 1863288 1712385
7412 1712385 1285712 351695 -85184 593491 1770013 2506268 2434813 1739736 1023065 1134162
7402 1134162 2415782 4143612 5198450 5045827 3694771 1443205 -590595 -663252 1513899
7393 1513899 3590952 3095077 682389 -872707 -542345 273305 852004 2244311 4477346
7384 4477346 5364104 3827293 2264531 3338631 5888578 6535892 4502211 2209875 1308718
7375 1308718 761613 -500857 -1335609 -244601 1882346 2519023 620085 -2195121 -3598052
7366 -3598052 -2871479 -1067563 484810 1225429 1166095 527419 -27505 456352 1963544
7357 1963544 2858195 1668716 -640513 -1550417 -279140 1295453 1400596 393868 -745610
7348 -745610 -2153728 -3947881 -4928534 -4197526 -2900643 -2488259 -2310130 -1089366 148742
7339 148742 -692915 -2947207 -3470464 -1217045 1143056 1176125 -79596 -256661 821715
7330 821715 1456842 680951 -1015179 -2744587 -3717220 -3303358 -1676585 74628 1093480
7321 1093480 1256627 179511 -2773685 -6509793 -7874123 -5047433 -262703 2599257
7313 2599257 2334130 705154 -555282 -856528 354946 3071892 5151064 4082722 935398
7304 935398 -134452 2626694 6105177 6823213 5416746 4492178 4235470 3068806 1249975
7295 1249975 525316 701088 -238743 -2407868 -3349351 -1766267 659566 2079757 2753151
7286 2753151 3446895 3802414 3578137 3506139 3631625 2812622 1116401 358845 709075 -466675
7276 -466675 -4034834 -6218698 -3677156 824913 1902390 -856916 -3267201 -3552658 -3922945
7267 -3922945 -5056471 -4309481 -909012 1740572 1204614 -395119 -374422 428327 261458
7258 261458 -12076 953847 1961110 1497203 775078 1469295 2441283 1902466 1056874 2255509
7248 2255509 4894105 6377105 6061414 5244421 4371881 3237702 2765148 3537334 3838471
7239 3838471 2361471 1346742 3261665 5833648 4923304 1372449 -155796 1044558
7231 1044558 714677 -2709904 -5099538 -3466022 -719542 -482987 -1398448 -376483 1696688
7222 1696688 1612858 -787259 -2724545 -2925683 -2736404 -3237033 -3748531 -3112413 -904851
7213 -904851 2205125 4331637 3663637 904720 -914543 -127726 1610791 2111572 1431744
7204 1431744 481884 -951864 -2840702 -3564082 -2184205 -358060 282848 879842 2926168
7195 2926168 4901055 4437828 2447300 1575032 1450374 -668119 -4643837 -6814227 -5415335
7186 -5415335 -3126803 -2698253 -3028361 -1704288 773617 1810527 615444 -1042229 -1676450
7177 -1676450 -1751472 -2104525 -2090638 -386879 2685830 4766131 4008368 1401574 -528847
7168 -528847 -1001499 -1387894 -2194710 -1739382 959977 3790895 3964304 1728109 -243785
7159 -243785 -371213 802988 2386575 3873046 4491884 3821373 2867912 2775112 2861829 1897810
7149 1897810 812313 1654145 3969134 4941148 3591225 2206567 2737130 4209700 4848865
7140 4848865 4503908 3617522 1899589 -340475 -1382863 -430035 756100 349898 -764686
7131 -764686 -616148 650955 1268409 681521 -178661 -845766 -1471994 -1437983 52566 2030368
7121 2030368 2437730 1016531 -243444 112802 1415273 2449256 2950097 2897201 1915791
7112 1915791 308419 -595506 -71686 1063498 1909934 2647679 3347333 3075376 1633104
7103 1633104 909143 2525741 4917282 5001326 2543000 507200 725024 1600985 1182253
7094 1182253 331737 1020231 2921082 3849944 2927173 1341302 263060 -144756 288055
7085 288055 1800172 3378375 3207214 1212142 -408569 -167569 639519 144864 -1070163
7076 -1070163 -972115 555842 1369502 257890 -1267062 -1153197 424544 1541715 1125766
7067 1125766 -68391 -996621 -1731245 -2724221 -3311524 -2073247 1047098 3886631 4168492
7058 4168492 2050007 -350148 -1671586 -2317426 -2763941 -2543099 -1647079 -1334766 -2129426
7049 -2129426 -2299331 -268797 2302472 2282176 -222652 -1602795 77902 2320747 2260631
7040 2260631 1106865 1819280 3875802 3786569 609086 -2462262 -2844303 -1796472 -1312465
7031 -1312465 -664081 1364298 3015760 1774795 -1074249 -1814340 -112648 273704 -2523942
7022 -2523942 -5338600 -4629929 -1393009 945008 1240388 630097 -321552 -1563458 -2003229
7013 -2003229 -1045770 -681809 -2825994 -5304883 -4199381 -146021 1719953 -908722 -4106667
7004 -4106667 -3588871 -642212 602720 -630383 -1572328 -599868 1059825 2011750 2493798
6995 2493798 3208969 4109626 4645164 4172403 2345411 50000 -785327 312302 892396
6986 892396 -1408809 -4844686 -5013195 -783479 3589785 3628034 192858 -2019871 -703001
6977 -703001 1544609 1247062 -1288348 -2794810 -1686281 74578 188119 -601376 150414
6968 150414 2687824 4433535 3435597 766608 -1242453 -1874507 -2077326 -2438515 -2273864
6959 -2273864 -636021 2368428 5272831 6247327 4844464 2706727 1798600 1962610 1326179
6950 1326179 -633633 -1819842 -207628 3174902 5162234 4084841 1642450 1009710
6942 1009710 3277734 5937631 5452939 1677004 -1370259 -338524 2985612 4202245
6934 4202245 2509938 1302418 2371563 3096378 987435 -2130083 -3042776 -1989448 -1634479
6925 -1634479 -2604153 -3017680 -1911465 -535014 -178530 -567262 -556320 718498 3081766
6916 3081766 4853167 4014977 882057 -1567767 -1339509 -79158 -467879 -2304807 -3213169
6907 -3213169 -2198030 -332449 1354069 2536264 2638163 1195448 -1042611 -2765263
6899 -2765263 -3331362 -2406109 225514 3187010 3837517 2007539 1180777 3382811 5367690
6890 5367690 3460023 -115434 -444694 2058872 2403602 -476081 -1830533 1069965 4594030
6881 4594030 4538122 1763224 -687161 -2276844 -3710639 -4111606 -2749263 -1294160 -1318303
6872 -1318303 -1409479 371789 2734453 2730032 118285 -2313204 -2245052 151146 3018695
6863 3018695 4229449 2843364 344732 -570433 705584 2061415 2111456 2128249 3205570
6854 3205570 3892290 2741247 1154637 1239005 2478981 3054652 2979174 3235766 3095538
6845 3095538 1299600 -912098 -1031894 777273 1891563 1354447 923485 1603102 1925809
6836 1925809 726044 -654990 -402036 1022050 1584352 344719 -1658729 -2747614 -2102875
6827 -2102875 -188912 1803869 2911487 2915058 2110500 1021741 387212 648650 1058881
6818 1058881 159557 -2156897 -3852318 -2954031 -68936 2185340 1946055 -340254 -2728375
6809 -2728375 -3527685 -2567115 -1127609 -369608 31173 940845 1913590 1911833 1791281 3769341
6799 3769341 7688270 10162011 8813986 5269239 2365036 576525 -770854 -984784
6791 -984784 471499 1598549 195928 -2351435 -2682190 -260092 2400684 3843948 4842343
6782 4842343 5550950 4790983 2742372 1420193 1621418 1929838 1507615 1314819 1682574
6773 1682574 1311275 -121977 -889010 -182350 280457 -628749 -1060643 870515 3693501
6764 3693501 4657451 3751124 2958893 2558616 1183231 -726173 -666690 1948369 4114525
6755 4114525 3068828 181030 -732592 1723123 4891984 5286416 2350259 -1302477 -2744388
6746 -2744388 -1384828 945992 2085088 1535907 450695 -179923 -873456 -2700340 -5150296
6737 -5150296 -5980242 -3916350 -758056 495082 -628296 -1732729 -1125551 59663 175374
6728 175374 -263621 123840 853213 276241 -1451068 -2203626 -835853 1423057 2841075
6719 2841075 2998332 2423421 1801650 1901066 2958280 3775446 2792634 463874 -917730
6710 -917730 -337497 576995 166034 -872760 -959311 -138694 433303 509289 600862 523579
6700 523579 -171898 -738092 -28982 1278403 1095975 -990058 -2659532 -1771545 821713
6691 821713 2445215 1896824 509668 195063 1360846 2897261 3626564 3420996 2992307
6682 2992307 2796045 2457302 1542060 569311 511382 1270710 1636893 1239920 1518771 3684107
6672 3684107 6441278 7251450 5692997 3929146 3499053 3345112 1985697 131915 -459937
6663 -459937 177716 370644 -572630 -1714033 -2520220 -3669524 -5187800 -5420054 -3073455
6654 -3073455 673580 3312230 3754630 2926898 1941419 768323 -1064735 -3169107 -4264414
6645 -4264414 -3486304 -1462848 269270 964484 1273679 1891228 2355923 1938500 1029499
6636 1029499 534653 369609 -174363 -937841 -1193622 -1121705 -1333692 -1176647 475880 2714535
6626 2714535 3160093 1464398 -87159 -111865 266824 285113 1121565 2974904 3447720
6617 3447720 1277363 -780237 298998 3129497 4108050 2714049 1341164 1092735 1220555
6608 1220555 1848367 3598805 5010203 4050335 2000655 1978270 3547557 3064371 53398
6599 53398 -1337035 1060046 3747969 3154569 1104018 1249104 2998617 3038972 1101212
6590 1101212 95350 1147659 2169194 1541999 274256 -115733 344517 799225 758856
6581 758856 121125 -831682 -1333903 -1048648 -838759 -1493065 -2171640 -1639575 -661533 -1237950
6571 -1237950 -3289572 -4018291 -1396137 2999299 5536565 4213038 286477 -3097954
6563 -3097954 -3519546 -1156681 1524576 2244385 1044531 -409850 -1143094 -1476646 -1679484
6554 -1679484 -1464568 -969048 -781797 -595731 647354 2557203 2856972 428359 -2551829
6545 -2551829 -3221380 -1804249 -769729 -852952 -386212 1292580 2461784 2147737 2216331
6536 2216331 4338373 6608276 5795125 2177587 -564280 -315877 1092384 1056624 -478551
6527 -478551 -1938422 -2512916 -2248269 -1126073 496296 1514645 1441867 1271004 1819617
6518 1819617 2217313 1350580 -220515 -1323579 -2163034 -3441909 -4353319 -3599715 -1912937
6509 -1912937 -1231531 -1524692 -927550 683315 889321 -1513116 -4308293 -4945474 -3977193
6500 -3977193 -3579454 -3974003 -3421282 -1219207 1214503 2359970 2320211 2192654 2630723
6491 2630723 3448464 4143973 4386460 4065319 3136742 1731010 466176 122784 541451
6482 541451 422470 -893867 -1916094 -585912 2666368 4877713 3986715 1160357 -786200
6473 -786200 -249274 2313330 5200707 6450994 5110872 2458876 1206826 2677540 5397983
6464 5397983 7038152 6834536 5393015 3232882 810255 -752382 -502079 857336 1518542
6455 1518542 776470 -223899 -193696 586872 745630 -302128 -1454179 -1138532 670531
6446 670531 2117761 1534742 -520797 -1980600 -1807871 -864752 -150393 681293 2333589
6437 2333589 4117488 4198808 1715334 -1778037 -3352108 -1509228 2054207 4072503 3334650
6428 3334650 1809787 1634813 2357071 2577481 2971353 5200109 8356161 9407835 7599450
6419 7599450 5622265 5393978 5352087 3599273 1328420 751294 1331936 822429 -786425
6410 -786425 -1056710 1117223 3723182 4233522 2557757 690600 201530 692442 622041
6401 622041 -560185 -1507469 -741313 1152494 2386840 2794827 3768928 4994808 3821378
6392 3821378 -561994 -4625276 -4604317 -1548388 438839 -62233 -853343 -549956 -643434
6383 -643434 -2325714 -3957964 -3309018 -727994 1452008 1855196 1227736 1037903 1723549
6374 1723549 2352188 1852913 573587 162928 1462901 3159459 3418281 2304581 1387522
6365 1387522 1342906 1419736 1226503 1461042 2452895 3339906 3386538 3084295 3125081 2992866
6355 2992866 1492419 -1490842 -4377735 -5231516 -3646343 -1206052 151535 160883 98310
6346 98310 632283 854573 29121 -846187 -459313 586690 468633 -1211824 -2920858
6337 -2920858 -3331801 -2647983 -1617660 -491692 578128 1072128 647699 -304112 -930351
6328 -930351 -466665 1340532 3843092 5689030 5994279 5174452 4185665 3421970 2997453
6319 2997453 3403211 4759662 5880434 5358840 3382776 1299581 -332376 -1860719 -2872405
6310 -2872405 -2098389 596621 3466691 4693887 4017888 2328448 727724 239825 1183004
6301 1183004 2335493 1914687 8688 -1092063 263429 2978563 4861266 5391219 5580492
6292 5580492 5736087 4970098 3091365 1622565 2045454 3575843 3680133 1042850 -2587503
6283 -2587503 -4095915 -2347708 787493 2728287 2674040 1494794 65906 -1336564 -2344596
6274 -2344596 -2237846 -693078 1558337 3046018 2675661 818221 -801537 -817241 245144
6265 245144 831034 579673 534188 1076757 1175025 247816 -699169 -642738 109589 983429
6255 983429 2015965 2657494 1500689 -1276330 -2952555 -1704643 523468 788444 -620477
6246 -620477 -1236432 -474243 315959 1060592 2918331 5033900 4540834 621039 -3846882
6237 -3846882 -5575575 -4075196 -1186447 879152 834216 -649083 -1120117 876572 3563053
6228 3563053 4240488 3121934 2544038 3075089 3209748 2443296 1591156 445757 -1522408
6219 -1522408 -2528029 -520892 2210120 1156061 -3018922 -4316494 -344816 3697073
6211 3697073 2751697 -1027885 -2470136 -641071 2028410 4382945 5998946 4938834
6203 4938834 716552 -2656229 -1236076 2794129 4032784 1466927 -1284797 -2201242
6195 -2201242 -2534446 -2709567 -1409488 769963 1046740 -1204805 -3399847 -3901248 -3929396
6186 -3929396 -4424122 -4201954 -2462711 -417213 789826 1482887 1848454 1156574 -502453
6177 -502453 -1720213 -1764553 -1251211 -457526 991464 2464142 2583078 1520940 836508
6168 836508 795605 247169 -725206 -871535 -808774 -2748329 -6383008 -8390830 -7313098
6159 -7313098 -5573516 -4952929 -3541279 282752 3939759 4002891 1344922 -344017 284850
6150 284850 1679059 2882006 4395204 5923187 6075043 4509959 2383059 632821 -583798
6141 -583798 -1087007 -951658 -1173279 -2367235 -3251891 -2253198 -273624 111832 -1816808
6132 -1816808 -4066140 -4725583 -3846541 -2262869 -337678 1411790 1875658 526695 -1664318
6123 -1664318 -3064469 -2703603 -752783 1563871 2551084 1494896 -299431 -797806 290150
6114 290150 1246332 700171 -851336 -2294782 -3514470 -4839006 -5635262 -4667662 -1832707
6105 -1832707 1326530 3098703 3120154 2220439 1249756 520312 126316 127868 300549 310051
6095 310051 392799 1178975 2379550 2520251 957570 -595976 -57814 1866923 2359743
6086 2359743 532964 -1188663 -645059 872021 575521 -1780207 -3575540 -2687357 201368
6077 201368 2623104 2740707 793697 -1257521 -1675153 -800543 -465222 -1442666 -2586812
6068 -2586812 -2897816 -2876212 -2810486 -1432291 1900018 4979962 5024212 2501582 378749
6059 378749 -82939 -277781 -989315 -942905 525794 1813516 1507491 602541 587101 802281
6049 802281 -351419 -2492914 -3564485 -2782672 -1506327 -999272 -849211 -183265 679118
6040 679118 689732 -334133 -1434197 -1765548 -1461041 -1055051 -627636 -61263 205567 -468964
6030 -468964 -1773395 -2552546 -2428859 -2351219 -2849647 -2762634 -919406 1597848 2403993 848342
6020 848342 -1320201 -2343336 -2102722 -1218960 -30186 960377 955415 36470 -497640 192438
6010 192438 1175695 856316 -1105926 -3472816 -4561297 -3519379 -1202705 119480 -990506
6001 -990506 -2906980 -2273534 1783041 6072098 6944479 4393714 1486897 674034 1867644
5992 1867644 3412236 3688521 2245707 373829 39306 1443381 2518801 1846070 867755
5983 867755 1624484 3383344 3720083 2442008 1953711 3454479 5068935 4698561 3014311
5974 3014311 2362578 3644074 5297637 4981478 1882528 -2180174 -4011869 -2236494 881550
5965 881550 1891940 271277 -1354410 -1032408 409213 1552792 2519617 3585234 3478352
5956 3478352 1063160 -2210152 -3528576 -2179529 -233632 257767 -554052 -1174856 -775922
5947 -775922 158702 685734 456455 -74458 -384700 -563387 -941089 -1369670 -1550987 -1742032
5937 -1742032 -2033389 -1209406 1942337 5942469 7342248 5180232 2762550 3366109 5831239
5928 5831239 6514865 4343732 1471599 -320609 -1214622 -1491642 -658099 1109632 2724643
5919 2724643 3886085 5174007 6125576 5315684 2962008 1264225 1171967 984609 -427190
5910 -427190 -1121864 1050519 4518611 5426334 2583539 -1106040 -2255930 -450922 2183473
5901 2183473 3656568 3851507 4068541 4996880 5242174 2717768 -2155273 -5998673 -6342600
5892 -6342600 -4637021 -3680150 -3211819 -717484 3622566 5890938 3562445 -675187 -2148531
5883 -2148531 197144 3431055 4940107 4811632 4058210 2785277 1044480 -91259 286637
5874 286637 1392300 1671940 948879 468199 855897 1289280 1100792 1032696 1968353 3212689
5864 3212689 3295276 2201585 1466522 1839533 2102719 901004 -1136092 -2045440 -938723
5855 -938723 1019467 1937741 979964 -1083961 -2708153 -3013913 -2591226 -2644255 -3325788
5846 -3325788 -3598854 -3056614 -2891863 -4073174 -5280488 -4174767 -708474 2332434 2661037
5837 2661037 1145415 201827 508328 779776 481266 938487 2936518 4603984 3431114
5828 3431114 76303 -1776560 -37077 3030065 4118053 3542753 4188385 6340110 6716934
5819 6716934 3687310 609713 1613605 5791778 8427833 7272395 4703367 3554556
5811 3554556 3643711 3475193 3046174 3203936 3625799 3265393 2165199 1346703 1227429 1337670
5801 1337670 1370439 1434822 1404412 1016530 574355 592150 705930 -53737 -1652119 -2727609
5791 -2727609 -2470812 -1977178 -2760640 -4371367 -4690241 -2706674 131972 1906261 2540604
5782 2540604 3070404 3352945 2202495 -153153 -1564016 -767020 714323 709158 -675911
5773 -675911 -1754305 -1973050 -2075931 -2072305 -1199991 -1775 -257427 -2139215 -3325934
5764 -3325934 -2044066 508946 1997796 1975284 1761481 2243676 3113769 3636447 3063341
5755 3063341 961806 -1797382 -3140284 -2084512 -246743 195008 -671330 -1132920 -617920
5746 -617920 -32841 296994 1054854 2200223 2686047 2369448 2528951 3745930 4686413
5737 4686413 3932695 2013129 708736 1024397 2515710 4036263 4638687 4258417 3817153
5728 3817153 4119793 4646564 4292098 3223554 2685521 2740569 1822121 -671995 -2823782
5719 -2823782 -2485380 -123895 1898025 2223478 1563525 1375868 2449263 4361528 5596393
5710 5596393 4755796 2265030 82998 -810158 -1359395 -2066129 -1486810 1178544 3662588
5701 3662588 3361781 1473162 1413520 3454937 4235732 2149069 -98383 165588 1545454
5692 1545454 1256277 -222190 -87253 2091846 3502252 2160828 -325115 -967419 867476
5683 867476 2882256 2577175 -51338 -2581536 -2772051 -814981 1292055 2151474 1768491
5674 1768491 230100 -2645513 -5677667 -6192379 -3200691 441075 1065890 -1120906 -2494185
5665 -2494185 -1175793 455319 -661345 -3914643 -5895865 -4920690 -2954366 -2706019 -4088094
5656 -4088094 -4708583 -3466986 -2084373 -2300475 -2931517 -1598248 1177790 2176739 402973
5647 402973 -823511 1486340 5304514 6111945 2868031 -1362141 -4080436 -5528425 -6077471
5638 -6077471 -4716257 -1424141 1425781 1730214 103183 -1679522 -3097331 -4314466
5630 -4314466 -4712984 -3772569 -2383840 -1590406 -822983 953502 2970678 3292407 1508775
5621 1508775 -692106 -1604722 -985093 395812 1543983 1746628 1358301 1847827 3923199
5612 3923199 5898640 5314189 2134676 -1080471 -2326496 -2013625 -1357051 -528319 654890
5603 654890 1466312 1078323 95654 28131 1247002 2367922 1899101 -35203 -1897233
5594 -1897233 -2401456 -1709725 -958920 -775092 -553639 601381 2499269 3950111 4299116
5585 4299116 4317043 5099831 6359706 6520048 4776150 2509240 1915488 3286748 4502348
5576 4502348 3642936 1370061 -77193 284793 1432125 2181647 2519288 2841028 2981853
5567 2981853 2543519 1496867 149629 -857716 -580716 1161054 2771996 2362735 434484
$$ [...]
##END NTUPLES=NMR SPECTRUM
##END=
