##TITLE=31Pdec_SR110
 CDCl3, 24 sc
 18.3.2022
##JCAMPDX= 6.0         $$ Bruker NMR JCAMP-DX V2.0
##DATA TYPE= NMR SPECTRUM
##DATA CLASS= NTUPLES
##ORIGIN= UXNMR, Bruker Analytische Messtechnik GmbH
##OWNER= root
$$ XWIN-NMR		Version 3.5
$$ Fri Mar 18 13:48:09 2022 Russian Standard Time (UT+4h)  she@DPX200
##.OBSERVE FREQUENCY= 81.013821
##.OBSERVE NUCLEUS= ^31P
##.ACQUISITION MODE= SIMULTANEOUS
##.ACQUISITION SCHEME= undefined
##.AVERAGES= 24
##.DIGITISER RES= 16
##SPECTROMETER/DATA SYSTEM= spect
##.PULSE SEQUENCE= zgpg30
##.SOLVENT NAME= D2O
##.SHIFT REFERENCE= (INTERNAL, D2O, 0, 248.564)
##AUDIT TRAIL= $$ (NUMBER, WHEN, WHO, WHERE, WHAT)
$$ ##TITLE= Audit trail, XWIN-NMR		Version 3.5
$$ ##JCAMPDX= 5.01
$$ ##ORIGIN= Bruker BioSpin GmbH
$$ ##OWNER= she
$$ F:/spectra/data/she/nmr/P31/1/pdata/1/auditp.txt
$$ ##AUDIT TRAIL=  $$ (NUMBER, WHEN, WHO, WHERE, WHAT)
(   1,<2022-03-18 13:47:09.84 +0400>,<she>,<DPX200>,
      <created by zg, POWCHK disabled, PULCHK disabled
       configuration hash MD5:
       00 E9 B6 7A A2 85 ED C7 34 08 36 98 17 FE 4E 26
       data hash MD5: 32K
       3B AC C2 B5 68 AD 29 F6 19 37 49 D8 16 62 30 6E>)
(   2,<2022-03-18 13:47:12.26 +0400>,<she>,<DPX200>,
      <Start of raw data processing
       efp BC_mod = 2 LB = 1 FT_mod = 6 PKNL = 1 PHC0 = -9150.572 PHC1 = 42.2756 SI = 64K 
       data hash MD5: 64K
       7F 67 52 F2 C4 D2 D4 E1 23 DF C6 9A 26 D5 D6 BA>)
(   3,<2022-03-18 13:47:27.67 +0400>,<she>,<DPX200>,
      <pk PHC0 = -27.88848 PHC1 = 0 
       data hash MD5: 64K
       5A 8A FC D5 E6 AF 9B 1F 98 39 48 08 A8 C7 AC F6>)
(   4,<2022-03-18 13:47:31.10 +0400>,<she>,<DPX200>,
      <abs ABSG = 5 
       data hash MD5: 64K
       9D 82 E8 6F 08 B4 3C 09 B1 1A 5F D6 0E 7A 7C 8C>)
$$ ##END=
$$ 
$$ hash MD5
$$ 15 2A 1F 3B 32 57 72 7C 6A 3F 95 E3 DC 29 F6 CE
##$RELAX= 
##$RELAX= 
##$RELAX= 
##$RELAX= 
##$RELAX= 
##$RELAX= 
##$RELAX= 
##$RELAX= 
$$ Bruker specific parameters
$$ --------------------------
##$DU= <F:/spectra>
##$EXPNO= 1
##$NAME= <P31>
##$PROCNO= 1
##$TYPE= <nmr>
##$USER= <she>
##$AMP= (0..31)
100 100 100 100 100 100 100 100 100 100 100 100 100 100 100 100 100 100 
100 100 100 100 100 100 100 100 100 100 100 100 100 100 
##$AQSEQ= 0
##$AQ_mod= 1
##$AUNM= <au_zg>
##$AUTOPOS= <>
##$BF1= 81.014009
##$BF2= 200.13
##$BF3= 200.13
##$BF4= 200.13
##$BF5= 200.13
##$BF6= 200.13
##$BF7= 200.13
##$BF8= 200.13
##$BYTORDA= 1
##$CFDGTYP= 0
##$CFRGTYP= 5
##$CHEMSTR= <none>
##$CNST= (0..31)
1 1 145 1 1 1 1 1 1 1 1 1 1 1 1 1 1 1 1 1 1 1 1 1 1 1 1 1 1 1 1 1 
##$CPDPRG= <waltz16>
##$CPDPRG1= <>
##$CPDPRG2= <waltz16>
##$CPDPRG3= <>
##$CPDPRG4= <mlev>
##$CPDPRG5= <mlev>
##$CPDPRG6= <mlev>
##$CPDPRG7= <mlev>
##$CPDPRG8= <mlev>
##$CPDPRGB= <>
##$CPDPRGT= <>
##$D= (0..31)
0 1 0 0 0 0 0 0 0 0 0 0.03 2e-05 3e-06 0 0 0 0 0 0 0 0 0 0 0 0 0 0 0 0 
0 0 
##$DATE= 1647596829
##$DBL= (0..7)
120 120 120 11 120 120 24 19 
##$DBP= (0..7)
150 150 150 150 150 150 150 150 
##$DBP07= 0
##$DBPNAM0= <>
##$DBPNAM1= <>
##$DBPNAM2= <>
##$DBPNAM3= <>
$$ [...]
##$SUBNAM3= <"">
##$SUBNAM4= <"">
##$SUBNAM5= <"">
##$SUBNAM6= <"">
##$SUBNAM7= <"">
##$SUBNAM8= <"">
##$SUBNAM9= <"">
##$SW= 501.771253377433
##$SWIBOX= (0..15)
0 1 3 0 0 0 0 0 0 0 0 0 0 0 0 0 
##$SW_h= 40650.406504065
##$TD= 32768
##$TD0= 1
##$TE= 0
##$TE2= 300
##$TE3= 300
##$TEG= 300
##$TL= (0..7)
0 120 53 12 22 120 120 120 
##$TP= (0..7)
150 150 150 150 150 150 150 150 
##$TP07= 0
##$TPNAME0= <>
##$TPNAME1= <>
##$TPNAME2= <>
##$TPNAME3= <>
##$TPNAME4= <>
##$TPNAME5= <>
##$TPNAME6= <>
##$TPNAME7= <>
##$TPOAL= (0..7)
0.5 0.5 0.5 0.5 0.5 0.5 0.5 0.5 
##$TPOFFS= (0..7)
0 0 0 0 0 0 0 0 
##$TUNHIN= 0
##$TUNHOUT= 0
##$TUNXOUT= 0
##$USERA1= <user>
##$USERA2= <user>
##$USERA3= <user>
##$USERA4= <user>
##$USERA5= <user>
##$V9= 5
##$VALIST= <valist>
##$VCLIST= <CCCCCCCCCCCCCCC>
##$VD= 0
##$VDLIST= <DDDDDDDDDDDDDDD>
##$VPLIST= <PPPPPPPPPPPPPPP>
##$VTLIST= <TTTTTTTTTTTTTTT>
##$WBST= 1024
##$WBSW= 4
##$XGAIN= (0..3)
0 0 0 0 
##$XL= 0
##$YL= 0
##$YMAX_a= 3288
##$YMIN_a= -3509
##$ZGOPTNS= <>
##$ZL1= 120
##$ZL2= 120
##$ZL3= 120
##$ZL4= 120
##$ABSF1= 248.5645
##$ABSF2= -253.2056
##$ABSG= 5
##$ABSL= 3
##$ALPHA= 0
##$AQORDER= 0
##$ASSFAC= 0
##$ASSFACI= 0
##$ASSFACX= 0
##$ASSWID= 0
##$AUNMP= <proc_1d>
##$AZFE= 0.1
##$AZFW= 0.5
##$BCFW= 0
##$BC_mod= 2
##$BYTORDP= 0
##$COROFFS= 0
##$CY= -3
##$DATMOD= 1
##$DC= 0
##$DFILT= <>
##$DTYPP= 0
##$F1P= 0
##$F2P= 0
##$FCOR= 1
##$FTSIZE= 65536
##$FT_mod= 6
##$GAMMA= 0
##$GB= 0
##$INTBC= 1
##$INTSCL= 5.30512e-09
##$ISEN= 30
##$LB= 1
##$LEV0= 0
##$LPBIN= 0
##$MAXI= 10000
##$MC2= 0
##$MEAN= 0
##$ME_mod= 0
##$MI= 50
##$NCOEF= 0
##$NC_proc= -6
##$NLEV= 6
##$NOISF1= 182.463
##$NOISF2= 159.3651
##$NSP= 0
##$NTH_PI= 0
##$NZP= 0
##$OFFSET= 248.5645
##$PC= 4
##$PHC0= -9178.461
##$PHC1= 42.2756
##$PH_mod= 1
##$PKNL= yes
##$PPARMOD= 0
##$PSCAL= 0
##$PSIGN= 0
##$REVERSE= no
##$SF= 81.014009
##$SI= 65536
##$SIGF1= 159.3651
##$SIGF2= -187.1042
##$SINO= 113.3802
##$SIOLD= 16384
##$SREGLST= <1H.CDCl3>
##$SSB= 0
##$STSI= 65536
##$STSR= 0
##$SW_p= 40650.406504065
##$SYMM= 0
##$S_DEV= 0
##$TDeff= 32768
##$TDoff= 0
##$TI= <>
##$TILT= no
##$TM1= 0
##$TM2= 0
##$TOPLEV= 0
##$USERP1= <user>
##$USERP2= <user>
##$USERP3= <user>
##$USERP4= <user>
##$USERP5= <user>
##$WDW= 1
##$XDIM= 65536
##$YMAX_p= 461972683
##$YMIN_p= -97137015
$$ End of Bruker specific parameters
$$ ---------------------------------
##NTUPLES= NMR SPECTRUM
##VAR_NAME=  FREQUENCY,     SPECTRUM/REAL,   SPECTRUM/IMAG
##SYMBOL=    X,             R,               I
##VAR_TYPE=  INDEPENDENT,   DEPENDENT,       DEPENDENT
##VAR_FORM=  AFFN,          ASDF,            ASDF
##VAR_DIM=   65536,         65536,           65536
##UNITS=     HZ,            ARBITRARY UNITS, ARBITRARY UNITS
##FACTOR=    0.620285442955139, 1,           1
##FIRST=     20137.2065510759, 0,            0
##LAST=      -20513.1999529892, 0,           0
##MIN=       -20513.1999529892, -97137015,   0
##MAX=       20137.2065510759, 461972683,    0
$$ Real data points
##PAGE= N=1
##DATA TABLE= (X++(R..R)), XYDATA
$$ [...]
$$ plain form
40881 -1024880 -1628737 -2152202 -1541124 -196735 463028 21732 -536893 -362690 287747
40872 287747 671015 441678 -214759 -902322 -1352856 -1581911 -1669890 -1484557 -948635 -451601
40862 -451601 -440142 -686005 -653784 -503939 -833021 -1435786 -1428850 -768215 -444173 -842234
40852 -842234 -1175013 -1014756 -1038854 -1567204 -1739204 -1072708 -509022 -753594 -819246 384737
40842 384737 2057976 2645638 2139166 1619066 1164154 12170 -1503922 -1992021 -1098405
40833 -1098405 -61742 108912 -230522 -337737 -105396 246422 612838 809869 609191
40824 609191 149742 -231562 -518205 -737311 -408864 820434 2114977 2087744 650980
40815 650980 -738149 -968014 -550329 -618642 -1382130 -2102860 -2164273 -1674363 -1175469 -1040346
$$ packed form
40881a024880o03857n23465O11078J344389O59763m41296n58625J74203O50437
40872B87747L83268k29337o56437o87563m50534k29055q7979J85333N35922M97034
40862d51601J1459k45863L2221J49845l29082o02765O936O60635L24042l98061
40852h42234l32779J60257k4098n28350j72000O66496N63686k44572o5652J203983
40842C84737J673239N87662n06472n20100m54912j151984j516092m88099Q93616
40833a098405J036663J70654l39434j07215K32341L51818L66416J97031k00678
40824F09191m59449l81304k86643k19106L28447J229298J294543k7233j436764
40815F50980j389129k29865M17685o8313p63488p20730o1413M89910M98894J35123
$$ plain form
40805 -1040346 -1145308 -1120504 -903974 -803705 -930227 -984421 -817151 -670004 -531179 95455
40795 95455 1246966 1998771 1631756 711701 192771 18202 -445644 -1099999 -1315088 -1064495
40785 -1064495 -781961 -426885 187737 489977 -137652 -972310 -698610 486172 960099
40776 960099 22213 -1269894 -1884616 -1989980 -1871166 -1127991 242299 1153959 783473
40767 783473 -228835 -750351 -597409 -282064 -72582 -87497 -626396 -1538687 -1828654 -803108
40757 -803108 765094 1468007 997370 280992 95170 326631 574799 761343 952633
40748 952633 1033730 783418 101941 -874364 -1769996 -2170080 -1991794 -1595610 -1406209 -1488895
40738 -1488895 -1562320 -1321044 -696036 90222 693103 947357 957404 824985 462671 -166693
$$ packed form
40805a040346j04962K4804K16530J00269j26522n4194J67270J47147J38825O26634
40795I5455J151511P51805l67015r20055n18930j74569m63846o54355k15089K50593
40785a064495K82534L55076O14622L02240o27629q34658K73700J184782M73927
40776I60099r37886j292107o14722j05364J18814P43175J370290R11660l70486
40767G83473j012308n21516J52942L15345K09482j4915n38899r12291k89967J025546
40757h03108J568202P02913m70637p16378j85822K31461K48168J86544J91290
40748I52633Q1097k50312o81477r76305q95632m00084J78286L96184J89401q2686
40738a488895p3425K41276O25008P86258O02881K54254J0047j32419l62314o29364
$$ plain form
40728 -166693 -844519 -1345729 -1651643 -1702399 -1302200 -575138 -53569 120412 538475 1466546
40718 1466546 2044956 1422272 189347 -377472 -149507 -58261 -428745 -695908 -684987 -786713
40708 -786713 -800330 -70018 1004017 1127544 176741 -505589 -441822 -868189 -2298862 -3069696
40698 -3069696 -1833871 14732 314035 -595508 -719011 177844 387669 -573642 -986707
40689 -986707 263708 1879809 2196529 1524744 1191370 1340958 1137841 565899 548317
40680 548317 1286337 1692356 871509 -612295 -1448601 -1124315 -307620 73471 -262028
40671 -262028 -865552 -1058363 -539681 259679 503569 -79253 -658205 -193982 1128473
40662 1128473 1963968 1531559 649641 590076 1435012 2193428 2157729 1469920 633305 140898
$$ packed form
40728a66693o77826n01210l05914n0756M00199P27062N21569J73981M18063R28071
40718A466546N78410o22684j232925n66819K27965R1246l70484k67163J0921j01726
40708g86713j3617P30312J074035J23527r50803o82330O3767m26367j430673p70834
40698c069696J235825J848603K99303r09543j23503Q96855K09825r61311m13065
40689i86707J250415J616101L16720o71785l33374J49588k03117n71942j7582
40680E48317P38020M06019q20847j483804q36306L24286Q16695L81091l35499
40671b62028o03524j92811N18682P99360K43890n82822n78952M64223J322455
40662A128473Q35495m32409q81918n9565Q44936P58416l5699o87809q36615m92407
$$ plain form
40652 140898 337311 984244 1254147 833483 571206 1121955 1496160 295861 -1932661
40643 -1932661 -3201371 -2939226 -2580900 -2952480 -2960015 -1730285 -295816 123745 63659
40634 63659 553533 1117876 724729 -150435 -229057 310329 102735 -1019066 -1655823 -1071656
40624 -1071656 -262308 -282226 -692858 -367578 889117 2143707 2425419 1687951 794363
40615 794363 525599 576747 -10525 -1232153 -1768424 -858933 367527 442877 -347580 -697419
40605 -697419 -437885 -393006 -490085 179092 1427618 1935059 1454476 1288585 1980826 2261449
40595 2261449 1236441 100136 411482 1797152 2678910 2457342 1712967 890382 51808
40586 51808 -489523 -476050 -377956 -730655 -1094216 -728088 -25456 -58506 -756759 -834816
$$ packed form
40652A40898J96413O46933K69903m20664k62277N50749L74205j200299k228522
40643a932661j268710K62145L58326l71580p535J229730J434469M19561o0086
40634F3659M89874N64343l93147q75164p8622N39386k07594j121801o36757N84167
40624a071656Q09348j9918m10632L25280J256695J254590K81712p37468q93588
40615G94363k68764N1148n87272j221628n36271R09491J226460P5350p90457l49839
40605f97419K59534M4879r7079O69177J248526N07441m80583j65891O92241K80623
40595B261449j025008j136305L11346J385670Q81758k21568p44375q22585q38574
40586E1808n41331J3473R8094l52699l63561L66128P02632l3050o98253p8057
$$ plain form
40576 -834816 206188 1231292 1194029 663122 772399 1385875 1388274 520609 -157151 196966
40566 196966 1070451 1432872 1091495 608657 258732 -174625 -648057 -696479 -244337 90279
40556 90279 -98998 -346867 -66312 504171 707267 452398 121555 -208193 -678453 -987835
40546 -987835 -670176 28847 416863 495529 894293 1564544 1608406 755646 -43884 -61314
40536 -61314 167034 -24270 -180480 376910 1108689 917820 -88171 -675217 -279063 331265
40526 331265 353330 21502 31634 524740 1028258 1063783 578895 -9880 -150546 263187
40516 263187 742619 898113 1039976 1627365 2334534 2305964 1324261 132271 -460732 -273455
40506 -273455 430554 1193063 1370668 596121 -549662 -960363 -372301 289154 218766 -276959
$$ packed form
40576h34816J041004J025104l7263n30907J09277O13476K399q67665o77760L54117
40566A96966Q73485L62421l41377m82838l49925m33357m73432m8422M52142L34616
40556I0279j89277k47869K80555N70483K03096k54869l30843l29748m70260l09382
40546i87835L17659O99023L88016P8666L98764O70251M3862q52760p99530j7430
40536f1314K28348j91304j56210N57390P31779j90869j005991n87046L96154O10328
40526C31265K2065l31828J0132M93106N03518L5525m84888n88775j40666M13733
40516B63187M79432J55494J41863N87389P07169k8570r81703j191990n93003J87277
40506b73455P04009P62509J77605p74547j145783m10701N88062O61455p0388m95725
$$ plain form
40496 -276959 -521560 -529374 -680854 -851399 -637395 -172161 42150 18497 316767 1147570
40486 1147570 1979093 2133616 1439502 347129 -292013 193584 1446787 2087275 1235588
40477 1235588 -192332 -562768 237699 730906 136053 -535489 -213221 628991 1034388
40468 1034388 1208270 1902541 2960874 3917564 5468433 8554486 12021741 13068679 10635781
40459 10635781 6875006 4473122 3804980 3639927 3372062 3198089 2966438 2363420 1837593
40450 1837593 2020111 2504607 2452657 2155212 2603357 3571489 3637365 2390931 1189759
40441 1189759 1156373 1703653 1799767 1534212 1433149 1165374 151042 -1098853 -1466055
40432 -1466055 -818708 -71622 243311 465804 809602 848679 341088 -165882 -43217 521488
$$ packed form
40496b76959k44601p814j51480j70545K14004M65234K14311k3653K98270Q30803
40486A147570Q31523J54523o94114j092373o39142M85597J253203O40488q51687
40477A235588j427920l70436Q00467M93207n94853o71542L22268Q42212M05397
40468A034388J73882O94271J058333R56690J550869L086053L467255J046938k432898
40459A0635781l760775k401884o68142j65053k67865j73973k31651o03018n25827
40450A837593J82518M84496n1950k97445M48145R68132O5876j246434j201172
40441A189759l3386N47280R6114k65555j01063k67775j014332j249895l67202
40432a466055O47347P47086L14933K22493L43798L9077n07591n06970J22665N64705
$$ plain form
40422 521488 773849 344871 -378329 -760934 -543279 104622 979476 2019907 2961128
40413 2961128 3139607 2157132 672729 -137949 -110758 -369574 -1634021 -2960068 -2934729
40404 -2934729 -1637881 -478842 -296390 -584605 -626438 -464765 -473488 -695867 -970652 -1190967
40394 -1190967 -1151109 -613904 196744 604874 253987 -477032 -982542 -953120 -305966 835364
40384 835364 1867138 1999454 1182073 262627 -68723 64986 426237 1233112 2394445
40375 2394445 2920932 2108592 887266 839378 1964108 2590445 1746989 480666 196065
40366 196065 604474 316585 -961208 -1891236 -1236461 689909 2597907 3604970 3578741
40357 3578741 2601327 894471 -720687 -1057126 252026 2113284 2985250 2421922 1245780
$$ packed form
40422E21488K52361m28978p23200l82605K17655O47901Q74854J040431R41221
40413B961128J78479r82475j484403q10678K7191k58816j264447j326047K5339
40404b934729J296848J159039J82452k88215m1833J61673q723k22379k74785k20315
40394a190967L9858N37205Q10648M08130l50887p31019n05510K9422O47154J141330
40384H35364J031774J32316q17381r19446l31350J33709L61251Q06875J161333
40375B394445N26487q12340j221326m7888J124730O26337q43456j266323k84601
40366A96065M08409k87889j277793r30028O54775J926370J907998J007063k6229
40357C578741r77414j706856j615158l36439J309152J861258Q71966n63328j176142
$$ plain form
40348 1245780 337604 -213996 -703986 -1104494 -1090811 -497927 488222 1393976 1605192 803020
40338 803020 -529275 -1397736 -1412652 -1276373 -1746400 -2415212 -2126164 -570034 1100152
40329 1100152 1472419 400519 -878024 -1011394 216973 1838310 2732751 2572692 1781546
40320 1781546 933071 514045 914191 1946501 2499379 1579122 -135534 -784858 199054
40311 199054 1198360 754471 -283162 -148920 1170968 2185022 2272068 2106222 1905376
40302 1905376 1069206 -237459 -900874 -745431 -929610 -1761504 -1810463 -264122 1368085
40293 1368085 1328243 185781 -236974 382541 863150 680703 421268 312166 -103521
40284 -103521 -795212 -1117827 -961426 -819638 -646565 115296 1209477 1522882 718959
$$ packed form
40348A245780r08176n51600m89990m00508J3683N92884R86149R05754K11216q02172
40338H03020j332295q68461j4916J36279m70027o68812K89048J556130J670186
40329A100152L72267j071900j278543j33370J228367J621337Q94441j60059p91146
40320A781546q48475m19026M00146J032310N52878r20257j714656o49324R83912
40311A99054R99306m43889j037633J34242J319888J014054Q7046j65846k00846
40302A905376q36170j306665o63415J55443j84179q31894m8959J546341J632207
40293A368085l9842j142462m22755O19515M80609j82447k59435j09102m15687
40284a03521o91691l22615J56401J41788J73073P61861J094181L13405q03923
$$ plain form
40275 718959 -190660 -320651 24236 180214 89261 -48557 -267168 -493899 -437730 -242994
40265 -242994 -537625 -1400091 -1986995 -1662652 -860683 -366435 -343052 -497063 -617341 -529979
40255 -529979 -90011 402519 368440 -128266 -278778 290628 929076 926822 356588 -368012
40245 -368012 -900641 -586510 1156094 3400811 3890726 1753650 -926568 -1497352 66772
40236 66772 1636720 1886908 1277841 534749 -210156 -749988 -672760 -109901 376537 632437
40226 632437 723241 250452 -918459 -1605678 -599464 1154554 1443322 34273 -920009
40217 -920009 -257726 458260 -366989 -1830077 -2224320 -1737920 -1627165 -1804768 -1267114
40208 -1267114 -282041 -98635 -659744 -537493 666566 1603369 1335187 716316 917418
$$ packed form
40275G18959r09619j29991L44887J55978r0953j37818k18611k26731N6169J94736
40265b42994k94631q62466n86904L24343Q01969M94248K3383j54011j20278Q7362
40255e29979M39968M92530l4079m96706j50512N69406O38448k254n70234p24600
40245c68012n32629L14131J742604K244717M89915k137076k680218n70784J564124
40236F6772J569948K50188o09067p43092p44905n39832P7228N62859M86438K55900
40226F32437R0804m72789j168911o87219J006214J754018K88768j409049r54282
40217i20009O62283P15986q25249j463088l94243M86400J10755j77603N37654
40208a267114R85073J83406n61109J22251J204059R36803k68182o18871K01102
$$ plain form
40199 917418 1745087 2205776 1875809 1020876 60081 -506213 -309077 205822 -11033 -1161777
40189 -1161777 -2061439 -1675795 -488446 401012 811943 1167667 1303606 825095 290494
40180 290494 667800 1639161 1820573 938277 439796 1336552 2647014 2898290 2217770
40171 2217770 1791489 1878796 1639718 708368 -251602 -637867 -584294 -369965 13696 470532
40161 470532 693555 696402 812864 982503 746982 197387 133467 864351 1592587 1528155
40151 1528155 945221 520724 282067 -9470 1087 748130 1658845 1600608 436572 -691690
40141 -691690 -752160 167543 1309031 2035732 2029385 1313538 349829 -284071 -458152 -423031
40131 -423031 -255444 142501 575121 736727 885816 1580207 2551020 2657246 1428995
$$ packed form
40199I17418Q27669M60689l29967q54933r60795n66294J97136N14899k16855j150744
40189a161777q99662L85644J187349Q89458M10931L55724J35939m78511n34601
40180B90494L77306R71361J81412q82296m98481Q96756J310462K51276o80520
40171B217770m26281Q7307k39078r31350r59970l86265N3573K14329L83661M56836
40161D70532K23023K847J16462J69639k35521n49595o3920P30884P28236o4432
40151A528155n82934m24497k38657k91537J0557P47043R10715n8237j164036j128262
40141f91690o0470R19703J141488P26701o347p15847r63709o33900j74081L5121
40131d23031J67587L97945M32620J61606J49089O94391R70813J06226j228251
$$ plain form
40122 1428995 -23502 -312917 430240 801145 34809 -1017550 -1050361 -15653 794828
40113 794828 427279 -405396 -214592 1132657 2034164 1347737 58103 -253615 111035
40104 111035 -439858 -1951323 -2552886 -1390001 -94959 -261848 -1018320 -652257 529079
40095 529079 878429 293581 334892 1482308 2248435 1533373 218642 -366172 -216904
40086 -216904 36316 451028 1254076 1807691 1343094 303476 -205447 -110169 -407011 -1463427
40076 -1463427 -2305850 -1936706 -617979 568264 919149 487272 -322736 -1093922 -1540728
40067 -1540728 -1648257 -1572670 -1264879 -439106 879204 2062120 2473852 2178385 1719939
40058 1719939 1371575 1025100 719808 727859 997879 1016881 499518 -168202 -483616 -472684
$$ packed form
40122A428995j452497k89415P43157L70905p66336j052359l2811J034708Q10481
40113G94828l67549q32675J90804J347249R01507o86427j289634l11718L64650
40104A11035n50893j511465o01563J162885J295042j66889p56472L66063J181336
40095E29079L49350n84848M1311J147416P66127p15062j314731n84814J49268
40086b16904K53220M14712Q03048N53615m64597j039618n08923R5278k96842j056416
40076a463427q42423L69144J318727J186243L50885m31877q10008p71186m46806
40067a540728j07529P5587L07791Q25773J318310J182916M11732k95467m58446
40058A719939l48364l46475l05292Q051K70020J9002n17363o67720l15414J0932
$$ plain form
40048 -472684 -381664 -38735 901222 2168297 2926918 2753095 2133812 1807334 1937658 2143579
40038 2143579 2082816 1784516 1547644 1643455 2003547 2178025 1791179 1035530 454283 235399
40028 235399 63149 -284738 -602605 -652758 -472992 -81592 688739 1745248 2507547 2532848
40018 2532848 2116855 1909466 2140836 2526448 2681057 2320811 1375036 282254 -150125
40009 -150125 350899 1040961 1069524 577320 304045 393108 335918 -29720 -282809 -234624
39999 -234624 -223934 -437538 -619525 -659288 -815717 -1110234 -1134337 -770663 -512660 -721799
39989 -721799 -1111970 -1301946 -1312562 -1178228 -717891 -131671 -115598 -781440 -1171494 -626773
39979 -626773 55995 -127504 -554198 249257 2174801 3363883 2765049 1522816 1189742
$$ packed form
40048d72684R1020L42929R39957J267075P58621j73823o19283l26478J30324K05921
40038B143579o0763k98300k36872R5811L60092J74478l86846p55649n81247k18884
40028B35399j72250l47887l17867n0153J79766L91400P70331J056509P62299K5301
40018B532848m15993k07389K31370L85612J54609l60246r45775j092782m32379
40009a50125N01024O90062K8563m92204k73275Q9063n7190l65638k53089M8185
39999b34624J0690k13604j81987l9763j56429k94517k4103L63674K58003k09139
39989g21799l90171j89976j0616J34334M60337N86220J6073o65842l90054N44721
39979f26773O82768j83499m26694Q03455J925544J189082n98834j242233l33074
$$ plain form
39970 1189742 1681365 1890998 1483020 1017038 796950 663843 710126 1200579 1795673 1773597
39960 1773597 1199290 1047397 1794939 2561319 2198238 844635 -191322 -7237 892584
39951 892584 1268849 566731 -520983 -902465 -370024 176881 -116768 -950270 -1251181
39942 -1251181 -548231 504362 1037329 918492 554168 175183 -231220 -497913 -300165
39933 -300165 333117 862625 758614 63312 -646336 -815372 -411744 120043 403151 522212
39923 522212 737700 954807 838933 462989 377107 842049 1434921 1716169 1829566 1988235
39913 1988235 1829464 999875 104580 151239 975125 1136465 -177964 -1854198 -2108412
39904 -2108412 -665075 1008387 1542041 1105544 838550 1292436 1847082 1619728 612143
$$ packed form
39970A189742M91623K09633m07978m65982k20088j33107M6283M90453N95094k2076
39960A773597n74307j51893P47542P66380l63081j353603j035957J84085Q99821
39951H92584L76265p02118j087714l81482N32441N46905k93649q33502l00911
39942a251181P02950J052593N32967j18837l64324l78985m06403k66693J97748
39933c00165O33282N29508j04011o95302p09648j69036M03628N31787K83108J19061
39923E22212K15488K17107j15874l75944q5882M64942N92872K81248J13397J58669
39913A988235j58771q29589q95295M6659Q23886J61340j314429j676234k54214
39904b108412J443337J673462N33654m36497k66994M53886N54646k27354j007585
$$ plain form
39895 612143 -295426 -416298 -6857 193141 -114103 -606808 -871412 -706607 -45747 893427
39885 893427 1357884 541575 -1401095 -3218796 -3768452 -3137845 -2342453 -2115356 -2213119
39876 -2213119 -1793379 -389594 1350950 2010111 899175 -815563 -1134156 400780 2026157
39867 2026157 1931608 495279 -388828 183370 1219573 1408204 721205 89147 62888
39858 62888 330589 375878 161747 41371 192756 377666 321221 134794 135055 362248 595336
39847 595336 758962 877701 661538 -253179 -1503011 -2105592 -1693314 -996404 -692522
39838 -692522 -509695 -85876 61973 -609359 -1426141 -1280180 -352119 187462 102148 366917
39828 366917 1308689 1834617 1138862 49197 -208645 211290 194138 -625623 -1489212 -1635912
$$ packed form
39895F12143r07569j20872M09441J99998l07244m92705k64604J64805O60860R39174
39885H93427M64457q16309j942670j817701n49656O30607P95392K27097r7763
39876b213119M19740J403785J740544O59161j110936j714738l18593J534936J625377
39867B026157r4549j436329q84107N72198J036203J88631o86999o32058k6259
39858F2888K67701M5289k14131j20376J51385J84910n6445j86427K61K27193K33088
39847E95336J63626J18739k16163r14717j249832o02581M12278O96910L03882
39838f92522J82827M23819J47849o71332q16782J45961R28061N39581q5314K64769
39828C66917R41772N25928o95755j089665k57842M19935j7152q19761q63589j46700
$$ plain form
39818 -1635912 -1061828 -245021 328764 430322 285138 385856 798056 923252 337838
39809 337838 -449811 -577506 90370 972770 1590701 1761104 1223402 -91119 -1384189
39800 -1384189 -1428199 -27144 1549493 1983101 1306224 495484 87283 -239482 -875385
39791 -875385 -1642914 -2053488 -1865142 -1234624 -489479 134739 605795 991516 1220090 1021820
39781 1021820 253219 -757351 -1388024 -1310330 -756944 -162780 264939 513471 544126 370219
39771 370219 213483 248951 233925 -237185 -1038396 -1456820 -1039904 -190257 356757 398618
39761 398618 276440 196749 -51303 -680413 -1485495 -1936399 -1631544 -727617 59417 116783
39751 116783 -301229 -308179 428903 1201125 1327209 1171301 1423158 1820971 1569270 839211
$$ packed form
39818a635912N74084Q16807N73785J01558j45184J00718M12200J25196n85414
39809C37838p87649j27695O67876Q82400O17931J70403n37702j314521j293070
39800a384189m4010J401055J576637M33608o76877q10740m08201l26765o35903
39791h75385p67529m10574J88346O30518P45145O24218M71056L85721K28574j98270
39781A021820p68601j010570o30673P7694N53386N94164M27719K48532L0655j73907
39771C70219j56736L5468j5026m71110q01211m18424M16916Q49647N47014M1861
39761C98618j22178p9691k48052o29110q05082m50904L04855R03927P87034N7366
39751A16783m18012o950P37082P72222J26084j55908K51857L97813k51701p30059
$$ plain form
39741 839211 686727 1291798 1460751 457826 -686071 -582436 513304 1156462 789213
39732 789213 280483 431235 931109 1084184 840959 658317 733251 799786 573580 161461
39722 161461 -9773 285812 613146 222566 -886759 -1592699 -902209 589619 1238481
39713 1238481 456451 -525930 -440678 206159 -63358 -1460045 -2533175 -2152997 -951765
39704 -951765 -242579 -176178 185382 1229172 2151444 2115421 1296724 398014 -269478 -663370
39694 -663370 -428590 777523 2454108 3459152 3235056 2357056 1662897 1275285 817842
39685 817842 293301 253803 1004878 1914911 1850798 474097 -1078075 -1245903 106529
39676 106529 1380882 1122326 -263286 -1231984 -1137634 -729422 -777736 -1133055 -1309512 -1209680
$$ packed form
39741H39211j52484O05071J68953j002925j143897J03635J095740O43158l67249
39732G89213n08730J50752M99874J53075k43225j82642P4934O6535k26206m12119
39722A61461j71234K95585L27334l90580j109325p05940O90490J491828O48862
39713A238481p82030r82381Q5252O46837k69517j396687j073130L80178J201232
39704i51765P09186O6401L61560J043790R22272l6023q18697q98710o67492l93892
39694f63370K34780J206113J676585J005044k24096q78000o94159l87612m57443
39685H17842n24541l9498P51075R10033o4113j376701j552172j67828J352432
39676A06529J274353k58556j385612r68698R4350M08212m8314l55319j76457R9832
$$ plain form
39666 -1209680 -988650 -832556 -1064353 -1765620 -2112989 -1011977 1159746 2380232 1310455
39657 1310455 -936706 -2210540 -1884678 -1008764 -402177 127962 721001 873313 336321
39648 336321 -275312 -324781 -36517 -3586 -193045 -15817 730711 1497439 1687542 1384296
39638 1384296 1081141 854733 295130 -593518 -986212 -293637 750263 879757 48128
39629 48128 -572614 -426145 -292846 -774292 -1209367 -872952 -247149 -77271 7606 721343
39619 721343 1601549 1629931 1000096 835439 1260927 1209617 317112 -373621 -42260 744235
39609 744235 1079629 979486 951159 1046658 1002270 828349 741361 858256 1261088 1989342
39599 1989342 2789335 3286303 3460668 3454635 3009898 1881790 780736 865858 2056979
$$ packed form
39666a209680K21030J56094k31797p01267l47369J101012K171723J220486j069777
39657A310455k247161j273834L25862Q75914O06587N30139N93039J52312n36992
39648C36321o11633m9469K88264L2931j89459J77228P46528P66728J90103l03246
39638A384296l03155k26408n59603q88648l92694O92575J043900J29494q31629
39629D8128o20742J46469J33299m81446m35075L36415O25803J69878Q4877P13737
39619G21343Q80206K8382o29835j64657M25488n1310q92505o90733L31361P86495
39609G44235L35394j00143k8327R5499m4388j73921q6988J16895M02832P28254
39599A989342P99993M96968J74365o033m44737j128108j101054Q5122J191121
$$ plain form
39590 2056979 2896117 2520794 1757998 1666717 1981289 1812074 1080718 341739 -214025 -660530
39580 -660530 -713838 -131075 565445 616938 138259 -875 670909 1704699 2232385 1619938
39570 1619938 -80712 -1923137 -2669538 -2051387 -1064585 -618348 -432636 173431 1008676
39561 1008676 1344387 1117596 929150 1034437 1098679 843401 299831 -441859 -1173776 -1474325
39551 -1474325 -1223481 -929610 -966784 -878309 -176513 537866 186482 -1198957 -2381117
39542 -2381117 -2409452 -1479691 -343185 425043 574614 257285 -4238 111032 326917
39533 326917 346061 369014 440733 -76216 -1412462 -2367346 -1666576 -13121 631829 -279130
39523 -279130 -1355436 -1468161 -995838 -620874 -340522 -129187 -253229 -409083 201230
$$ packed form
39590B056979Q39138l75323p62796r1281L14572j69215p31356p38979n55764m46505
39580f60530n3308N82763O96520N1493m78679j39134O71784J033790N27686o12447
39570A619938j700650j842425p46401O18151R86802M46237J85712O06067Q35245
39561A008676L35711k26791j88446J05287O4242k55278n43570p41690p31917l00549
39551a474325K50844K93871l7174Q8475P01796P14379l51384j385439j182160
39542b381117k8335R29761J136506P68228J49571l17329k61523J15270K15885
39533C26917J9144K2953P1719n16949j336246r54884P00770J653455O44950r10959
39523b79130j076306j12725M72323L74964K80352K11335j24042j55854O10313
$$ plain form
39514 201230 1431383 2106540 1890428 1839062 2466157 2807645 2307892 2021335 2664358 2975667
39504 2975667 1665585 -194335 -595886 396576 942758 227266 -864298 -1574704 -1989898
39495 -1989898 -2017603 -1374757 -680012 -945092 -1812814 -1890702 -1079857 -885501 -1900534 -2655993
39485 -2655993 -1867183 -422365 -17497 -828945 -1662385 -1702358 -1112324 -423187 -163971
39476 -163971 -627316 -1308216 -1148527 -55242 522873 -500725 -1987138 -1887195 -170403
39467 -170403 954335 -9609 -1911763 -2633944 -1799040 -836267 -775311 -1083365 -872077
39458 -872077 -333961 -295227 -811935 -1086496 -747384 -352378 -349149 -353674 3407 265576
39448 265576 -23498 -319795 63187 568056 132908 -903372 -1090381 -182257 364929
$$ packed form
39514B01230J230153O75157k16112n1366O27095L41488m99753k86557O43023L11309
39504B975667j310082j859920m01551R92462N46182p15492j091564p10406m15194
39495a989898k7705O42846O94745k65080q67722p7888Q10845J94356j015033p55459
39485b655993P88810J444818M04868q11448q33440l9973N90034O89137K59216
39476a63971m63345o80900J59689J093285N78115j023598j486413R9943J716792
39467a70403J124738r63944j902154p22181Q34904R62773O0956l08054K11288
39458h72077N38116L8734n16708k74561L39112L95006L229m525L57081K62169
39448B65576k89074k96297L82982N04869m35148j036280j87009R08124N47186
$$ plain form
39439 364929 -291565 -1049763 -704834 194313 492166 366256 730147 1428067 1515350 962269
39429 962269 637479 717225 475785 -252593 -672671 -370821 42899 16842 -179357 -211669
39419 -211669 -328740 -716152 -934911 -601959 -70848 143504 170625 460693 1017484 1497482
39409 1497482 1799523 2024941 2042705 1641922 1078417 968106 1481223 1958759 1594311 454397
39399 454397 -385523 83535 1591650 2731223 2526606 1602772 1370554 2185339 2885992
39390 2885992 2276754 545237 -1083316 -1714427 -1428626 -804028 -259005 83941 209748
39381 209748 172553 251433 852624 1918378 2555857 1857438 292319 -424513 566802 1931933
39371 1931933 1827649 487479 -126184 807137 1876089 1678312 811063 675850 1279660
$$ packed form
39439C64929o56494p58198L44929Q99147K97853j25910L63891O97920Q7283n53081
39429I62269l24790P9746k41440p28378m20078L01850M13720k6057j96199l2312
39419b11669j17071l87412k18759L32952N31111K14352K7121K90068N56791M79998
39409A497482L02041K25418J7764m00783n63505j10311N13117M77536l64448j139914
39399D54397q39920M69058J508115J139573k04617r23834k32218Q14785P00653
39390B885992o09238j731517j628553o31111K85801O24598N45023L42946J25807
39381B09748l7195P8880O01191J065754O37479o98419j565119p16832R91315J365131
39371A931933j04284j340170o13663R33321J068952j97777q67249j35213O03810
$$ plain form
39362 1279660 1449095 713891 -248475 -879260 -1325892 -1675046 -1596660 -1090197 -817437 -1212879
39352 -1212879 -1765563 -1678747 -944090 -283539 -145808 -216661 -14409 400671 623142 624661
39342 624661 792477 1139644 1030833 155175 -680891 -499523 326710 453687 -469513 -1262154
39332 -1262154 -994944 -241381 125508 371335 1096725 1770343 1394587 298517 -80984
39323 -80984 739028 1600810 1335075 146401 -932041 -1201242 -642338 205066 459209
39314 459209 -362436 -1600324 -2073248 -1570909 -993819 -875960 -708264 -93742 408320
39305 408320 243768 -144873 -76002 250839 225327 -63947 -38294 402792 949242 1635137
39295 1635137 2657703 3593327 3670249 2844213 1838551 1063529 261252 -635256 -1079317
$$ packed form
39362A279660J69435p35204r62366o30785m46632l49154P8386N06463K72760l95442
39352a212879n52684Q6816P34657O60551J37731p0853K02252M15080K22471J519
39342F24661J67816L47167j08811q75658q36066J81368Q26233J26977r23200p92641
39332a262154K67210P53563L66889K45827P25390O73618l75756j096070l79501
39323h0984Q20012Q61782k65735j188674j078442k69201N58904Q47404K54143
39314D59209q21645j237888m72924N02339N77090J17859J67696O14522N02062
39305D08320j64552l88641O8871L26841k5512k89274K5653M41086N46450O85895
39295A635137J022566R35624P6922q26036j005662p75022q02277q96508m44061
$$ plain form
39286 -1079317 -714642 -11736 333820 251452 168367 327149 579110 671589 473531 50479
39276 50479 -308647 -292754 66508 404714 519180 648266 1104296 1809842 2356886 2377695
39266 2377695 1742047 584998 -686381 -1563350 -1790599 -1488611 -909130 -304586 -91165
39257 -91165 -707837 -1954576 -2786148 -2322116 -1019106 -308007 -926500 -2060837 -2400558
39248 -2400558 -1665750 -683660 -177791 -1576 376761 1063000 1659118 1779352 1400836
39239 1400836 797441 332986 286200 689507 1288510 1749789 1926904 1859342 1553687 931834
39229 931834 71967 -619842 -654551 59203 1038490 1622639 1583045 1291722 1237922 1442176
39219 1442176 1461489 948513 58668 -716303 -970342 -618656 77185 624241 652762 310104
$$ packed form
39286a079317L64675P02906L45556q2368q3085J58782K51961R2479j98058m23052
39276E0479l59126J5893L59262L38206J14466J29086M56030P05546N47044K0809
39266B377695o35648j157049j271379q76969k27249L01988N79481O04544K13421
39257i1165o16672j246739q31572M64032J303010P11099o18493j134337l39721
39248b400558P34808R82090N05869J76215L78337O86239N96118J20234l78516
39239A400836o03395m64455m6786M03307N99003M61279J77115o7562l05655o21853
39229I31834q59867o91809l4709P13754R79287N84149l9594k91323n3800K04254
39219A442176J9313n12976q89845p74971k54039L51686O95841N47056K8521l42658
$$ plain form
39209 310104 102296 176863 39534 -695233 -1515064 -1476343 -437693 663557 907408 378763
39199 378763 -124184 -43254 497899 945228 790891 26840 -679567 -531260 410823 1067832
39189 1067832 579815 -494976 -786054 47270 711823 -71092 -1732164 -2347024 -962259
39180 -962259 1221046 2308665 1828015 796589 47951 -581768 -1306082 -1623188 -1121819
39171 -1121819 -383439 -260302 -614907 -602086 2138 603932 835720 906440 868924 476849
39161 476849 -28769 43564 633458 718413 -123351 -852843 -466704 433940 571226 -80892
39151 -80892 -415275 79114 855316 1478459 2095753 2575980 2289665 1224597 465333 925026
39141 925026 2131241 2842526 2489941 1481487 392011 -522677 -1070252 -987719 -346411
$$ packed form
39209C10104k07808P4567j37329p34767q19831L8721J038650J101250K43851n28645
39199C78763n02947Q0930N41153M47329j54337p64051p06407J48307R42083O57009
39189A067832m88017j074791k91078Q33324O64553p82915j661072o14860J384765
39180i62259K183305J087619m80650j031426p48638o29719p24314l17106N01369
39171a121819P38380J23137l54605J2821O04224O01794K31788P0720l7516l92075
39161D76849n05618P2333N89894Q4955q41764p29492L86139R00644J37286o52118
39151h0892l34383M94389P76202O23143O17294M80227k86315j065068p59264M59693
39141I25026J206215P11285l52585j008454j089476r14688n47575Q2533O41308
$$ plain form
39132 -346411 207042 29623 -641536 -740720 370872 1894511 2351619 1359512 44116
39123 44116 -493936 -397853 -314578 -235001 112918 327203 -133362 -782522 -604023 357692
39113 357692 1004685 834536 467183 362637 201421 -97293 42841 649723 731854 -143913
39103 -143913 -817144 -124391 1272059 1811659 1219620 542955 373970 327475 211923 468267
39093 468267 1179691 1633965 1285024 471223 -176334 -520610 -810279 -1160999 -1382317 -1150143
39083 -1150143 -396554 280553 -56605 -1455568 -2540013 -1986389 -334952 578722 -27703
39074 -27703 -1076717 -1327201 -871714 -532496 -642760 -1008982 -1435596 -1727643 -1680728 -1504273
39064 -1504273 -1696491 -2093674 -1755074 -387017 842297 748744 -171914 -489016 78854
$$ packed form
39132c46411N53453j77419o71159r9184J111592J523639M57108r92107j315396
39123D4116n38052R6083Q3275P9577L47919K14285m60565o49160J78499R61715
39113C57692O46993j70149l67353j04546j61216k98714J40134O06882Q2131q75767
39103a43913o73231O92753J396450N39600n92039o76665j68985m6495j15552K56344
39093D68267P11424M54274l48941q13801o47557l44276k89669l50720k21318K32174
39083a150143P53589O77107l37158j398963j084445N53624J651437R13674o06425
39074b7703j049014k50484M55487L39218j10264l66222m26614k92047M6915J76455
39064a504273j92218l97183L38600J368057J229314r3553r20658l17102N67870
$$ plain form
39055 78854 441626 -46648 -662776 -532294 96921 354910 23468 -249179 149495 1038784
39045 1038784 1614195 1293987 385953 -223203 -137317 88695 -139412 -445187 -1867 1105698
39035 1105698 1837477 1665195 1308001 1561902 2017813 1660042 472573 -343741 74301
39026 74301 1059479 1224824 228392 -814405 -785624 76132 699711 701636 641753 802951
39016 802951 629359 -226580 -1118867 -1355546 -1267532 -1460523 -1556899 -807618 364555 747117
39006 747117 269157 191781 1047545 1721001 1234286 269762 1738 351215 465413 245210
38996 245210 256757 539960 603503 402385 333367 352926 18459 -570274 -693296 -15253
38986 -15253 950172 1498120 1402386 928833 558972 584767 683842 256649 -465299 -332821
$$ packed form
39055G8854L62772m88274o16128J30482O29215K57989l31442k72647L98674Q89289
39045A038784N75411l20208r08034o09156Q5886K26012k28107l05775M43320J107565
39035A105698P31779j72282l57194K53901M55911l57771j187469q16314M18042
39026G4301R85178J65345r96432j042797K8781Q61756O23579J925n9883J61198
39016H02951j73592q55939q92287k36679Q8014j92991r6376P49281J172173L82562
39006G47117m77960p7376Q55764O73456m86715r64524k68024L49477J14198k20203
38996B45210J1547K83203O3543k01118o9018J9559l34467n88733j23022O78043
38986a5253R65425N47948r5734m73553l69861K5795R9075m27193p21948J32478
$$ plain form
38976 -332821 991327 1995935 1184478 -601446 -1203395 -216252 647284 351654 -111277
38967 -111277 246527 709926 232459 -785246 -1290400 -1209234 -1087480 -832599 -49058 843669
38957 843669 1014850 518872 170180 238997 179064 -326430 -783928 -486724 706843 2156692
38947 2156692 2787866 1990166 484150 -156788 747877 2176476 2710490 2052358 833960
38938 833960 -280984 -675593 133774 1569397 1978422 657725 -860297 -826420 150396
38929 150396 155015 -917980 -1245414 -72567 1146402 1120950 498216 410282 667487 475318
38919 475318 -59012 -235340 43801 298685 308197 268115 426951 955272 1778364 2318259
38909 2318259 1995902 1204913 1031038 1698263 2141942 1561025 517469 -77160 -203242
$$ packed form
38976c32821J324148J004608q11457j785924o01949R87143Q63536k95630m62931
38967a11277L57804M63399m77467j017705n05154Q1166J21754K54881P83541Q92727
38957H43669J71181m95978l48692O8817n9933n05494m57498K97204J193567J449849
38947B156692O31174p97700j506016o40938R04665J428599N34014o58132j218398
38938H33960j114944l94609Q09367J435623M09025j320697j518022L3877R76816
38929A50396M619j072995l27434J172847J218969k5452o22734q7934K57205j92169
38919D75318n34330j76328K79141K54884R512m0082J58836N28321Q23092N39895
38909B318259l22357p90989j73875O67225M43679n80917j043556n94629j26082
$$ plain form
38900 -203242 -240169 -12422 795929 1808528 2354613 2334103 2073804 1750081 1487017 1488962
38890 1488962 1528866 954259 -169896 -685791 62445 1018966 873159 107418 299556
38881 299556 1687442 2754494 2289356 751852 -593579 -1014853 -608611 -31984 -123430
38872 -123430 -1173682 -2457978 -2971924 -2551104 -1768946 -1024867 -442229 -319277 -716529
38863 -716529 -827858 119212 1432707 1680740 918459 756639 1793571 2484233 1482881
38854 1482881 -169121 -522656 442882 978305 246491 -657404 -572060 119891 370885
38845 370885 75100 -73571 75932 -136004 -989160 -1658920 -1201028 67437 815051
38836 815051 368582 -464906 -590401 -157079 -268006 -1316413 -2324923 -2189061 -1093575
$$ packed form
38900b03242l6927K27747Q08351J012599N46085k0510k60299l23723k63064J945
38890A488962L9904n74607j124155n15895P48236R56521j45807p65741J92138
38881B99556J387886J067052m65138j537504j345431m21274M06242N76627r1446
38872a23430j050252j284296n13946M20820P82158P44079N82638J22952l97252
38863g16529j11329R47070J313495K48033p62281j61820J036932O90662j001352
38854A482881j652002l53535R65538N35423p31814r03895Q5344O91951K50994
38845C70885k95785j48671J49503k11936q53156o69760M57892J268465P47614
38836H15051m46469q33488j25495M33322j10927j048407j008510J35862J095486
$$ plain form
38827 -1093575 -236243 -283603 -557466 10900 1335911 2096279 1463605 438651 688635
38818 688635 2147427 2836019 1543874 -323811 -570855 797238 1726217 1057358 -101451
38809 -101451 -275868 352860 586320 23518 -698574 -1062053 -1162388 -1107970 -684533 138039
38799 138039 828795 799603 134338 -524716 -851746 -1234821 -1996444 -2521095 -1824697 -53914
38789 -53914 1321062 1201184 129587 -633211 -670267 -327431 331057 1448789 2530250
38780 2530250 2740919 2048515 1142663 236881 -1040288 -2460574 -3007503 -2276258 -1152211
38771 -1152211 -589518 -443189 -20045 824579 1652779 2062181 1963170 1613836 1558626 2060328
38761 2060328 2520057 2105599 1036245 420799 614864 678059 -114182 -1123414 -1318324
$$ packed form
38827a093575Q57332m7360k73863N68366J325011P60368o32674j024954K49984
38818F88635J458792O88592j292145j867685k47044J368093R28979o68859j158809
38809a01451j74417O28728K33460n62802p22092l63479j00335N4418M23437Q22572
38799A38039O90756k9192o65265o59054l27030l83075p61623n24651O96398J770783
38789e3914J374976j19878j071597p62798l7056L42836O58488J117732J081461
38780B530250K10669o92404r05852r05782j277169j420286n46929P31245J124047
38771a152211N62693J46329M23144Q44624Q28200M09402r9011l49334n5210N01702
38761B060328M59729m14458j069354o15446J94065O3195p92241j009232j94910
$$ plain form
38752 -1318324 -662639 96887 450434 384261 132563 95809 484002 790352 340037 -440479
38742 -440479 -328401 748883 1309837 540871 -372839 -148424 583461 487975 -260951 -495279
38732 -495279 -53426 283697 321781 385954 182570 -661818 -1270924 -468197 1069060 1391920
38722 1391920 126179 -1030774 -956495 -453700 -379593 -182792 723724 1580567 1444553
38713 1444553 674310 150773 -111421 -509803 -782604 -501177 -43160 8796 -26699 489625
38703 489625 1177182 1027575 46531 -599500 -263424 288599 70623 -718384 -1054707 -525351
38693 -525351 182105 264217 -166009 -382190 -210514 -323352 -1121737 -1886046 -1699799 -904926
38683 -904926 -740576 -1512700 -2074748 -1482326 -319056 229055 -18166 -298872 -199305 -97213
$$ packed form
38752a318324O55685P59526L53547o6173k51698l6754L88193L06350m50315p80516
38742d40479J12078J077284N60954p68966r13710K24415P31885r5486p48926k34328
38732d95279M41853L37123L8084O4173k03384q44388o09106Q02727J537257L22860
38722A391920j265741j156953P4279N02795P4107J96801R06516Q56843j36014
38713A444553p70243n23537k62194l98382k72801K81427M58017N1956l5495N16324
38703D89625O87557j49607r81044o46031L36076N52023k17976p89007l36323N29356
38693e25351P07456Q2112m30226k16181J71676j12838p98385p64309J86247P94873
38683i04926J64350p72124n62048N92422J163270N48111k47221k80706R9567J02092
$$ plain form
38673 -97213 -396809 -957372 -1402626 -1611400 -1744327 -1936676 -2048237 -1766893 -1084232 -560151
38663 -560151 -745127 -1321783 -1322829 -428074 430701 156474 -1137766 -2262654 -2284525 -1361457
38653 -1361457 -361759 24532 -190355 -436907 -221047 349845 738857 642596 290516 68032
38643 68032 55581 16942 -256693 -574937 -330897 824763 2166516 2338899 1093088 -71102
38633 -71102 176375 1051386 847228 -367029 -877856 -156634 315829 -367850 -967375 -221215
38623 -221215 1021246 1292278 903433 1082537 1546617 910716 -756597 -1682880 -913102
38614 -913102 473133 1076574 828831 420457 154217 4734 78225 432351 882089 1303949
38604 1303949 1734987 2036860 1918549 1366209 616466 -220507 -996837 -1207969 -574921
$$ packed form
38673i7213k99596n60563m45254k08774j32927j92349j11561K81344O82661N24081
38663e60151j84976n76656j046Q94755Q58775k74227j294240j124888k1871R23068
38653a361457R99698L86291k14887k46552K15860N70892L89012r6261l52080k22484
38643F8032j2451l8639k73635l18244K44040J155660J341753J72383j245811j164190
38633g1102K47477Q75011k04158j214257n10827P21222M72463o83679n99525P46160
38623b21215J242461K71032l88845J79104M64080o35901j667313r26283P69778
38614i13102J386235O03441k47743m08374k66240j49483P3491L54126M49738M21860
38604A303949M31038L01873j18311n52340p49743q36973p76330k11132O33048
$$ plain form
38595 -574921 240376 387528 155418 491277 1240210 1164913 -7798 -918619 -571947 238297
38585 238297 371410 121641 424214 1082528 1082419 263379 -549054 -920100 -1187723 -1446355
38575 -1446355 -1222103 -459058 31484 -405792 -1334932 -1790337 -1468977 -947860 -830128
38566 -830128 -1014348 -915172 -289034 363694 391706 -111128 -361680 59301 616678 581643
38556 581643 32252 -366277 -374499 -420280 -817685 -1247848 -1220294 -725758 -178122 127565
38546 127565 270631 470149 785325 1112330 1369324 1534000 1495312 1077621 375199 -116490
38536 -116490 -2913 457328 659160 488711 399208 540716 361677 -522127 -1460550 -1368858
38526 -1368858 -114321 1228268 1630158 1215826 862487 953557 948043 266887 -737038
$$ packed form
38595e74921Q15297J47152k32110L35859P48933p5297j172711r10821L46672Q10244
38585B38297J33113k49769L02573O58314j09q19040q12433l71046k67623k58632
38575a446355K24252P63045M90542m37276r29140m55405L21360N21117J17732
38566h30128j84220R9176O26138O52728K8012n02834k50552M20981N57377l5035
38556E81643n49391l98529q222m5781l97405m30163K7554M94536N47636L05687
38546A27565J43066J99518L15176L27005K56994J64676l8688m17691p02422m91689
38536a16490J13577M60241K01832j70449q9503J41508j79039q83804r38423R1692
38526a368858J254537J342589M01890m14332l53339R1070n514o81156j003925
$$ plain form
38517 -737038 -1078806 -376469 631045 987809 569943 -88341 -643268 -1090613 -1327679
38508 -1327679 -1239733 -1138482 -1407896 -1694428 -1210288 22611 1031738 1235434 1067738
38499 1067738 897918 299302 -935902 -1952188 -1923545 -1275747 -790414 -152988 1300437
38490 1300437 2823390 2835572 1342355 267270 870748 2082652 2107940 685247 -1069770
38481 -1069770 -2254328 -2665477 -2256311 -1129539 80641 597313 275729 -446516 -1147803
38472 -1147803 -1487280 -1015964 345500 1775998 2253388 1824354 1495301 1764936 2014391
38463 2014391 1663274 1202253 1440788 2166989 2346851 1607806 803792 833863 1417302 1535922
38453 1535922 869709 210561 323254 869129 864282 4252 -944233 -1123585 -543544 165112
$$ packed form
38517g37038l41768P02337J007514L56764m17866o58284n54927m47345k37066
38508a327679Q7946J01251k69414k86532M84140J232899J009127K03696j67696
38499A067738j69820n98616j235204j016286K8643O47798M85333O37426J453425
38490A300437J522953J2182j493217j075085O03478J211904K5288j422693j755017
38481a069770j184558m11149M09166J126772J210180N16672l21584p22245p01287
38472a147803l39477M71316J361464J430498M77390m29034l29053K69635K49455
38463B014391l51117m61021K38535P26201J79862p39045q04014L0071N83439J18620
38453A535922o66213o59148J12693N45875m847q60030r48485j79352N80041P08656
$$ plain form
38443 165112 646653 1087371 1661242 2084936 1893404 1011315 -103341 -865655 -1047284
38434 -1047284 -874280 -719489 -749041 -851578 -823447 -549717 -48305 560156 1119650 1556901
38424 1556901 1942465 2363214 2726043 2752772 2192201 1053702 -271771 -1115898 -1014141
38415 -1014141 -286245 120420 -251277 -604243 178254 1850531 2792193 1996198 406168
38406 406168 -317116 115170 526979 45851 -875938 -1299473 -949085 -249580 270095 294413
38396 294413 -192507 -851119 -1261250 -1396709 -1524864 -1580815 -1163335 -370970 -23935 -571811
38386 -571811 -1301913 -1282522 -685466 -372243 -444068 -216091 343695 284188 -738555 -1512316
38376 -1512316 -777768 906256 1814884 1338392 583758 617210 1114539 1222184 944706
$$ packed form
38443A65112M81541M40718N73871M23694j91532q82089j114656p62314j81629
38434a047284J73004J54791k9552j02537K8131K73730N01412O08461N59494M37251
38424A556901L85564M20749L62829K6729n60571j138499j325473q44127J01757
38415a014141P27896M06665l71697l52966P82497J672277R41662p95995j590030
38406D06168p23284M32286M11809m81128r21789m23535L50388O99505N19675K4318
38396B94413m86920o58612m10131j35459j28155n5951M17480P92365L47035n47876
38386e71811p30102J9391N97056L13223p1825K27977N59786n9507j022743p73761
38376a512316P34548J684024R08628m76492p54634L3452M97329J07645k77478
$$ plain form
38367 944706 889113 1075169 911703 316538 36163 598925 1583987 2302335 2672263 2924876
38357 2924876 2911254 2422849 1939971 2175227 2812151 2598606 1076904 -551796 -896239
38348 -896239 -110636 587851 697972 811332 1365343 1962932 2082613 1704448 1016292 180474
38338 180474 -371438 -129656 629822 840776 21683 -906073 -782472 254187 1086732
38329 1086732 1186479 1101614 1402949 1802459 1560070 457587 -824809 -1268108 -499198
38320 -499198 788991 1595532 1719717 1703956 1757952 1503481 974951 927578 1591488 2016988
38310 2016988 1472734 672908 586761 793052 337478 -359767 -56600 1093561 1596304
38301 1596304 1013862 611734 1175010 1804376 1628291 1253280 1517535 2001304 1891839
$$ packed form
38367I44706n5593J86056j63466n95165k80375N62762R85062P18348L69928K52613
38357B924876j3622m88405m82878K35256O36924k13545j521702j628700l44443
38348h96239P85603O98487J10121J13360N54011N97589J19681l78165o88156q35818
38338A80474n51912K41782P59478K10954q19093r27756J23601J036659Q32545
38329A086732R9747q4865L01335L99510k42389j102483j282396m43299P68910
38320d99198J288189Q06541J24185j5761N3996k54471n28530m7373O63910M25500
38310B016988n44254p99826q6147K06291m55574o97245L03167J150161N02743
38301A596304n82442m02128N63276O29366j76085l75011K64255M83769j09465
$$ plain form
38292 1891839 1406223 1257711 1432904 1502154 1503928 1607224 1543825 1244707 1307602 1902069
38282 1902069 2037875 1051897 17147 305592 1388303 1586753 589573 -363069 -557986
38273 -557986 -426603 -148588 624094 1399955 913158 -843007 -2120910 -1745565 -716189
38264 -716189 -620205 -1477730 -2123083 -1969781 -1442842 -1115657 -1177323 -1470320 -1592427 -1289048
38254 -1289048 -956866 -1191851 -1682209 -1411078 -297994 382159 -145969 -867664 -447233
38245 -447233 809670 1525148 1218661 599120 233272 22593 -111524 -14592 196211 242236
38235 242236 348810 1039682 2178976 2942820 2923217 2634365 2705432 3113324 3456846 3507578
38225 3507578 3196262 2456458 1448165 695756 648767 1187841 1815359 2265304 2632182
$$ packed form
38292A891839m85616j48512J75193O9250J774J03296o3399k99118O2895N94467
38282A902069J35806r85978j034750K88445J082711J98450r97180r52642j94917
38273e57986J31383K78015P72682P75861m86797j756165j277903L75345J029376
38264g16189R5984q57525o45353J53302N26939L27185o1666k92997j22107L03379
38254a289048L32182k34985m90358K71131J113084O80153n28128p21695M20431
38245d47233J256903P15478l06487o19541l65848k10679j34117R6932K10803M6025
38235B42236J06574O90872J139294P63844j9603k88852P1067M07892L43522N0732
38225C507578l11316p39804j008293p52409m6989N39074O27518M49945L66878
$$ plain form
38216 2632182 2860965 2500715 1352058 161363 16987 876780 1388419 675706 -363049
38207 -363049 -364671 472998 877411 671282 883463 1576490 1350686 -231272 -1375597 -482703
38197 -482703 1446882 2348457 2030299 1840664 2113464 1935142 1230278 1049825 1524803
38188 1524803 1407226 256144 -596678 -152716 624178 405628 -430126 -615186 -56190
38179 -56190 285561 107331 35888 353915 650481 786933 1141299 1660628 1606499 676723
38169 676723 -306170 -327386 635381 1780535 2478215 2646739 2369542 1658828 682063 -65944
38159 -65944 -20224 961052 2318653 3116364 2891739 2191240 1953681 2314567 2476036 1972146
38149 1972146 1457326 1649119 1999446 1398229 47469 -538502 297461 1323434 1248337
$$ packed form
38216B632182K28783l60250j148657j190695j44376Q59793N11639p12713j038755
38207c63049j622Q37669M04413k06129K12181O93027k25804j581958j144325Q92894
38197d82703J929585R01575l18158j89635K72800j78322p04864j80453M74978
38188A524803j17577j151082q52822M43962P76894k18550q35754j85060N58996
38179e6190L41751j78230p1443L18027K96566J36452L54366N19329n4129r29776
38169F76723r82893k1216R62767J145154O97680J68524k77197p10714r76765p48007
38159f5944M5720R81276J357601P97711k24625p00499k37559L60886J61469n03890
38149A972146n14820J91793L50327o01217j350760n85971Q35963J025973p5097
$$ plain form
38140 1248337 608804 807090 1968009 3006731 3492572 4123464 5298309 6384699 6667344
38131 6667344 6086190 4801486 2947134 1118356 242318 582652 1523877 2475679 3205375
38122 3205375 3292310 2407512 1331198 1380315 2393291 2654341 1448462 238974 394344
38113 394344 1192572 1317589 1021907 1282554 1866581 1899972 1567834 1582124 1624192 1054585
38103 1054585 635060 1657310 3598197 4512909 3797734 2835905 2715391 2933883 2742020
38094 2742020 2357991 2359159 2918887 3947339 5123665 5778835 5629047 5397436 5744753
38085 5744753 6094002 5756647 5540873 6575310 8139931 8664220 8451993 9181687 10953673
38076 10953673 12290347 13037623 14642840 17371951 20034426 22848109 27574682 34148994
$$ packed form
38140A248337o39533J98286J160919J038722M85841O30892J174845J086390K82645
38131F667344n81154j284704j854352j828778q76038L40334R41225R51802P29696
38122C205375Q6935q84798j076314M9117J012976K61050j205879j209488J55370
38113C94344P98228J25017k95682K60647N84027L3391l32138J4290M2068n69607
38103A054585m19525J022250J940887R14712p15175r61829j20514K18492j91863
38094B742020l84029J168N59728J028452J176326O55170j49788k31611L47317
38085E744753L49249l37355k15774J034437J564621N24289k12227P29694J771986
38076A0953673J336674P47276J605217K729111K662475K813683M726573O574312
$$ plain form
38068 34148994 40378166 46028216 53948364 65870108 80550738 97617707 119530751
38061 119530751 148182586 184450889 233355221 301839012 383209480 448030778 461972683
38054 461972683 416362009 336076030 256004221 194816675 151904866 120646447 97173696
38047 97173696 79563446 66017503 55557029 47798873 41622423 35717220 30088018 25461550
38039 25461550 21741721 18510737 16356460 16007284 16521574 15949853 13776124 11411938
38031 11411938 10162363 9774840 9295895 8565296 8272254 8673117 8751132 7205777 4356121
38022 4356121 2248118 2229739 3240293 3557144 3356191 3875788 4686683 4066442 2124786
38013 2124786 1172676 2323217 3864232 3947057 2938793 2017511 1325913 840783 1317473
$$ packed form
38068C4148994O229172N650050P920148J1921744J4680630J7066969K1913044
38061A19530751K8651835L6268303M8904332O8483791Q1370468O4821298J3941905
38054D61972683m5610674q0285979q0071809o1187546m2911809l1258419k3472751
38047I7173696j7610250j3545943j0460474p758156o176450n905203n629202m626468
38039B5461550l719829l230984k154277l49176N14290n71721k173729k364186
38031A1411938j249575l87523m78945p30599k93042M00863P8015j545355k849656
38022D356121k108003j8379J010554L16851k00953N19597Q10895o20241j941656
38013B124786r52110J150541J541015Q2825j008264r21282o91598m85130M76690
$$ plain form
38004 1317473 2826310 3843838 3354266 2493067 2586436 2991055 2576696 1928791 2100248
37995 2100248 2429002 1800645 1064919 1801122 3370880 3690373 2602895 2005137 2630147
37986 2630147 3149768 2839119 2832363 3961908 5266226 5601513 5257980 5069745 5088854 4925602
37976 4925602 4475603 3743908 2765267 1995519 1881675 1918732 1223225 137360 -38784
37967 -38784 880903 1605042 1458897 1331245 1897732 2374203 1944280 1161554 904992 988021
37957 988021 843837 690320 950371 1226648 847684 -111948 -1135294 -1966896 -2320640
37948 -2320640 -1661667 -113737 1154230 1343766 1143041 1532341 2210969 2262428 1741932
37939 1741932 1453815 1630621 1927346 2254643 2496558 1913645 136972 -1621113 -1769560
$$ packed form
38004A317473J508837J017528m89572q61199R3369M04619m14359o47905J71457
37995B100248L28754o28357p35726P36203J569758L19493j087478n97758O25010
37986B630147N19621l10649o756J129545J304318L35287l43533j88235J9109j63252
37976D925602m49999p31695r78641p69748j13844L7057o95507j085865j76144
37967c8784R19687P24139j46145j27652N66487M76471m29923p82726k56562Q3029
37957I88021j44184j53517K60051K76277l78964r59632j023346q31602l53744
37948b320640O58973J547930J267967J89536k00725L89300O78628N1459n20496
37939A741932k88117J76806K96725L27297K41915n82913j776673j758085j48447
$$ plain form
37930 -1769560 -546464 431148 701203 1362968 2727732 3338184 2137372 225432 -589029
37921 -589029 -24323 879021 1419886 1648644 1632840 1345134 1101027 1306956 1809962 2038741
37911 2038741 1730340 1144047 694881 663869 1057280 1513509 1620191 1477252 1525839 1692086
37901 1692086 1366863 542090 165857 786883 1602851 1632634 1154218 1026321 1148478 723544
37891 723544 -286546 -1100819 -1309147 -1043730 -219168 1150191 2067080 1483537 183161
37882 183161 110313 1480264 2294709 1447005 520210 1249623 2747161 2938219 1673246
37873 1673246 552504 313202 280623 131226 344623 825073 767253 209483 199541 941880
37863 941880 1180594 102250 -1336373 -1783199 -1255047 -702633 -540651 -444272 -142756
$$ packed form
37930a769560J223096R77612K70055O61765J364764O10452j200812j911940q14461
37921e89029N64706R03344N40865K28758j5804k87706k44107K05929N03006K28779
37911B038741l08401n86293m49166l1012L93411M56229J06682j42939M8587J66247
37901A692086l25223q24773l76233O21026Q15968K9783m78416j27897J22157m24934
37891G23544j010090q14273k08328K65417Q24562J369359R16889n83543j300376
37882A83161p2848J369951Q14445q47704r26795P29413J497538J91058j264973
37873A673246j120742k39302l2579j49397K13397M80450n7820n57770r942P42339
37863I41880K38714j078344j438623m46826N28152N52414J61982R6379L01516
$$ plain form
37854 -142756 285114 621763 561216 -134925 -1184071 -1806095 -1454240 -248603 1308835
37845 1308835 2561092 2760904 1717367 402146 -6120 252304 -52216 -954503 -993452
37836 -993452 359586 1523334 1099157 -14902 -160212 553898 870056 702235 1010792
37827 1010792 1762909 1859691 1106700 582034 781756 900315 383951 -154218 -146794 -12120
37817 -12120 -194633 -285931 110732 475250 188401 -371254 -425604 -66215 -48729 -527097
37807 -527097 -840017 -627359 -466514 -1065830 -2167080 -2615195 -1532168 704513 2713073
37798 2713073 3332684 2578682 1424640 796500 880325 1266296 1510034 1466050 1191774 731340
37788 731340 184118 -66382 396299 1278019 1517916 553223 -670225 -742617 306445
$$ packed form
37854a42756M27870L36649o0547o96141j049146o22024L51855J205637J557438
37845A308835J252257J99812j043537j315221m08266K58424l04520r02287l8949
37836i93452J353038J163748m24177j114059j45310P14110L16158j67821L08557
37827A010792P52117R6782p52991n24666J99722J18559n16364n38169P424J34674
37817a2120j82513r1298L96663L64518k86849n59655n4350L59389J7486m78368
37807e27097l12920K12658J60845n99316j101250m48115J083027K236681K008560
37798B713073O19611p54002j154042o28140Q3825L85971K43738m3984k74276m60434
37788G31340n47222k50500M62681Q81720K39897r64693j223448p2392J049062
$$ plain form
37779 306445 1088196 833226 194253 -119073 -272900 -408095 -70193 717022 990741 371888
37769 371888 -67123 535593 1447486 1773923 2030679 2816365 3149707 2010096 516687
37760 516687 384669 963402 274926 -1417274 -1806699 -400338 606593 -64082 -926387
37751 -926387 -526990 315206 430336 334656 747128 881869 -36859 -1047709 -996215 -531470
37741 -531470 -806314 -1325424 -940259 -60751 40411 -536015 -660530 -311169 -530682 -1450410
37731 -1450410 -2044392 -1819460 -1260223 -612192 349241 1290143 1433385 870883 548235
37722 548235 764264 796722 184264 -675574 -1366353 -1878068 -2050246 -1600089 -874045 -576470
37712 -576470 -580135 -59745 943770 1241114 288777 -768508 -605649 479019 1103758
$$ packed form
37779C06445P81751k54970o38973l13326j53827j35195L37902P87215K73719o18853
37769C71888m39011O02716R11893L26437K56756P85686L33342j139611j493409
37760E16687j32018N78733o88476j692200l89425J406361J006931o70675q62305
37751i26387L99397Q42196J15130r5680M12472J34741r18728j010850N1494M64745
37741e31470k74844n19110L85165Q79508J01162n76426j24515L49361k19513r19728
37731a450410n93982K24932N59237O48031R61433R40902J43242n62502l22648
37722E48235K16029L2458o12458q59838o90779n11715j72178M50157P26044K97575
37712e76470l665N20390J003515K97344r52337j057285J62859J084668O24739
$$ plain form
37703 1103758 694408 2820 -132028 179809 281531 -22934 -281310 -190545 -136094 -538541
37693 -538541 -955679 -583738 328172 500980 -557836 -1716443 -1877811 -1543842 -1708811
37684 -1708811 -1992071 -1261149 271644 1064630 417138 -667722 -1053634 -776573 -367643
37675 -367643 144871 913030 1554373 1422583 459393 -546589 -635831 282427 1134180 895270
37665 895270 128338 408600 1869296 2586118 1360775 -205256 -34242 1089349 693912
37656 693912 -1362703 -2560753 -1638770 -398717 -700470 -1742415 -1676240 -384727 796217
37647 796217 1069927 614205 -167830 -741766 -486372 428247 894951 397495 -122248 238503
37637 238503 862953 639342 -310946 -1016319 -1135971 -991753 -661161 -83117 385426 489632
$$ packed form
37703A103758m09350o91588j34848L11837J01722l04465k58376R0765N4451m02447
37693e38541m17138L71941R11910J72808j058816j158607j61368L33969j64969
37684a708811k83260P30922J532793P92986o47492j084860l85912K77061M08930
37675c67643N12514P68159O41343j31790r63190j005982q9242R18258Q51753k38910
37665H95270p66932K80262J460696P16822j225343j566031J71014J123591l95437
37656F93912k056615j198050R21983J240053l01753j041945O6175J291513J180944
37647G96217K73710m55722p82035n73936K55394R14619M66704m97456n19743L60751
37637B38503O24450k23611r50288p05373j19652J44218L30592N78044M68543J04206
$$ plain form
37627 489632 700953 1392514 1911219 1500773 675064 551765 1157379 1500728 1090341 334988
37617 334988 -341133 -762385 -625948 64764 393936 -507871 -2001059 -2561295 -1832678
37608 -1832678 -925576 -645404 -630557 -460092 -444876 -875374 -1400297 -1597351 -1465748 -1085557
37598 -1085557 -466051 136182 490746 995833 2075445 2971119 2355967 420242 -975059
37589 -975059 -783510 -115896 -284838 -775010 -383654 584148 779128 19142 -451721 73915
37579 73915 784463 620334 -377447 -1357855 -1679863 -1310571 -618159 -28476 325057 656435
37569 656435 1039181 1024924 149392 -1249779 -2153742 -1864212 -628283 680140 1253900
37560 1253900 887880 155787 -92004 286860 500755 -30391 -690944 -482576 488774
$$ packed form
37627D89632K11321O91561N18705m10446q25709j23299O05614L43349m10387p55353
37617C34988o76121m21252J36437O90712L29172r01807j493188n60236P28617
37608a832678R07102K80172J4847J70465J5216m30498n24923j97054J31603L80191
37598a085557O19506O02233L54564N05087J079612Q95674o15152j935725j395301
37589i75059J91549O67614j68942m90172L91356R67802J94980p59986m70863N25636
37579G3915P10548j64129r97781r80408l22008L69292O92412N89683L53533L31378
37569F56435L82746j4257q75532j399171r03963K89530J235929J308423N73760
37560A253900l66020p32093k47791L78864K13895n31146o60553K08368R71350
$$ plain form
37551 488774 1202254 1257066 1204274 1274004 930301 128671 -116453 754705 1658956 1267543
37541 1267543 10902 -504112 188555 910858 709601 51809 -225969 -163785 -240194 -401521
37531 -401521 -279487 12888 -5653 -444383 -958245 -1304262 -1502783 -1486582 -1040116 -168875
37521 -168875 785226 1485819 1836996 1827841 1380483 503857 -504969 -1171726 -1215643 -768920
37511 -768920 -133993 654535 1777955 3027987 3682823 3491535 3448753 4745911 7061926
37502 7061926 9090780 11089200 15321058 22558550 29184166 29977233 24012366 15974146
37494 15974146 10883552 9110270 7782895 5600717 4008416 3973422 4054573 2666738 623994
37485 623994 -106744 643651 1189064 677239 179173 637647 1162042 437007 -1036218
$$ packed form
37551D88774P13480N4812n2792O9730l43703q01630k45124Q71158R04251l91413
37541A267543j256641n15014O92667P22303k01257o57792k77778O2184p6409j61327
37531d01521J22034K92375j8541m38730n13862l46017j98521J6201M46466Q71241
37521a68875R54101P00593L51177r155m47358q76626j008826o66757m3917M46723
37511g68920O34927P88528J123420J250032O54836j91288m2782J297158K316015
37502G061926K028854J998420M231858P237492O625616P93067n964867q038220
37494A5974146n090594j773282j327375k182178j592301l4994Q1151j387835k042744
37485F23994p30738P50395N45413n11825m98066M58474N24395p25035j473225
$$ plain form
37476 -1036218 -1428817 -96561 1539838 1780063 477070 -1135495 -1794639 -1171554 -16644
37467 -16644 505705 58788 -371628 188853 1143935 1119250 198822 -30971 1016660 1902546
37457 1902546 1383170 202460 -423610 -746580 -1475126 -2027597 -1585544 -995580 -1567981
37448 -1567981 -2509690 -1796585 471684 1864806 1151194 -105682 -218447 329170 353200
37439 353200 59097 273154 765652 711724 68657 -606717 -1085345 -1326793 -1059121 -287089
37429 -287089 414502 784383 1356539 2475065 3632590 4360352 4918180 5672897 6919018
37420 6919018 9646220 14693713 20235826 22173337 18775942 13281526 9872633 8625327
37412 8625327 6896283 4272549 2827954 2980241 2656584 1098534 271109 1288097 2204458
$$ packed form
37476a036218l92599J332256J636399K40225j302993j612565o59144O23085J154910
37467a6644N22349m46917m30416N60481R55082k4685r20428k29793J047631Q85886
37457A902546n19376j180710o26070l22970p28546n52471M42053N89964n72401
37448a567981r41709P13105K268269J393122p13612j256876j12765N47617K4030
37439C53200k94103K14057M92498n3928o43067o75374m78628k41448K67672P72032
37429b87089P01591L69881N72156J118526J157525P27762N57828P54717J246121
37420F919018K727202N047493N542113J937511l397395n494416l408893j247306
37412H625327j729044k623734j444595J52287l23657j558050q27425J016988R16361
$$ plain form
37403 2204458 1055329 -1096771 -2049819 -1711168 -1472224 -1590712 -1280202 -701311 -887067
37394 -887067 -1873829 -2511630 -2174572 -1397875 -736636 -87050 673604 1271719 1544016 1734800
37384 1734800 2037656 2247962 2045385 1402709 678872 395461 753674 1269040 1164947
37375 1164947 262026 -842221 -1541333 -1689072 -1241786 -159142 1045664 1439600 876353
37366 876353 366769 606432 816002 -96391 -1722720 -2511684 -1773934 -464524 54771
37357 54771 -598335 -1653313 -1877600 -566229 1609588 2892721 2181199 372591 -640182
37348 -640182 -213439 500911 260945 -766613 -1474512 -1208581 -311111 421108 498174 60042
37338 60042 -388577 -531224 -455422 -333444 -179557 -44988 -45729 61179 808469 2054563
$$ packed form
37403B204458j149129k152100r53048L38651K38944j18488L10510N78891j85756
37394h87067r86762o37801L37058P76697O61239O49586P60654N98115K72297J90784
37384A734800L02856K10306k02577o42676p23837k83411L58213N15366j04093
37375A164947r02921j104247o99112j47739M47286J082644J204806L93936n63247
37366H76353n09584K39663K09570r12393j626329p88964P37750J309410N19295
37357E4771o53106j054978k24287J311371K175817J283133p11522j808608j012773
37348f40182M26743P14350k39966j027558p07899K65931Q97470P32219P7066m38132
37338F0042m48619j42647P5802J21978J53887J34569p41J06908P47290J246094
$$ plain form
37328 2054563 2658690 1898280 768899 831538 1960120 2461962 1597350 685875 1093365
37319 1093365 2236505 2585953 1901889 1275444 1268222 1236495 642620 18082 154534 967310
37309 967310 1637829 1507218 498433 -943547 -1950776 -1688818 -283553 930069 683250
37300 683250 -769411 -2019581 -2272421 -2046200 -1986025 -1807178 -953701 285017 1037714
37291 1037714 952880 415692 -118743 -390274 -123395 739555 1645389 1951670 1848556 2083620
37281 2083620 2746246 3094057 2736215 2195796 1997774 1928399 1588164 1044364 547073 185879
37271 185879 151006 654068 1233662 941281 -270356 -1155515 -800008 167972 706857 826882
37261 826882 1003900 993632 419804 -151284 -48859 167067 -328804 -827897 -14876 1511830
$$ packed form
37328B054563O04127p60410j129381O2639J128582N01842q64612r11475M07490
37319A093365J143140L49448o84064o26445p222l1727n93875o24538J36452Q12776
37309I67310O70519j30611j008785j441980j007229K61958J405265J213622k46819
37300F83250j452661j250170k52840K26221O0175J78847Q53477J238718P52697
37291A037714q4834n37188n34435k71531K66879Q62950R05834L06281j03114K35064
37281B083620O62626L47811l57842n40419j98022o9375l40235n43800m97291l61194
37271A85879l4873N03062N79594k92381j211637q85159L55507R67980N38885J20025
37261H26882J77018j0268n73828n71088J02425K15926m95871m99093Q13021J526706
$$ plain form
37251 1511830 1649619 38376 -1052246 116579 2362610 3425194 2851865 1820647
37243 1820647 1128662 690098 387768 224790 9381 -221413 72123 981126 1533975
37234 1533975 984329 134881 262874 1141065 1333281 285352 -1036445 -1609587 -1417775
37225 -1417775 -908244 -290567 367645 999804 1664287 2309531 2459063 1723837 557313
37216 557313 -136450 -73217 355445 897968 1516498 1817396 1403255 821740 1127314 2274175
37206 2274175 2921188 2187730 723853 -361044 -786953 -855765 -723368 -493722 -380694
37197 -380694 -238718 436876 1500824 1810691 587679 -1345916 -2369137 -1808136 -389963
37188 -389963 705304 810225 156403 -319154 60884 701511 302341 -1274838 -2565279
$$ packed form
37251A511830J37789j611243j090622J168825K246031J062584n73329j031218
37243A820647o91985m38564l02330j62978k15409k30794K93536R09003N52849
37234A533975n49646q49448J27993Q78191J92216j047929j321797n73142J91812
37225a417775N09531O17677O58212O32159O64483O45244J49532p35226j166524
37216E57313o93763O3233M28662N42523O18530L00898m14141n81515L05574J146861
37206B274175O47013p33458j463877j084897m25909o8812J32397K29646J13028
37197c80694J41976O75594J063948L09867j223012j933595j023221N61001J418173
37188c89963J095267J04921o53822m75557L80038O40627l99170j577179j290441
$$ plain form
37179 -2565279 -2467774 -1713223 -1542616 -1811927 -1537128 -660151 -17500 28695 -278285 -951678
37169 -951678 -1984798 -2531439 -1767959 -403256 163277 120052 962977 2716969 3359819
37160 3359819 1835052 -85843 -226224 1028570 1684894 1150218 652448 1060370 1831531
37151 1831531 2175809 2035632 1659682 1129302 618186 442487 573750 620339 501172 653351
37141 653351 1310297 1966233 1906041 1089666 194345 -243531 -506785 -1304059 -2728539 -3953097
37131 -3953097 -4207203 -3726113 -3247829 -2825294 -1869351 -338955 956014 1476985 1614058
37122 1614058 1862341 2053072 1856071 1397421 880906 216694 -447256 -481330 283976 962049
37112 962049 687625 -200911 -776823 -829830 -767169 -660214 -260883 344471 900251 1485132
$$ packed form
37179b565279R7505P54551J70607k69311K74799Q76977O42651M6195l06980o73393
37169i51678j033120n46641P63480J364703N66533m3225Q42925J753992O42850
37160C359819j524767j920895j40381J254794O56324n34676m97770M07922P71161
37151A831531L44278j40177l75950n30380n11116j75699J31263M6589j19167J52179
37141F53351O56946O55936o0192q16375q95321m37876k63254p97274j424480j224558
37131c953097k54106M81090M78284M22535R55943J530396J294969N20971J37073
37122A614058K48283J90731j97001m58650n16515o64212o63950l4074P65306O78073
37112I62049k74424q88536n75912n3007O2661J06955L99331O05354N55780N84881
$$ plain form
37102 1485132 2089815 2121468 1232820 224981 79529 451022 296052 -295420 -278950 426975
37092 426975 727263 265120 -4519 312053 127685 -1218853 -2405677 -1787548 159395
37083 159395 1415545 1100409 298624 195237 569933 606178 335969 445497 934592 890900
37073 890900 -71582 -859850 -221913 1262094 1642476 306671 -958787 -356252 1527186
37064 1527186 2822284 2983326 2823612 2580420 1761255 777272 837746 1879315 2296705
37055 2296705 1283202 -109511 -844182 -1200036 -1380808 -534114 1542081 3163503 2841351
37046 2841351 1566798 1379798 2464003 3388863 3672627 4247211 5564269 7096071 8929437
37037 8929437 12063415 16331997 19333219 18574929 14259380 9214032 6185987 5530566
$$ packed form
37102A485132O04683L1653q88648j007839j45452L71493j54970n91472J6470P05925
37092D26975L00288m62143k69639L16572j84368j346538j186824O18129J946943
37083A59395J256150l15136q01785j03387L74696L6245k70209J09528M89095m3692
37073H90900r62482p88268O37937J484007L80382j335805j265458O02535J883438
37064A527186J295098J61042j59714k43192q19165r83983O0474J041569M17390
37055B296705j013503j392713p34671l55854j80772Q46694K076195J621422l22152
37046B841351j274553j87000J084205R24860K83764N74584J317058J531802J833366
37037H929437L133978M268582L001222p58290m315549n045348l028045o55421
$$ plain form
37029 5530566 5453548 4314047 2506475 1732555 2463324 3033100 1901455 -44465 -684058
37020 -684058 264471 880623 -99230 -1528471 -1652254 -542021 309859 220557 34204
37011 34204 691877 1977158 2950872 3074180 2512109 1631603 679475 -68443 -309090 -93585
37001 -93585 126950 136573 292649 797934 1037808 381567 -620473 -818497 -199153 86325
36991 86325 -392996 -717881 -362333 -189541 -796669 -1161028 -269769 921647 787239 -360173
36981 -360173 -717268 221421 1107473 1063000 828902 1115693 1339865 804364 -35632 -403933
36971 -403933 -459540 -807587 -1319052 -1313932 -651895 69311 338547 270862 287569 520898
36961 520898 639306 287233 -328340 -559149 -196402 154242 -45208 -443026 -446275 -258132
$$ packed form
37029E530566p7018j139501j807572p73920P30769N69776j131645j945920o39593
37020f84058R48529O16152r79853j429241j23783J110233Q51880q9302j86353
37011C4204O57673J285281R73714J23308n62071q80506r52128p47918k40647K15505
37001i3585K20535R623J56076N05285K39874o56241j002040j98024O19344K85478
36991H6325m79321l24885L55548J72792o07128l64359Q91259J191416j34408j147412
36981c60173l57095R38689Q86052m4473k34098K86791K24172n35501q39996l68301
36971d03933n5607l48047n11465N120O62037P21206K69236o7685J6707K33329
36961E20898J18408l52073o15573k30809L62747L50644j99450l97818l249J88143
$$ plain form
36951 -258132 -418756 -606118 16054 1215126 1567478 332971 -1394745 -1964981 -1047787
36942 -1047787 272734 918882 838351 670158 702763 432475 -592708 -1683488 -1551920
36933 -1551920 -212065 631689 -173400 -1531472 -1722824 -872551 -363946 -451892 -220875
36924 -220875 387816 402960 -282343 -686410 -615035 -900150 -1440252 -1017822 330464 869574
36914 869574 31416 -397077 712820 1674708 660197 -1195797 -1542453 -427650 129004
36905 129004 -616651 -1575649 -2064859 -2405641 -2423458 -1446315 10700 409355 -588100 -1597085
36895 -1597085 -1545564 -835516 -216606 88076 -144125 -1076938 -1868361 -1282112 268011
36886 268011 846132 -155079 -946400 -184174 737836 -139674 -2082705 -2616561 -1220218
$$ packed form
36951b58132j60624j87362O22172J199072L52352j234507j727716n70236R17194
36942a047787J320521O46148q0531j68193L2605k70288j025183j090780J31568
36933a551920J339855Q43754q05089j358072j91352Q50273N08605q7946K31017
36924b20875O08691J5144o85303m04067P1375k85115n40102M22430J348286N39110
36914H69574q38158m28493J109897R61888j014511j855994l46656J114803N56654
36905A29004p45655r58998m89210l40782j7817R77143J457015L98655r97455j008985
36895a597085N1521P10048O18910L04682k32201r32813p91423N86249J550123
36886B68011N78121j001211p91321P62226R22010q77510j943031n33856J396343
$$ plain form
36877 -1220218 39521 -280071 -1112560 -992774 -434543 -820346 -1877090 -1950029 -640505
36868 -640505 430554 8006 -935452 -731493 441636 918780 178833 -379433 323269
36859 323269 1315614 984206 -584942 -1748887 -1492249 -521108 -155253 -831049 -1870329
36850 -1870329 -2316684 -1872820 -1204306 -1259729 -2159099 -3009141 -3027600 -2476339 -2129207 -2208894
36840 -2208894 -2347559 -2288232 -2058541 -1648379 -1062515 -569792 -425145 -465235 -391869 -272609
36830 -272609 -337517 -507036 -586663 -691966 -972519 -1139467 -808302 -129224 425124 677649
36820 677649 652718 183046 -747128 -1525199 -1487062 -808597 -155201 352782 1063310 1833074
36810 1833074 2008417 1417804 634709 142130 -122706 -300553 -283602 28535 590401 1304726
$$ packed form
36877a220218J259739l19592q32489J19786N58231l85803j056744p2939J309524
36868f40505J071059m22548r43458K03959J173129M77144p39947n58266P02702
36859C23269R92345l31408j569148j163945K56638R71141L65855o75796j039280
36850a870329m46355M43864O68514n5423q99370q50042j8459N51261L47132p9687
36840b208894j38665N9327K29691M10162N85864M92723J44647m0090P3366J19260
36830b72609o4908j69519p9627j05303k80553j66948L31165O79078N54348K52525
36820F77649k4931m69672r30174p78071L8137O78465O53396N07983P10528P69764
36810A833074J75343n90613p83095m92579k64836j77847J6951L12137N61866P14325
$$ plain form
36800 1304726 1872252 1807041 1139767 753744 1312190 2226641 2548054 2447357 2664333 2834967
36790 2834967 1874461 65411 -855055 -188038 603349 57106 -1223378 -1673665 -1009437
36781 -1009437 -243064 -34358 -115085 -131990 -152694 -277036 -321739 -49600 482722 854890
36771 854890 657283 123130 137236 1149599 2346023 2595384 1988494 1518875 1395416
36762 1395416 859430 -233862 -976276 -939738 -862916 -1202053 -1233052 -435414 321721 5856
36752 5856 -972978 -1377124 -759063 356563 1296222 1512242 737070 -385723 -592121 279412
36742 279412 712827 -391324 -1941619 -2154331 -1058785 -182681 -322830 -991566 -1621480
36733 -1621480 -1913279 -1319946 356092 1995939 2180808 1127784 318697 301909 286325
$$ packed form
36800A304726N67526o5211o67274l86023N58446R14451L21413j00697K16976J70634
36790B834967r60506j809050r20466O67017P91387n46243j280484m50287O64228
36781a009437P66373K08706q0727j6905k0704j24342m4703K72139N32322L72168
36771H54890j97607n34153J4106J012363J196424K49361o06890m69619j23459
36762A395416n35986j093292p42414L6538P6822l39137l0999P97638P57135l15865
36752E856r78834m04146O18061J115626R39659K16020p75172j122793k06398Q71533
36742B79412M33415j104151j550295k12712J095546Q76104j40149o68736o29914
36733a621480k91799N93333J676038J639847J84869j053024q09087j6788j5584
$$ plain form
36724 286325 -77305 -102611 412611 570223 -121046 -866083 -881007 -505875 -338824 -222845
36714 -222845 144868 382744 -15509 -851799 -1578879 -1980680 -1995927 -1434621 -442846 231503
36704 231503 21073 -735393 -1282231 -1348387 -1229171 -1310613 -1785788 -2482005 -2772774 -2107714
36694 -2107714 -818678 110306 259448 159962 241299 111308 -683957 -1802132 -2511027
36685 -2511027 -2483827 -1799354 -683644 331663 559101 -41467 -697896 -876196 -897147
36676 -897147 -1056846 -921419 -250455 110414 -680994 -1923598 -2079857 -894313 274693
36667 274693 310987 -455090 -1103220 -1267609 -1051818 -587629 -191635 -353167 -991756 -1195571
36657 -1195571 -347280 805401 948430 -1872 -682475 -118340 899818 852840 -466490
$$ packed form
36724B86325l63630k5306N15222J57612o91269p45037j4924L75132J67051J15979
36714b22845L67713K37876l98253q36290p27080m01801j5247N61306R91775O74349
36704B31503k10430p56466n46838o6156J19216q1442m75175o96217k90769O65060
36694b107714J289036R28984J49142r9486Q1337j29991p95265j118175p08895
36685b511027K7200O84473J115710J015307K27438o00568o56429j78300k0951
36676h97147j59699J35427O70964L60869p91408j242604j56259J185544J169006
36667B74693L6294p66077o48130j64389K15791M64189L95994j61532o38589k03815
36657a195571Q48291J152681J43029r50302o80603N64135J018158m6978j319330
$$ plain form
36648 -466490 -1687438 -1601218 -445813 750794 1398518 1437625 826035 -274257 -1099604
36639 -1099604 -931079 -119824 284781 -3839 -173605 367124 1069785 1024975 108931 -1031597
36629 -1031597 -1698554 -1531963 -643877 275114 391055 -358960 -1109658 -1105525 -529689 -25532
36619 -25532 183939 325045 543294 708906 586145 47431 -685331 -1096177 -1067910 -1269194
36609 -1269194 -2089983 -2438232 -850266 2059801 3739507 2906792 1197869 678861 1121783
36600 1121783 1099684 540399 408831 661936 452477 -44082 75588 487182 -54135 -1303960
36590 -1303960 -1405035 271761 1946105 1925458 755019 -128016 -553572 -1192893 -1926049
36581 -1926049 -1954068 -1101061 -9814 679495 655381 -181841 -1503534 -2521543 -2703365
$$ packed form
36648d66490j220948Q6220J155405J196607O47724L9107o11590j100292q25347
36639a099604J68525Q11255M04605k88620j69766N40729P02661m4810r16044j140528
36629a031597o66957J66591Q88086R18991J15941p50015p50698M133N75836N04157
36619b5532K09471J41106K18249J65612j22761n38714p32762m10846K8267k01284
36609a269194q20789l48249J587966K910067J679706q32715j708923n19008M42922
36600A121783k2099n59285j31568K53105k09459m96559J19670M11594n41317j249825
36590a303960j01075J676796J674344k0647j170439q83035m25556o39321p33156
36581a926049k8019Q53007J091247O89309k4114q37222j321693j018009j81822
$$ plain form
36572 -2703365 -2265920 -1676534 -1117615 -684821 -474355 -163863 743940 1887392 2142813
36563 2142813 1283435 566555 902048 1393775 729588 -772669 -1693232 -1500600 -791093
36554 -791093 17451 928791 1534596 1240131 337522 -274022 -475649 -940292 -1689535 -1813082
36544 -1813082 -919254 198583 757176 900865 949030 620475 -329476 -1356631 -1719786
36535 -1719786 -1439535 -1108375 -1036340 -1044675 -879813 -468011 42783 240964 -276899 -1314925
36525 -1314925 -2022706 -1743881 -746827 131644 392929 196307 -59090 -200345 -363285
36516 -363285 -769619 -1422607 -1982638 -2002303 -1337289 -337828 339117 198868 -581413 -1141553
36506 -1141553 -816681 -84492 -88895 -1001684 -1582656 -914931 153119 200756 -664683 -1028710
$$ packed form
36572b703365M37445N89386N58919M32794K10466L10492R07803J143452K55421
36563B142813q59378p16880L35493M91727o64187j502257r20563J92632P09507
36554g91093Q08544R11340O05805k94465r02609o11544k01627m64643p49243j23547
36544a813082Q93828J117837N58593J43689M8165l28555r49951j027155l63155
36535a719786K80251L31160P2035q335J64862M11802N10794J98181n17863j038026
36525a314925p07781K78825R97054Q78471K61285j96622k55397j41255j62940
36516c63285m06334o52988n60031j9665O65014R99461O76945j40249p80281n60140
36506a141553L24872P32189m403r12789n80972O67725J068050M7637q65439l64027
$$ plain form
36496 -1028710 -231087 994488 1883387 2362832 2242053 1042421 -810737 -1823214 -1268023
36487 -1268023 -264919 -169638 -675717 -494513 674492 1920246 2531018 2587487 2245055
36478 2245055 1409892 335840 -197771 285582 1277263 1724688 1084388 -152691 -976896
36469 -976896 -897838 -368129 -74610 -91439 -117480 -223338 -620419 -841142 -137024 1174942
36459 1174942 1822822 1393187 938422 1204804 1413549 721427 -149040 29403 1038929
36450 1038929 1654018 1529037 1294099 1087628 422960 -517518 -812721 -233538 400192
36441 400192 537697 528668 666078 616573 204173 -116716 -15055 207313 239411 250741
36431 250741 442702 727150 1104504 1714243 2263145 2089901 1109921 73358 -402811
$$ packed form
36496a028710P97623J225575Q88899M79445j20779j199632j853158j012477N55191
36487a268023J003104R5281n06079J81204J169005J245754O10772N6469l42432
36478B245055q35163j074052n33611M83353R91681M47425o40300j237079q24205
36469i76896P9058N29709K93519j6829k6041j05858l97081k20723P04118J311966
36459A174942O47880m29635m54765K66382K08745o92122q70467J78443J009526
36450A038929O15089j24981k34938k06471o64668r40478k95203N79183O33730
36441D00192J37505r029J37410m9505m12400l20889J01661K22368L2098J1330
36431B50741J91961K84448L77354O09739N48902j73244r79980j036563m76169
$$ plain form
36422 -402811 -463864 -458936 -412587 -308324 -259610 -173724 113040 248515 -280241 -1073675 -1101882
36411 -1101882 -338405 15360 -577571 -1074618 -588759 130949 21143 -471242 -188707
36402 -188707 769774 1250863 890810 488309 620720 969567 1062830 827058 382684 -4556
36392 -4556 141017 946794 1732018 1763583 1235046 841051 759541 835483 1287073 2186243
36382 2186243 2640289 1747546 185094 -447024 182720 897604 947538 736485 477059
36373 477059 -268098 -1236999 -1268638 -226698 359655 -430304 -1356699 -940339 287593
36364 287593 878280 782177 938135 1281309 943135 84421 -222853 120211 130089 -375514
36354 -375514 -428560 226375 551094 104610 -39940 812690 1563591 1028733 -35688 -77230
$$ packed form
36422d02811o1053M928M6349J04263M8714Q5886K86764J35475n28756p93434k8207
36411a101882P63477L53765n92931m97047M85859P19708j09806m92385K82535
36402a88707R58481M81089l60053m02501J32411L48847R3263k35772m44374l87240
36392d556J45573Q05777P85224L1565n28537l93995q1510P5942M51590Q99170
36382B186243M54046q92743j562452o32118O29744P14884M9934k11053k59426
36373D77059p45157r68901l1639J041940N86353p89959r26395M16360J227932
36364B87593N90687r6103J55958L43174l38174q58714l07274L43064R878n05603
36354c75514n3046O54935L24719m46484j44550Q52630P50901n34858j064421m1542
$$ plain form
36344 -77230 816193 1183899 515594 -287557 -724185 -1333353 -2144617 -2026004 -449950 1259819
36334 1259819 1573973 861490 611606 1050148 948568 -219340 -1337301 -1319993 -577983
36325 -577983 -78296 134095 490480 638161 -107227 -1222791 -1178300 504499 2415087
36316 2415087 3022282 2470294 1912137 1707481 1241687 276581 -505860 -472630 145067 673120
36306 673120 737226 337759 -357576 -938029 -798554 283984 1700924 2466710 2164632
36297 2164632 1291676 684300 712202 982481 729677 -421759 -1938936 -2697180 -2026549
36288 -2026549 -470828 671266 633645 -131282 -637261 -531467 -309410 -447493 -747875
36279 -747875 -778163 -632857 -781357 -1224235 -1331581 -727013 82802 321349 -64761 -429259
$$ packed form
36344g7230Q93423L67706o68305q03151m36628o09168q11264J18613J576054J709769
36334A259819L14154p12483k49884M38542j01580j167908j117961J7308P42010
36325e77983M99687K12391L56385J47681p45388j115564M4491J682799J910588
36316B415087O07195n51988n58157k04656m65794r65106p82441L3230O17697N28053
36306F73120O4106l99467o95335n80453J39475J082538J416940P65786l02078
36297B164632q72956o07376K7902K70279k52804j151436j517177p58244O70631
36288b026549J555721J142094l7621p64927n05979J05794K22057j38083l00382
36279g47875l0288J45306j48500m42878j07346O04568Q09815K38547l86110l64498
$$ plain form
36269 -429259 -336969 -63667 -164435 -831305 -1727861 -2258870 -2008557 -1119460 -226992 166388
36259 166388 190373 286225 548690 736369 813940 992430 1202618 1045289 432022 -184895
36249 -184895 -441227 -485518 -529769 -451258 -207492 -190946 -656707 -1133674 -986690 -353917
36239 -353917 63066 13711 -94746 57081 369976 758297 1254492 1551697 1139502 223605
36229 223605 -121601 758994 2097141 2559032 1828757 762960 156292 -4014 -67491
36220 -67491 -173536 -415938 -1026766 -1968637 -2617925 -2308207 -1153241 6399 534172
36211 534172 628583 910007 1555566 2043650 1747815 650953 -595387 -1277540 -1223703 -807045
36201 -807045 -430444 -118885 347400 1017413 1649473 2001686 2072773 1982128 1767665 1436909
$$ packed form
36269d29259R2290K73302j00768o66870q96556n31009K50313Q89097Q92468L93380
36259A66388K3985R5852K62465J87679P7571J78490K10188j57329o13267o16917
36249a84895k56332m4291m4251P8511K43766J6546m65761m76967J46984O32773
36239c53917M16983m9355j08457J51827L12895L88321M96195K97205m12195r15897
36229B23605l45206Q80595J338147M61891p30275j065797o06668j60306o3477
36220f7491j06045k42402o10828r41871o49288L09718J154966J159640N27773
36211E34172R4411K81424O45559M88084k95835j096862j246340o82153N3837M16658
36201h07045L76601L11559M66285O70013O32060L52213P1087r0645k14463l30756
$$ plain form
36191 1436909 1087575 795856 484909 112445 -114263 5683 263971 261456 32354 5599
36181 5599 230683 172412 -394339 -789077 -298924 658461 946808 248634 -477394 -263584
36171 -263584 662727 1248438 860760 -130948 -836542 -703319 -22467 315970 -269034 -1337586
36161 -1337586 -1858836 -1420169 -695561 -531310 -875177 -948871 -343264 414278 455641 -435659
36151 -435659 -1521133 -1792174 -968961 210236 749467 362625 -448392 -1136948 -1587309
36142 -1587309 -1825811 -1685312 -1068432 -342332 -113408 -572882 -1259041 -1545202 -1278896
36133 -1278896 -859632 -699225 -725380 -564705 -163539 63314 -171514 -578477 -700599 -520204
36123 -520204 -293399 19192 670461 1515627 1960246 1639850 857292 284983 431548 1288837
$$ packed form
36191A436909l49334k91719l10947l72464k26708J19946K58288k515k29102k6755
36181E599K25084n8271n66751l94738M90153R57385K88347o98174p26028K13810
36171b63584R26311N85711l87678r91708p05594J33223O80852L38437n85004j068552
36161a337586n21250M38667P24608J64251l43867p3694O05607P57542M1363q91300
36151d35659j085474k71041Q23213J179197N39231l86842q11017o88556m50361
36142a587309k38502J40499O16880P26100K28924m59474o86159k86161K66306
36133a278896M19264J60407k6155J60675M01166K26853k34828m06963j22122J80395
36123e20204K26805L12591O51269Q45166M44619l20396p82558n72309J46565Q57289
$$ plain form
36113 1288837 2207465 2289225 1307074 83956 -467857 -440544 -503096 -685415 -422690 320546
36103 320546 911784 1052344 948223 430857 -921671 -2502584 -2791232 -1385916 186319
36094 186319 451900 -233231 -718363 -821242 -988497 -1107758 -904713 -825842 -1246633 -1399534
36084 -1399534 -461887 770082 797998 -255724 -801178 -222683 402733 255648 -68239
36075 -68239 120486 406819 109656 -627367 -1256796 -1615182 -1742708 -1558743 -1195274 -1079371
36065 -1079371 -1283825 -1339340 -1017859 -739473 -889446 -1273966 -1523999 -1499132 -1086869 -227478
36055 -227478 604283 573596 -527843 -1959711 -2884010 -3020755 -2424706 -1373339 -643152
36046 -643152 -1054732 -2391234 -3477824 -3629446 -3274548 -2872732 -2138407 -876731 221326
$$ packed form
36113A288837R18628Q1760r82151j223118n51813K7313o2552j82319K62725P43236
36103C20546N91238J40560j04121n17366j352528j580913k88648J405316J572235
36094A86319K65581o85131m85132j02879j67255j19261K03045P8871m20791j52901
36084a399534R37647J231969K7916j053722n45454N78495O25416j47085l23887
36075f8239J88725K86333k97163p37023o29429l58386j27526J83965L63469J15903
36065a079371k04454n5515L21481K78386j49973l84520k50033K4867M12263Q59391
36055b27478Q31761l0687j101439j431868r24299j36745N96049J051367P30187
36046f43152m11580j336502j086590j51622L54898M01816P34325J261676J098057
$$ plain form
36037 221326 347002 -327736 -862555 -538416 607252 1774536 1830864 424373 -1205671
36028 -1205671 -1341448 118531 1574826 1886973 1490956 1074835 497561 -319622 -717204
36019 -717204 -409110 -172332 -533005 -850607 -629501 -541953 -1033103 -1161267 -236912 551531
36009 551531 -147068 -1467000 -1597120 -747594 -712024 -1749625 -2108571 -874570 704290
36000 704290 1288706 1148678 1073225 998322 586478 144818 158433 571320 1018931 1185370
35990 1185370 731946 -384496 -1397850 -1398428 -633915 -222304 -486608 -653198 -340329 -86324
35980 -86324 -70895 328185 1100326 1058129 -355624 -1820516 -1784216 -542042 411972 469201
35970 469201 216015 90647 -116003 -522125 -891167 -1202890 -1740747 -2399565 -2439839 -1279725
$$ packed form
36037B21326J25676o74738n34819L24139J145668J167284N6328j406491j630044
36028a205671j35777J459979J456295L12147l96017m16121n77274q17183l97582
36019g17204L08094K36778l60673l17602K21106Q7548m91150j28164R24355P88443
36009E51531o98599j319932j30120Q49526L5570j037601l58946J234001J578860
36000G04290N84416j40028p5453p4903m11844m41660J3615M12887M47611J66439
35990A185370m53424j116442j013354n78P64513M11611k64304j66590L12869K54005
35980h6324J5429L99080P72141m2197j413753j464892L6300J242174R54014N7229
35970D69201k53186j25368k06650m06122l69042l11723n37857o58818m0274J160114
$$ plain form
35960 -1279725 611582 1867675 1507965 162046 -354456 858446 2445616 2338037 444051
35951 444051 -1256436 -1380936 -649289 -264096 -109428 463540 1103838 1022988 493081 452714
35941 452714 893736 928646 428498 306027 876437 1123122 282056 -697156 -246813 1566439
35931 1566439 2833004 2076961 117587 -877570 24471 1526850 1848912 827905 -303780
35922 -303780 -795288 -1071172 -1535004 -1729845 -1231961 -608514 -678705 -1223987 -1261756 -493103
35912 -493103 261779 185372 -549462 -1151149 -1188168 -898821 -700870 -678002 -582983 -182396
35902 -182396 537800 1437611 2255403 2530640 1848812 443791 -752912 -1097556 -1023008
35893 -1023008 -1295734 -1714201 -1347294 -80728 996689 1116741 945594 1552044 2784878
$$ packed form
35960a279725J891307J256093l59710j345919n16502J212902J587170j07579j893986
35951D44051j700487j24500P31647L85193J54668N72968O40298q0850n29907m0367
35941D52714M41022L4910n00148j22471N70410K46685q41066r79212M50343J813252
35931A566439J266565p56043j959374r95157R02041J502379L22062j021007j131685
35922c03780m91508k75884m63832j94841M97884O23447p0191n45282l7769P68653
35912d93103P54882p6407p34834o01687l7019K89347J97951K2868R5019M00587
35902a82396P20196Q99811Q17792K75237o81828j405021j196703l44644P4548
35893a023008k72726m18467L66907J266566J077417J20052j71147O06450J232834
$$ plain form
35884 2784878 3390506 2563617 842449 -503354 -657708 105923 765264 592847 -93970
35875 -93970 -406162 -38287 464182 617026 611017 760349 830854 339319 -692073 -1559787
35865 -1559787 -1410657 -38535 1606710 1994154 681376 -831640 -751520 657246 1460843
35856 1460843 819292 -19441 81879 438340 -10067 -787207 -750614 -55955 170541 -298542
35846 -298542 -572809 -158574 420451 539616 179782 -281362 -413680 -85979 77693 -831463
35836 -831463 -2461874 -2979149 -1414697 605394 866804 -394096 -1138285 -695146 -240920
35827 -240920 -228193 326051 1442318 1354335 -704383 -2746204 -2627587 -1003777 12709
35818 12709 55760 434044 1468228 1949545 1304165 533370 535864 859195 743397 355816
$$ packed form
35884B784878O05628q26889j721168j345803j54354P63631O59341j72417o86817
35875i3970l12192L67875N02469J52844o009J49332P0505m91535j031392q67714
35865a559787J49130J372122J645245L87444j312778j513016Q0120J408766Q03597
35856A460843o41551q38733J01320L56461m48407p77140L6593O94659K26496m69083
35846b98542k74267M14235N79025J19165l59834m61144j32318L27701J63672r09156
35836h31463j630411n17275J564452K020091K61410j260900p44189M43139M54226
35827b40920J2727N54244J116267q7983k058718k041821J18617J623810J016486
35818A2709M3051L78284J034184M81317o45380p70795K494L23331j15798l87581
$$ plain form
35808 355816 280908 539238 797957 989800 1066577 595807 -663244 -2010255 -2344140 -1476257
35798 -1476257 -369341 29953 -246105 -543754 -494500 -241676 14841 313324 729277
35789 729277 1099845 1071637 405491 -763829 -1953731 -2659829 -2682823 -2128629 -1222978 -337092
35779 -337092 -47929 -656719 -1526586 -1512280 -453384 362516 -112108 -1103448 -1126107 -282085
35769 -282085 -67789 -830770 -992494 519309 2453355 2977228 2211525 1659577 1773631
35760 1773631 1615449 726343 -157847 -478067 -714617 -1427175 -2321066 -2752150 -2547207
35751 -2547207 -1957540 -1301845 -929901 -1088701 -1602476 -2049989 -2322951 -2587574 -2730189
35742 -2730189 -2404509 -1637515 -794835 38404 956300 1548347 1210524 287104 -76748
$$ packed form
35808C55816p4908K58330K58719J91843P6777m70770j259051j347011l33885Q67883
35798a476257J106916L99294k76058k97649M9254K52824K56517K98483M15953
35789G29277L70568k8208o66146j169320j189902p06098k2994N54194R05651Q85886
35779c37092K89163o08790q69867J4306J058896Q15900m74624r91340k2659Q44022
35769b82085K14296p62981j61724J511803J934046N23873p65703n51948J14054
35760A773631j58182q89106q84190l20220k36550p12558q93891m31084K04943
35751b547207N89667O55695L71944j58800n13775m47513k72962k64623j42615
35742b730189L25680P66994Q42680Q33239R17896N92047l37823r23420l63852
$$ plain form
35733 -76748 411919 671426 -28507 -749665 -196162 1317432 2272664 2030485 1493797 1684336
35723 1684336 2523465 3255576 3426402 3060549 2263334 1117737 -35170 -532068 87129
35714 87129 1381671 2092966 1337990 -276664 -1175038 -600240 543909 898997 270256
35705 270256 -398527 -361760 195164 707655 956941 1033567 958518 726574 624992 1078689
35695 1078689 1955448 2331873 1457087 -60321 -629971 456238 2073203 2670006 2139997
35686 2139997 1561800 1443626 1224789 523343 -126280 -125752 339736 690615 626667 139620
35676 139620 -558971 -873828 -247729 949561 1635890 1440539 1132419 1225502 1107885 252315
35666 252315 -659325 -839109 -822565 -1503075 -2282089 -1727605 23951 1097970 452233
$$ packed form
35733g6748M88667K59507o99933p21158N53503J513594R55232k42179n36688J90539
35723A684336Q39129P32111J70826l65853p97215j145597j152907m96898O19197
35714H7129J294542P11295p54976j614654q98374N74798J144149L55088o28741
35705B70256o68783L6767N56924N12491K49286P6626p5049k31944j01582M53697
35695A078689Q76759L76425q74786j517408n69650J086209J616965N96803n30009
35686B139997n78197j18174k18837p01446o49623N28M65488L50879o3948m87047
35676A39620o98591l14857O26099J197290O86329j95351l08120R3083j17617q55570
35666B52315r11640j79784J6544o80510p79014N54484J751556J074019o45737
$$ plain form
35657 452233 -782935 -1163752 -893874 -988004 -1444284 -1466538 -986198 -708592 -783743 -608559
35647 -608559 -89172 21914 -513179 -741406 11819 789657 226561 -1298251 -2053890
35638 -2053890 -1554170 -1349796 -2586112 -3999493 -3556338 -1384292 354087 336231 -558030
35629 -558030 -970717 -846226 -854085 -1044705 -988626 -698118 -566993 -666989 -756133 -770598 -749286
35618 -749286 -472349 290456 1320165 2188917 2767289 3052974 2779907 1807698 723735
35609 723735 357925 678391 798911 192931 -678200 -1120793 -1033989 -698399 -243404 253334
35599 253334 499236 337239 185096 575886 1240901 1193243 -10560 -1505289 -2058366
35590 -2058366 -1561043 -1044586 -1246748 -1788840 -1997997 -1931186 -2078807 -2473259 -2706043 -2600245
$$ packed form
35657D52233j235168l80817K69878r4130m56280k2254M80340K77606p5151J75184
35647f08559N19387J11086n35093k28227P53225P77838n63096j524812p55639
35638b053890M99720K04374j236316j413381M43155K172046J738379j7856q94261
35629e58030m12687J24491p859j90620N6079K90508J31125r9996q9144j4465K1312
35618g49286K76937P62805J029709Q68752N78372K85685k73067r72209j083963
35609G23735l65810L20466J20520o05980q71131m42593Q6804L35590M54995M96738
35599B53334K45902j61997j52143L90790O65015m7658j203803j494729n53077
35590b058366M97323N16457k02162n42092k09157O6811j47621l94452k32784J05798
$$ plain form
35580 -2600245 -2288437 -1802683 -1153517 -610850 -282473 323165 1514691 2451476 2022750
35571 2022750 636458 -100850 321506 686989 182262 -281416 213513 855632 404721
35562 404721 -714309 -1113065 -649652 -386796 -605415 -419952 508414 1266957 1109703
35553 1109703 505768 276617 486148 651297 455306 -122509 -906571 -1482941 -1479359 -1076408
35543 -1076408 -859558 -1053071 -1256057 -972486 -88852 1056528 1725338 1214519 -168375
35534 -168375 -879358 287858 2519646 3710529 2878668 1098851 41631 344395 1407282
35525 1407282 2031914 1318290 -304873 -1155909 -315415 843458 469675 -800914 -596494
35516 -596494 1408189 2733999 1893615 656760 1032115 1985959 1287855 -777437 -1968342
$$ packed form
35580b600245L11808M85754O49166N42667L28377O05638J191526R36785m28726
35571B022750j386292p37308M22356L65483n04727m63678M94929O42119m50911
35562D04721j119030l98756M63413K62856k18619J85463R28366P58543j57254
35553A109703o03935k29151K09531J65149j95991n77815p84062n76370L582M02951
35543a076408K16850j93513k02986K83571Q83634J145380O68810n10819j382894
35534a68375p10983J167216K231788J190883q31861j779817j057220L02764J062887
35525A407282O24632p13624j623163q51036Q40494J158873l73783j270589K04420
35516e96494K004683J325810q40384j236855L75355R53844o98104k065292j190905
$$ plain form
35507 -1968342 -1598422 -1046784 -990875 -516734 704694 1496353 1156031 628041 819220
35498 819220 1173588 896577 415549 544740 1071037 1231612 982717 813612 729599 330077
35488 330077 -325965 -683188 -449117 83661 359864 -60839 -1144589 -2147696 -2174351
35479 -2174351 -1275017 -479706 -398192 -449664 -17236 361341 -184331 -1359576 -2032268 -1820317
35469 -1820317 -1398180 -1307056 -1362069 -1271795 -1024742 -586411 28534 346660 -80824 -722015
35459 -722015 -508479 603239 1517494 1736818 2070029 3009107 3547843 2616737 817121
35450 817121 -459358 -1003886 -1558657 -2011138 -1347962 478031 2006236 2055614 1024849
35441 1024849 -64650 -868164 -1434691 -1450274 -631934 510351 1036230 597074 -297415
$$ packed form
35507a968342L69920N51638N5909M74141J221428P91659l40322n27990J91179
35498H19220L54368k77011m81028J29191N26297J60575k48895j69105q4013l99522
35488C30077o56042l57223K34071N32778K76203m20703j083750j003107k6655
35479b174351Q99334P95311Q1514n1472M32428L78577n45672j175245o72692K11951
35469a820317M22137R1124n5013R0274K47053M38331O14945L18126m27484o41191
35459g22015K13536J111718R14255K19324L33211R39078N38736r31106j799616
35450H17121j276479n44528n54771m52481O63176J825993J528205M9378j030765
35441A024849j089499q03514n66527j5583Q18340J142285N25879m39156q94489
$$ plain form
35432 -297415 -884570 -793217 -310061 -117857 -467355 -687727 -121028 561865 20405 -1549665
35422 -1549665 -2147034 -643011 1454539 2021600 1086042 175819 -249549 -913522 -1684023
35413 -1684023 -1456006 -271577 335038 -278056 -793181 -101801 959848 1160683 872981
35404 872981 1135204 1666789 1370920 295942 -424010 -411679 -447176 -959370 -1358245 -1179473
35394 -1179473 -899205 -1171706 -1939877 -2654762 -2862197 -2375382 -1401657 -659972 -805744
35385 -805744 -1544538 -1870594 -1390592 -821450 -884044 -1301712 -1353771 -946683 -554199 -352212
35375 -352212 -20885 572613 956979 566388 -473397 -1313117 -1284794 -741288 -634487 -1124889
35365 -1124889 -1128123 212467 1999359 2427065 1138649 -238943 -246134 642151 1044565
$$ packed form
35432b97415n87155R1353M83156J92204l49498k20372N66699O82893n41460j570070
35422a549665n97369J504023K097550N67061r35558r10223m25368o63973p70501
35413a684023K28017J184429O06615o13094n15125O91380J061649K00835k87702
35404H72981K62223N31585k95869j074978p19952J2331l5497n12194l98875J78772
35394a179473K80268k72501p68171p14885k07435M86815R73725P41685j45772
35385h05744p38794l26056M80002N69142o2594m17668n2059M07088L92484K01987
35375c52212L31327N93498L84366l90591j039785q39720K8323N43506J06801m90402
35365a124889l234J340590J786892M27706j288416j377592p191Q88285M02414
$$ plain form
35356 1044565 701219 502384 869689 1186736 931317 492316 490441 870381 1121097 1065806
35346 1065806 979787 1030756 989934 609198 88647 -38315 477547 1237647 1599739 1374513
35336 1374513 903708 491794 111609 -234421 -275443 123070 645249 966861 1226830 1643084
35326 1643084 1917904 1558571 653286 -223837 -812085 -1287957 -1619549 -1495288 -1055117
35317 -1055117 -990541 -1557509 -2082299 -1917943 -1406390 -1338656 -1817805 -2245384 -2198480 -1744832
35307 -1744832 -1059973 -323734 102824 9094 -177920 133639 686777 526584 -606842
35298 -606842 -1715357 -1803022 -1132202 -640516 -548000 -316237 185049 341893 -168903 -718719
35288 -718719 -555651 158234 662430 671488 545261 497550 302481 -65530 -147981 228714
$$ packed form
35356A044565l43346j98835L67305L17047k55419m39001j875L79940K50716n5291
35346A065806q6019N0969m0822l80736n20551j26962N15862P60100L62092k25226
35336A374513m70805m11914l80185l46030m1022L98513N22179L21612K59969M16254
35326A643084K74820l59333r05285q77123n88248m75872l31592J24261M40171
35317a055117O4576n66968n24790J64356N11553O7734m79149m27579M6904M53648
35307a744832O84859P36239M26558r3730j87014L11559N53138j60193j133426
35298f06842j108515q7665O70820M91686R2516K31763N01286J56844n10796n49816
35288g18719J63068P13885N04196R058j26227m7711j95069l68011q2451L76695
$$ plain form
35278 228714 416338 -192637 -1071878 -1110236 -224691 378902 -215405 -1520188 -2479261 -2691091
35268 -2691091 -2222657 -930143 1058729 2588240 2388095 820606 -313735 1784 896108
35259 896108 1133882 793286 686720 858009 671689 55641 -364433 -358333 -430686 -865479
35249 -865479 -1172228 -872489 -312895 -197068 -564307 -723601 -218076 499593 585882 -90599
35239 -90599 -671822 -358675 470778 669661 -129862 -999756 -1067288 -744268 -953379 -1609673
35229 -1609673 -1787650 -1207170 -543060 -180275 309157 1118765 1639861 1533282 1471854 1969890
$$ packed form
35278B28714J87624o08975q79241l8358Q85545O03593n94307j304783r59073k11830
35268b691091M68434J292514J988872J529511k00145j567489j134341L15519Q94324
35259H96108K37774l40596j06566J71289j86320o16048m20074O100p2353m34793
35249h65479l06749K99739N59594J15827l67239j59294N05525P17669Q6289o76481
35239i0599n81223L13147Q29453J98883p99523q69894o7532L23020k09111o56294
35229a609673j77977N80480O64110L62785M89432Q09608N21096j06579o1428M98036
$$ [...]
##END NTUPLES=NMR SPECTRUM
##END=
