##TITLE=31Pdec_SR10_K2_2rd2O
 D2O, 24 sc
 3.9.2020
##JCAMPDX= 6.0         $$ Bruker NMR JCAMP-DX V2.0
##DATA TYPE= NMR SPECTRUM
##DATA CLASS= NTUPLES
##ORIGIN= UXNMR, Bruker Analytische Messtechnik GmbH
##OWNER= root
$$ XWIN-NMR		Version 3.5
$$ Thu Sep  3 12:10:40 2020 Russian Standard Time (UT+4h)  she@DPX200
##.OBSERVE FREQUENCY= 81.013821
##.OBSERVE NUCLEUS= ^31P
##.ACQUISITION MODE= SIMULTANEOUS
##.ACQUISITION SCHEME= undefined
##.AVERAGES= 24
##.DIGITISER RES= 17
##SPECTROMETER/DATA SYSTEM= spect
##.PULSE SEQUENCE= zgpg30
##.SOLVENT NAME= D2O
##.SHIFT REFERENCE= (INTERNAL, D2O, 0, 182.463)
##AUDIT TRAIL= $$ (NUMBER, WHEN, WHO, WHERE, WHAT)
$$ ##TITLE= Audit trail, XWIN-NMR		Version 3.5
$$ ##JCAMPDX= 5.01
$$ ##ORIGIN= Bruker BioSpin GmbH
$$ ##OWNER= she
$$ F:/spectra/data/she/nmr/P31/1/pdata/1/auditp.txt
$$ ##AUDIT TRAIL=  $$ (NUMBER, WHEN, WHO, WHERE, WHAT)
(   1,<2020-09-03 12:09:38.18 +0400>,<she>,<DPX200>,
      <created by zg, POWCHK disabled, PULCHK disabled
       configuration hash MD5:
       00 E9 B6 7A A2 85 ED C7 34 08 36 98 17 FE 4E 26
       data hash MD5: 32K
       D2 8E 48 00 F1 C1 B6 23 F4 53 8C 20 0B CA A5 CE>)
(   2,<2020-09-03 12:09:43.79 +0400>,<she>,<DPX200>,
      <Start of raw data processing
       efp BC_mod = 2 LB = 1 FT_mod = 6 PKNL = 1 PHC0 = -3132.477 PHC1 = 807.802 SI = 64K 
       data hash MD5: 64K
       7F 8B 8D 9A 18 AD 7B BE B2 85 01 01 69 C6 42 A6>)
(   3,<2020-09-03 12:09:56.78 +0400>,<she>,<DPX200>,
      <pk PHC0 = 59.60352 PHC1 = 0 
       data hash MD5: 64K
       9C 27 8D E4 02 B7 3E A1 EB 79 F7 38 62 5B F6 5C>)
(   4,<2020-09-03 12:10:00.70 +0400>,<she>,<DPX200>,
      <abs ABSG = 5 
       data hash MD5: 64K
       C2 16 7B 31 2C 41 6E E3 57 3E 2B B5 E4 CC 21 32>)
$$ ##END=
$$ 
$$ hash MD5
$$ 40 78 7D DB E6 86 CF C4 1D 62 B3 3B 18 81 87 EB
##$RELAX= 
##$RELAX= 
##$RELAX= 
##$RELAX= 
##$RELAX= 
##$RELAX= 
##$RELAX= 
##$RELAX= 
$$ Bruker specific parameters
$$ --------------------------
##$DU= <F:/spectra>
##$EXPNO= 1
##$NAME= <P31>
##$PROCNO= 1
##$TYPE= <nmr>
##$USER= <she>
##$AMP= (0..31)
100 100 100 100 100 100 100 100 100 100 100 100 100 100 100 100 100 100 
100 100 100 100 100 100 100 100 100 100 100 100 100 100 
##$AQSEQ= 0
##$AQ_mod= 1
##$AUNM= <au_zg>
##$AUTOPOS= <>
##$BF1= 81.014009
##$BF2= 200.13
##$BF3= 200.13
##$BF4= 200.13
##$BF5= 200.13
##$BF6= 200.13
##$BF7= 200.13
##$BF8= 200.13
##$BYTORDA= 1
##$CFDGTYP= 0
##$CFRGTYP= 5
##$CHEMSTR= <none>
##$CNST= (0..31)
1 1 145 1 1 1 1 1 1 1 1 1 1 1 1 1 1 1 1 1 1 1 1 1 1 1 1 1 1 1 1 1 
##$CPDPRG= <waltz16>
##$CPDPRG1= <>
##$CPDPRG2= <waltz16>
##$CPDPRG3= <>
##$CPDPRG4= <mlev>
##$CPDPRG5= <mlev>
##$CPDPRG6= <mlev>
##$CPDPRG7= <mlev>
##$CPDPRG8= <mlev>
##$CPDPRGB= <>
##$CPDPRGT= <>
##$D= (0..31)
0 1 0 0 0 0 0 0 0 0 0 0.03 2e-05 3e-06 0 0 0 0 0 0 0 0 0 0 0 0 0 0 0 0 
0 0 
##$DATE= 1599120577
##$DBL= (0..7)
120 120 120 11 120 120 24 19 
##$DBP= (0..7)
150 150 150 150 150 150 150 150 
##$DBP07= 0
##$DBPNAM0= <>
##$DBPNAM1= <>
##$DBPNAM2= <>
$$ [...]
##$SUBNAM3= <"">
##$SUBNAM4= <"">
##$SUBNAM5= <"">
##$SUBNAM6= <"">
##$SUBNAM7= <"">
##$SUBNAM8= <"">
##$SUBNAM9= <"">
##$SW= 369.568048894756
##$SWIBOX= (0..15)
0 1 3 0 0 0 0 0 0 0 0 0 0 0 0 0 
##$SW_h= 29940.119760479
##$TD= 32768
##$TD0= 1
##$TE= 0
##$TE2= 300
##$TE3= 300
##$TEG= 300
##$TL= (0..7)
0 120 53 12 22 120 120 120 
##$TP= (0..7)
150 150 150 150 150 150 150 150 
##$TP07= 0
##$TPNAME0= <>
##$TPNAME1= <>
##$TPNAME2= <>
##$TPNAME3= <>
##$TPNAME4= <>
##$TPNAME5= <>
##$TPNAME6= <>
##$TPNAME7= <>
##$TPOAL= (0..7)
0.5 0.5 0.5 0.5 0.5 0.5 0.5 0.5 
##$TPOFFS= (0..7)
0 0 0 0 0 0 0 0 
##$TUNHIN= 0
##$TUNHOUT= 0
##$TUNXOUT= 0
##$USERA1= <user>
##$USERA2= <user>
##$USERA3= <user>
##$USERA4= <user>
##$USERA5= <user>
##$V9= 5
##$VALIST= <valist>
##$VCLIST= <CCCCCCCCCCCCCCC>
##$VD= 0
##$VDLIST= <DDDDDDDDDDDDDDD>
##$VPLIST= <PPPPPPPPPPPPPPP>
##$VTLIST= <TTTTTTTTTTTTTTT>
##$WBST= 1024
##$WBSW= 4
##$XGAIN= (0..3)
0 0 0 0 
##$XL= 0
##$YL= 0
##$YMAX_a= 11478
##$YMIN_a= -5276
##$ZGOPTNS= <>
##$ZL1= 120
##$ZL2= 120
##$ZL3= 120
##$ZL4= 120
##$ABSF1= 182.463
##$ABSF2= -187.1042
##$ABSG= 5
##$ABSL= 3
##$ALPHA= 0
##$AQORDER= 0
##$ASSFAC= 0
##$ASSFACI= 0
##$ASSFACX= 0
##$ASSWID= 0
##$AUNMP= <proc_1d>
##$AZFE= 0.1
##$AZFW= 0.5
##$BCFW= 0
##$BC_mod= 2
##$BYTORDP= 0
##$COROFFS= 0
##$CY= -3
##$DATMOD= 1
##$DC= 0
##$DFILT= <>
##$DTYPP= 0
##$F1P= 0
##$F2P= 0
##$FCOR= 1
##$FTSIZE= 65536
##$FT_mod= 6
##$GAMMA= 0
##$GB= 0
##$INTBC= 1
##$INTSCL= 5.30512e-09
##$ISEN= 30
##$LB= 1
##$LEV0= 0
##$LPBIN= 0
##$MAXI= 10000
##$MC2= 0
##$MEAN= 0
##$ME_mod= 0
##$MI= 50
##$NCOEF= 0
##$NC_proc= -7
##$NLEV= 6
##$NOISF1= 182.463
##$NOISF2= 159.3651
##$NSP= 0
##$NTH_PI= 0
##$NZP= 0
##$OFFSET= 182.463
##$PC= 4
##$PHC0= -3072.874
##$PHC1= 807.802
##$PH_mod= 1
##$PKNL= yes
##$PPARMOD= 0
##$PSCAL= 0
##$PSIGN= 0
##$REVERSE= no
##$SF= 81.0140089999434
##$SI= 65536
##$SIGF1= 159.3651
##$SIGF2= -187.1042
##$SINO= 113.3802
##$SIOLD= 16384
##$SREGLST= <1H.CDCl3>
##$SSB= 0
##$STSI= 65536
##$STSR= 0
##$SW_p= 29940.119760479
##$SYMM= 0
##$S_DEV= 0
##$TDeff= 32768
##$TDoff= 0
##$TI= <>
##$TILT= no
##$TM1= 0
##$TM2= 0
##$TOPLEV= 0
##$USERP1= <user>
##$USERP2= <user>
##$USERP3= <user>
##$USERP4= <user>
##$USERP5= <user>
##$WDW= 1
##$XDIM= 65536
##$YMAX_p= 351416282
##$YMIN_p= -57124922
$$ End of Bruker specific parameters
$$ ---------------------------------
##NTUPLES= NMR SPECTRUM
##VAR_NAME=  FREQUENCY,     SPECTRUM/REAL,   SPECTRUM/IMAG
##SYMBOL=    X,             R,               I
##VAR_TYPE=  INDEPENDENT,   DEPENDENT,       DEPENDENT
##VAR_FORM=  AFFN,          ASDF,            ASDF
##VAR_DIM=   65536,         65536,           65536
##UNITS=     HZ,            ARBITRARY UNITS, ARBITRARY UNITS
##FACTOR=    0.456856943014862, 1,           1
##FIRST=     14782.0589164792, 0,            0
##LAST=      -15158.0608439998, 0,           0
##MIN=       -15158.0608439998, -57124922,   0
##MAX=       14782.0589164792, 351416282,    0
$$ Real data points
##PAGE= N=1
##DATA TABLE= (X++(R..R)), XYDATA
$$ [...]
41225F65314l265900l895930j768919N99580L67891j470607j885613p7159K167343
$$ 665314 -2600586 -6496516 -8265435 -7665855 -7297964 -8768571 -10654184 -10731343 -8564000
41216h564000L111560K233399q2494k238594j913123J178461L813530K719348
$$ -8564000 -5452440 -3219041 -3301535 -5540129 -7453252 -6274791 -2461261 258087
41208B58087p72150j795086J741621N835489M889104j311595o862161o308954
$$ 258087 -514063 -2309149 -567528 5267961 10157065 8845470 1983309 -4325645
41200d325645o71507M077934L767118j87031l515614l796061j741339O10248J681881
$$ -4325645 -4997152 -919218 2847900 2660869 -854745 -4650806 -6392145 -5781897 -4100016
41191d100016J250712O81122J497754K941975K316002j011660l697116k678847
$$ -4100016 -2849304 -2168182 -670428 2271547 4587549 3575889 -121227 -2800074
41183b800074J58402O01348j462909k005282M57244K211839K38727k766627k387550
$$ -2800074 -2641672 -2040324 -3503233 -5508515 -5051271 -2839432 -2600705 -5367332 -7754882
41174g754882Q37804K531855J244845Q5930J238844K645474J845017M1132l47469
$$ -7754882 -6917078 -4385223 -3140378 -3054448 -1815604 829870 2674887 2716019 2368550
41165B368550o2614j494040l728762k991526J367400M852508L590664n60577k965961
$$ 2368550 2305936 811896 -2916866 -5908392 -4540992 311516 3902180 3341603 375642
41156C75642k199215m36166N54080P91730L52315p10796j074248L93699K116814
$$ 375642 -1823573 -2259739 -1705659 -913929 -561614 -1272410 -2346658 -1952959 163855
41147A63855J583804n99509j521350o82724l51917j002880m72079J426846J811099
$$ 163855 1747659 1148150 -373200 -1055924 -1407841 -2410721 -2882800 -1455954 355145
41138C55145K7341l31953K565094M831314K559760j849884l284396j366133J41397
$$ 355145 382486 50533 2615627 7446941 10006701 8156817 4872421 3506288 3647685
41129C647685k98941p74666l03507j45909o56099m15431R53674J815535Q66102
$$ 3647685 3348744 2574078 2270571 2124662 1468563 1053132 2006806 3822341 4688443
41120D688443j371376l266370k925622N44223M870851N495165J140923l350275
$$ 4688443 3317067 50697 -2874925 -2330702 2540149 8035314 9176237 5825962
41112E825962k927463O85757J796518q24165k905892j730170M15322N42659j153059
$$ 5825962 2898499 3584256 5380774 4556609 1650717 -79453 335869 878528 -274531
41103b74531k755340k931675j118550J881850L371953J685226o78180j83198K040421
$$ -274531 -3029871 -5961546 -7080096 -5198246 -1826293 -141067 -819247 -1002445 1037976
41094A037976J830972r22410j864982M84974K314092J105822n30476j13227N08183
$$ 1037976 2868948 1946538 81556 566530 2880622 3986444 3455968 3342741 3850924
41085C850924n90397j388905J3107J189787m29303k414907j123861J879453K265823
$$ 3850924 3260527 1871622 1884729 3074516 2645213 230306 -893555 985898 3251721
41076C251721J46105m97013R79789N88864l415025o825462m770719J957563P750597
$$ 3251721 3397826 2900813 3880602 4469466 1054441 -5771021 -10541740 -8584177 -833580
41067h33580P932453K726897l239044m896191j448259K658827K699435o90699
$$ -833580 7098873 9825770 6586726 1690535 242276 2901103 5600538 4909839
41059D909839k680245q74621J806071J676578q64824k855008l143256k673936
$$ 4909839 2229594 1354973 3161044 4837622 3972798 1117790 -2025466 -4699402
41051d699402j525039J142866M000138L701254k02621l162891j231980K990807
$$ -4699402 -6224441 -5081575 -1081437 2619817 2417196 -745695 -1977675 1013132
41043A013132L604828j39027k928021j561247O15417j96237j971548o86555K595758
$$ 1013132 4617960 4478933 1550912 -10335 605082 408845 -1562703 -2249258 346500
41034C46500L368221Q76319j328677j589001j947283l162029k588085J183183
$$ 346500 3714721 4591040 3262363 1673362 -273921 -3435950 -6024035 -4840852
41026d840852N131093N442408K108165j657105k891362r79080K051672L035804
$$ -4840852 290241 5732649 7840814 6183709 3292347 2313267 4364939 7400743
41018G400743J091195j044752j142707j275656l872661n816835k168226M677996
$$ 7400743 8491938 7447186 6304479 5028823 1156162 -4660673 -6828899 -2150903
41010b150903O370235O12462m977654m002721J07305R33690j142471j537812L91099
$$ -2150903 4219332 4831794 -145860 -4148581 -4041276 -3107586 -4250057 -5787869 -5396770
41001e396770J762927J917160K206784K111462N71116o57431K74023J130974r92689
$$ -5396770 -3633843 -1716683 490101 2601563 3172679 2515248 2789271 3920245 2927556
40992B927556l979158l664941r40624j75614j530390q97583K537741M688202L373176
$$ 2927556 -1051602 -4716543 -5657167 -5832781 -7363171 -8260754 -5723013 -1034811 2338365
40983B338365J172907N4636j582882m357335n169844j999129K171296L282653
$$ 2338365 3511272 3565908 1983026 -2374309 -7544153 -9543282 -7371986 -4089333
40975d089333J472124k67993n85313l40673j93739J735J30289j31791n30169m69850
$$ -4089333 -2617209 -2885202 -3470515 -3811188 -4004927 -4003192 -3872903 -4004694 -4534863 -5004713
40965e004713K16823J051074J140940j6105j366156q65832J668819L560075K804450
$$ -5004713 -4787890 -3736816 -2595876 -2611981 -3978137 -4843969 -3175150 384925 3189375
40956C189375J115405J062483J715091L90005k358070l390401k238523j532338
$$ 3189375 4304780 5367263 7082354 7472359 5114289 1723888 -514635 -2046973
40948b046973j888742p39439K548458M536570K759454m97231j802425j185326
$$ -2046973 -3935715 -4675154 -2126696 2409874 5169328 4672097 2869672 1684346
40940A684346p51780j043789j270673j405459j708066j445368j03605J148538
$$ 1684346 932566 -111223 -1381896 -2787355 -4495421 -5940789 -6044394 -4895856
40932d895856R39694j56061l36094J153710L297172M206738K492288j139803l654251
$$ -4895856 -3956162 -4112223 -4448317 -3294607 2565 4209303 6701591 5561788 1907537
40923A907537k727724m4937O10712j255206k108131J84037L123119L330730R43540
$$ 1907537 -820187 -865124 -254412 -1509618 -3617749 -3433712 -310593 3020137 3963677
40914C963677j601934k892041k600919l58540K992233M555414K327143j853612
$$ 3963677 2361743 -530298 -3131217 -3489757 -497524 4057890 6385033 4531421
40906D531421m303780l735304j847416n01595k99K79724Q25153J288894M41523
$$ 4531421 227641 -3507663 -5355079 -5856674 -5856973 -5577249 -4752096 -3463202 -3021679
40897c021679k195925m503070l449467O62723L857313L533383J473823K76934
$$ -3021679 -5217604 -9720674 -13170141 -12507418 -8650105 -5116722 -3642899 -3365965
40889c365965m87222k077606k980411r18205K849298M558813K760275n87586l209276
$$ -3365965 -3853187 -5930793 -8911204 -9829409 -6980111 -2421298 338977 -248609 -3457885
40880c457885m056175k509526Q73883L111528J540433j889733k222805J773275
$$ -3457885 -7514060 -10023586 -9149703 -6038175 -4497742 -6387475 -8610280 -6837005
40872f837005N445354M261613n00480l933350l505697q06476J499659K230486
$$ -6837005 -1391651 2869962 2369482 -1563868 -5069565 -5876041 -4376382 -2145896
40864b145896J539314J60626p23893m2484J981811L570878K880117j08553l318135
$$ -2145896 -606582 -445956 -1169849 -1212333 769478 4340356 7220473 7111920 3793785
40855C793785m393250k860795m09642Q98834M35530q36644j394443k51030K208468
$$ 3793785 -599465 -3460260 -3869902 -2971068 -2535538 -3372182 -4766625 -5017655 -2809187
40846b809187M102700L519985P20630j757394j883157m30298L00111n31711j629242
$$ -2809187 1293513 4813498 5534128 3776734 1893577 1463279 1763390 1231679 -397563
40837c97563j535669j81379J472716K337068J717671n4497j373139q12399P76101
$$ -397563 -1933232 -2114611 -641895 1695173 3412844 3358347 1985208 1172809 1948910
40828A948910P62817j817946m338894l545470K5436K477601J712720N2139L79290
$$ 1948910 2711727 893781 -3445113 -6990583 -6965147 -4487546 -2774826 -2722687 -2343397
40819b343397J665693R67843j263993j498637R41920K112987n83199m061403m076652
$$ -2343397 -677704 290139 -973854 -2472491 -1530571 582416 -783 -4062186 -8138838
40810h138838j344815N23506J094937K566771M197232K504572k342496n214413
$$ -8138838 -9483653 -8960147 -7865210 -5298439 -1101207 1403365 -939131 -6153544
40802f153544l028315Q85006J890418K79415m92828P06235K153475K687326K651732
$$ -6153544 -9181859 -8296853 -6406435 -6127020 -6619848 -5913613 -3760138 -1072812 1578920
40793A578920K148770Q12495r18937k031133k183662j639365o27085K77911J85497
$$ 1578920 3727690 4540185 3621248 1590115 -593547 -2232912 -2859997 -2582086 -2396589
40784b396589o19766m19934J447687L046620K239117l65914k295523k232656q83974
$$ -2396589 -3016355 -3436289 -1988602 1058018 3297135 2931221 635698 -1596958 -2480932
40775b480932M09303P77141J81888m84577l35227J19370l56244j488939j673550
$$ -2480932 -2071629 -1294488 -1112600 -1597177 -1932404 -1813034 -2169278 -3658217 -5331767
40766e331767p21414k60999p90258q40216K8420K59291l87481K06416K332307
$$ -5331767 -6053181 -6314180 -7104438 -7944654 -7916234 -7656943 -8044424 -7838008 -5505701
40757e505701K696276l24112k924080j109859K835718L340691n88852m577771
$$ -5505701 -2809425 -3133537 -6057617 -7167476 -4331758 -991067 -1579919 -6157690
40749f157690n031972k413548R47679L013894K616978P10579J11238J529356J794244
$$ -6157690 -11189662 -13603210 -12655531 -9641637 -7024659 -6314080 -6202842 -4673486 -2879242
40740b879242r22656k868307j82143L956415L532273o02427k043552N94008J851753
$$ -2879242 -3801898 -6670205 -6852348 -2895933 636340 33913 -2009639 -1415631 436122
40731D36122p59226k678066p76173J086892q05862l269698j769139J876695K930053
$$ 436122 -323104 -3001170 -3777343 -2690451 -3496313 -6766011 -8535150 -6658455 -3728402
40722c728402J463746R56083J572291O32731j514181j680113L46902J240744j03644
$$ -3728402 -2264656 -1308573 263718 896449 -617732 -2297845 -1950943 -710199 -813843
40713h13843q30043O26610J579743n00366l579433l698006m86739K368915J841585
$$ -813843 -1643886 -1017276 562467 62101 -3517332 -7215338 -7702077 -5333162 -3491577
40704c491577r56018k371894m41970L134840N110936M031191R61310k320856m504992
$$ -3491577 -4447595 -6819489 -7261459 -4126619 984317 5015508 5976818 3655962 -849030
40695h49030m463700j771136J882530L493336J952032p95900k458957k696573
$$ -849030 -5312730 -7083866 -5201336 -1708000 244032 -551868 -3010825 -5707398
40687e707398j973180k17713J857645K037499o29883l603492l550488m64308K774351
$$ -5707398 -7680578 -7898291 -6040646 -4003147 -4633030 -8236522 -11787010 -12251318 -9476967
40678i476967M081079L536331K006077N23873L51861J531309K012794L76424j433201
$$ -9476967 -5395888 -1859557 146520 670393 1022254 2553563 4566357 4942781 3509580
40669C509580p35485J299479J117715j259310j755766J173626L495628J573000
$$ 3509580 2774095 4073574 5191289 3931979 2176213 3349839 6845467 8418467
40661H418467k125528k684626J31458K245540J583556R5316l58648m07645p97577
$$ 8418467 6292939 3608313 3739771 5985311 7568867 7664183 7305535 6897890 6100313
40652F100313q74750n48978r32459j800831j247153O78610J074268j004956k137862
$$ 6100313 5225563 4676585 3744126 1943295 696142 1374752 2449020 1444064 -693798
40643f93798p85J979351j77930l686405k552080K668097N064515J900153j531839
$$ -693798 -694583 1284768 1106838 -2579567 -5131647 -2463550 2600965 4501118 2969279
40634B969279p58032J257969O9827k794311l135239j111939P7451j41547k45071
$$ 2969279 2211247 3469216 3539043 744732 -2390507 -3502446 -3424995 -3566542 -3811613
40625c811613n81740j927610k004680J340358M914081L687202j149688l244807
$$ -3811613 -4393353 -6320963 -8325643 -6985285 -2071204 1615998 466310 -2778497
40617b778497k70391L353857L561134J329861q16214k210333k512587j084188
$$ -2778497 -3048888 304969 3866103 5195964 4379750 2169417 -343170 -1427358
40609a427358O67523K28406j687545j778459J50441P82148n62200o97992J085962
$$ -1427358 -759835 -531429 -2218974 -3997433 -3846992 -3064844 -3627044 -4325036 -3239074
40600c239074J311362q68964j338985J296594K087730j710140m614641j380552
$$ -3239074 -1927712 -2796676 -4135661 -2839067 -751337 -2461477 -7076118 -8456670
40592h456670L794082L615307p51230k290397K49172J576543j78258q28405J626544
$$ -8456670 -4662588 -1047281 -1798511 -4088908 -3839736 -2263193 -2441451 -3269856 -1643312
40583a643312L291267J106228k438586l871093l372195k293134j13685L195755
$$ -1643312 1647955 2754183 315597 -3555496 -6927691 -9220825 -9334510 -6138755
40575f138755M960857L110856k41115j213855R18267L177892K624130o44964l805742
$$ -6138755 -1177898 1932958 1691843 477988 1396255 4574147 7198277 6553313 2747571
40566B747571l985174j072729J986240K272277O8687j777437j263877Q92087K378594
$$ 2747571 -1237603 -2310332 -324092 1948185 2016872 239435 -1024442 -132355 2246239
40557B246239J512194j143900k937172j896153M39904P74618j011140j482101
$$ 2246239 3758433 2614533 -322639 -2218792 -1778888 -1004270 -2015410 -3497511
40549c497511P21480K424704J334286J67358J840920L897258K316417j641924
$$ -3497511 -2776031 -351327 982959 1150317 2991237 6888495 9204912 7562988
40541G562988l517304k795226k583458l244370k018095J164844K942707K098450
$$ 7562988 4045684 1250458 -1333000 -4577370 -6595465 -5430621 -2487914 -389464
40533c89464R65349O82013j62064j436950q83221J331513K136835Q15659R2435
$$ -389464 575885 1257898 1095834 -341116 -1224337 107176 2244011 3059670 3152105
40524C152105P11404j37781l152192m570903k026166J570688K709039J990073
$$ 3152105 3863509 3725728 573536 -3997367 -6023533 -4452845 -1743806 246267
40516B46267J435851O95220j117070k742970k622419j093264R18606K780712K870197
$$ 246267 1682118 2377338 1260268 -1482702 -4105121 -5198385 -4279779 -1499067 1371130
40507A371130P0492k641725q14976M011572N107544R29514j781406J163659M287149
$$ 1371130 1441622 -1200103 -2015079 1996493 7104037 8033551 6252145 7415804 11702953
40498A1702953J626435l175998l134352M89696J027318k184657l660297j661770
$$ 11702953 13329388 10153390 7019038 7508734 8536052 6351395 2691098 1029328
40490A029328j08058o30441k91744J703252J827572j269620l749659k397589J028538
$$ 1029328 921270 290829 -915 1702337 3529909 2260289 -1489370 -3886959 -2858421
40481b858421L249201L371042J755878j186595l437970k239360J671568L872702
$$ -2858421 390780 3761822 5517700 4331105 893135 -1346225 325343 4198045
40473D198045J991592j274762k398203j439665n76335p11370j273448j553410
$$ 4198045 6189637 4914875 2516672 1077007 500672 -210698 -1484146 -3037556
40465c037556j024685J73711O78985m22928j596323q95440M89206j23658k049551
$$ -3037556 -4062241 -3888530 -3209545 -3632473 -5228796 -6124236 -5635030 -5758688 -7808239
40456g808239j914691N72480J828456L44654r42830J12865J488639J085053K91378
$$ -7808239 -9722930 -9150450 -7321994 -6977340 -7920170 -7807305 -6318666 -5233613 -4942235
40447d942235P72063J191217J17520q71221o4230J131127Q65445J66833M67202
$$ -4942235 -4170172 -2978955 -2861435 -3732656 -3796886 -2665759 -1800314 -1633481 -1166279
40438a166279M62767j052326j766126O04806L362420K065998k367073m512638
$$ -1166279 -703512 -1755838 -3521964 -2917158 445262 2511260 144187 -4368451
40430d368451k224568Q76101J305817J01120o4591J055833J884310J553240L35462
$$ -4368451 -6593019 -5716918 -4411101 -4309981 -4374572 -3318739 -1434429 118811 454273
40421D54273j020148j449938l97176R42187O53288j049822j598576M10569K869114
$$ 454273 -565875 -2015813 -2412989 -1470802 -817514 -1867336 -3465912 -3055343 -186229
40412a86229K661080k00895k379227j380463J095372J143818j969001m121395
$$ -186229 2474851 2273956 -105271 -1485734 -390362 753456 -1215545 -5336940
40404e336940j643050L012540L972550J99209k839186j170235J992345J568136
$$ -5336940 -6979990 -3967450 5100 204309 -2634877 -3805112 -1812767 -244631
40396b44631j691433l013992j022249J227822J631214J067553L98385m52680m63241
$$ -244631 -1936064 -4950056 -5972305 -4744483 -3113269 -2045716 -1647331 -2100011 -2563252
40387b563252J489776L528241K630463l34643j647587q92809j187282k746440
$$ -2563252 -1073476 2454765 5085228 4750585 3102998 2210189 1022907 -1723533
40379a723533j921305J715861L346006Q64680j032475J146941L184794J96264
$$ -1723533 -3644838 -1928977 1417029 2281709 1249234 2396175 5580969 5777233
40371E777233m477437m172828M50085K906063J327630P4481J241647J724868j57118
$$ 5777233 1299796 -2873032 -2422947 483116 1810746 1885227 3126874 4851742 4694624
40362D694624j534614n27921N01344l39252j157839k69531N47740m80989j848952
$$ 4694624 3160010 2632089 3133433 2794181 1636342 1366811 1914551 1433562 -415390
40353d15390j614152n65940j59598q0041k1352r66391k473676j797867J676606
$$ -415390 -2029542 -2595482 -2755080 -2835121 -2856473 -3822864 -6296540 -8094407 -6417801
40344f417801M136236K489178q31701j438491Q83655K877955K749696J207070
$$ -6417801 -2281565 207613 -624088 -2062579 -1178924 1699031 4448727 5655797
40336E655797q18456k471918k417738o83539M29213l92185j314554p77062k60748
$$ 5655797 4837341 2365423 -52315 -735854 -306641 -698826 -2013380 -2790442 -3051190
40327c051190p22580L13068M019100O095115K705074k347121k805748j34691r93733
$$ -3051190 -3773770 -3460702 558398 6653513 9358587 7011466 4205718 4071027 3077294
40318C077294n527730o615661j773435K638749J904266j55241R39551K429519
$$ 3077294 -2450436 -9066097 -10839532 -8200783 -6296517 -6451758 -5512207 -3082688
40310c082688K4413l742673l329973R19684L808176L292434K050624K092456K497334
$$ -3082688 -3058275 -6800948 -10130921 -9211237 -5403061 -2110627 -60003 2032453 4529787
40301D529787K151338J090247n31404k071843j971602k03632M08532j878484m277706
$$ 4529787 6681125 7771372 7239968 5168125 3196523 2992891 3401423 1522939 -2754767
40292b754767l174707M16098K590640K212547J144851K55647q12603j049921M90144
$$ -2754767 -5929474 -5513376 -2922736 -710189 434662 690309 -122294 -1172215 -682071
40283f82071J504901q43301m506887m571285p37435K097818J406303J91116J087607
$$ -682071 822830 -20471 -4527358 -9098643 -9836078 -7738260 -6331957 -6140841 -5053234
40274e053234K126425R23254r21995p43385Q47489J639606J585054J895504K087374
$$ -5053234 -2926809 -2003555 -2925550 -3668935 -2821446 -1181840 403214 2298718 4386092
40265D386092Q63510j070534j665987n59362N68762M55634m20013q95463n23284
$$ 4386092 5249602 4179068 2513081 1953719 2522481 2978115 2558102 1662639 1139355
40256A139355O5681q5205p86486l09719K329634M979984M229774O2889l449744
$$ 1139355 1205036 1119831 333345 23626 2353260 7333244 11563018 11625907 8176163
40247H176163l055868j22469J587181L86200k256553l824807k893555k13538J677549
$$ 8176163 5120295 4997826 6585007 6971207 4714654 889847 -2003708 -2217246 -539697
40238e39697J031245p71567j096043j24585l60052j697221o31383L852637P182527
$$ -539697 491548 -280019 -1376062 -1500647 -1860699 -3557920 -4189303 -336666 6845861
40229F845861N042542m17867l818552l928578l710744m253584l285708N3653L128611
$$ 6845861 11888403 11470536 7651984 3723406 12662 -4240922 -7526630 -7472977 -4344366
40220d344366L732062K907081K374144J755225R1733j820077k405526j479131
$$ -4344366 -612304 2294777 4668921 6424146 6515879 4695802 2290276 811145
40212H11145j84558L32208m94678k218621l006387j217910J977914L328669J734956
$$ 811145 626587 958795 464117 -1754504 -4760891 -5978801 -4000887 -672218 1062738
40203A062738k43344l69306J65437k71217j35232K426611M738038K281943l739892
$$ 1062738 819394 450088 615525 344308 209076 2635687 7373725 9655668 5915776
40194E915776o433028k537277K681959K937761m24316j681072k7467N4652k850348
$$ 5915776 -517252 -3054529 -372570 2565191 2140875 459803 432336 486988 -2363360
40185b363360m290461j147209L251277M162869J999428M25296M62323K75603o53973
$$ -2363360 -6653821 -7801030 -4549753 -386884 1612544 2037840 2500163 2775766 2121793
40176B121793r14127k29435J27912p771M99150J388349Q38248j313183k585234
$$ 2121793 1207666 978231 1106143 1098372 1597522 2985871 3824119 2510936 -74298
40167g4298j254733J015509J283332r40461l229816l202626j240370L1566q91449
$$ -74298 -1329031 -313522 969810 29349 -3200467 -6403093 -7643463 -7611897 -8503346
40158h503346k108486o87706K825182M575143K897986Q50214J268207K188041
$$ -8503346 -10611832 -11299538 -8474356 -3899213 -1001227 -151013 1117194 3305235
40150C305235M71101k358601k280168M51771J499097o38285k516496j427476R09393
$$ 3305235 3776336 1417735 -862433 -410662 1088435 450150 -2066346 -3493822 -2584429
40141b584429J703146P29602p34008j678168j084234J244260L021665J883389
$$ -2584429 -881283 -151681 -885689 -2563857 -3648091 -2403831 617834 2501223
40133B501223l04851M39014L390469L398217p70114l918428k628701l13882n95420
$$ 2501223 2196372 2635386 6025855 9424072 8653958 4735530 2106829 1792947 1197527
40124A197527j183107R10981L001855J383751j533472j094625J425027J094745
$$ 1197527 14420 925401 3927256 5311007 3777535 2682910 4107937 5202682
40116E202682k088734l500417j799499j59594O6028P04370J600841K02626k840156
$$ 5202682 3113948 -386469 -2185968 -2345562 -2279534 -1575164 25677 228303 -2611853
40107b611853l407589n70984J789102J465743P71990J194967O00496j771659k638043
$$ -2611853 -6019442 -6590426 -4801324 -3335581 -2563591 -1368624 -768128 -2539787 -5177830
40098e177830j37041K533423K366711J348440K259097L398174J788741j287563
$$ -5177830 -5314871 -2781448 -414737 933703 3192800 6590974 8379715 7092152
40090G092152k422508j585493j171596j238030m1094J763631J720937n7325r85456
$$ 7092152 4669644 3084151 1912555 674525 633431 2397062 4117999 4060674 3075218
40081C075218l75660j81864j235706k047920j742537j151562n58890O52115J586716
$$ 3075218 2699558 2517694 1281988 -765932 -2508469 -3660031 -4218921 -3566806 -1980090
40072a980090L18053k194670k029629J923076N096388L018176k126867m179435
$$ -1980090 -1662037 -3856707 -5886336 -3963260 1133128 4151304 2024437 -2154998
40064b154998j422876J334194k23578l948308m414452l92830L586485L191497
$$ -2154998 -3577874 -2243680 -2467258 -6415566 -10830018 -11222848 -7636363 -4444866
40056d444866m66783k822993j727995O66132J662364J405915J414132J507089
$$ -4444866 -4911649 -7734642 -9462637 -8796505 -7134141 -5728226 -4314094 -2807005
40048b807005L90133j404649j709304j80997R01749L59951J14176J476079J923191
$$ -2807005 -2416872 -3821521 -5530825 -5711822 -4810073 -4450122 -4335946 -2859867 -936676
40039i36676r82802m116972k075866L954807O076685O69252n605772m942718O33785
$$ -936676 -1919478 -6036450 -8112316 -4157509 1919176 2588428 -3017344 -7960062 -7326277
40030g326277L200222J064263j93876J861940K858642K24074j755806N63614L472877
$$ -7326277 -4126055 -3061792 -3255668 -1393728 1464914 1688988 -66818 496796 3969673
40021C969673J887616k270514l428056j124219N58511M79675J177518K688197
$$ 3969673 5857289 3586775 158719 -965500 -406989 72686 1250204 3938401
40013C938401J717828k100505m373905k270835J351375K283219L87247j422130
$$ 3938401 5656229 3555724 -818181 -3089016 -1737641 545578 932825 -489305
40005d89305j422293l93390K1717r19244k179717j758877O21908K442203J682417
$$ -489305 -1911598 -2304988 -2283271 -3202515 -5382232 -7141109 -6519201 -4076998 -2394581
39996b394581k8504q1927O91219j44960j425226K75877L992059M278412n67379
$$ -2394581 -2423085 -2505012 -1813793 -1958753 -3383979 -3108102 883957 5162369 4594990
39987D594990m968245l585989J394317L888689K095329n69161j183030n93035
$$ 4594990 -373255 -3959244 -2564927 1323762 3419091 2849930 1666900 1073865
39979A073865j175899l472880n391410m269896j31238L525391L630021J574904
$$ 1073865 -102034 -3574914 -8966324 -13236220 -13367458 -9842067 -6212046 -4637142
39971d637142R00816J629062O42749k102827k387553J521244N252838M283867
$$ -4637142 -3736326 -2107264 -1464515 -3567342 -5954895 -4433651 819187 5103054
39963E103054K2202l119976l697491l000103j577939L21522R05664q53749k493854
$$ 5103054 5125256 2005280 -1692211 -4692314 -6270253 -5948731 -5043067 -5896816 -8390670
39954h390670j071148K247834L810386K666770R72914M7657p23246j393937r45602
$$ -8390670 -9461818 -7213984 -3403598 -736828 236086 283743 -439503 -1833440 -2779042
39945b779042M62286J101242L5912j579558j753414M65151L738356M753634J491755
$$ -2779042 -2316756 -1215514 -1179602 -2759160 -4512574 -4047423 -309067 4444567 5936322
39936E936322l164812l646606J028549N109592L558157j292188l728740k691605
$$ 5936322 2771510 -875096 153453 5263045 8821202 7529014 3800274 1108669
39928A108669j687206k365388k747988j495314J07471Q59536J227653J698882
$$ 1108669 -578537 -2943925 -5691913 -7187227 -7079756 -6220220 -4992567 -3293685
39920c293685J911654J703154J198874R0460j527383k315739j394917J37856J067957
$$ -3293685 -1382031 321123 1519997 1610457 83074 -2232665 -3627582 -3489726 -2421769
39911b421769J875916K765085K041882q21573k732310j045422J817512J733210
$$ -2421769 -545853 2219232 4261114 3439541 707231 -338191 1479321 3212531
39903C212531p31480j637200k32359N48025k64879l20039J309528K339309J197726
$$ 3212531 2481051 843851 611492 1159517 894638 574599 1884127 4223436 5421162
39894E421162p60302j833454j858743j062765K97223J071369M76040k92804j65757
$$ 5421162 4660860 2827406 968663 -94102 203121 1274490 1750530 1457726 1291969
39885A291969n11655k262137k845617k42048K165321L34755k766712j116405L750519
$$ 1291969 780314 -1481823 -4327440 -4569488 -2404167 -2069412 -4836124 -5952529 -2202010
39876b202010M102445j432830n140919k423108J404063M29863k964156l535928
$$ -2202010 1900435 467605 -4673314 -7096422 -5692359 -5262496 -8226652 -11762580
39868a1762580j479954J57419J455045L521236M410862K353511k95184r34150
$$ -11762580 -13242534 -13085115 -11630070 -8108834 -3697972 -1344461 -1639645 -2573795
39860b573795j010319j933953q13428M218392Q129991M960684k680247o524213
$$ -2573795 -3584114 -5518067 -6331495 -2113103 6016888 10977572 8297325 1773112
39852A773112l765229O09466J789519p6276k684587m106301k609096J588605M646836
$$ 1773112 -1992117 -1382651 406868 330592 -2353995 -6460296 -9069392 -7480787 -2833951
39843b833951L350702L69034Q08215M235434N239273J899503j619576j841044
$$ -2833951 516751 885785 1694000 5929434 11168707 13068210 11448634 9607590
39835I607590m18233j53239p38782n84501J90210N08231m4592j397538k872210
$$ 9607590 9189357 9036118 8297336 7712835 7903045 8411276 8366684 6969146 4096936
39826D096936k703181j03695K299905J142403k450165l730618j031230J926022
$$ 4096936 1393755 1290060 3589965 4732368 2282203 -1448415 -2479645 -553623
39818e53623J595606q05446j971182j036755N08000J467063J728688J619757J527529
$$ -553623 1041983 236537 -1734645 -2771400 -2263400 -796337 932351 2552108 4079637
39809D079637J274244j50504k821173m421407k911514j93240j3774k190284k563834
$$ 4079637 5353881 5203377 2382204 -2039203 -4950717 -5143957 -5157731 -7348015 -9911849
39800i911849M59605L139910K029469r64305j732959K95189K394288K855897K274763
$$ -9911849 -9452244 -6312334 -4282865 -5247170 -6980129 -6684940 -4290652 -1434755 840008
39791H40008J395861K05640q95520q73307N03403J848993J284989j459369m072435
$$ 840008 2235869 2441509 1545989 672682 1176085 3025078 4310067 2850698 -1221737
39782a221737l632444k99277K127707Q71541j836113j812284J011148K803671
$$ -1221737 -4854181 -5153458 -3025751 -2154210 -3990323 -5802607 -4791459 -1987788
39774a987788J849947N92244R14594J156392l69392k074242j770365l30923r1457
$$ -1987788 -137841 454403 1368997 2525389 2155997 81755 -1688610 -2019533 -2110990
39765b110990j111813j401151k1344J856971K503101J162690j307517k787701
$$ -2110990 -3222803 -4623954 -4645298 -2788327 -285226 877464 -430053 -3217754
39757c217754j811702O80052K689091L784912M313742K819217k087868p221212
$$ -3217754 -5029456 -4349404 -1660313 2124599 6438341 9257558 7169690 -51522
39749e1522o863799r46737L457410J604514k320733j887673K203586M329830K624959
$$ -51522 -6915321 -7862058 -4404648 -2800134 -5120867 -7008540 -4804954 -475124 2149835
39740B149835n0342j997320l792540m332073j591833K403307K919365j25269j405838
$$ 2149835 2099493 102173 -3690367 -8022440 -9614273 -7210966 -4291601 -4416870 -5822708
39731e822708J430547L750277J200539l401841m380285j358139J168147P90716
$$ -5822708 -4392161 -641884 558655 -2843186 -7223471 -8581610 -7413463 -6622747
39723f622747l40568K92115K155537L025664J848120l53797j644028j277980p37748
$$ -6622747 -6963315 -6671200 -4515663 -1489999 358121 4324 -1639704 -2917684 -3655432
39714c655432j604067k414444m9156M799772O701163K570974l135962m134093
$$ -3655432 -5259499 -7673943 -7723099 -2923327 3777836 6348810 3212848 -921245
39706i21245j157883k42893l054560m676301k011469J340840J415867J73367J274529
$$ -921245 -2079128 -2322021 -5376581 -10052882 -12064351 -10723511 -9307644 -9134277 -7859748
39697g859748L318305K475857l91728q53500J649203K962048J168311q25245r10665
$$ -7859748 -4541443 -2065586 -2457314 -3310814 -1661611 1300437 2468748 1643503 732838
39688G32838j007029k424408k583831L18433L098425K069330r35977j333183J169006
$$ 732838 -274191 -2698599 -5282430 -4963997 -1865572 203758 -732219 -2065402 -896396
39679h96396K681361J431239l13563n88414j76256k10656n95437j409607k907927
$$ -896396 1784965 3216204 2902641 2314227 2137971 1927315 1331878 -77729 -2985656
39670b985656l547935j097835L353223N464422L067092j052860l171823k928666
$$ -2985656 -6533591 -7631426 -4278203 1186219 4253311 3200451 28628 -2900038
39662b900038k017300j049553J07756P29665K99377l6485Q36451J800627J027834
$$ -2900038 -4917338 -5966891 -5859135 -5129470 -4830093 -4866578 -4030127 -2229500 -1201666
39653a201666r21135j514012K77975K500414K606008M59621j537247j271308L53077
$$ -1201666 -2122801 -3636813 -3358838 -858424 1747584 2207205 669958 -601350 -248273
39644b48273K84639k455042m613192k615432K122837M494488K388516r21950j885759
$$ -248273 36366 -2418676 -7031868 -9647300 -7524463 -3029975 -641459 -1563409 -3449168
39635c449168r88094k85359L06992J600342K347446J042670r39033j124002O5933
$$ -3449168 -4437262 -4722621 -4415629 -2815287 -467841 574829 -364204 -1488206 -1422273
39626a422273J78644r70297j115909K44501P22039q80642k184076p84226J718869
$$ -1422273 -1243629 -2213926 -3329835 -3085334 -2363295 -3243937 -5428013 -6212239 -4493370
39617d493370J598842j745439m652407l842333n91208J165649K33678l92298J824255
$$ -4493370 -2894528 -4639967 -9292374 -13134707 -13725915 -12560266 -12326588 -12718886 -10894631
39608a0894631M859166M756299J275036j813399j965779n57433K96936P59518
$$ -10894631 -6035465 -1279166 -4130 -1817529 -3783308 -4340741 -4043805 -3284287
39600c284287J670367K344722J824502N22834r89823k932305m409151k933844
$$ -3284287 -1613920 730802 2555304 3078138 2088315 -843990 -5253141 -8186985
39592h186985J656323M936411K886228k062025l566205K42996M329746L476037
$$ -8186985 -6530662 -1594251 1291977 -770048 -4336253 -4093257 236489 3712526
39584C712526j273892m383087k535328J918721L957105J532524k317035l311429
$$ 3712526 2438634 -1944453 -4479781 -2561060 1396045 2928569 611534 -2699895
39576b699895j092813J007809R89095L84886Q47970J471770J133948P87357J236871
$$ -2699895 -3792708 -2784899 -1795804 -1410918 -562948 908822 2042770 2830127 4066998
39567D066998J103001n28427j814299j246689n76376j469269j782553Q75591M068355
$$ 4066998 5169999 4641572 2827273 1580584 1004208 -465061 -2247614 -1372023 2696332
39558B696332L610023J57732k134288k391554l156049m292831k539572K159662
$$ 2696332 6306355 6464087 4329799 1938245 -1217804 -5510635 -8050207 -5890545
39550e890545N220373L814669K68493k241765l158858k579648k74709J962920
$$ -5890545 -670172 3144497 3412990 1171225 -1987633 -4567281 -4841990 -2879070
39542b879070J453024m93353L90566L870624M331707j29339l621469j435855K338482
$$ -2879070 -1426046 -1919399 -1528833 2341791 6673498 6544159 2922690 1486835 3825317
39533C825317J449132k659958l787446q49249J550082R32032o08661j295111j728109
$$ 3825317 5274449 2614491 -1172955 -2022204 -472122 459910 -148751 -1443862 -3171971
39524c171971j920602q48203O59297N88307l80289M73911K974890L693050J382643
$$ -3171971 -5092573 -5940776 -5281479 -4693172 -5073461 -4599550 -1624660 2068390 3451033
39515C451033r71232r16031K1527m87804j716707j451541M15290K019496K227548
$$ 3451033 2479801 1563770 1585297 1097493 -619214 -2070755 -1655465 364031 2591579
39506B591579J489430N63330k63577q35377q94827l86413K15517P8553j113725
$$ 2591579 4081009 4644339 4380762 3545385 2650558 2264145 2479662 2558215 1444490
39497A444490k426904k520331j440093n88643n48890k77771Q59823J840061J815538
$$ 1444490 -982414 -3502745 -4942838 -5531481 -6080371 -6358142 -5498319 -3658258 -1842720
39488a842720J509990J402551L60512k044534l662352k608991m84497m3757q90767
$$ -1842720 -332730 1069821 1430333 -614201 -4276553 -6885544 -7370041 -7413798 -8304565
39479h304565n01653J344605K410060J875547J141347P88743r0659j287969j302664
$$ -8304565 -8806218 -7461613 -5051553 -3176006 -2034659 -1245916 -1336575 -2624544 -3927208
39470c927208k68732p4744r55266r65895L89224J155667N94660N34008J541927
$$ -3927208 -4195940 -4270684 -5225950 -6191845 -5802621 -4646954 -4052294 -3518286 -1976359
39461a976359J228117j296218k567132K40773L946354L111325k012014n477912
$$ -1976359 -748242 -2044460 -4611592 -4370819 -424465 2686860 674846 -4803066
39453d803066l643919O44059K834325K256161R94675j62424j756376k930225j871351
$$ -4803066 -8446985 -7802926 -4968601 -2712440 -1717765 -1880189 -3636565 -6566790 -8438141
39444h438141Q25159J992359K88749j406873O4865L348422M322940J956562o16847
$$ -8438141 -7612982 -5620623 -5331874 -6738747 -6673882 -3325460 997480 2954042 2337195
39435B337195j131376j037664j910036k111715K30637L078040K787186k62905
$$ 2337195 1205819 168155 -1741881 -3853596 -3622959 -544919 2242267 1979362
39427A979362j802929K73435K930293K207432j575059m287285k835589J440913
$$ 1979362 176433 449868 3380161 5587593 4012534 -274751 -3110340 -1669427
39419a669427M149572K522836j419882l218029j542747L71231k32335j515032
$$ -1669427 2480145 5002981 3583099 365070 -1177677 -806446 -1038781 -2553813
39411b553813k17242K982640M449422K934693O36039p17817j564719k163801j716411
$$ -2553813 -2771055 211585 4661007 7595700 8231739 7513922 5949203 3785402 2068991
39402B068991m70710O677o06046r02258l60716q8527m31454k04896J065407K281672
$$ 2068991 1598281 1604958 998912 96654 -264062 -352589 -784043 -988939 76468 2358140
39392B358140K593642K039532L70588k340442m056790k674260L39469J311818
$$ 2358140 4951782 6991314 7361902 5021460 964670 -1709590 -1370121 -58303
39384e8303m41890k092503k075839j580656r70735Q38483K598378J205935k479584
$$ -58303 -500193 -2592696 -4668535 -6249191 -7219926 -6381443 -3783065 -2577130 -5056714
39375e056714l356049J31981L057552J827117k66220P94840K985385K525970O97496
$$ -5056714 -8412763 -8280782 -5223230 -3396113 -3662333 -2867493 117892 2643862 3341358
39366C341358Q27356J831483N97222j722169j608445N33385J551017J277445J506243
$$ 3341358 4168714 6000197 6597419 4875250 3266805 3800190 5351207 6628652 8134895
39357H134895R73998k489401o017092m521463Q57351L673602J889137J53637J368317
$$ 8134895 9108893 6619492 602400 -3919063 -3061712 611890 2501027 2654664 4022981
39348D022981K458108N74860k302291l507541l442513k765481n14475K558550
$$ 4022981 6481089 7055949 4753658 1246117 -2196396 -4961877 -5476352 -2917802
39340b917802L346196J529895P99285K406268K433872j276590m448545k884272
$$ -2917802 428394 1958289 2757574 5163842 7597714 6321124 1872579 -1011693
39332a011693O38151R06989j648668k587192o65243J684780L233104M258793L326708
$$ -1011693 -373542 533447 -1115221 -3702413 -4367656 -2682876 550228 4809021 8135729
39323H135729r99865n640613n266772K40389M832427L959190k34221k701305j604656
$$ 8135729 7135864 1495251 -3771521 -3531132 1301295 5260485 5026264 2324959 720303
39314G20303J011292K561823K122682L11532j592189k480845j924012k22968J523000
$$ 720303 1731595 4293418 6416100 6727632 5135443 2654598 730586 507618 2030618
39305B030618J635567n17612k849141k256177J235919L935284L183688N38750
$$ 2030618 3666185 3148573 299432 -1956745 -720826 3214458 6398146 6936896
39297F936896j123982j337002r06825M93328K809858L657219J137750k602728
$$ 6936896 5812914 4475912 3569087 4062415 6872273 10529492 11667242 9064514
39289I064514l708172j590374J175842K756053K873939J078598k175505l713209
$$ 9064514 5356342 3765968 4941810 7697863 10571802 11650400 9474895 5761686
39281E761686j035108K843527K347759k506618n404283k422143K763955M412680
$$ 5761686 4726578 7570105 9917864 7411246 2006963 -415180 2348775 6761455
39273F761455J852513j527454l483497l950088k757317K83269L405583L649670
$$ 6761455 8613968 7086514 3603017 -347071 -3104388 -2821119 584464 4234134
39265D234134K46519l982192n236857k554702J188913K411258R46065r00J517875
$$ 4234134 4480653 498461 -4738396 -7293098 -6104185 -3692927 -2746862 -2747762 -1229887
39256a229887L430739L059746J254846L83393o5974k018651l926690k099490K690193
$$ -1229887 2200852 5260598 6515444 6898837 6832863 4814212 887522 -1211968 1478225
39247A478225M805000J637374k460700k652270k13435N61559r73511k022601j402309
$$ 1478225 6283225 7920599 5459899 2807629 2594194 3155753 2182242 159641 -1242668
39238a242668p14390j100349j686499j261771K28754J765072K051285R32693J81266
$$ -1242668 -1957058 -3057407 -4743906 -6005677 -5776923 -4011851 -1960566 -1027873 -846607
39229h46607J286102K527273R55458k404023l024664K20146K821515J532302q81141
$$ -846607 439495 2966768 3922226 1518203 -1506461 -1286315 1535200 3067502 2186361
39220B186361j055517q04640k919517n015080l221823P13761K093992J149930
$$ 2186361 1130844 326204 -2593313 -7608393 -10830216 -10116455 -8022463 -6872533
39212f872533J902427M298791M212595J141944q30427m40553r30435k962582k623610
$$ -6872533 -4970106 -671315 3541280 4683224 3852797 3412244 2481809 -480773 -3104383
39203c104383J084777L265861J007099j712759j010694N59702n55024k142057
$$ -3104383 -2019606 1246255 2253354 540595 -470099 89603 -465421 -2607478
39195b607478n57984K205503J947405k60570l21995J362978J094307q35243p23581
$$ -2607478 -3165462 -959959 987446 726876 404881 1767859 2862166 2026923 1303342
39186A303342J133875L67545l477617n319213k583186R46755J639737J045214
$$ 1303342 2437217 2804762 -672855 -5992068 -8575254 -7628499 -5988762 -4943548
39178d943548J485181J506246n30288k320953j268076P81204O49304p31443l02042
$$ -4943548 -3458367 -1952121 -2482409 -4803362 -6071438 -5290234 -4640930 -5372373 -5674415
39169e674415J546786J909978P81037Q90526K340551J931098j354487m141296
$$ -5674415 -4127629 -2217651 -1436614 -546088 1794463 3725561 2371074 -1770222
39161a770222l429653m66676J742009K193096J557722M37104l19774M09908K023361
$$ -1770222 -5199875 -5666551 -3924542 -1731446 -173724 263380 -56394 353514 2376875
39152B376875K140382K98177n53542J391006L027342N52074m102050n254377j611018
$$ 2376875 4517257 4815434 4261892 5652898 8680240 9232314 5130264 -124113 -1735131
39143a735131J939893J555334o82334j064599K40984R06968P70554Q70996K07072
$$ -1735131 204762 1760096 1077762 13163 254147 1161115 1931669 2802665 3009737
39134C009737k500040m900746l206734J689681M448362K547853n14121q73832
$$ 3009737 509697 -4391049 -7597783 -5908102 -1459740 1088113 573992 -299840
39126b99840M34028K90087j449790k816834l454484m049121l518477n00289K968792
$$ -299840 134188 424275 -1025515 -3842349 -7296833 -11345954 -14864431 -15364720 -12395928
39117a2395928L109369J28239j275101J574620N299091M970611N27636l638947
$$ -12395928 -9286559 -9158320 -10433421 -8858801 -3559710 1410901 1938537 -1700410
39109a700410m280703k138255L84349K189478L507917M248563L447650M88909
$$ -1700410 -5981113 -8119368 -7735019 -5545541 -2037624 2210939 5658589 6147498
39101F147498l407861n444765l689755O51648M086699M243705J900540m69681
$$ 6147498 2739637 -2705128 -6394883 -5743235 -1656536 2587169 4487709 4018028
39093D018028j257251m39733J130619K159534J351019j316780l896245m104240
$$ 4018028 2760777 2321044 3451663 5611197 6962216 5645436 1749191 -2355049
39085b355049j788413R70751K259386K039881J318448N30473n98793k079074l284568
$$ -2355049 -4143462 -3172711 -913325 1126556 2445004 2975477 2376684 297610 -2986958
39076b986958l508814k444155k29072K392383L901027K809502o11763l724255
$$ -2986958 -6495772 -8939927 -9168999 -6776616 -2875589 -66087 -677850 -4402105
39068d402105l634876l12320L046587L385254J172225l17744R82245L527625M217132
$$ -4402105 -8036981 -8349301 -5302714 -1917460 -745235 -1062979 -80734 3446891 7664023
39059G664023K178055m36286j369755r06862q73139j729663k050190r71098L57500
$$ 7664023 9842078 9405792 8036037 7129175 6256036 4526373 2476183 1505085 1862585
39050A862585O19519L28156N73986Q35320k832j107379o79478N71500j28171k894717
$$ 1862585 2482104 2810260 3384246 4219566 4216734 3109355 2429877 3001377 2873206 -21511
39040b1511m017204j321664K179567K702941J287581J404366K753768J871152
$$ -21511 -4038715 -5360379 -3180812 -477871 809710 2214076 4967844 6838996
39032F838996j582634l754682k615160q60042j157193k126356j333960O81112
$$ 6838996 5256362 1501680 -1113480 -1973522 -3130715 -5257071 -6591031 -5909919
39024e909919J977032K427179K675606J891788n09361k461507j655180O48047
$$ -5909919 -3932887 -1505708 1169898 3061686 2552325 90818 -1564362 -916315
39016i16315J251542j54056q95779J33148R83910K23668q77791q60020m69296
$$ -916315 335227 181171 -714608 -581460 402450 626118 -251673 -1111693 -1580989
39007a580989j077363k307306k679889j592180M92700K954282N017724N503008
$$ -1580989 -2658352 -4965658 -7645547 -9237727 -8745027 -5790745 -773021 4729987
38999D729987L728107N93487j897150k315378r41450N53198N49365j044103k702237
$$ 4729987 8458094 9051581 7154431 4839053 3897603 4450801 5000166 3956063 1253826
38990A253826k874174j497471K45544J175808P49865p73442k026007j221101J632222
$$ 1253826 -1620348 -3117819 -2872275 -1696467 -946602 -1720044 -3746051 -4967152 -3334930
38981c334930L816859K703753q16323l221254k585907l49142J189746J370303
$$ -3334930 481929 3185682 2369359 -851895 -3437802 -3786944 -2597198 -1226895
38973a226895O98859m12142j467387j650646p60981L50825R01207R65916P63711
$$ -1226895 -528036 -940178 -2407565 -4058211 -4819192 -4468367 -3567160 -2601244 -1837533
38964a837533J96296l62081m721J142431J414883j89574k162567k194335k77898
$$ -1837533 -1641237 -2003318 -2008039 -865608 549275 359701 -1802866 -3997201 -4275099
38955d275099J307274J139784M76480J298879L331685M061537J859737j720335
$$ -4275099 -2967825 -1828041 -1351561 -52682 3279003 7340540 9200277 7479942
38947G479942l536341k451075l00775P97776P58967N53679M58058N28728J379489
$$ 7479942 3943601 1492526 1191751 1989527 2748494 3302173 3760231 4288959 5668448
38938E668448K687261K254704j028478m354408m167132j546279p48388k331489
$$ 5668448 8355709 10610413 9581935 5227527 1060395 -485884 -1234272 -3565761
38930c565761k135289J570014M530514K957438m93424j227391n5792j011816l720681
$$ -3565761 -5701050 -4131036 399478 3356916 2863492 1636101 1580309 568493 -3152188
38921c152188l689248j00217K244727K76633k695389k192553J123611L319650
$$ -3152188 -6841436 -6941653 -4696926 -4420293 -7115682 -9308235 -8184624 -4864974
38913d864974K842344J186716m10616j776016k091654l77207K237788L119106
$$ -4864974 -2022630 -835914 -1246530 -3022546 -5114200 -5491407 -3253619 -134513
38905a34513J531965l57919n12149M64940P20063p5063n15918M05551J962519
$$ -134513 1397452 1039533 527384 992324 1712387 1637324 1121406 1526957 3489476
38896C489476K558813J398659q13555k523905k628153j420037l31012m28063j058599
$$ 3489476 6048289 7446948 6633393 4109488 1481335 61298 -269714 -697777 -1756376
38887a756376m50124J917865L964463K902050j399218n696471o453453l241964
$$ -1756376 -2206500 -288635 3675828 6577878 5178660 -517811 -6971264 -10213228
38879a0213228J148949L472726K604931J2600j719971j093230J098484K774017
$$ -10213228 -9064279 -5591553 -2986622 -2974022 -4693993 -5787223 -4688739 -1914722
38871a914722K757960J620473N24260M5401J60174M24459K0933j266568j999408
$$ -1914722 843238 2463711 2987971 3033372 3193546 3618005 3638938 2372370 372962
38862C72962n06999K247755L081630P79682k023173k452584r90636J74531M15198
$$ 372962 -134037 2113718 5195348 5975030 3951857 1499273 508637 683168 1098366
38853A098366J69785q49281k306813j967091J004860L149498J067170k641881
$$ 1098366 1268151 418870 -1887943 -3855034 -2850174 299324 1366494 -1275387
38845a275387k568295R50916K060730j142446l388770q34688K771877K374651
$$ -1275387 -3843682 -2892766 -832036 -1974482 -5363252 -6197940 -3426063 -1051412
38837a051412o11042j594257l52385M2107n57441K23575J915483J659928l06175
$$ -1051412 -1662454 -3256711 -3609096 -3566989 -4124430 -3900855 -1985372 -325444 -631619
38828f31619p03073R75152J547493p0382q30039J033412K680186J114492k238320
$$ -631619 -1334692 -359540 1187953 1117571 287532 1320944 4001130 5115622 2877302
38819B877302l877553k811659o68557Q67073R97044o8254o61932P54579K726544
$$ 2877302 -1000251 -3811910 -4480467 -3613394 -2616350 -2684604 -3346536 -2591957 134587
38810A34587K161439m98124j010033J887352L492090K77714l734244k560032K388024
$$ 134587 2296026 1797902 787869 2675221 6167311 6445025 2710781 150749 2538773
38801B538773M255325R80460k377218j946223L0034L15879l26434j12348j52127
$$ 2538773 6794098 7774558 5397340 3451117 3481151 3797030 3470596 3358248 3206121
38792C206121j857069l270974j695735J711273L285687J797920p03725k114190
$$ 3206121 1349052 -1921922 -3617657 -1906384 1379303 3177223 2473498 359308
38784C59308j840527l5377K215322K701322O23140j393011m79067K013146K368304
$$ 359308 -1481219 -1516596 698726 3400048 4023188 2630177 2151110 4164256 6532560
38775F532560L48056o17032O00912Q80377j554381l619026k257262M48994P74716
$$ 6532560 6880616 6263584 6864496 7744873 6190492 2571466 314204 763198 1537914
38766A537914l89792P47566L926306M452007M90802l578181l210182J32506J684998
$$ 1537914 1148122 1895688 5821994 10274001 10764803 7186622 3976440 4108946 5793944
38757E793944R0317j889156k323594k212311k309207j181260J852485M246290
$$ 5793944 5884261 3995105 1671511 -540800 -2850007 -4031267 -2178782 2067508
38749B067508L271969L38479n61204J486549L112097J855911l17969n52557L23227
$$ 2067508 5339477 5677956 5116752 6603301 9715398 11571309 11253340 10700783 11024010
38740A1024010k88878j756372q51182K661098M690315K309252k200929m443384
$$ 11024010 10735132 8978760 8127578 10788676 15478991 17788243 15587314 11143930
38732A1143930k981167K83987L028236M123307L737024L282015M082118N231015
$$ 11143930 8162763 8446750 11474986 15598293 19335317 22617332 26699450 31930465
38724C1930465M566067K544596K447359N258683P521820O594927M588065L792589
$$ 31930465 36496532 39041128 41488487 46747170 54268990 60863917 65451982 69244571
38716F9244571J876666l575225q911606r021724o053077o350696r488235q478908
$$ 69244571 71121237 67546012 58634406 49612682 43559605 37208909 27720674 19241766
38708A9241766j980610K228164p27490n148918m178916j86680O25295j370279
$$ 19241766 17261156 19489320 18761830 13612912 9433996 9247316 9872611 8502332
38700H502332j542498O5887r9299j302283K17347L070453J709058l724056n974951
$$ 8502332 6959834 7025721 6926422 5624139 5841486 8911939 10620997 6896941 921990
38691I21990j377792M321814M197816o01521l635988j939635J724116L577891
$$ 921990 -455802 3866012 8063828 7462307 3826319 1886684 3610800 7188691
38683G188691K723703Q61043j37831l24070j319100l306473l699093q02281K693973
$$ 7188691 9912394 10773437 10635606 10311536 8992436 5685963 1986870 1184589 3878562
38674C878562L046725J067760L63314Q32767r30420m495926m615723O86765O169102
$$ 3878562 6925287 7993047 8356361 9189128 8258708 3762782 -852941 -166176 6002926
38665F002926O387619K549930n91056j091924r4744J103258J446683L31317m77941
$$ 6002926 12390545 14940475 14349419 13257495 13162751 14266009 15712692 16044009 15566068
38656A5566068J701804N476662O142761L516455L609158R209797J4727381J5201199
$$ 15566068 17267872 22744534 28887295 32403750 36012908 45222705 59950086 75151285
38648G5151285J4527249J8511962K5524503L1812297M0183740N2381133N6594661
$$ 75151285 89678534 108190496 133714999 165527296 205711036 258092169 314686830
38641C14686830L6729452m031024m1218737n5291104n0175037m1012030l3837582
$$ 314686830 351416282 347385258 306166521 250875417 200700380 159688350 125850768
38634A25850768k5652513j6688010j1576996j0886876j0295656p832339n663074
$$ 125850768 100198255 83510245 71933249 61046373 50750717 42918378 37255304
38627C7255304n067392m885856m600982m486620l350616l69821J742663j25051
$$ 37255304 32187912 27302056 22701074 18214454 14863838 14494017 16236680 16111629
38619A6111629l933028m721447j930405L27344J86433M5938J047013Q81561j167965
$$ 16111629 12178601 7457154 5526749 5854093 6040526 6086464 7133477 8015038 6847073
38610F847073j978963m0593J162501j335343m510790l476165J104464L942752
$$ 6847073 4868110 4827517 5990018 4654675 143885 -3332280 -2227816 1714936
38602A714936K579149K6623k69440J075389J115003j148658l636993l720023j100308
$$ 1714936 4294085 4320708 4051268 5126657 6241660 5093002 1456009 -2264014 -3364322
38593c364322J797386K323404N28471r07818L2180K198487K744204O21223k180556
$$ -3364322 -1566936 756468 1284939 377121 409301 2607788 5351992 5973215 3792659
38584C792659k819679o49528J895486J613472j817390m921003m234678p08711
$$ 3792659 972980 323452 2218938 3832410 2015020 -2905983 -7140661 -7849372
38576g849372J453387M64583q76253L08368K791343L670263K953448K757777L101130
$$ -7849372 -6395985 -5931402 -6807655 -6499287 -3707944 -37681 2915767 5673544 8774674
38567H774674J939550p12559k132097j187262k24000j151643k271682j112131
$$ 8774674 10714224 10001665 7869568 6682306 6458306 5306663 3034981 1922850
38559A922850J543030K845866J817571k28944k220589l810591l921960j527789
$$ 1922850 3465880 6311746 8129317 7900373 5679784 1869193 -2052767 -3580556
38551c580556J922580L339803J989888N58665J212823K486864J609801j389383
$$ -3580556 -1657976 1681827 3671715 4230380 5443203 7930067 9539868 8150485
38543H150485l680575l209927p93639J274160J564042K99390j358386k346519
$$ 8150485 4469910 1259983 466344 1740504 3304546 3603936 2245550 -100969
38535a00969k251320j214321L25098J646744K020346J515948J082484J100362
$$ -100969 -2352289 -3566610 -3241512 -1594768 425578 1941526 3024010 4124372
38527D124372N78378r46575j551731P86189M219802M195920m71113n359742n912559
$$ 4124372 4702750 3756175 2204444 2990633 7210435 11406355 10935242 5575500 -337059
38518c37059k787953K86020J652458J904900R16463j596785l499908k204389P56805
$$ -337059 -3125012 -2838992 -1186534 718366 1634829 38044 -3461864 -5666253 -4909448
38509d909448R93345k096615l731270n83366M097118M965798J933753k40939J196459
$$ -4909448 -3916103 -6012718 -9743988 -10327354 -6230236 -1264438 669315 428376 1624835
38500A624835L695844L376050L6353l014332l084406p78912J383258J981734J510137
$$ 1624835 5320679 8696729 8733082 5718750 2634344 1855432 3238690 5220424 6730561
38491F730561O92442n02439j768672k034729j237423r47367j660906j223872J688803
$$ 6730561 7423003 6920564 5151892 3117163 1879740 932373 -728533 -1952405 -263602
38482b63602M223285K847596q85229k161856k07820Q48401q92638k030214O3308
$$ -263602 3959683 6807279 5922050 3760194 3552374 4400775 3508137 1477923 1541231
38473A541231K656848K217629j72344j443558j496762j842798j922046o95253
$$ 1541231 4198079 6415708 6243364 4799806 3303044 1460246 -461800 -1157053
38465a157053K47713q39960k095797p97939J729234K177361P93917L22855N88943
$$ -1157053 -909340 -1749300 -3845097 -4643036 -2913802 -736441 57476 380331 969274
38456I69274p76609k759001j668705K071031L359515J86389l067630k380666L02945
$$ 969274 192665 -2566336 -4235041 -2164010 1195505 1381894 -1685736 -4066402 -3763457
38447c763457J079200l0023m96983J77079O40080N45891M27573R0527o52328r45351
$$ -3763457 -2684257 -2714280 -3211263 -3034184 -2394104 -1848213 -1420640 -1330113 -1982441 -2927792
38437b927792l60038P1547k03106j16728O59295M40718j352553k100839K91157
$$ -2927792 -3287830 -3216283 -3419389 -3536117 -2876822 -2436104 -3788657 -5889496 -5598339
38428e598339L433902L365037K97249j741450o37307J364922J256286r68724k825164
$$ -5598339 -2164437 1200600 1497849 -243601 -880908 484014 1740300 771576 -2053588
38419b053588k286328K20578K161400J485796p52865j394373N61685K300795J147601
$$ -2053588 -4339916 -4119338 -1957938 -472142 -1225007 -2619380 -2057695 243100 1390701
38410A390701j519542k360743p65980J016414J658701J980025K471102K110176
$$ 1390701 -128841 -2489584 -3255564 -2239150 -580449 1399576 3870678 5980854
38402E980854K98236j794187k558064j557941M60374K172250K231938L37543k083522
$$ 5980854 6279090 4484903 1926839 368898 829272 3001522 5233460 5571003 3487481
38393C487481l139949k478154j238271k06791R00377K206546K799118J720107
$$ 3487481 347532 -2130622 -3368893 -3575684 -2675307 -468761 2330357 4050464
38385D050464n33891k059132j403092O32900J584001J52182k194076l209419k568766
$$ 4050464 3516573 1457441 54349 687249 2271250 2423432 229356 -2980063 -5548829
38376e548829j311831K52824J969597K216605r8224k468199j416771J787802K379326
$$ -5548829 -6860660 -6607836 -4638239 -2421634 -2519858 -4988057 -6404828 -4617026 -2237700
38367b237700k53110j233080J627144L811401J624088j565158j381383q2212k103744
$$ -2237700 -2490810 -3723890 -2096746 1714655 3338743 1773585 392202 309990 -1793754
38358a793754n574965n182198j249760J158863R55527J594505L325984K384041
$$ -1793754 -7368719 -12550917 -13800677 -12641814 -11686287 -10091782 -6765798 -4381757
38350d381757j286115k774593m79300J194107j64274q99387J483562L312742J308790
$$ -4381757 -5667872 -8442465 -8921765 -7727658 -7891932 -8791319 -7307757 -3995015 -2686225
38341b686225j277011j64277K629960K370798o68498k418149j765648j025700
$$ -2686225 -3963236 -4127513 -1497553 873245 204747 -2213402 -3979050 -5004750
38333e004750j007992k72077J236298J708827O09844n70939o21766K77663J192992
$$ -5004750 -6012742 -6284819 -5048521 -3339694 -2729850 -3300789 -3922555 -3644892 -2451900
38324b451900Q74489j145609k868313j459269K184958L500457P06821k305572
$$ -2451900 -1577411 -2723020 -5591333 -7050602 -4865644 -1365187 -658366 -2963938
38316b963938k031149l67992j21603M18656L578301O389843M430407n95729l063165
$$ -2963938 -4995087 -5363079 -5484682 -5066026 -1487725 4902118 9332525 8736796 5673631
38307E673631j898754r87280j900327k207784j039386n65600j306395j219247
$$ 5673631 3774877 2787597 887270 -1320514 -2359900 -2925500 -4231895 -5451142
38299e451142j93174l79893j336320j47730K589013K523852j002519k898805k14284
$$ -5451142 -5644316 -6024209 -7360529 -7508259 -4919246 -2395394 -3397913 -6296718 -6511002
38290f511002L197918L047081P89808k09042l34147j337865j952992m38592J259233
$$ -6511002 -3313084 -266003 523805 314763 -19384 -1357249 -3310241 -3748833 -2489600
38281b489600M07462j528377j134908J289103K531918J837032J375985J849023
$$ -2489600 -2082138 -3610515 -4745423 -3456320 -924402 912630 2288615 4137638
38273D137638J446861n68661k336896k026726N6034K140896K300336l28580m043371
$$ 4137638 5584499 5015838 2678942 652216 708250 2849146 5149482 4820902 777531
38264G77531n267673k622682P38214R52908j450040k623858o90658K560145M682396
$$ 777531 -4490142 -7112824 -6374610 -5421702 -6871742 -9495600 -10186258 -7626113 -2943717
38255b943717M799363L114759M97282j483593j890881j529702j358749q19192
$$ -2943717 1855646 4970405 5467687 3984094 2093213 563511 -795238 -1614430
38247a614430N20452J112925l45364k180642k068514q55368p97991j167250L82678
$$ -1614430 -1093978 18947 -326417 -2507059 -4575573 -5430941 -6228932 -7396182 -7013504
38238g013504K707065K108586j248264k658063J1768L063947K981192J456874
$$ -7013504 -4306439 -2197853 -3446117 -6104180 -6092412 -3028465 -47273 1409601
38230A409601J444952J911627L81880j986140k137989l74019K80460p28982q22848
$$ 1409601 2854553 4766180 5148060 3161920 1023931 649912 930372 201390 -621458
38221f21458J067507K655288J894935k83202j826967k046958j314792q2419Q18959
$$ -621458 446049 3101337 4996272 4713070 2886103 839145 -475647 -558066 260893
38212B60893L99572r98475j668164q61287M4651l59420j410133j572852q28008
$$ 260893 660465 -338010 -2006174 -2867461 -2822810 -3182230 -4592363 -6165215 -6993223
38203f993223l50195k49401O75136K621640L676779K036136j363695l596737l089770
$$ -6993223 -7343418 -7592819 -6917683 -4296043 -619264 1416872 53177 -3543560 -6633330
38194f633330j214929j99269l45467j83093J114011K597402K890449J684506l77135
$$ -6633330 -7848259 -8047528 -8392995 -8576088 -7462077 -4864675 -1974226 -289720 -666855
38185f66855k356937l108760j749990J039326K974963K571735J046465N43085
$$ -666855 -3023792 -6132552 -7882542 -6843216 -3868253 -1296518 -250053 293032
38177B93032R58216L39591j579044k544656j432839m09522j381981k171207N03274
$$ 293032 1251248 1590839 11795 -2532861 -3965700 -4375222 -5757203 -7928410 -7425136
38168g425136M937131N424767M12997m249444k966051J773320L211004Q3933k405438
$$ -7425136 -2488005 2936762 3349759 -899685 -3865736 -2092416 1118588 1202521 -1202917
38159a202917j133039Q00536J42793j188174j90301J547110O11338k098928k676667
$$ -1202917 -2335956 -1535420 -1392627 -2580801 -2771102 -1223992 -612654 -2711582 -5388249
38150e388249n73762Q94601K43590l28612O67165J793776J891679J742942J254977
$$ -5388249 -5962011 -5067410 -4823820 -5152432 -4485267 -2691491 -799812 943130 2198107
38141B198107j153548m491159m439560N20178N600726N712865K163715l53804
$$ 2198107 1044559 -3446600 -7886160 -7365982 -1765256 3947609 6111324 5757520
38133E757520q63396j642058k515375j046440J845398J790822k296094n795788
$$ 5757520 4894124 3252066 736691 -309749 1535649 3326471 1030377 -4765411
38125d765411m578234j80536L122536L476202J769096m80687j503108M8562K723589
$$ -4765411 -9343645 -9524181 -6401645 -2925443 -1156347 -1637034 -3140142 -3091580 -367991
38116c67991K834511n29466l412935k298064R25293K238037J489312J444872K471065
$$ -367991 2466520 1937054 -1475881 -3773945 -2848652 -610615 878697 2323569 4794634
38107D794634K357875P62459l31489n69735j614841l172946k718432j90071J070251
$$ 4794634 7152509 7914968 7583479 7013744 5398903 2225957 -492475 -682546 387705
38098C87705l21194j404730o3258J236678m6779j722746n28460K037594K105864
$$ 387705 66511 -1338219 -1401477 -164799 -211578 -1934324 -2462784 -425190 1680674
38089A680674k4183o32066Q38249J018924j145976k362979p50645P86029n36636
$$ 1680674 1656491 1024425 1862674 2881598 1735622 -627357 -1378002 -591973 -1128609
38080a128609k666277k028448R94186L140537L123046K295975J598156P88233
$$ -1128609 -3794886 -5823334 -4829148 -1688611 1434435 3730410 5328566 6116799
38072F116799J39968K32965L09648q16944k379269k393683p65368M34998n3167
$$ 6116799 6256767 6489732 6799380 5982436 3603167 1209484 444116 879114 825947
38063H25947j293872j880194j329769K12388J847585J657163j257184m438560
$$ 825947 -467925 -2348119 -3677888 -3465500 -1617915 39248 -1217936 -5656496
38055e656496m270844r13721J618277J127447J36165J603058M417010N400810
$$ -5656496 -9927340 -10841061 -9222784 -8095337 -7959172 -6356114 -1939104 3461706
38047C461706L775860J232597q41024j803634r37673J156218J608604j317603
$$ 3461706 7237566 8470163 7629139 5825505 4887832 6044050 7652654 6335051
38039F335051m803187m657951j320033R29504O21256P76567K942316L878784P58930
$$ 6335051 1531864 -3126087 -4446120 -3516616 -2895360 -2118793 823523 4702307 5461237
38030E461237l709438m769089k062800R01602K324371L408909M520687L821355
$$ 5461237 1751799 -3017290 -5080090 -4178488 -1854117 1554792 6075479 9896834
38022I896834O27098k699749l621983k382101r18296k66943j64760j41354O0953
$$ 9896834 10523932 7824183 4202200 1820099 901803 634860 470100 328746 389699
38013C89699M97703P96008N26796P3731K18643O47002J26313j368469k143616
$$ 389699 887402 1683410 2210206 2283937 2502580 3149582 3275895 1907426 -236190
38004b36190j227928N8253J14291o02562o68718j08520n5402o43512r32603n92651
$$ -236190 -1464118 -1405865 -1291574 -1894136 -2562854 -2671374 -2726776 -3370288 -4302891 -4895542
37994d895542m6065Q32685K431099L802233L181741N74599j756083k087016j189144
$$ -4895542 -4941607 -4108922 -1677823 2124410 5306151 5880750 4124667 2037651 848507
37985H48507o91750p11627j94781J152582K356163K352669J095373l49304p52954
$$ 848507 156757 -554870 -749651 402931 2759094 5111763 6207136 5857832 5104878
37976E104878k48247n81222k707829m470299k740022J668893L778109P96135l570137
$$ 5104878 4856631 4275409 1567580 -2902719 -5642741 -3973848 -195739 600396 -2969741
37967b969741l809618l6473K691284J893983N47798J551403L114065K127498n51747
$$ -2969741 -6779359 -6815832 -4124548 -2230565 -1682767 -131364 2982701 5110199 4558452
37958D558452j506875j46200P40987l29315j496654j018700l725p8805m88591
$$ 4558452 3051577 2905377 3646364 3317049 1820395 801695 797970 719165 230574
37949B30574K68030J316803N41682j670122k492377q04374J171756J304658L83935
$$ 230574 498604 1815407 2357089 686967 -1805410 -2609784 -1438028 -133370 250565
37940B50565j1650m95306k398982m487607l844727J0070M056353N153415K901895
$$ 250565 238915 -256391 -2655373 -7142980 -10987707 -10977637 -6921284 -1767869 1134026
37931A134026q72192l723351l651341o23291K563962K893239R94070K63647J723137
$$ 1134026 261834 -3461517 -7112858 -7736149 -5172187 -2278948 -1284878 -1021231 701906
37922G01906K510900N92525k009094k628061j861280j535055j227296Q8852R92979
$$ 701906 3212806 3805331 1796237 -831824 -2693104 -4228159 -5455455 -5366603 -4373624
37913d373624j77650j555836r4165L210964M492970K961130J446760J050214j30984
$$ -4373624 -4551274 -6107110 -6201275 -2990311 1502659 4463789 5910549 6960763 6829779
37904F829779k189869k193480L58421J402975j488022m573300l117072J734463
$$ 6829779 4639910 2446430 2804851 4207826 2719804 -1853496 -4970568 -3236105
37896c236105M909113M205500J607042o66869j950370j937170q94197n30604j964906
$$ -3236105 1673008 5878508 7485550 6818681 4868311 2931141 2036944 1506340 -458566
37887d58566l412110k376867N70245K712031L079639K752414K028560L12115j513270
$$ -458566 -3870676 -6247543 -5677298 -2965267 114372 2866786 4895346 5207461 3694191
37878C694191j646315m20307m6620j058791j550481k97807J629877K626795J936648
$$ 3694191 2047876 1627569 1580949 522158 -1028323 -1326130 303747 2930542 4867190
37869D867190m73164l241805l478651q0585L479968L021258k78980j700849m95197
$$ 4867190 4394026 1152221 -2326430 -2407015 1072953 4094211 3815231 2114382 1619185
37860A619185m94672k618639k681979R93288L560047J174043k365221j506885
$$ 1619185 1124513 -1494126 -4176105 -3182817 377230 1551273 -813948 -2320833
37852b320833K348649L717548J870639O70689J099852K72959k252558l168843
$$ -2320833 27816 3745364 5616003 6286692 7386544 7659503 5406945 2238102
37844B238102j373800K8692p48035j311988K19946J803583J239786l0685L71089
$$ 2238102 864302 892994 144959 -1167029 -947083 856500 2096286 2065601 2436690
37835B436690J850675K179174P65502j458179l520783m084056j834923J937327
$$ 2436690 4287365 6466539 7232041 5773862 2253079 -1830977 -3665900 -1728573
37827a728573L445775J202013j496842j144348J145830J994360Q15340m95254
$$ -1728573 1717202 2919215 1422373 278025 1423855 3418215 4233555 3738301
37819C738301j152656j540952j127181L81964J079357n08086k062233n73705K299268
$$ 3738301 2585645 1044693 -82488 299476 1378833 870747 -1191486 -1765191 534077
37810E34077K424083J34259j33440K535512L737470J117373j748288j428414J81245
$$ 534077 2958160 3092419 2958979 5494491 9231961 10349334 8601046 7172632 7353877
37801G353877R1035o79002k69853m48394l073682n144850k893229J194990J369809
$$ 7353877 7444912 6765910 6496057 6047663 2973981 -2170869 -5064098 -3869108 -2499299
37792b499299k253556l627926j79839L572477L313307O02763j062657j318226
$$ -2499299 -4752855 -8380781 -8560620 -4988143 -1674836 -1072073 -2134730 -3452956
37784c452956j151256J30317K776141M315085K746688j34415j531224j645189
$$ -3452956 -4604212 -4473895 -1697754 2617331 5364019 5229604 3698380 2053191
37776B053191j962984j799257m5877J503875N57220j181238j24726L138148M236066
$$ 2053191 90207 -1709050 -1754927 -251052 306168 -875070 -999796 2138352 6374418
37767F374418J665431j221739j792104j547464k243230k422394n16365J524398
$$ 6374418 8039849 6818110 5026006 3478542 1235312 -1187082 -1703447 -179049
37759a79049Q88157j656299l023614k307145j095392o7588J710664M063699M972295
$$ -179049 709108 -947191 -3970805 -6277950 -7373342 -7440930 -5730266 -1666567 3305728
37750C305728L313231M83188j439143j792416j124427k20933J13015n54241j602343
$$ 3305728 6618959 7102147 5663004 3870588 2746161 2525228 2638243 2084002 481659
37741D81659k008917j817403j721970j223968Q03418L197833K735917j022139
$$ 481659 -1527258 -3344661 -5066631 -6290599 -5487181 -2289348 446569 -575570
37733e75570l567353j072186L474229L688079j041656m278124j686474K867712
$$ -575570 -4142923 -5215109 -1740880 1947199 905543 -3372581 -5059055 -2191343
37725b191343L340872K44622r84914J388199L301731J594222j576954k555013
$$ -2191343 1149529 1394151 409237 1797436 5099167 6693389 5116435 2561422
37717B561422j099482O29232J588087J967824J345007q18618l368979m087039
$$ 2561422 1461940 2091172 3679259 5647083 6992090 6173472 2804493 -1282546
37709a282546k226864O14849K222442J896118R86395J273702K485003K178773
$$ -1282546 -3509410 -2894561 -672119 1223999 2210394 3484096 5969099 8147872
37701H147872p25706l401737k500901N82075J223585j459322l184982j330634
$$ 8147872 7422166 4020429 1519528 2101603 3325188 1865866 -1319116 -2649750
37693b649750J132733J040768K16851J532459L311093K310287k85920r08843J40215
$$ -2649750 -1517017 -476249 -259398 1273061 4584154 6894441 6608521 5699678 5839893
37684E839893k71512j975574j919919k74464m49240k647904k998445k21991K146125
$$ 5839893 5568381 3592807 1672888 1398424 949184 -1698720 -4697165 -4919156 -2773031
37675b773031J795843Q54506J142685J170498J93751L94902K213720K244027r01568
$$ -2773031 -977188 -122682 1020003 2190501 2384252 2779154 4992874 7236901 6335333
37666F335333l190766j477933J097441M36166j747490j529133J96862j45617k161943
$$ 6335333 3144567 1666634 2764075 3200241 1452751 -76382 120480 -25137 -2187080
37657b187080k660182j620180j283377p19058K665037O860061O699904J933026
$$ -2187080 -4847262 -6467442 -7750819 -8469877 -5804840 1055221 7755125 9688151
37649I688151j902911j644730k11773p89568k369124k985388k862205k202120
$$ 9688151 7785240 6140510 5928737 5139169 2770045 -215343 -3077548 -5279668
37641e279668J0727K789405K764935m41768k343772q3091K784812J640151j993975
$$ -5279668 -5268941 -2479536 285399 -156369 -2500141 -2583232 201580 1841731 -152244
37632a52244k796010N70838M156322M507433K161523o03814k464440k950653j944372
$$ -152244 -2948254 -2377416 1778906 6286339 8447862 7844048 5379608 2428955 484583
37623D84583j88291R38117P60458j29715o91741l85990M84112J097032J074830
$$ 484583 296292 1234409 1994867 1865152 1173411 787421 1271533 2368565 3443395
37614C443395R62449J017572P8898k671689n072493l632828J446423N442431M808903
$$ 3443395 4405844 5423416 5502314 2830625 -2241868 -5874696 -4428273 1014158 5823061
37605E823061J507953l03176L9584m2479j602368k653677j575112L31777O80922
$$ 5823061 7331014 7027838 7067422 7024943 5422575 2768898 1193786 1525563 2206485
37596B206485q08163k007340j074970J195670K273095J128711m33306m52334M24567
$$ 2206485 1398322 -609018 -1683988 -488318 1784777 2913488 2480182 2027848 2452415
37587B452415M98528J57716Q87899J868209Q41492j669899k715888j962616k144345
$$ 2452415 2950943 3108659 3996558 5864767 6706259 5036360 2320472 357856 -1786489
37578a786489l274796j382905M256571P625963M118705j904745l233307l82778
$$ -1786489 -5061285 -6444190 -2187619 5438344 9557049 7652304 4418997 4036219
37570D036219L93403k205440l179764o43060Q38830j505093l554181j200246K654731
$$ 4036219 4429622 2224182 -955582 -1598642 -759812 -2264905 -5819086 -7019332 -4364601
37561d364601K659411p29037k401702l26350K338040K471351O80732p60884j059792
$$ -4364601 -1705190 -2434227 -4835929 -5162279 -2824239 -352888 327844 -433040 -1492832
37552a492832r83572j145891j073279J50108K238560L082640J050002k078228
$$ -1492832 -2476404 -3622295 -4695574 -4545466 -2306906 775734 1825736 -252492
37544b52492k495860N81457L557775L491087J932510J483841J082316j673384
$$ -252492 -2748352 -2166895 1390880 4881967 6814477 8298318 9380634 7707250
37536G707250n098407m825737n99756K711418K024778j3589K6408J133611O35918
$$ 7707250 2608843 -2216894 -2816650 -105232 1919546 1905957 1932365 3065976 3701894
37527C701894o84380k41800J236399O02770k098702l220364j392200K37650p19289
$$ 3701894 3017514 2775714 4012113 4614883 2516181 -704183 -2096383 -1858733 -2578022
37518b578022k022450p34430J981959L149228K709230K350021J428758j563963
$$ -2578022 -4600472 -5334902 -3352943 -203715 2505515 4855536 6284294 4720331
37510D720331m325410k501147L197188O364071L336746j766853l132411q81680
$$ 4720331 394921 -2106226 1090962 7455033 10791779 9024926 5892515 5010835
37502E010835Q76658Q62928J063899J669676K63140l463927n965879m309108J2839
$$ 5010835 5887493 6750421 7814320 9483996 9747136 6283209 317330 -3991778 -3978939
37493c978939L161394L259950J462955q2387k60553M10132N72587k88542j099228
$$ -3978939 -817545 2442405 3905360 3822973 3562420 3972552 4545139 4256597 3157369
37484C157369p87474j49387q10980k462353k753119m76000K456021L140699J111278
$$ 3157369 2369895 2220508 1409528 -1052825 -3805944 -4281944 -1825923 1314776 2426054
37475B426054j240831j529317p8419N74735j091474l373910l195125n5260L082980
$$ 2426054 1185223 -344094 -422513 152222 -939252 -4313162 -7508287 -7563547 -4480567
37466d480567L276749Q08881j686146k154843n55556J404931J399341j135894
$$ -4480567 -1203818 -394937 -2081083 -4235926 -4791482 -3386551 -1987210 -3123104
37458c123104l267776j417258L253000N266595K313264j144754o07747J650121
$$ -3123104 -6390880 -7808138 -4555138 711457 3024721 1879967 1272220 2922341
37450B922341Q42613k164907k608851j34900R39746n51206r58895R70587J441929
$$ 2922341 3764954 1600047 -1008804 -1143704 -203958 -755164 -1714059 -743472 698457
37441F98457j602401m632267m397767k627489j522540N91613M875012P483434
$$ 698457 -903944 -5536211 -9933978 -12561467 -14084007 -13492394 -8617382 -1133948
37433a133948M639668p21607k617343m44657J250026K39564j041197l75253J291189
$$ -1133948 3505720 2784113 166770 -277887 972139 1211703 170506 -204747 1086442
37424A086442K201389J859069M68846j176939j500304j24295P77518l63863j332939
$$ 1086442 3287831 5146900 5615746 4438807 2938503 2814208 3591726 3227863 1894924
37415A894924O27948L613946L155977r27414m069628l701477k281326k488243
$$ 1894924 2522872 6136818 9292795 8365381 4295753 594276 -1687050 -4175293
37407d175293l191395k047769P42672L153730L799492K397020l79116k565825
$$ -4175293 -7366688 -9414457 -8671785 -5518055 -1718563 678457 299341 -2266484
37399b266484k308781l27556Q92154P50717J045167K342645K631123P44409j399702
$$ -2266484 -4575265 -4902821 -4010667 -3259950 -2214783 127862 2758985 3503394 2103692
37390B103692j490642K39866K041056K739319J809823o04673k741752k423279
$$ 2103692 613050 852916 2893972 5633291 7443114 6838441 4096689 1673410
37382A673410j95847R95679J15783p53461n37010j013277k665967k503134Q70985
$$ 1673410 1477563 2473242 2589025 1835564 1298554 285277 -2380690 -4883824 -4012839
37373d012839L440655J231353k959892l151336R57321L871559K733338O44838
$$ -4012839 -572184 659169 -2300723 -5452059 -4494738 -623179 2110159 2754997
37365B754997O09256J004109n97105k833995k859699r30439L09876o4474m84012
$$ 2754997 3364253 4368362 3771257 937262 -1922437 -2852876 -2543000 -2607474 -3091486
37356c091486J91734J074009Q36909l57426j052159k97128R89760Q79212r19934
$$ -3091486 -2899752 -1825743 -988834 -1346260 -2398419 -2695547 -1705787 -826575 -1746509
37347a746509k002666j63476L127469M090626J580002j551215k643789k331715
$$ -1746509 -3749175 -3912651 -785182 3305444 4885446 3334231 690442 -1641273
37339a641273k116125j398491O59894K296730J344466p71974o62143J638949K460000
$$ -1641273 -3757398 -5155889 -4495995 -2199265 -854799 -1626773 -2288916 -649967 1810033
37330A810033K45681k050104j768332l35183Q6092O09663K865326M567829K247103
$$ 1810033 2055714 5610 -1762722 -2097905 -2011813 -1402150 1463176 6031005 8278108
37321H278108k560633m482394j941189Q33422N88648n64088J85933J366074L91525
$$ 8278108 5717475 1235081 -706108 127314 715962 151874 337807 1703881 2095406
37312B095406j397962j059913O79406R31494P8993Q71144K580045J326116k937670
$$ 2095406 697444 -362469 316937 1248431 1327424 2198568 4778613 6104729 3167059
37303C167059m947121j812065K309224K329215o44317k064438r97855q6105j85867
$$ 3167059 -1780062 -3592127 -1282903 1046312 401995 -1662443 -2660298 -2746403 -2932270
37294b932270L70899J626024J345200r70118k924104k929325k031917j065049
$$ -2932270 -2561371 -935347 409853 -560265 -3484369 -6413694 -8445611 -9510660
37286i510660R74974M072657N372692K613752k164573m644838l213116j15319
$$ -9510660 -8535686 -4463029 909663 3523415 1358842 -3285996 -6499112 -6614431
37278f614431J808848J865569J170917R57794J341028J087124r97112l776471
$$ -6614431 -4805583 -2940014 -1769097 -811303 529725 1616849 619737 -3156734
37270c156734l878837L64090N644901O501165J812037l487274m274822j196774
$$ -3156734 -7035571 -6671481 -1026580 5474585 7286622 3799348 -475474 -1672248
37262a672248R92995p452j591848n73074K335265L812198K371550l24391k118170
$$ -1672248 -679253 -686705 -2278553 -2851627 -516362 3295836 5667386 5342995 3224825
37253C224825k481067j811240l91072J059245J152852m57770j913976j208559
$$ 3224825 743758 -1067482 -1458554 -399309 753543 295773 -1618203 -2826762
37245b826762Q90634J580383j26148j926104j435731N30226J367758N33258m711
$$ -2826762 -1936128 -355745 -481893 -2407997 -3843728 -3313502 -1945744 -1412486 -1417197
37236a417197P45228R50077j132673l821465l676477k76769K730846K155337p06122
$$ -1417197 -671969 278108 -854565 -4676030 -8352507 -8629276 -5898430 -3743093 -4449215
37227d449215j982612l35486J648490J311628m60872o65328J431351K915402J002659
$$ -4449215 -6431827 -6767313 -5118823 -3807195 -4268067 -4933395 -3502044 -586642 416017
37218D16017k732141l665308j54142L570049K498691k201554m350174j178724
$$ 416017 -2316124 -5981432 -6135574 -2565525 -66834 -2268388 -6618562 -7797286
37210g797286K849863K577353o07775j538241P11081K053292L08678j669943r84494
$$ -7797286 -4947423 -2370070 -2977845 -4516086 -3805005 -1751713 -1443035 -3112978 -4097472
37201d097472J082472J904777J495447J185032P60329l90033j155995m52647M41427
$$ -4097472 -3015000 -1110223 385224 1570256 2330585 1940552 784557 331910 773337
37192G73337J794n46876O15488K061594J077636j271504j284107R25539P45972
$$ 773337 775131 228255 843743 2905337 3982973 2711469 1427362 2352901 3098873
37183C098873l455242o557352l704158K157548M162802J234056j055667O45621
$$ 3098873 -356369 -6913721 -10617879 -8460331 -4297529 -3063473 -4119140 -3473519
37175c473519K767401J124379k135607j817099K145612M318490J581010k769479
$$ -3473519 -706118 418261 -1717346 -3534445 -1388833 2929657 4510667 1741188
37167A741188m152693k577389r33325j3829J336635K471782J245125j788886k980552
$$ 1741188 -2411505 -4988894 -5922219 -5936048 -4599413 -2127631 -882506 -2671392 -5651944
37158e651944o02931K418928K425862k72484k289374j395325J583348M046565
$$ -5651944 -6254875 -3835947 -1410085 -1682569 -3971943 -5367268 -3783920 262645
37150B62645L697634L94159l203205l988906k035710l24991l38132j93134J681489
$$ 262645 3960279 4354438 1151233 -2837673 -4873383 -5198374 -5536506 -5729640 -4048151
37141d048151L616429L487415K179547J716285J700300L98617j927281l531225
$$ -4048151 -431722 3055693 5235240 6951525 8651825 9050442 7123161 3591936
37133C591936m014927m042886l207776q72499J663731K490289J899908J483353
$$ 3591936 -422991 -4465877 -7673653 -8546152 -6882421 -4392132 -2492224 -1008871
37125a008871J379053Q89599N32303O97048j14520k401535k976820M90997M025784
$$ -1008871 370182 1259781 1792084 2489132 2374612 -26923 -3003743 -2512746 1513038
37116A513038J961268l895281o007276k197345J740016J838276J274564K960931
$$ 1513038 3474306 -420975 -6428251 -8625596 -6885580 -5047304 -3772740 -811809
37108h11809L661085K10258l889627l650677l88541J149042L14463j81032r622
$$ -811809 2849276 3059534 -830093 -4480770 -4869311 -3720269 -3405806 -3586838 -3596460
37099c596460p49450j452584r135K201267J954656l54545j485643p53190q8762
$$ -3596460 -4345910 -5798494 -5807629 -3606362 -1651706 -2006251 -3491894 -4245084 -4333846
37090d333846M25965K135443L448499J298624k742662l281169P24082L737942
$$ -4333846 -3907881 -1772438 1676061 2974685 232023 -3049146 -2325064 1412878
37082A412878J716291k124512k491901N40166K591837J316678j372082k457628
$$ 1412878 3129169 1004657 -1487244 -947078 1644759 2961437 1589355 -868273
37074h68273j045821J261043K177620J136827j59476j98409K57458j965o7220
$$ -868273 -1914094 -653051 1524569 2661396 2501920 2303511 2560969 2559004 2491784
37065B491784J312530K540805J103918j919253k988023j541418l16549j57734
$$ 2491784 3804314 6345119 7449037 5529784 2541761 1000343 683794 526060
37057E26060R43722K894161K541303n99575k518984j162410q1186k264023m529545
$$ 526060 1469782 4363943 6905246 6305671 3786687 2624277 2543091 279068 -4250477
37048d250477k380741K717352N507626M228874J404432r68782k725860l166467
$$ -4250477 -6631218 -3913866 1593760 5822634 7227066 6258284 3532424 365957
37040C65957j567469L93220L08031j212059j598762n06504L33890P90745K251458
$$ 365957 -1201512 -808292 -500261 -1712320 -3311082 -3817586 -3483696 -2692951 -441493
37031d41493M081479L810583J151272j469453k723541l447029l533625j453852
$$ -441493 3639986 7450569 8601841 7132388 4408847 961818 -2571807 -4025659
37023d025659K032098L278739P71901k219222k214480k41384N56789l8825K00398
$$ -4025659 -1993561 1285178 2057079 -162143 -2376623 -2618007 -2061218 -2100043 -1899645
37014a899645J525684J649214j47556j316483J21615K136486J381300j585151
$$ -1899645 -373961 1275253 1127697 -188786 -67171 2069315 3450615 1865464
37006A865464k618496q7246K284801Q62067k065023j705462J248626J262867k760189
$$ 1865464 -753032 -840278 1444523 2306590 241567 -1463895 -215269 1047598 -1712591
36997a712591m655503m64087M574469L570758j424650k808941Q67296L730286
$$ -1712591 -6368094 -6832181 -2257712 1313046 -111604 -2920545 -2053249 1677037
36989A677037K616971R47082J287836R98274j807878l928198k643196p74640j682843
$$ 1677037 4294008 5241090 6528926 7527200 5719322 1791124 -852072 -1626712 -3309555
36980c309555l096952r14770L582516N399162L119476j13212j936423k737450
$$ -3309555 -6406507 -7321277 -3738761 1660401 4779877 4666665 2730242 -7208
36972g208k750842j331573O36768J086167q570n67070J83557R00375R40151J359826
$$ -7208 -2758050 -4089623 -3452855 -2366688 -2375258 -2942328 -2758771 -1858396 -918245 441581
36962D41581K666273L776542L543048J544943k234902o366218p424861l537007
$$ 441581 3107854 6884396 10427444 11972387 9737485 3371267 -4053594 -7590601
36954g590601J896125L426508N87700j898068j263187J41881M2099J50347K277476
$$ -7590601 -5694476 -2267968 -1680268 -3578336 -4841523 -4699642 -4657543 -4507196 -2229720
36945b229720M207181K908168n79070k793983k641769j548195m30495N06365L40602
$$ -2229720 1977461 4885629 4306559 1512576 -1129193 -2677388 -3107883 -2601518 -2260916
36936b260916j176452j960810k90041K011640K236937J421199K504734M626206
$$ -2260916 -3437368 -5398178 -5688219 -3676579 -1439642 -18443 2486291 7112497
36928G112497L678750j088326n313176n549150l218092r76522J159552L778083
$$ 7112497 10791247 9702921 4389745 -1159405 -4377497 -5354019 -4194467 -416384
36920d16384N330511M244326J572664r06508l162989n156710m946335j544916
$$ -416384 4914127 9158453 10731117 9824609 6661620 1504910 -3441425 -4986341
36912d986341K186260K751249Q06700m18465k22630m30278j210304q37858N11207
$$ -4986341 -2800081 -48832 757868 339403 116773 -313505 -1523809 -2361667 -1850460
36903a850460N95047q62292j624842j066984j107175k007477j215327J764295
$$ -1850460 -1255413 -2117705 -3742547 -4809531 -5916706 -7924183 -9139510 -7375215
36895g375215L192919N79233k858039k599403O52459K499313J370335j40360K25806
$$ -7375215 -4182296 -3603063 -6461102 -9060505 -8408046 -5908733 -4538398 -4678758 -4452952
36886d452952J847886L081560L003413J368144r09743j517948P27956L476272
$$ -4452952 -2605066 476494 3479907 4848051 3938308 2420360 3148316 6624588
36878F624588L368268O39279j455027j596500j694249k830783l194814j405763
$$ 6624588 9992856 10632135 9177108 7580608 5886359 3055576 -139238 -1545001
36870a545001Q26325J239086K66938j46194M03118P25718J69809p24435j195553
$$ -1545001 -718676 520410 787348 641154 1044272 1769990 1939799 1215364 19811
36861A9811p91357O12856K456806L499922K796625N25662k150739l661438k967237
$$ 19811 -771546 -158690 2298116 5798038 8594663 9120325 6969586 3308148 340911
36852C40911r20509p1871j594516l022764j246311K570603L907278J117422k334656
$$ 340911 -579598 -651469 -2245985 -5268749 -6515060 -3944457 -37179 1080243 -1254413
36843a254413k993265j674929p44764o2366J568783L065379K428093L08717p82769
$$ -1254413 -4247678 -5922607 -6667371 -6729737 -5160954 -2095575 332518 641235 -141534
36834a41534k76268J21733l66818n30642M91055J779502J962434P58899q39145
$$ -141534 -417802 -296069 -662887 -1193529 -702474 1077028 3039462 3798361 2959216
36825B959216j179770N80061K800065K466966p36885l163106j928850Q82762J460093
$$ 2959216 1779446 2359507 5159572 7626538 6889653 3726547 1797697 2680459 4140552
36816D140552P4209L8722J742774J965220n08173k711652k330956j140828j532215
$$ 4140552 4214761 4253483 5996257 7961477 7453304 4741652 2410696 1269868 -262347
36807b62347k480145j583272P79303K014842J140859j85048k25677P97928J324074
$$ -262347 -2742492 -4325764 -3546461 -1531619 -390760 -575808 -801485 -3557 1320517
36798A320517L29814j454951k158426r63623O95306J073465O46590J038018J868802
$$ 1320517 1650331 195380 -1963046 -2926669 -2231363 -1157898 -511308 526710 2395512
36789B395512J078665j376579k786296j631156J08482Q043j438219k090646j148751
$$ 2395512 3474177 2097598 -688698 -2319854 -2211372 -2203329 -3641548 -5732194 -6880945
36780f880945O51284K332000K794506J229572j174215j648316M25968K019552
$$ -6880945 -6229661 -3897661 -1103155 126417 -1047798 -2696114 -2270146 -250594
36772b50594O05381k047414k639705j222614l06314k54581Q66845K967991L059579
$$ -250594 354787 -1692627 -4332332 -5554946 -5861260 -6115841 -5248996 -2281005 778574
36763G78574j55056l547272l255818L86944L304426K418721j274552m192912l884272
$$ 778574 623518 -2923754 -6179572 -5792628 -2488202 -69481 -1344033 -5536945 -9421217
36754i421217j030326J870133L168500L000261K169031J288771R15341J088082
$$ -9421217 -10451543 -8581410 -5412910 -2412649 -243618 1045153 1960494 3048576
36746C048576O29870j366185l155011j868438J767347L214763M65048k475173
$$ 3048576 3678446 2312261 -842750 -2711188 -943841 2270922 2735970 260797
36738B60797j419569J463143J216713j613439j553108K971879O617370M590056
$$ 260797 -1158772 304371 1521084 -92355 -1645463 1326416 7943786 12533842
36730A2533842j029672m816364m702798k539467l62221J002232R70692m88987
$$ 12533842 11504170 6687806 1985008 -554459 -916680 85552 1056244 567257
36722E67257j981930j884881k07645J725556K831698K670213J191424q88646k198568
$$ 567257 -1414673 -3299554 -3507199 -1781643 1050055 3720268 4911692 4023046 1824478
36713A824478k125014j466612r67736q1039J856550L909135M110436J656705k016211
$$ 1824478 -300536 -1767148 -2734884 -2815923 -959373 2949762 7060198 8716903 6700692
36704F700692m365487m009524k119945j146521j693446j610965P02795L343513
$$ 6700692 2335205 -1674319 -3794264 -4940785 -6634231 -8245196 -7542401 -4198888
36696d198888L317564J016310m70848j66466j55938j440235k238977j462360o01699
$$ -4198888 -881324 134986 -335862 -502328 -658266 -2098501 -4337478 -5799838 -6401537
36687f401537o40254k19158J217478J540643l92393k036471r53592J211062J630186
$$ -6401537 -7041791 -7260949 -6043471 -4502828 -4895221 -6931692 -7885284 -6674222 -5044036
36678e044036Q58038J047529J631674O88514q20513k77278J924950K896852J964755
$$ -5044036 -4185998 -3138469 -1506795 -818281 -1638794 -1916072 8878 2905730 4870485
36669D870485R63717J31759k062627m690355m317124m56472K702700J827438j227288
$$ 4870485 5834202 5965961 3903334 -787021 -5104145 -5560617 -2857917 -1030479 -2257767
36660b257767k365950k07092L287238N049285K884147k429528o285310m307901
$$ -2257767 -4623717 -4830809 -1543571 3505714 6389861 3960333 -2324977 -6632878
36652f632878J726707N064351K381529k250000l604295j968195p44321n15797
$$ -6632878 -4906171 158180 2539709 289709 -3314586 -5282781 -6027102 -6542899
36644f542899O41399K711480L453330J987955k37658j674093j648749N5881K368583
$$ -6542899 -5901500 -3190020 263310 2251265 2013607 339514 -1309235 -1253354 1115229
36635A115229K645094l53285m036675m937380l128179j100636N98230L158303
$$ 1115229 3760323 3407038 -629637 -5567017 -8695196 -9795832 -9197602 -6039299
36627f039299N468418M339142l68613m298321l924933p64661J474076J810121
$$ -6039299 -570881 3768261 3399648 -898673 -4823606 -5588267 -4114191 -2304070
36619b304070J930607K537465K116504n17209l824227m570711j426762K889636
$$ -2304070 -373463 2164002 4280506 3763297 -60930 -4631641 -6058403 -3168767
36611c168767M175779J788910m60265M33869K480955K016100n26308j536052q8264
$$ -3168767 1007012 2795922 2335657 2769526 5250481 7266581 6740273 5204221 5115957
36602E115957J000267J10832j090799j356517j779323k525767j446245J801086
$$ 5115957 6116224 6227056 5136257 3779740 2000417 -525350 -1971595 -170509
36594a70509L693525J787340j197421j464220J66645K65929j399148j954038k35121
$$ -170509 3523016 5310356 4112935 2648715 2815360 3081289 1682141 -271897 -507018
36585e07018K079242L454323L377914J133230k805674m945749k339944K264692
$$ -507018 1572224 5026547 8404461 9537691 6732017 1786268 -553676 1711016
36577A711016L058579p01898l527802j705050J828135K505651J99816k220453
$$ 1711016 4769595 4067697 539895 -1165155 662980 3168631 3368447 1147994
36569A147994l201939k663603n30724K075418K490006J93729j260103R55571M118923
$$ 1147994 -2053945 -4717548 -5248272 -3172854 -682848 -489119 -1749222 -793651 3325272
36560C325272L384884j266543n063650m770685j655128J534167L289237K957695
$$ 3325272 6710156 5443613 379963 -4390722 -6045850 -4511683 -1222446 1735249
36552A735249P32925j386838j155470Q29897J716776L26379j670897k558863k114913
$$ 1735249 2468174 1081336 -74134 755763 2472539 2798918 1128021 -1430842 -3545755
36543c545755l19990K555744M189690J843303l092470n417300k759389J059658
$$ -3545755 -3865745 -1310001 2879689 4722992 1630522 -3786778 -6546167 -5486509
36535e486509J503736o37290j581514n94215n3973p55053r29584K06459J252427
$$ -5486509 -3982773 -4620063 -6201577 -6795792 -6849765 -7604818 -8534402 -8327943 -7075516
36526g075516J397158J553631J999121J483400j55642p77065R59939K888339J728618
$$ -7075516 -5678358 -4124727 -2125606 -642206 -797848 -1574913 -614974 2273365 4001983
36517D001983k481781o045784n624702j513106L000762M618995K491109j247678
$$ 4001983 1520202 -4525582 -10150284 -11663390 -8662628 -4043633 -1552524 -2800202
36509b800202l110724j273123K534509M642894L336224N46470q12823l36504J72068
$$ -2800202 -5910926 -7184049 -4649540 -6646 3329578 3876048 3063225 2726721 2898789
36500B898789j85662m49879p9332j07429j065047j580685n20080J004182J422939
$$ 2898789 2713127 2263248 2183916 2076487 1011440 -569245 -1089325 -85143 1337796
36491A337796J012496N20008p35880k808022l069642Q3424K980653R71464l623695
$$ 1337796 2350292 2870300 2134420 -673602 -3743244 -3659820 -679167 292297 -3331398
36482c331398l685670J806839N509225K827855j289147j079590P09235j262011
$$ -3331398 -7017068 -5210229 298996 3126851 1837704 758114 1467349 205338
36474B05338m555832k793834K759362M385270L14713k780223j077842R44741n83176
$$ 205338 -4350494 -7144328 -4384966 304 315017 -2465206 -3543048 -2598307 -3181483
36465c181483k196720q800K883919J749331j548683j835667Q88675K310073J269673
$$ -3181483 -5378203 -5387003 -2503084 -753753 -2302436 -4138103 -3249428 -939355 330318
36456C30318N69111J212575J266556L53777L53456J206453N45436j673561k417473
$$ 330318 899429 2112004 3378560 3732337 4085793 5292246 5837682 4164121 1746648
36447A746648p27819L51295j142652k633324j148387J873827K859320J347217
$$ 1746648 1018829 1370124 227472 -2405852 -3554239 -1680412 1178908 2526125
36439B526125j1962K54622R59026R07377O20608Q29326R76845J91169j168760
$$ 2526125 2514163 2768785 3727811 4635188 5255796 6085122 7061967 7253136 6084376
36430F084376j836993j137683M59834K011749K681401J836515m31666k518628
$$ 6084376 4247383 3109700 3569534 5581283 8262684 10099199 9667533 7148905
36422G148905k147936Q47137L296266J916485k336262m964648l392084R4026J660963
$$ 7148905 5000969 5848106 9144372 11060857 8724595 3759947 367863 461889 2122852
36413B122852L85300j794880k872145k015881M01305K351054J349149j912253
$$ 2122852 2508152 713272 -2158873 -4174754 -3773449 -1422395 -73246 -1985499
36405a985499k936902Q63170N477501M960130j39136l357060j552813J099244
$$ -1985499 -4922401 -4059231 1418270 6378400 6239264 2882204 1329391 2428635
36397B428635L2632l094480l806568j682354M9162J9005j37092M12953M25697
$$ 2428635 2461267 -633213 -4439781 -6122135 -6072973 -6053968 -6191060 -5778107 -5352410
36388e352410m21854l64513J410633K862651J857467o17056j674601k89445J621063
$$ -5352410 -5774264 -6138777 -4728144 -1865493 -8026 -625082 -2299683 -2589128 -968065
36379i68065J764108O1634j557000j378380L45913J708729J175810o60542j623070
$$ -968065 796043 857677 -699323 -2077703 -1731790 -23061 1152749 492207 -1130863
36370a130863m57900J584364K201116P98828j000600j598481j125571m92660J33339
$$ -1130863 -1588763 -4399 2196717 2995545 1994945 396464 -729107 -1221767 -1088428
36361a088428Q94568J166105L76662n17370N600J635903K415318J484154j5713
$$ -1088428 -193860 972245 1348907 831537 837137 2473040 4888358 6372512 6356799
36352F356799j054217j828001k248248j517406j99132l36215j973108k059129
$$ 6356799 5302582 3474581 1226333 -291073 -490205 -826420 -2799528 -4858657
36344d858657R02066L523746K069069j535481k212321O29985K365344L28193k584883
$$ -4858657 -3956591 -432845 1636224 100743 -2111578 -1481593 883751 1211944 -1372939
36335a372939k888236j340813n70610p23748j78177J160574J833486J260153K96057
$$ -1372939 -4261175 -5601988 -6172598 -6896346 -7074523 -5913949 -4080463 -2820310 -2524253
36326b524253j57037J57966R97257J539067Q28658r54249k312948k004244j99010
$$ -2524253 -2681290 -2523324 -1526067 13000 841658 -112591 -2425539 -4429783 -4628793
36317d628793J881633K583463O37438k950852m455045j402209L275685M239746
$$ -4628793 -2747160 -163697 473741 -2477111 -6932156 -8334365 -5058680 -818934
36309h18934J105185j034631N19989K065530j90800l891902m313323j343080J418237
$$ -818934 286251 -748380 -228391 1837139 1646339 -2245563 -6558886 -7901966 -6483729
36300f483729K293306K076803P35164j949750l524151j223569L117356M726555
$$ -6483729 -4190423 -2113620 -1378456 -3328206 -6852357 -8075926 -4958570 -232015
36292b32015K462348k58783j125997j298736j669409j191258j20546p01655k825483
$$ -232015 2230333 1971550 845553 -453183 -2122592 -3313850 -3434396 -4136051 -6961534
36283f961534k892628O65668M130619L484742q2187k462899k196485q94241J91563
$$ -6961534 -9854162 -9188494 -5057875 -1573133 -1655320 -4118219 -6314704 -7208945 -7017382
36274g017382J217392K339275L362489L962612L041087l92649m347188m454272
$$ -7017382 -5799990 -3460715 -98226 3864386 6905473 6512824 2165636 -2288636
36266b288636J76174M231959K581173k631585n070336k919944j29326M70837N01048
$$ -2288636 -2112462 2119497 4700670 2069085 -3001251 -5921195 -6050521 -5579684 -5078636
36257e078636J683965K515665J218088j154673k544747k366217o05137K837097
$$ -5078636 -3394671 -879006 339082 -815591 -3360338 -5726555 -6331692 -3494595
36249c494595O045379N295059J74750l945276k157536K853702M019042l05953
$$ -3494595 2550784 7845843 8020593 4075317 1917781 4771483 8790525 8484572
36241H484572m158371k560121J793111K942127j20668l091380k961516j398631
$$ 8484572 4326201 1766080 3559191 6501318 6380650 3289270 327754 -1070877
36233a070877j108424j730430j049542J259280L115731K951821J495217K72316
$$ -1070877 -2179301 -3909731 -4959273 -3699993 -584262 2367559 3862776 4135092
36225D135092l77500r20268j173408n96529K34869j8538j282127j728008m56906
$$ 4135092 3757592 2837324 1663916 1067387 1302256 1283718 1591 -1726417 -2183323
36216b183323R03026O36763l37393j96898L64988p16901k543806j549741K688318
$$ -2183323 -1280297 -643534 -980927 -1177825 -812837 -1529738 -4073544 -5623285 -2934967
36207b934967N285710K276462l352065n109727j279061L536359M748226K538715
$$ -2934967 2350743 4627205 1275140 -3834587 -5113648 -1577289 3170937 5709652
36199E709652k6626q57819O3508J368820J224633q93589k987001k704777p17865
$$ 5709652 5683026 4825207 4888715 6257535 7482168 6588579 3601578 896801 178936
36190A78936J78652o69618j122624k96000q9705j407309k022387k96773J743426
$$ 178936 357588 -312030 -1434654 -1730654 -1820359 -3227668 -5250055 -5546828 -3803402
36181c803402J626722L93930L98147J063776J98589j673087j796142L50273K200431
$$ -3803402 -2176680 -1782750 -1384603 -320827 -122238 -1795325 -3591467 -3241194 -1040763
36172a040763J885758L19617p73208p86458K0070R18336Q67056j84231o43821
$$ -1040763 844995 1164612 391404 -395054 -374984 543352 1410408 1226177 582356
36163E82356L38346P92401j315556m078238l573108K97183L214602K330545l44561
$$ 582356 920702 1713103 397547 -3680691 -7253799 -6956616 -3742014 -1411469 -1756030
36154a756030j533581q52988J84998R97305J838308K353467J867484L40556j718014
$$ -1756030 -3289611 -4142599 -3957601 -2960296 -1121988 1231479 3098963 3439519 1721505
36145A721505l352012l048886j84339L133613L655452J009312j870508k878208
$$ 1721505 -1630507 -4679393 -4863732 -1730119 1925333 2934645 1064137 -1814071
36137a814071k880852k825888j570994J422737L596398K213069j452733l317905
$$ -1814071 -4694923 -7520811 -9091805 -7669068 -4072670 -1859601 -3312334 -6630239
36129f630239j353285K621129N469464N311608J997069l018732o884480o862183
$$ -6630239 -7983524 -5362395 107069 5418677 7415746 4397014 -2487466 -9349649
36121i349649k705441K529222M672119K245117j694371k505051N62758L256407
$$ -9349649 -12055090 -9525868 -4853749 -2608632 -4303003 -6808054 -6245296 -2988889
36113b988889K081130p09026o94934J638106J672016j637294l694023j441064
$$ -2988889 -907759 -1616785 -2311719 -673613 998403 -638891 -4332914 -5773978
36105e773978J909004K116790J79664k53718R71880J014701p71414j982257j141571
$$ -5773978 -3864974 -1748184 -1568520 -1822238 -850358 164343 -607071 -2589328 -3730899
36096c730899M69637J036047J54802j389646k292005j539964K88496J288783P31295
$$ -3730899 -3261262 -2225215 -2070413 -3460059 -5752064 -7292028 -7003532 -5714749 -4983454
36087d983454J02937P04656J791476K180933J876005R75987p94012k221255j047125
$$ -4983454 -4880517 -4175861 -2384385 -203452 1672553 2648540 1854528 -366727 -1413852
36078a413852K019160K848962k54561l524142l315633j178492J06753J642394
$$ -1413852 605308 3454270 3199709 -324433 -3640066 -4818558 -4711805 -3069411
36070c069411M816483O240470K482203k626811k408868K063290L055781j918911
$$ -3069411 1747072 7987542 10469745 7842934 5434066 7497356 10553137 8634226
36062H634226o453606n096360l54263K686040L105325K377769N50314k257517
$$ 8634226 2180620 -2915740 -3270003 -583963 2521362 4899131 5449445 3191928
36054C191928l938306l093054j153808J97561J033212J211823j85463j885678
$$ 3191928 -746378 -3839432 -4993240 -4795679 -3762467 -2550644 -2736107 -4621785
$$ [...]
##END NTUPLES=NMR SPECTRUM
##END=
