##TITLE=31Pdec_SR10_2_2
 CDCl3, 24 sc
 8.7.2020
##JCAMPDX= 6.0         $$ Bruker NMR JCAMP-DX V2.0
##DATA TYPE= NMR SPECTRUM
##DATA CLASS= NTUPLES
##ORIGIN= UXNMR, Bruker Analytische Messtechnik GmbH
##OWNER= root
$$ XWIN-NMR		Version 3.5
$$ Wed Jul  8 13:24:23 2020 Russian Standard Time (UT+4h)  she@DPX200
##.OBSERVE FREQUENCY= 81.013821
##.OBSERVE NUCLEUS= ^31P
##.ACQUISITION MODE= SIMULTANEOUS
##.ACQUISITION SCHEME= undefined
##.AVERAGES= 24
##.DIGITISER RES= 17
##SPECTROMETER/DATA SYSTEM= spect
##.PULSE SEQUENCE= zgpg30
##.SOLVENT NAME= DMSO
##.SHIFT REFERENCE= (INTERNAL, DMSO, 0, 182.463)
##AUDIT TRAIL= $$ (NUMBER, WHEN, WHO, WHERE, WHAT)
$$ ##TITLE= Audit trail, XWIN-NMR		Version 3.5
$$ ##JCAMPDX= 5.01
$$ ##ORIGIN= Bruker BioSpin GmbH
$$ ##OWNER= she
$$ F:/spectra/data/she/nmr/P31/1/pdata/1/auditp.txt
$$ ##AUDIT TRAIL=  $$ (NUMBER, WHEN, WHO, WHERE, WHAT)
(   1,<2020-07-08 13:22:50.84 +0400>,<she>,<DPX200>,
      <created by zg, POWCHK disabled, PULCHK disabled
       configuration hash MD5:
       00 E9 B6 7A A2 85 ED C7 34 08 36 98 17 FE 4E 26
       data hash MD5: 32K
       AA 25 B7 5A 04 4D DF C8 40 DA BE 90 06 53 D3 DC>)
(   2,<2020-07-08 13:22:53.15 +0400>,<she>,<DPX200>,
      <Start of raw data processing
       efp BC_mod = 2 LB = 1 FT_mod = 6 PKNL = 1 PHC0 = -2105.544 PHC1 = -88.19806 SI = 64K 
       data hash MD5: 64K
       2C 00 CF 34 E0 A4 F4 AC B2 8A 35 D1 87 2E 85 86>)
(   3,<2020-07-08 13:23:08.40 +0400>,<she>,<DPX200>,
      <pk PHC0 = 151.0394 PHC1 = 0 
       data hash MD5: 64K
       57 B8 B8 30 3C B3 7F 22 26 EA DD 88 68 61 25 64>)
(   4,<2020-07-08 13:23:11.34 +0400>,<she>,<DPX200>,
      <abs ABSG = 5 
       data hash MD5: 64K
       AA 96 7E 02 FD D9 58 A6 F5 C1 15 30 F8 C2 03 62>)
$$ ##END=
$$ 
$$ hash MD5
$$ 2F 20 F5 3A 30 E1 2E 01 BA E3 9D A1 D7 2F 53 26
##$RELAX= 
##$RELAX= 
##$RELAX= 
##$RELAX= 
##$RELAX= 
##$RELAX= 
##$RELAX= 
##$RELAX= 
$$ Bruker specific parameters
$$ --------------------------
##$DU= <F:/spectra>
##$EXPNO= 1
##$NAME= <P31>
##$PROCNO= 1
##$TYPE= <nmr>
##$USER= <she>
##$AMP= (0..31)
100 100 100 100 100 100 100 100 100 100 100 100 100 100 100 100 100 100 
100 100 100 100 100 100 100 100 100 100 100 100 100 100 
##$AQSEQ= 0
##$AQ_mod= 1
##$AUNM= <au_zg>
##$AUTOPOS= <>
##$BF1= 81.014009
##$BF2= 200.13
##$BF3= 200.13
##$BF4= 200.13
##$BF5= 200.13
##$BF6= 200.13
##$BF7= 200.13
##$BF8= 200.13
##$BYTORDA= 1
##$CFDGTYP= 0
##$CFRGTYP= 5
##$CHEMSTR= <none>
##$CNST= (0..31)
1 1 145 1 1 1 1 1 1 1 1 1 1 1 1 1 1 1 1 1 1 1 1 1 1 1 1 1 1 1 1 1 
##$CPDPRG= <waltz16>
##$CPDPRG1= <>
##$CPDPRG2= <waltz16>
##$CPDPRG3= <>
##$CPDPRG4= <mlev>
##$CPDPRG5= <mlev>
##$CPDPRG6= <mlev>
##$CPDPRG7= <mlev>
##$CPDPRG8= <mlev>
##$CPDPRGB= <>
##$CPDPRGT= <>
##$D= (0..31)
0 1 0 0 0 0 0 0 0 0 0 0.03 2e-05 3e-06 0 0 0 0 0 0 0 0 0 0 0 0 0 0 0 0 
0 0 
##$DATE= 1594200170
##$DBL= (0..7)
120 120 120 11 120 120 24 19 
##$DBP= (0..7)
150 150 150 150 150 150 150 150 
##$DBP07= 0
##$DBPNAM0= <>
##$DBPNAM1= <>
##$DBPNAM2= <>
$$ [...]
##$SUBNAM3= <"">
##$SUBNAM4= <"">
##$SUBNAM5= <"">
##$SUBNAM6= <"">
##$SUBNAM7= <"">
##$SUBNAM8= <"">
##$SUBNAM9= <"">
##$SW= 369.568048894756
##$SWIBOX= (0..15)
0 1 3 0 0 0 0 0 0 0 0 0 0 0 0 0 
##$SW_h= 29940.119760479
##$TD= 32768
##$TD0= 1
##$TE= 0
##$TE2= 300
##$TE3= 300
##$TEG= 300
##$TL= (0..7)
0 120 53 12 22 120 120 120 
##$TP= (0..7)
150 150 150 150 150 150 150 150 
##$TP07= 0
##$TPNAME0= <>
##$TPNAME1= <>
##$TPNAME2= <>
##$TPNAME3= <>
##$TPNAME4= <>
##$TPNAME5= <>
##$TPNAME6= <>
##$TPNAME7= <>
##$TPOAL= (0..7)
0.5 0.5 0.5 0.5 0.5 0.5 0.5 0.5 
##$TPOFFS= (0..7)
0 0 0 0 0 0 0 0 
##$TUNHIN= 0
##$TUNHOUT= 0
##$TUNXOUT= 0
##$USERA1= <user>
##$USERA2= <user>
##$USERA3= <user>
##$USERA4= <user>
##$USERA5= <user>
##$V9= 5
##$VALIST= <valist>
##$VCLIST= <CCCCCCCCCCCCCCC>
##$VD= 0
##$VDLIST= <DDDDDDDDDDDDDDD>
##$VPLIST= <PPPPPPPPPPPPPPP>
##$VTLIST= <TTTTTTTTTTTTTTT>
##$WBST= 1024
##$WBSW= 4
##$XGAIN= (0..3)
0 0 0 0 
##$XL= 0
##$YL= 0
##$YMAX_a= 15421
##$YMIN_a= -11726
##$ZGOPTNS= <>
##$ZL1= 120
##$ZL2= 120
##$ZL3= 120
##$ZL4= 120
##$ABSF1= 182.463
##$ABSF2= -187.1042
##$ABSG= 5
##$ABSL= 3
##$ALPHA= 0
##$AQORDER= 0
##$ASSFAC= 0
##$ASSFACI= 0
##$ASSFACX= 0
##$ASSWID= 0
##$AUNMP= <proc_1d>
##$AZFE= 0.1
##$AZFW= 0.5
##$BCFW= 0
##$BC_mod= 2
##$BYTORDP= 0
##$COROFFS= 0
##$CY= -3
##$DATMOD= 1
##$DC= 0
##$DFILT= <>
##$DTYPP= 0
##$F1P= 0
##$F2P= 0
##$FCOR= 1
##$FTSIZE= 65536
##$FT_mod= 6
##$GAMMA= 0
##$GB= 0
##$INTBC= 1
##$INTSCL= 5.30512e-09
##$ISEN= 30
##$LB= 1
##$LEV0= 0
##$LPBIN= 0
##$MAXI= 10000
##$MC2= 0
##$MEAN= 0
##$ME_mod= 0
##$MI= 50
##$NCOEF= 0
##$NC_proc= -7
##$NLEV= 6
##$NOISF1= 182.463
##$NOISF2= 159.3651
##$NSP= 0
##$NTH_PI= 0
##$NZP= 0
##$OFFSET= 182.463
##$PC= 4
##$PHC0= -1954.505
##$PHC1= -88.19806
##$PH_mod= 1
##$PKNL= yes
##$PPARMOD= 0
##$PSCAL= 0
##$PSIGN= 0
##$REVERSE= no
##$SF= 81.0140089999434
##$SI= 65536
##$SIGF1= 159.3651
##$SIGF2= -187.1042
##$SINO= 113.3802
##$SIOLD= 16384
##$SREGLST= <1H.CDCl3>
##$SSB= 0
##$STSI= 65536
##$STSR= 0
##$SW_p= 29940.119760479
##$SYMM= 0
##$S_DEV= 0
##$TDeff= 32768
##$TDoff= 0
##$TI= <>
##$TILT= no
##$TM1= 0
##$TM2= 0
##$TOPLEV= 0
##$USERP1= <user>
##$USERP2= <user>
##$USERP3= <user>
##$USERP4= <user>
##$USERP5= <user>
##$WDW= 1
##$XDIM= 65536
##$YMAX_p= 402605720
##$YMIN_p= -26973087
$$ End of Bruker specific parameters
$$ ---------------------------------
##NTUPLES= NMR SPECTRUM
##VAR_NAME=  FREQUENCY,     SPECTRUM/REAL,   SPECTRUM/IMAG
##SYMBOL=    X,             R,               I
##VAR_TYPE=  INDEPENDENT,   DEPENDENT,       DEPENDENT
##VAR_FORM=  AFFN,          ASDF,            ASDF
##VAR_DIM=   65536,         65536,           65536
##UNITS=     HZ,            ARBITRARY UNITS, ARBITRARY UNITS
##FACTOR=    0.456856943014862, 1,           1
##FIRST=     14782.0589164792, 0,            0
##LAST=      -15158.0608439998, 0,           0
##MIN=       -15158.0608439998, -26973087,   0
##MAX=       14782.0589164792, 402605720,    0
$$ Real data points
##PAGE= N=1
##DATA TABLE= (X++(R..R)), XYDATA
$$ [...]
41237i27920n85151P13271J028243Q5184q58315j071113r78481j158019j289476
41228e041777n43751Q34814J184218l17036j801243q59504J778285K866027J194334
41219g05633p64437n98685P97382J073592j41597j154826m81465J840363M168207
41210D032901L953020J74776m275366m885036j353857J460573K98560j706639
41202b301068j45650L265230L033346j306522l939577j320479K665331K565535
41194B516146j109586l545444k635181o96330l8838k99543n16515r67684j793030
41185i086005j831524l15760J558464K219269K027940K500400L687839L952222
41177D712845K459865M47034n39976n11035l86820m63546n52385r52748j978869
$$ y = [-927920, -1513071, -799800, 228443, 313627, -544688, -1615801, -2594282, -3752301, -5041777, -5585528, -4750714, -3566496, -3883532, -5684775, -6544279, -4765994, -1899967, -705633, -1470070, -2068755, -1271373, -197781, -339378, -1494204, -1975669, -135306, 4032901, 7985921, 8160697, 3885331, -999705, -2353562, -892989, -594429, -2301068, -2446718, 818512, 3851858, 2545336, -1394241, -2714720, -49389, 2516146, 1406560, -2138884, -4774065, -5470395, -5509233, -5808776, -6325291, -7292975, -9086005, -10917529, -11233289, -9674825, -7455556, -5427616, -2927216, 760623, 4712845, 7172710, 7619744, 7079768, 6568733, 6181913, 5718367, 5165982, 4213234, 2234365]
41168B234365k715472j585322J436730M073686L856633P21277k783836l773032
41160A465029j598712J550766K762221J389019m27719o42158J7075o51220k809038
41151A055263m052895k771525m91140J71421j058015j976963q76649J472835L000508
41142e527160K767510J705529J099468R30731K41239j097423j949485j603646
41134c433237q64690o45210m76991L46443J111297Q82901N60580J481628K438671
41125A401392R49350k252072l230234n73158K089546J453690m41676L34216L268231
41116B999285M320307K124899o57931k028740k765775l201759j779712J415245
41108D25819L019751R19762k031236j910660K91542J66039l099840m952267j894751
$$ y = [2234365, -481107, -2066429, -629699, 3443987, 7300620, 8021897, 5238061, 1465029, -133683, 1417083, 4179304, 5568323, 5140604, 4498446, 4515521, 3864301, 1055263, -2997632, -5769157, -6260297, -6088876, -7146891, -9123854, -10000503, -8527668, -5527160, -2759650, -1054121, 45347, 976078, 1217317, 119894, -1829591, -3433237, -4297927, -4943137, -5420128, -5073685, -3962388, -3079487, -2518907, -1037279, 1401392, 2350742, 98670, -3131564, -3704722, -1615176, -161486, -603162, -268946, 2999285, 7319592, 9444491, 8786560, 6757820, 3992045, 790286, -989426, 425819, 3445570, 4365332, 2334096, 423436, 714978, 881017, -2218823, -7171090, -9065841]
41099i065841L222213M693008J354207k135340j545773J563198K172367j452515
41091a194476n345099m812649l93739K836939J603359j844565l067428q65857
41083a3083515K190400L663211L553255K749062J345817m87800j491379o55764
41075b216713J082266J773548Q02077o97864j494700j347286o39627P5895K43428
41066b418976j06991j11608O35958R14252n92466k745569k777480r5445K595214
41057d703111K868688J515492N93663K20488p52893j995053j911082l05871J148524
41048c321155J224014L96288k83137k35553P15685K133126K688883J426311o93605
41039D050857j788937j484731r13243m72382N97719K228292L006189K187845N73562
$$ y = [-9065841, -5843628, -1150620, 203587, -1931753, -3477526, -1914328, 258039, -1194476, -6539575, -11352224, -11745963, -8909024, -7305665, -9150230, -12217658, -13083515, -10893115, -7229904, -3676649, -927587, 418230, -69570, -1560949, -2216713, -1134447, 639101, 1441178, 743314, -751386, -2098672, -2738299, -2662404, -2418976, -2525967, -2637575, -2001617, -1087365, -1679831, -4425400, -7202880, -7298325, -4703111, -1834423, -318931, 274732, 495220, -257673, -2252726, -4163808, -4469679, -3321155, -2097141, -1700853, -1983990, -2219543, -1503858, 629268, 3318151, 4744462, 4050857, 2261920, 777189, -136054, -608436, -10717, 2217575, 5223764, 7411609, 7985171]
41030G985171j126268k990868m259958l035990R62122M808813N160216J911957
41022I415195k017651l846181l042337j141385k84936j197968k090319n97585
41014d803167K756914M572341K889147j94297j601362j395479j826867l251313
41006b854083l376296p42435K800140L936605J611110j702660k653379q18259
40998c799257R40762M76704o69510p8284J138837r925k783025k961744L33009
40989g412433K544042O69919j922057j124213J286565J208050n95146l00294J796008
40980c849559J805909n73000j286201J010997K601244J039407j022935o60114
40972i34252P91370P68713k26663k83054L94625L05777o95604j660943k019926
$$ y = [7985171, 6858903, 3868035, -391923, -3427913, -2465791, 2343022, 7503238, 9415195, 7397544, 3551363, 509026, -632359, -917295, -2115263, -4205582, -4803167, -2046253, 2526088, 5415235, 5220938, 3619576, 2224097, 397230, -2854083, -6230379, -6972814, -4172674, -236069, 1375041, -327619, -2980998, -3799257, -2858495, -2381791, -3051301, -3129585, -1990748, -2000673, -4783698, -7745442, -7412433, -4868391, -4198472, -6120529, -7244742, -5958177, -4750127, -5345273, -5645567, -3849559, -2043650, -2616650, -3902851, -2891854, -290610, 748797, -274138, -934252, -142882, 625831, 399168, 116114, 510739, 816516, 120912, -1540031, -3559957]
40963c559957j390337L75713J911090J271279q41092j431491N7043N96550j148315
40954d159517k085162P2391K461973J683159l58680K03887K295266J594354j893448
40945a85777l354620o00198K807065L070559Q58308j070884j662500j258260j44609
40936a540916Q73826N25493q91422j352567p2753J262196J182912L03115m77833
40927a87949j321985j727413N975L620185N470234K836533j859187l821952j937314
40918A077127M93178N50590j211097k429670j632431Q76748L199102K955582k02708
40909C676421l357571l269698l77017J982126K114339J440245J276890Q66543
40901D352278l81896j197583o56961r9802r30955k107271j855294n63240K23971
$$ y = [-3559957, -4950294, -4574581, -2663491, -1392212, -2233304, -3664795, -3607752, -3011202, -4159517, -6244679, -6172288, -3710315, -2027156, -2385836, -2181949, 113317, 1707671, -185777, -3540397, -4140595, -1333530, 1737029, 2595337, 1524453, -138047, -1396307, -1540916, -667090, -141597, -1033019, -2385586, -2458339, -1196143, -13231, 289884, -187949, -1509934, -3237347, -3231372, 388813, 5859047, 8695580, 6836393, 3014441, 1077127, 1570305, 2120895, 909798, -1519872, -3152303, -2275555, 923547, 3879129, 3676421, 318850, -2950848, -3327865, -1345739, 768600, 2208845, 3485735, 4352278, 3970382, 2772799, 2115838, 2016036, 1085081, -1022190, -2877484, -3440724, -3216753]
40892c216753N77372J552111K614985K301352R87540L65651L82771n04979k033543
40883C026507k167184q36058l46713j196273j011665Q61596J499502m86055j737273
40874b393616M74219L015291J585759j874943j913458J598051L235782P31670
40866D458755j923055j443757J00344N0216j88977J386090K990964J913492q64732
40857F479340k449226k369170j882623r39440P52923J407437l92445k252807q63396
40848b509407K486891L266449L56582k525383k398341m10184J069281J434035
40840G69923Q87468n26094j747628j189159N34600R65128j52474k03289J555081
40831H93556J988278q32850l710904k813708K75520R33416j428577k830968j006990
$$ y = [-3216753, -2639381, -1087270, 1527715, 3829067, 4816607, 5182258, 5565029, 5060050, 3026507, 859323, 23265, -323448, -1519721, -2531386, -1669790, -170288, -656343, -2393616, -1919397, 1095894, 2681653, 806710, -1106748, 491303, 3727085, 4458755, 2535700, 1091943, 1192287, 1242503, 1053526, 2439616, 5430580, 7344072, 6479340, 4030114, 1660944, -221679, -1161119, -408196, 999241, 606796, -1646011, -2509407, -22516, 3243933, 3600515, 1075132, -1323209, -1733393, -664112, 769923, 1657391, 1131297, -616331, -1805490, -1270890, -305762, -458236, -661525, 893556, 2881834, 2048984, -1661920, -4475628, -4200108, -3266692, -4695269, -7526237, -8533227]
40822h533227J772575K844665K602904K408559J985199Q05976j22532P0941L03911
40813D138971n71551j436748p12230N34736j15268k385974l236224j253258J334047
40804c703499K064378J557446J803357K677181K231372j40119k727857l731998
40796C0261l018376j426054M21047K022225K539157J271786j360363l592742l440908
40787f553967n68426K899586M093958K274010n98167k354294k714947k447132
40779e969379j747571n42182O48305J389881K038431K656208K337262Q99942j59331
40770A551566j02228o71131k993876m491357k235786J817497L054989J202148
40762b868178M71658K248119K640365q07906m606439m518263j593871M15125P73340
$$ y = [-8533227, -6760652, -3915987, -1313083, 1095476, 3080675, 3886651, 3764119, 3835060, 4138971, 3567420, 2130672, 1418442, 1953178, 1837910, -548064, -3784288, -5037546, -3703499, -1639121, -81675, 1721682, 4398863, 6630235, 6490116, 3762259, 30261, -2988115, -4414169, -3993122, -1970897, 568260, 1840046, 479683, -3113059, -6553967, -7122393, -4222807, -128849, 2145161, 1546994, -807300, -3522247, -5969379, -7716950, -8259132, -7610827, -6220946, -4182515, -1526307, 810955, 1710897, 1551566, 1449338, 778207, -2215669, -6707026, -8942812, -7125315, -4070326, -2868178, -2396520, -148401, 2491964, 1684058, -2922381, -7440644, -9034515, -8619390, -7846050]
40753g846050J239825J974756J685359O13175J54410L08249J29446p8850O69997
40744a149683K033821K753837K229314M14720k375723m470445l843000j364050
40736e771209l06129j247944j056202J279065K421914J113098J367796M866479
40728B666868N961796O74547m751017k708484K682088J618350m796545n801089
40720d453486J108530N830427K216764k715141j635991J408727k06436l543665
40712a990271j822472L362071M713892Q84384k741785l013761j640027r0183J742201
40703e95951K482833N00046k212005k169470J38127J285813N89714L54357J144005
40694A517469J134206j47148j225071j449797j175756j32325J329180J046201
$$ y = [-7846050, -6606225, -4631469, -2946110, -2332935, -2178525, -1870276, -1740830, -1819680, -1149683, 884138, 3637975, 5867289, 6282009, 3906286, -564159, -4407159, -5771209, -6077338, -7325282, -8381484, -7102419, -4680505, -3567407, -2199611, 2666868, 8628664, 9303211, 4552194, 1843710, 4525798, 6144148, 1347603, -4453486, -3344956, 2485471, 4702235, 1987094, 351103, 1759830, 1553394, -1990271, -3812743, -450672, 4263220, 5147604, 2405819, -607942, -2247969, -2338152, -595951, 1886882, 2386928, 174923, -1994547, -1856420, -570607, 19107, 373464, 1517469, 2651675, 2504527, 1279456, -170341, -1346097, -1478422, -149242, 896959]
40686H96959j463593k555946L15169L408274J938967j749504j608583J948183
40678A129926K562402j372194m029302j779861J453841J323115m66915m39643
40670a618631P49129O84623j67136j0551P25425O14580r4829o16614j399214k530293
40660c663511k384877K4803L057750M420060L495886Q39241k381540l749409j408232
40651a749829K488756L461342R98343o75007L51808N43439k352861m275024j063272
40642b272305M016290M445471k5740l537551k823411n20575K69628k5649N3423
40633d20419K69969J692k64764p7794K4106n05341j469782k268660j917598O06141
40623f022450M479153O441094M266806J02968k084304j727367j477241k251980
$$ y = [896959, -566634, -3122580, -2807411, 600863, 2539830, 790326, -818257, 1129926, 3692328, 2320134, -1709168, -3489029, -2035188, -712073, -1178988, -1618631, -869502, -184879, -352015, -362566, 362859, 977439, 882610, 265996, -1133218, -3663511, -6048388, -6023585, -2965835, 1454225, 4950111, 5789352, 3407812, -341597, -1749829, 738927, 4200269, 5198612, 4523605, 4875413, 5418852, 3065991, -1209033, -2272305, 1743985, 6189456, 6163716, 2626165, -197246, -717821, -448193, -473842, -420419, -150450, -148758, -413522, -491316, -467210, -972551, -2442333, -4710993, -6628591, -6022450, -1543297, 4897797, 9164603, 9267571, 7183267, 5455900, 3978659, 1726679]
40615A726679j979560J84090J875391J241787k50273o10989m96424j347823k341767
40606a998889j815100m10057r344k52530Q99671L064912L011852m41066l712182
40597a662733k886997P59699K450901N59025j471963n27505J740548J867492q1770
40588G46697j023643P0530P81490n18104j852142q02884J386986J292422j637120
40579a555768l811158j997276K426962N080320L864680J050742k70425j86246
40571D601831r24489k860502l887536k780950q10624O21088J580501J941561Q59250
40562a659870o39447L20795L534156M259361K37834l277346o69070M536967L996222
40553A0639602k666873o851172l628476J969122L756059K517900J481418k1012
$$ y = [1726679, -252881, -68791, 1806600, 3048387, 2798114, 2187125, 1690701, 342878, -1998889, -3813989, -4224046, -4233390, -4485920, -3586249, -521337, 2490515, 2049449, -1662733, -4549730, -3790031, -1339130, -780105, -2252068, -2779573, -1039025, 828467, 746697, -276946, -206416, 575074, 56970, -1795172, -2598056, -1211070, 81352, -1555768, -5366926, -7364202, -4937240, 143080, 4007760, 5058502, 4788077, 4601831, 3677342, 816840, -3070696, -5851646, -6662270, -6041182, -4460681, -2519120, -1659870, -2299317, -1978522, 1555634, 5814995, 6052829, 2775483, 2106413, 6643380, 10639602, 7972729, 1121557, -2506919, -537797, 3218262, 5736162, 7217580, 7196568]
40545G196568l109258m597441j678531K198679K107011m30612l35354K259201
40537C610263K557156m72470k606927j709135p68887k178349l781378k712925
40529h062652L52821K782497L284522K164847L26562r32281p50776J67231O50170
40520a7059R76728J927641K636429J716906r1309r30722q34265j062111j266470
40511C055768l91197M28813o14579k263966j864745k02719k26549j246369L04410
40502c021133L761838L805885q69977m272978j913131K195046J887044j778155
40494b05561k905803j24287K038733N12044k385422k931693m61956K927649M675024
40485A138728L248432o18309l775736l397972j75636K494989K455703O21842r46419
$$ y = [7196568, 4087310, -510131, -2188662, 10017, 2117028, 1686416, 1351062, 3610263, 6167419, 5694949, 3088022, 1378887, 610000, -1568349, -5349727, -8062652, -7709831, -4927334, -1642812, 522035, 848597, -83684, -834460, -667229, -17059, 959669, 2887310, 5523739, 7240645, 7149336, 6218614, 5384349, 4322238, 3055768, 2664571, 3093384, 2478805, 214839, -1649906, -1852625, -2079174, -3325543, -3021133, 740705, 4546590, 3676613, -596365, -2509496, -314450, 1572594, -205561, -3111364, -3235651, -1196918, -684874, -3070296, -6001989, -6463945, -3536296, 1138728, 4387160, 3768851, -6885, -3404857, -3580493, -1085504, 1370199, 1992041, 1045622]
40476A045622j307880p82221n4988M01223O09668R79268J648937K142190J891779
40467F573598P18015j260433l395014m096228j967397J963534M351230K971027
40459E858332o84715l205853l029024j464684n10568p57694j450470j784510j665841
40450h695027j253313k30770J676659L395227L032488O12657j064930J13175K398362
40441a5472K563868N98342n60538L85954J583675J302966N7262j073416j797724
40432C044917j756674o77215J83654p50118k364766j928497L34636J079058p53194
40423c588199j932104n3011K751792L447867K400515J526733Q69589k59681j076076
40414D087425j007535j469911l216172l931689j420198K459512L971079K377322
$$ y = [1045622, -262258, -1044479, -1099467, -698244, -88576, 890692, 2539629, 4681819, 6573598, 7291613, 6031180, 2636166, -1460062, -3427459, -1463925, 2887305, 5858332, 5173617, 1967764, -1061260, -2525944, -3036512, -3794206, -5244676, -7029186, -8695027, -9948340, -10179110, -8502451, -5107224, -2074736, -1462079, -2527009, -2413834, -15472, 2548396, 3146738, 2586200, 2972154, 4555829, 5858795, 5916057, 4842641, 3044917, 1288243, 611028, 794682, 44564, -2320202, -4248699, -3914063, -2835005, -3588199, -5520303, -5573314, -2821522, 626345, 3026860, 4553593, 5423182, 5163501, 4087425, 3079890, 1609979, -1606193, -5537882, -6958080, -4498568, -527489, 1849833]
40406A849833M1345j216286j487288j461526j635221j858254o93973K754516N631635
40397A924781L499916k497521n047446n30707M952273M122260r14104k726562
40389B782890j91954J170139p98117k084449k63898J746806J431062M23058L47428
40380D562965j45728j810583k546309j123077N18700Q46935J047170J673230P42909
40371C766212k204000l644343r35122L000736L237755o51941m691157n810647
40363g932507m263576j546320J369913L568041L812771J515715k136367m270375
40355i882705k387301K668313O540112N741094J634132j701388k659859k687346
40347b734948k522458j258763Q14211J913033J930092K643216L954883L264920
$$ y = [1849833, 1891178, 674892, -812396, -2273922, -3909143, -5767397, -6461370, -3706854, 1924781, 5424697, 2927176, -2120270, -2650977, 2301296, 6423556, 5509452, 2782890, 2590936, 3761075, 2962958, 878509, 614611, 2361417, 3792479, 4215537, 4562965, 4417237, 2606654, 60345, -1062732, -544032, 302903, 1350073, 3023303, 3766212, 1562212, -2082131, -3017253, -16517, 3221238, 2569297, -2121860, -7932507, -12196083, -13742403, -12372490, -8804449, -4991678, -3475963, -5612330, -9882705, -12270006, -9601693, -3061581, 2679513, 4313645, 2612257, -47602, -2734948, -5257406, -6516169, -5701958, -3788925, -1858833, 784383, 4739266, 8004186]
40339H004186j38678l177327l076289p85493J097313J432075L99347j328855k241452
40330A84827j176634M47752J73609j432065j491539J44320O30091m21514J6710
40321b924443K412115K893663m9222k157571j23799K898816K538844j74329j847472
40312C466602k597864l985850m321915j400670K418266L083187J068806q2657
40304b352095K55818Q1868n26755O0728R65268O5484j647262j551973j34380L42540
40294d440759N32410K339504L921872J994749j840417l062378j847815k214799
40286d617633l828081k035817K999645M942987J440285j747108k95643J882249
40278a259116P7208l040741k424810Q60298K274409J507099J435915J806987Q8622
$$ y = [8004186, 7865508, 4688181, 1611892, 826399, 1923712, 3355787, 3755134, 2426279, 184827, -991807, -544055, -370446, -1802511, -3294050, -3149730, -2519639, -2941153, -2924443, -512328, 2381335, 2332113, 174542, 50743, 2949559, 5488403, 5314074, 3466602, 868738, -3117112, -7439027, -8839697, -6421431, -3338244, -2269438, -2352095, -2096277, -2014409, -2541164, -2480436, -1515168, -1449684, -3096946, -4648919, -4783299, -4440759, -3908349, -1568845, 2353027, 4347776, 2507359, -555019, -2402834, -4617633, -8445714, -10481531, -7481886, -2538899, -1098614, -2845722, -3141365, -1259116, -1181908, -4222649, -6647459, -5787161, -3512752, -2005653, -569738, 1237249, 1325871]
40269A325871k631141k426088Q93704K949157J093686k385542l996428k777128
40261g953909J37987K879342L454282J473817o62340n71948N91626J53706j202817
40252a700254k70512K794665L615836K12432l275408k236838J747476L290472
40244D177869P33465k316005k677688j329489n37570k63254N57590J230162M91589
40235F6669n29130M75972K834142K993610k30647l334525k878590j74442J199376
40226D22435N51765k60369p79183j921189k746799j156104K059105L573343K512610
40217B255614J477594J781443J529350j47534r27834L92469J095489j077473l874953
40208B504165m035570k112200n14927O07469J839341J429697j774171m294831
$$ y = [1325871, -1305270, -3731358, -2837654, 111503, 1205189, -1180353, -5176781, -7953909, -7815922, -4936580, -1482298, -8481, -670821, -1242769, -651143, -497437, -1700254, -1970766, 823899, 4439735, 4652167, 1376759, -860079, 887397, 4177869, 4911334, 2595329, -82359, -1411848, -1949418, -2212672, -1655082, -424920, 66669, -462461, 13511, 2847653, 5841263, 5610616, 2276091, -602499, -776941, 422435, 974200, 713831, -65352, -1986541, -4733340, -5889444, -3830339, -256996, 2255614, 3733208, 5514651, 7044001, 6896467, 5968633, 6361102, 7456591, 6379118, 2504165, -1531405, -3643605, -4158532, -3551063, -1711722, -282025, -2056196, -6351027]
40200f351027j989193L038716M757083K086539o0974Q85106J650641j73832j589671
40191B253388J91385K268794P88493k169923j716651J648672K538618p26302l365928
40182A710546j611778J529645J097728k190603l156734K1189L294764K892618
40174C587375N92037M86215K569653K857727m00356l883044l808768r73355R01748
40165A929232M11361m04837K43184J457775J469022J72193j140787j649140j658943
40156H29060j709026j660121q80771N89790J340086j9339k418544k664456M90094
40147f103227L824652L352468n7321j545884Q68080L347322J859227j905885l194331
40138D45101j245314L6361j494514k918629j102977K159318K861572R07591j23452
$$ y = [-6351027, -8340220, -5301504, -544421, 1542118, 1481144, 2366250, 4016891, 3843059, 2253388, 2444773, 4713567, 5502060, 3332137, 1615486, 3264158, 5802776, 5076474, 1710546, 98768, 1628413, 2726141, 535538, -2621196, -2600007, 694757, 3587375, 4179412, 4665627, 7235280, 10093007, 9692651, 5809607, 2000839, 1027484, 1929232, 2340593, 1935756, 2178940, 3636715, 5105737, 5277930, 4137143, 2488003, 829060, -879966, -2540087, -3420858, -2831068, -1490982, -1510321, -3928865, -6593321, -6103227, -2278575, 1073893, 1016572, -529312, 338768, 3686090, 5545317, 3639432, 445101, -800213, -763852, -2258366, -5176995, -6279972, -4120654, -1259082, -351491, -474943]
40129d74943J029692J444648p48304k869457j899957N93510J105580j03787N0712
40120a872306J721704J812867k36365j001126Q98845J683902j600853n464485
40112d057817m473332O47626L838905K056924j247882j559787J075319L223481
40104d96563K779384R35442J23193Q71457J061686j088220l662215k820051J362361
40095i33526L802067J350030k174663j519779J870257K216472j256476l041362
40087C13020j6107L973184M138970R37580k233389l830820l936919k315272M33012
40078b536741K141950J998916J939911K937965K593600q44940m665991n196814
40070a632144l042284j400778r39609m4406J174935J060095p2692k64483N51243
$$ y = [-474943, 554749, 1999397, 1251093, -1618364, -3518321, -2924811, -1819231, -1923018, -1872306, -150602, 1662265, 1425900, 424774, 1323619, 3007521, 1406668, -4057817, -8531149, -7883523, -4044618, -1987694, -3235576, -4795363, -3720044, -496563, 2282821, 3218263, 3341456, 4212913, 5274599, 4186379, 524164, -2295887, -933526, 2868541, 4218571, 2043908, 524129, 2394386, 4610858, 3354382, 313020, 296913, 4270097, 8409067, 9346647, 7113258, 3282438, -654481, -2969753, -2536741, -394791, 1604125, 3544036, 6482001, 9075601, 8230661, 3564670, -1632144, -4674428, -6075206, -7014815, -7059221, -5884286, -4824191, -4896883, -5161366, -4610123]
40061d610123P62413N08565J331801K503667J541261j148675k019073J08157J933318
40052I11311P97243j324092j168175J052184K663435K399191R77633o34276j411730
40043D262724k06908K222231K426928j764776p130309p803948k509328L405048
40035g098338M223706L92198k702018j459427K243069M152666K754593P2727j769310
40026H09866k758554l264400k122726J588455N745180O544793L039970j455080
40018H127504l127073j488428J104285K369426J712146R174j326819j693418k042896
40009C643901l426135m812338l924135o27148K351630K929758K023520J241863
40001e99084L03660j335172k092511j90007K911722L734669J340057j613907k486314
$$ y = [-4610123, -3847710, -3339145, -2007344, 496323, 2037584, 888909, -1130164, -1022007, 911311, 1708554, 384462, -783713, 268471, 2931906, 5331097, 6308730, 5674454, 4262724, 4055816, 6278047, 8704975, 6940199, -190110, -7994058, -10503386, -7098338, -2874632, -2482434, -5184452, -6643879, -4400810, -248144, 2506449, 2579176, 809866, -1948688, -5213088, -7335814, -5747359, -2179, 6542614, 9582584, 8127504, 5000431, 3512003, 4616288, 6985714, 8697860, 8707034, 7380215, 5686797, 3643901, 217766, -4594572, -8518707, -9145855, -6794225, -3864467, -1840947, -599084, -295424, -1630596, -3723107, -3913114, -1001392, 2733277, 4073334, 2459427, -26887]
39992b6887j304315L93227J409142J185364k4370q64950k97407N74431p1847j502693
39982e30305j114746J018629J369812j540329l876767j785078K252772K472453
39974a733559j567472m042964j447341K280019J929236j009928p63117L707414
39966b647712O762974M035894j531711l975454k113861R6297j11833j147607p52529
39957a385542J86471n46598k611235l427635j878585M57749K003648L132636M407599
39948C38508M451873J541820l044557n343211l212398Q83992K939937K266331
39940H22295J387895J557905J115310p79526j612331P56357L770211L140900n54901
39931I604115k260516J0659K200459P52612j786808j167513J519163J719548j159758
$$ y = [-26887, -1331202, -937975, 471167, 1656531, 1632161, 767211, 469804, 1044235, 972388, -530305, -1645051, -626422, 743390, -796939, -4673706, -6458784, -4206012, -1733559, -3301031, -7343995, -8791336, -6511317, -4582081, -5592009, -6355126, -2647712, 4115262, 8151156, 6619445, 2643991, 530130, 626427, 514594, -633013, -1385542, -1199071, -1745669, -4356904, -7784539, -9663124, -9205375, -7201727, -4069091, 338508, 4790381, 6332201, 3287644, -2055567, -5267965, -4383973, -1444036, 822295, 2210190, 3768095, 4883405, 4103879, 2491548, 3247905, 7018116, 10159016, 9604115, 7343599, 7354258, 9554717, 10307329, 8520521, 7353008, 8872171, 10591719, 9431961]
39922I431961l068436j926624k66044l51199r53641p09565p83271j716577j088343
39913a431739K392687N134919K928587k542676n405540l304090K22514J218148
39905g87190j62290j414495j195202K05754J941629K963232K623286J590312R23119
39896F688155J80154j644106l188329j506453L070870N663060K706108k931013
39888I038446n429891l319307l35832L08676p62176j756576k405396k595573j006915
39879h264544K607800N436342M469529P09542j832303j278593J78291p4277j576772
39870C75015k076696p36663J346336K776567K660815P20287j879758k647077n11431
39861B7395K159302K342541O71419L52504J790151J592043j824608m853338l469709
$$ y = [9431961, 6363525, 4436901, 4170857, 3819658, 2866017, 2156452, 1373181, -343396, -1431739, 960948, 6095867, 9024454, 6481778, 1076238, -2227852, -2005338, -787190, -949480, -2363975, -3559177, -3353423, -1411794, 1551438, 4174724, 5765036, 6688155, 6868309, 5224203, 2035874, 529421, 3600291, 9263351, 11969459, 9038446, 3608555, 289248, -46584, 262092, -500084, -2256660, -4662056, -7257629, -8264544, -5656744, -220402, 4249127, 4958669, 3126366, 1847773, 2026064, 1951787, 375015, -1701681, -2438344, -1092008, 1684559, 4345374, 5065661, 3185903, 538826, 27395, 2186697, 4529238, 5200657, 5553161, 7343312, 8935355, 7110747, 2257409, -1212300]
39852a212300Q51374L040400J038665k424586l980111k742637L60561L552835
39844a515799M398169J747588j960187k723804J5450K571704J944899o32330k092152
39835A753538j465683p7565O97509N63112R3338J18299N55420L995k060730l256454
39825c075221j004733K883565L699399N56016k170174j602774m33564j552235
39817b699721k685613n43636K847880L071073O53243j8765J655773J665219j257269
39808B688184l060409j140242J187500J17142k442913j974039J540573L588028
39800E03824J578839j943998k955912o43617K287782K840995O88862j652326j516018
39791h11569Q96837K615043J358666j671860l147654j481645J399176K386540
$$ y = [-1212300, -360926, 2679474, 3718139, 1293553, -2686558, -5429195, -5068634, -1515799, 2882370, 4629958, 2669771, -54033, -38583, 2533121, 4478020, 3845690, 1753538, 287855, 210290, 907799, 1470911, 1564249, 1682548, 2237968, 2241963, 181233, -3075221, -4079954, -1196389, 2503010, 3059026, 888852, -713922, -1147486, -2699721, -5385334, -5928970, -3081090, -10017, 643226, 624461, 2280234, 3945453, 2688184, -372225, -1512467, -324967, -207825, -2650738, -4624777, -3084204, 503824, 2082663, 138665, -2817247, -3460864, -1173082, 1667913, 2356775, 704449, -811569, 85268, 2700311, 4058977, 2387117, -760537, -2242182, -843006, 1543534]
39783A543534Q72167n99881L28899K649436L376648J686891l83115j637389l356445
39774D480745n744260n703096j220107M132008M993715J472863j476425j447642
39766e12199q39533j372561j258684M47545J189558o30511k214965o75965K140117
39757c727198K655664J080268K03890M03727j83339j454028j278036M62020J403666
39748d33366P77186O58823K047976K538780j97811m374811n653062k271765K879400
39739d028650N476067M150706J150057r10165j768668k443760k745442j705837
39731b825692m614L87989o87251j195586l53755N9536r47852j559675l30240J100842
39721f356298Q53244J46752R94670K459803K389135J375606J507638K212079J061942
$$ y = [1543534, 2415701, 1815820, 2144719, 4794155, 8170803, 9857694, 9474579, 7837190, 4480745, -1263515, -6966611, -8186718, -4054710, 939005, 2411868, 935443, -512199, -1351732, -2724293, -3982977, -3535432, -2345874, -2976385, -5191350, -5867315, -3727198, -1071534, 8734, 212624, 616351, 433012, -1021016, -2299052, -1837032, -433366, 343820, 1002643, 3050619, 5589399, 5391588, 1016777, -4636285, -6908050, -4028650, 1447417, 5598123, 6748180, 5838015, 4069347, 1625587, -1119855, -2825692, -2830306, -2442317, -3129568, -4325154, -4678909, -4619373, -5567225, -7126900, -7457140, -6356298, -5503054, -5356302, -4361632, -1901829, 487306, 1862912, 3370550, 5582629, 6644571]
39712F644571j712408l229390k563893j809285k053042j703424J95494K020934
39704d210443K234255J480018P99997o493j069970j564573j238233r06109n04417
39695d985968J210605L903683M807290K204941j967692m539357m627012l323397
39687g316907j408242Q36506K532781K713117J641854N52781K64892N47612M74678
39678H39072o61108k138903j929863O57852K994467J962643j314831k346744M30065
39669a507350L171046K065209j348751k703825q63363J194706P50077j658423
39661i00674l443225k725843k5298K080877J597901k39104l52348J649109K528071
39652A69466L38566k177190j552871J019277J532849o46657k040158n55389J691548
$$ y = [6644571, 4932163, 1702773, -861120, -2670405, -4723447, -6426871, -6231377, -4210443, -1976188, -496170, 303827, 297334, -772636, -2337209, -3575442, -4481551, -4985968, -3775363, 128320, 4935610, 7140551, 5172859, 633502, -3993510, -7316907, -8725149, -7888643, -5355862, -2642745, -1000891, -448110, -183218, 364394, 839072, 177964, -1960939, -3890802, -3232950, -238483, 1724160, 409329, -1937415, -1507350, 1663696, 3728905, 2380154, -323671, -1187034, 7672, 757749, -900674, -4343899, -7069742, -7095040, -5014163, -3416262, -3655366, -4007714, -2358605, 169466, 508032, -1669158, -3222029, -2202752, -669903, -1316560, -3356718, -3912107, -2220559]
39643b220559K100435J283844J228782J742845J033035r69355k076245r84436
39635A138346N75028r0936k942933m814439l118963R19215L667118L279042J331425
39626e7097L39993R52696J993233K143555R47361j010133k361877k103396q19571
39617B4764O243R729J32678O60227O40755j96617o21667O5528P48101M10725j16814
39606A763652K56255Q48085M00311o55377q41519J7776O17965M9474j293945k364312
39596a201635k188740n14625J527841K175143J170874J95782M36585J000851O97599
39587C299675r3980o18207j265688k294194k538640j356798m56074j391580k349104
39578i064590k81660M108698O407819L995035p54612l568592k905991o52307O27508
$$ y = [-2220559, -120124, 1163720, 2392502, 4135347, 5168382, 4199027, 2122782, 1138346, 1713374, 1622438, -1320495, -6134934, -9253897, -8334682, -4667564, -1388522, -57097, 282896, 1235592, 3228825, 5372380, 6319741, 5309608, 2947731, 844335, 24764, 31007, 40736, 173414, 833641, 1474396, 1277779, 656112, 721640, 1469741, 1880466, 1763652, 2019907, 2867992, 3268303, 2612926, 1771407, 1789183, 2407148, 2456622, 1162677, -1201635, -3390375, -3905000, -2377159, -202016, 968858, 1164640, 1601225, 2602076, 3299675, 3205695, 2587488, 1321800, -972394, -3511034, -4867832, -5323906, -6715486, -9064590, -9346250, -5237552, 1170267, 5165302, 4410690, 842098, -2063893, -2716200, -2088692]
39569b088692K47890l79383K72881J776557K297742J304183L32988L54793J27317
39560D246276j374176k631515j868348l07742m63995j901563j589022J438554
39552d451531M367358M233091J388671j345988j691752L31106K605954K751555
39544H188464N83320j525241j538417k65269J39565p88258j812639k180941k112931
39535a312347j728830j060802n18832l8189J225332L015620L330443J429949k99695
39526D042649K17233J314358M17058j515301j811834q28313r58464j992480j646715
39517b761809r6109L22523l74695l1460R83422P8184k136198j724247J959319
39508c781070M292590K086126j821120l007087j117952J190812K113653J496446
$$ y = [-2088692, -1840802, -2220185, -1947304, -170747, 2126995, 3431178, 3764166, 4118959, 4246276, 2872100, 240585, -1627763, -1935505, -2399500, -4301063, -5890085, -4451531, -84173, 4148918, 5537589, 4191601, 2499849, 2830955, 5436909, 8188464, 8771784, 7246543, 5708126, 5442857, 5582422, 4794164, 2981525, 800584, -1312347, -3041177, -4101979, -4620811, -4659000, -3433668, -418048, 2912395, 4342344, 4042649, 4259882, 5574240, 5991298, 4475997, 2664163, 1835850, 877386, -1115094, -2761809, -2857918, -2535395, -2910090, -2941550, -1958128, -1879944, -4016142, -5740389, -3781070, 511520, 2597646, 776526, -2230561, -3348513, -2157701, -44048, 1452398]
39500A452398J75052p9650J744006L588630K458761r16934k962799k794088k594347
39491G1029k373944K22124L919133L723830r93671m317099k620677K73706K88964
39482a806605n11615Q21969K100206N34810j562988j185336k81500j312730j604879
39473d808668J539700M299969K021004k131486j904784J474985J685159j623872
39465E52007k705415P001J920612R75632L61960J379313R95009j674436l136059
39456a324376j825350o15801j072747r09970R28962K199990K159279K842633L821521
39447F204141J704620k903307m213784j20229L685578K224355j538881k213430
39439B829063Q560J436890J092936L35683n90580j571644r61927J464766K612281
$$ y = [1452398, 1627450, 1547800, 3291806, 6880436, 9339197, 8422263, 5459464, 2665376, 71029, -2302915, -2080791, 1838342, 5562172, 4568501, 251402, -2369275, -2095569, -1806605, -2318220, -1496251, 603955, 1138765, -424223, -1609559, -1891059, -3203789, -4808668, -3268968, 1031001, 3052005, 920519, -984265, 490720, 2175879, 552007, -2153408, -2146407, -225795, 749837, 1111797, 2491110, 3486119, 1811683, -1324376, -3149726, -3765527, -4838274, -5748244, -4819282, -2619292, -460013, 2382620, 6204141, 7908761, 5005454, 791670, 671441, 4357019, 6581374, 5042493, 2829063, 2837623, 4274513, 5367449, 5703132, 5112552, 3540908, 2578981, 4043747, 6656028]
39430F656028M68864k318382k480672r18716k61543m88774k59116J17221J76275
39421F91185J009009K509366K002932j272275l658544k411067J762N61934P39696
39412A73998K507108L344172O35497k402890j281293J963021J914165j290155
39404E563623k778937j340809k58201m44461M48933K058592J202401j541441j722343
39395A187357J194309K329326l37222k379892m25994K391101J998690l88851j504155
39386D064669j517778k196648k679469j203170J114539J888503J254369R00376
39378A625391P65935l32048j932129k526664k099958j710979j254043K20765K433149
39369d810581L919994L872334K682411J116446j14595n60104m99696n43434n83483
$$ y = [6656028, 7124892, 4806510, 2325838, 1407122, 1145579, 656805, 397689, 514910, 691185, 1700194, 4209560, 6212492, 4940217, 1281673, -1129394, -1127632, -565698, 173998, 2681106, 6025278, 6660775, 4257885, 2976592, 4939613, 6853778, 5563623, 2784686, 1443877, 1185676, 741215, 1190148, 3248740, 4451141, 2909700, 1187357, 2381666, 4710992, 4373770, 1993878, 1567884, 3958985, 5957675, 5568824, 4064669, 2546891, 350243, -2329226, -3532396, -2417857, -529354, 725015, 1625391, 2391326, 2059278, 127149, -2399515, -4499473, -6210452, -7464495, -7243730, -4810581, -890587, 2981747, 5664158, 6780604, 6666009, 6105905, 5606209, 5062775, 4479292]
39360D479292l05185o12295k542071m615485l909234n21805J923566J527875P67314
39351c808028J914887K998574J362111j336185j476974P34288J747471K56615
39343B392759j403045j440737q04563o56013n67933j07589J61232J45834O68117
39334a611938J649513J764206O94534j66897j46562m03745j372820j180169J329744
39325E55866L536630J798060l083546n922913l520933J176674K848701K90345
39317b321116k917177l546678k034697k60444J400145L109843L620406J913703
39309a036015j55428J61393J968161J393965k307237m624450j924821K984001
39301c540431M608897K374858O26266J495177J990253m97447l401006k563420
$$ y = [4479292, 4174107, 3561812, 1019741, -3595744, -7504978, -8026783, -6103217, -4575342, -3808028, -1893141, 1105433, 2467544, 1131359, -345615, 388673, 2136144, 2392759, 989714, -451023, -1255586, -1911599, -2479532, -2587121, -2425889, -2280055, -1611938, 37575, 1801781, 2496315, 2329418, 2182856, 1779111, 406291, -773878, 555866, 4092496, 5890556, 2807010, -3115903, -6636836, -5460162, -2611461, -2321116, -5238293, -8784971, -10819668, -11080112, -9679967, -6570124, -2949718, -1036015, -1191443, -1030050, 938111, 2332076, 24839, -4599611, -6524432, -3540431, 1068466, 3443324, 4069590, 5564767, 7555020, 7057573, 3656567, 1093147]
39293A093147J359494L441999J180247k268744k534908K68325K026342N6361l622536
39284I99727m757748j670523K950425M775707K096906k525752m877284l417103
39276f425645o00234M54203k30391k16562J444200L096793L442899L191611K732856
39267F889730P59335k744146m554775k388669P28367K09580k876916k986226J201785
39258e761935M282049K231046j596789j857560J028651K642844J608752L18124
39250B895182j19264j088718k708555k898387r52067J146871J834094J693886
39242a96958J339587K24120j443037j999628o87743J307273K951581M217716M158346
39233I871257J170930l255501m320805k37276L911889K374832k970423m959764
$$ y = [1093147, 2452641, 5894640, 7074887, 4806143, 2271235, 2539560, 4565902, 4622263, 999727, -3758021, -5428544, -2478119, 2297588, 4394494, 1868742, -3008542, -6425645, -7025879, -6571676, -6802067, -7018629, -5574429, -2477636, 965263, 4156874, 6889730, 7649065, 4904919, 350144, -2038525, -1310158, -1100578, -3977494, -6963720, -5761935, -1479886, 751160, -845629, -2703189, -1674538, 968306, 2577058, 2895182, 2775918, 1687200, -1021355, -3919742, -4871809, -3724938, -1890844, -196958, 1142629, 1366749, -76288, -2075916, -2763659, -1456386, 1495195, 5712911, 9871257, 11042187, 7786686, 3465881, 3228605, 7140494, 9515326, 6544903, 1585139]
39225A585139j267158K654869J866179j439642k430437j112317r88409k145257
39217c277033q65933L408198N594882K054564l327953m059147k14174J923363
39209A236767n88067l005326l67303M611536N233513M59639l902099l646648j166367
39200a134355k93222k65462J643923M077234K823611k232420n706758l623872
39192d711321J477973M359759L524073J333688m13510j816302k612795k010776
39184h69211j004763j703560l484207k884382J111086M616996M073094J380776
39176A235829O49385J804424J473217p11253j261865J220774L507926K684394
39168A0602831Q9995j632665k318295k824234k597480j351025p85176j824514
$$ y = [1585139, 317981, 2972850, 4839029, 3399387, 968950, -143367, -1131776, -3277033, -4142966, -734768, 4860114, 6914678, 3586725, -472422, -686596, 1236767, 648700, -2356626, -2723929, 1887607, 7121120, 7580759, 3678660, 32012, -1134355, -1427577, -1693039, -49116, 4028118, 6851729, 4619309, -1087449, -4711321, -3233348, 1126411, 4650484, 5984172, 5570662, 3754360, 1141565, -869211, -1873974, -3577534, -7061741, -9946123, -8835037, -4218041, -144947, 1235829, 1885214, 3689638, 5162855, 4451602, 3189737, 4410511, 7918437, 10602831, 10692826, 9060161, 6741866, 3917632, 1320152, -30873, -816049, -2640563]
39160b640563k322042n26158J371937P22635o26737P20597L296433K573904j170106
39151A399900k524693M68347L011676J239973j854032j723553O95409J621548
39143B334575R21266J008067J297503q99804m586246n330574j974143J290137
39135e939219R13445j511306k400585q25214J804207M103677M829921K929074
39127C904000m01295j701838M12074K708939J674292j315333k306529r88156o27736
39118A358418j955644j545918K178035N256054L484936j248745l526519j866186
39110B134431J84768R3048m71063M83145J698848J244525J70704O76339J991659
39101H206404J275193j618161l332744j790250P68504J080110o61124j677367
$$ y = [-2640563, -4962605, -5488763, -4116826, -3394191, -4020928, -3300331, -3898, 2570006, 1399900, -1124793, -656446, 2355230, 3595203, 1741171, 17618, 713027, 2334575, 3255841, 4263908, 5561411, 4661607, 75361, -5255213, -7229356, -5939219, -5025774, -6537080, -8937665, -9762879, -7958672, -3854995, 974926, 3904000, 3502705, 1800867, 2212941, 4921880, 6596172, 5280839, 2974310, 1986154, 1358418, -597226, -2143144, 34891, 5290945, 8775881, 7527136, 4000617, 2134431, 2319199, 2412247, 1941184, 2424329, 4123177, 5367702, 5538406, 6214745, 8206404, 9481597, 7863436, 4530692, 2740442, 3508946, 4589056, 3927932, 2250565]
39093B250565q84616M1493k82826j050047j037304m73306l9889N52521J528040
39084F04631J685010l7844k210805k284917k98168J087128P08336M52510J439760
39075A145641J494698j039919l327065j595803K555287L742290P12289j796262
39067A891156l62759K206543J693909j399330l686290l989840l050370m98070
39059g195051L765170O691048M969024J97475k831636k599679j537625o85567
39051G73159J329955L466134K006282k714833m566373j64265N190683M673456
39043I994198k68076k650844n41045J031834j343135m584350m524777j822731
39035d708926J79247N45403P76941J481464J828147J651071J713957J866305Q95287
$$ y = [2250565, 1365949, 1407442, 1124616, 74569, -962735, -1436041, -1475930, -923409, 604631, 2289641, 2251797, 40992, -2243925, -2542093, -1454965, -746629, -294119, 1145641, 2640339, 1600420, -1726645, -3322448, -767161, 2975129, 3687418, 1891156, 1528397, 3734940, 5428849, 4029519, 343229, -3646611, -6696981, -7195051, -3429881, 3261167, 8230191, 8427666, 5596030, 2996351, 1458726, 773159, 2103114, 5569248, 7575530, 4860697, 294324, 130059, 5320742, 9994198, 9726122, 7075278, 6534233, 7566067, 6222932, 1638582, -2886195, -4708926, -4529679, -3984276, -3207335, -1725871, 102276, 1753347, 3467304, 5333609, 6228896]
39026F228896j192985k247399n40622K417944L112055K86218l320010m349339
39018C94758k782392j006541J32212J847104L937901L820095N39887k714057k492274
39009A676693J71485J547203O30453k03610M08368R04500r7597j427542j393269
39000B216684l79141l927p36778j496889j114280M15683J797625J561234j20667
38991B139544j167979j32157J626406J793824M88314l21640l94097j438992l446861
38982h53638l871802j716235M51253M31955k79878M63767J506049O53292r23183
38973d138420m24842J353971Q64154j924616k590217P60958L697715J737109k623694
38964c287882l246761Q15605M316559L646275J261945P39052J232210o7640k454352
$$ y = [6228896, 5035911, 2788512, 2247890, 4665834, 7777889, 8064107, 4744097, 394758, -2387634, -3394175, -3261963, -1414859, 2523042, 6343137, 6883024, 4168967, 1676693, 1848178, 3395381, 4025834, 3822224, 4230592, 5135092, 5037495, 3609953, 2216684, 1837543, 1833616, 1096838, -400051, -1514331, -1098648, 698977, 2260211, 2139544, 971565, 839408, 2465814, 4259638, 4747952, 4426312, 4032215, 2593223, -853638, -4725440, -6441675, -5990422, -5558467, -5838345, -5374578, -3868529, -3215237, -4138420, -4563262, -3209291, -2345137, -4269753, -6859970, -6099012, -2401297, -664188, -3287882, -6534643, -5719038, -1402479, 2243796, 3505741, 4244793, 5477003, 5409363, 2955011]
38955B955011k592347n5095J828747J079441l55718l33142K05744l23664r45372
38946A463605o4864J140669M01676j492350j507519P42491K091435N06037k064565
38937A216615k685679j064158J090496K428438K364900Q11641j137536j701936
38929A322781p63990j86867p34325o88979R34693K044452O62148j444587j221963
38920g6637R00567J841247O51277p94972j487283k190127k536283q45849K222499
38911b315561L245775Q54372j927524k039347m94636O5558l47154J01790J528969
38902a327758K323102J782039M81168j184227k679474k408088N02726L976277
38894A465765M873439K915454O42613k74911m60946o76323o10041j71466N3841
$$ y = [2955011, 362664, 307569, 2136316, 3215757, 2860039, 2526897, 2732641, 2408977, 1463605, 1398741, 2539410, 2941086, 1448736, -58783, 683708, 2775143, 3281180, 1216615, -1469064, -2533222, -1442726, 985712, 3350612, 4162253, 3024717, 1322781, 558791, 371924, -362401, -1051380, -116687, 1927765, 2589913, 1145326, -76637, 823930, 2665177, 3316454, 2521482, 1034199, -1155928, -3692211, -4538060, -2315561, 930214, 1784586, -142938, -2182285, -2676921, -2611363, -2958517, -2856727, -1327758, 995344, 2777383, 3258551, 2074324, -605150, -3013238, -2510512, 1465765, 6339204, 9254658, 9897271, 9622360, 9161414, 8485091, 7875050, 7703584, 7757425]
38885G757425K6425J61040k5347j136472j850715k42281K568659L038020L43512
38876A0640266k112077j764635m47143q23281k043017j695785K8603J085055R43376
38867C811362M24696m45469j609704j367367J305346L932786L324978L20920j646316
38858H051232j867207k342435l035072j742122R80350J624072k63534o73444K070126
38849B801966L707281N49928m225793m940903j476195J325010Q30990q48943r60435
38840c237094O84650K652926L587904K918622J457542P60636P84664l08817k653987
38831F647046l353077r14208J554785P89668j337211r35101J406269J892994J08304
38822E859469p52244J42728K38711j056583j138636N96182J245986k77970j117695
$$ y = [7757425, 7783850, 7944890, 7919543, 6783071, 4932356, 4690075, 7258734, 10296754, 10640266, 8528189, 6763554, 6316411, 5493130, 3450113, 1754328, 1782931, 2867986, 3811362, 4236058, 3790589, 2180885, 813518, 2118864, 6051650, 9376628, 9697548, 8051232, 6184025, 3841590, 806518, -935604, 44746, 1668818, 1405284, 731840, 2801966, 6509247, 7059175, 2833382, -2107521, -3583716, -2258706, -1427716, -2276659, -3237094, -2552444, 100482, 3688386, 6607008, 8064550, 8825186, 9609850, 9301033, 6647046, 3293969, 2379761, 3934546, 4724214, 3387003, 2451902, 3858171, 5751165, 5859469, 5107225, 5249953, 5488664, 4432081, 3293445, 3889627, 5135613, 4857643, 3739948]
38813C739948L05906J480893P12842L77016K099991K905072J78993l009637k173788
38804F617236J487354K995097J055522j013419j072430m53614l45463J91295J653511
38795A1115089K474457J256050j102253k420556j537049N70655J517032q007k170055
38786I695363j916493M92823J334175q84937k661794r69977J596980J003463j350839
38777F338764q59967K391031L396410K36965k824795j932354R42464J724538L08863
38768I721919r1951J921675M148730L877398J137237j528372k123811j508899
38760A5553926j826752k828784j873724J465204L495505J449639k012624k585591
38752A0836799m98818R98871J457190K665684L503943J062482l146406m005362
$$ y = [3739948, 4045854, 5526747, 6239589, 6616605, 8716596, 11621668, 11800661, 8791024, 6617236, 8104590, 11099687, 12155209, 11141790, 10069360, 9615746, 9270283, 9461578, 11115089, 13589546, 14845596, 13743343, 11322787, 9785738, 10356393, 11873425, 11865418, 9695363, 7778870, 8271693, 9605868, 8720931, 6059137, 5089160, 6686140, 7689603, 6338764, 5478797, 7869828, 11266238, 11503203, 8678408, 6746054, 7688518, 9413056, 9721919, 9629968, 11551643, 15700373, 19577771, 20715008, 19186636, 17062825, 15553926, 13727174, 10898390, 9024666, 10489870, 13985375, 15435014, 13422390, 10836799, 10337981, 11336852, 12794042, 15459726, 18963669, 20026151, 16879745, 12874383]
38744A2874383p39356J760155J047260M64357J967354J999264j479823l672235
38736A4221359p3737N586643O579246L060856M74493M15671k81301k399183k900844
38727B4683203j030534K7936j079358j447569Q82352L459446L367926J341214
38719C0204616k68958r47306j229118o16594J379776L391130L365543J087785
38711C6366874j565256k410035n78269K739313M797025L630569M27636j336428
38703D2071429L88274M047490O225575M949753J315015j486102r26874K384921
38695E8969481N309206N696355M410448L221892K333546J484697J682329L339726
38687H6447680M087933J615743k018503k411429Q38700L354622K204439n26908
$$ y = [12874383, 12135027, 13895182, 14942442, 15406799, 17374153, 19373417, 17893594, 14221359, 14147622, 19734265, 26313511, 29374367, 29848860, 30264531, 29983230, 27584047, 24683203, 23652669, 23680605, 22601247, 21153678, 22036030, 25495476, 28863402, 30204616, 29935658, 28988352, 27759234, 27142640, 28522416, 31913546, 35279089, 36366874, 34801618, 32391583, 31813314, 34552627, 39349652, 42980221, 43407857, 42071429, 42459703, 46507193, 52732768, 57682521, 58997536, 57511434, 56584560, 58969481, 64278687, 69975042, 74385490, 77607382, 79940928, 81425625, 83107954, 86447680, 90535613, 92151356, 90132853, 87721424, 88560124, 91914746, 94119185, 93592277]
38679I3592277j589880p39186O89466K420520M191559M474560K801302J579708
38671A07420326L041942N734357O523683N023293L548252L508382M431361O047700
38663A45279296Q555496J0723908J0502632Q359502P674773J0461534J4465377
38656B16022518J6124303J5090940J3934322J4169952J4807082J4838535J4913698
38649C19901350J5592499J5749842J4272743J2067219J0485476Q702802N081716
38642D01853647P52073j147409l94516q09054m921307j0293799j3409658j4683212
38634C56946765j6492003j8242552j7419716j4701098j3753816j5566716j6857665
38627B43913199j5231320j2503137j1262541j1081532j0215866q774037p978824
$$ y = [93592277, 92002397, 91263211, 91952677, 94373197, 98564756, 103039316, 105840618, 107420326, 110462268, 116196625, 122720308, 127743601, 131291853, 134800235, 139231596, 145279296, 153834792, 164558700, 175061332, 183420834, 191095607, 201557141, 216022518, 232146821, 247237761, 261172083, 275342035, 290149117, 304987652, 319901350, 335493849, 351243691, 365516434, 377583653, 388069129, 396771931, 401853647, 402605720, 401458311, 401063795, 400254741, 395333434, 385039635, 371629977, 356946765, 340454762, 322212210, 304792494, 290091396, 276337580, 260770864, 243913199, 228681879, 216178742, 204916201, 193834669, 183618803, 174844766, 166865942]
38620A66865942p938042q136982q736693r528413q958237o244644l471941l473056
38612A10377934o105405q423777q299299o324898m260467l038365k569760k521591
38604F8834372k778851l367529m074359m347941l920525l235992k637457j624784
38596D2846934J6504R50889j54234k156572k645729j633583j575174l233742m238472
38587B8176821k895986q29746j46452k62362M28429J587547J749939O86346q76697
38578B7617839k514747l512092k698495n28032O37359J34704M84447K895709M071224
38569B6587916J020624l349171l958025j259588o3887j339497j016169K217103
38561A8839306L867607J032344k251716j091830K496611K724038j154580m187887
$$ y = [166865942, 158927900, 150790918, 142054225, 132525812, 123567575, 117322931, 113850990, 110377934, 104272529, 95848752, 87549453, 81224555, 76964088, 73925723, 71355963, 68834372, 66055521, 62687992, 58613633, 54265692, 50345167, 47109175, 44471718, 42846934, 42863438, 43814327, 43660093, 41503521, 38857792, 37224209, 35649035, 32415293, 28176821, 25280835, 24451089, 24304637, 24042275, 24470704, 26058251, 27808190, 28494536, 27617839, 25103092, 21591000, 18892505, 18364473, 19001832, 19136536, 19620983, 22516692, 26587916, 27608540, 24259369, 20301344, 19041756, 18977869, 17638372, 16622203, 18839306, 22706913, 23739257, 21487541, 20395711, 22892322, 25616360, 24461780, 20273893]
38553B0273893l411524j441188j429518k484684k306476j405961j639504k207031
38545C948007n89245K824133M498028L039182J466247K153780K495564q42247
38537A8993449n329087n071206K54266M066424K025609k190512l049751q88236
38529H810956N56357R33128K389711L846430J942258k484715m290503j528701
38521A0174921J580576J071646j313593j643831K54184J339534L1947k356388
38513I138996l889938l577325j315512J890290L877577K946365k64697l240042
38505E565714m066413l142294k272837k082787r09803K611553O132308N196129
38497G031570m96315n074460l487425J509788L061036k67422l082095j380274
$$ y = [20273893, 16862369, 15421181, 13991663, 11506979, 9200503, 7794542, 6155038, 3948007, 3358762, 6182895, 10680923, 13720105, 15186352, 17340132, 19835696, 18993449, 13664362, 8593156, 8847422, 12913846, 14939455, 12748943, 9699192, 8810956, 9367313, 10300441, 12690152, 16536582, 18478840, 15994125, 11703622, 10174921, 11755497, 12827143, 11513550, 9869719, 10123903, 11463437, 11495384, 9138996, 5249058, 1671733, 356221, 2246511, 6124088, 9070453, 8805756, 5565714, 1499301, -1642993, -3915830, -5998617, -6908420, -4296867, 1835441, 7031570, 6535255, 1460795, -2026630, -516842, 2544194, 2276772, -805323, -2185597]
38489b185597K297694L375083J282347j030150j110809J131577L612598L180582
38481A0553325j188215n681616n039519M47608M614386L439430j81882j682953
38473E280564j131485j208056j944296j352146M20840J175910J57782j227214
38465A71899j585314n13149J608553L224811K491139R0024q06550Q61029J930160
38456G472602j59573l036859k926740j87776K086157K896496L024087J847912
38448A1016306j187468l392121j877650J019638L44487l566071m950366j250553
38440c843798L098862L367662P58142n76398N47837K137651K486498J435364l41709
38431I070111j593521j294812k48373l91202j781970k190434n05288J564721K203222
$$ y = [-2185597, 112097, 3487180, 4769527, 3739377, 2628568, 3760145, 7372743, 10553325, 9365110, 3683494, -1356025, -908417, 3705969, 7145399, 6963517, 5280564, 4149079, 2941023, 996727, -355419, 65421, 1241331, 1399113, 171899, -1413415, -1926564, -318011, 2906800, 5397939, 5487963, 4681413, 5542442, 7472602, 7313029, 4276170, 1349430, 1161654, 3247811, 6144307, 9168394, 11016306, 9828838, 6436717, 4559067, 5578705, 5923192, 2357121, -2593245, -3843798, -744936, 2622726, 3380868, 2804470, 3352307, 5489958, 7976456, 9411820, 9070111, 7476590, 6181778, 5933405, 5542203, 3760233, 1569799, 1064511, 2629232, 4832454]
38422D832454J745104J080819M3784j175404j177544L35364J305142K46440j265574
38413E970585j025529L96595Q79325K18577K4169P62882J125009K53917j192592
38404G412938k348208l092811l443907l035207j568833O57924K712323L416850
38396G11069K330316O04043K4868P08904P69748q70753k436297j523747J216620
38387A534771K422517L06086k887237l576680j107304J811555K572989J284717
38379B361414l14025j130415q95560O57352K886667L254701j00465m663624n441664
38370c385619j620810J872255J427880l4534J711191M744264L733740j269207
38362G179160m307451k141801J652729K616825R95701o89174j827220k790872
$$ y = [4832454, 6577558, 7658377, 7702161, 6526757, 5349213, 5684577, 6989719, 7236159, 5970585, 4945056, 5341651, 6220976, 6439553, 6463722, 7226604, 8351613, 8605530, 7412938, 5064730, 1971919, -1471988, -4507195, -6076028, -5418104, -2705781, 711069, 3041385, 3645428, 3670296, 4379200, 5148948, 4278195, 1841898, 318151, 1534771, 3957288, 4263374, 1376137, -2200543, -3307847, -1496292, 1076697, 2361414, 2047389, 916974, 21414, 678766, 3565433, 6820134, 6719669, 2056045, -3385619, -5006429, -3134174, -1706294, -1740828, -29637, 4714627, 8448367, 7179160, 2871709, 729908, 2382637, 4999462, 5995163, 5305989, 3478769, 687897]
38354F87897k733640j115909N55167P90998K64685J80305L82134O31320J587603
38345A230560K844757K355791k27490k013853q62121J382782J951754J086878
38337G749058L57825n10764k101138k834714j387295M21985N93642O45675K379216
38328E313490L228650m22m299517l547721J671584L851579l74141n201764m621064
38319c979326q19050O66992k61279K66289K571881L195321J310071N8386J003544
38310D012829J791379O93031l64408N48376J636017P0405l358631n108676l653307
38301c732985q98092R71968J744824J946762J497741N70132J63102N84435N51912
38292C399799q93091k534232k435276n22240J634672K861552K729472Q10053k337509
$$ y = [687897, -2045743, -3161652, -2606485, -1815487, -1550802, -1370497, -988363, -357043, 1230560, 4075317, 6431108, 6203618, 4189765, 3327644, 4710426, 6662180, 7749058, 8106883, 7596119, 5494981, 2660267, 1272972, 1694957, 2288599, 2934274, 5313490, 8542140, 8541718, 4242201, 694480, 2366064, 6217643, 5843502, 641738, -3979326, -4798376, -4131384, -4392663, -4126374, -1554493, 1640828, 2950899, 3009285, 4012829, 5804208, 6497239, 6132831, 6681207, 8317224, 8387629, 5028998, -79678, -3732985, -4631077, -3659109, -1914285, 32477, 1530218, 2100350, 2263452, 2847887, 3399799, 2506708, -27524, -2462800, -2985040, -1350368, 1511184, 4240656, 5050709, 2713200]
38283B713200m089370k265388J292557K325952k03913k791765k525656o87215
38275f231598K35834L62187J078509K126665K474199K352863K035622K87469l231198
38266A490552n508652l375170J599716M594933L645902J194379m01733j488272
38258A751655k439690j709434J366850M010897K865865j238581l588266j157985
38250a38689L397247M519000M20956m359778m236887N28127M351985L616716N85665
38241H684342r41704p94371r22946j272200m49896R26247R45393j63606m16853
38232E594406L83998M32441p11917j268051j74040J332904J555217J81684j726833
38223E599809k391166o95401J793780J747897j170610k767443l58635K312032
$$ y = [2713200, -1376170, -3641558, -2349001, -23049, -226962, -3018727, -5544383, -6231598, -5995764, -5633577, -4555068, -2428403, 45796, 2398659, 4434281, 4721750, 1490552, -4018100, -7393270, -5793554, -1198621, 2447281, 3641660, 3239927, 1751655, -688035, -2397469, -1030619, 2980278, 5846143, 4607562, 1019296, -138689, 3258558, 7777558, 8198514, 3838736, -398151, 129976, 4481961, 8098677, 8684342, 7742638, 6948267, 6025321, 4753121, 4303225, 5229472, 6174865, 6011259, 5594406, 5978404, 6410845, 5698928, 4430877, 4256837, 5589741, 7144958, 7326642, 5599809, 3208643, 2513242, 4307022, 6054919, 4884309, 2116866, 1758231, 4070263]
38215D070263M70216l670395l919370J04534K652803J299241j76220L72965j66089
38206A037948l138235m175284n24848L384315K767149J36843N26825K879380K368222
38197E262315j197054l430289k516181p41328M03654J558335K272333J214688
38189B826473m04045j2855J620215J162557j509524k657063o37915J577936J224254
38180C190033m95983j117905m36788L53665O63973K40580j016828j902748p05623
38171a227624J881057K891310J182836q47346q15649O04008J510414J459899P99340
38162G438245n60992j945688j554277N58953J111707j989542n326788l666816
38154e935198K255002N513028J970406l751487m156292J136868N079612K892749
$$ y = [4070263, 4540479, 870084, -3049286, -2944752, -291949, 1007292, 831072, 1204037, 1037948, -2100287, -6275571, -6800419, -3416104, -648955, -512112, 14713, 2894093, 5262315, 4065261, 634972, -1881209, -2622537, -2218883, -660548, 1611785, 2826473, 2422428, 2409573, 4029788, 5192345, 3682821, 1025758, 387843, 1965779, 3190033, 2694050, 1576145, 1139357, 1493022, 2156995, 2397575, 1380747, -522001, -1227624, 653433, 3544743, 4727579, 3880233, 3064584, 3668592, 5179006, 6638905, 7438245, 6877253, 4931565, 3377288, 3936241, 5047948, 3058406, -2268382, -5935198, -3680196, 1832832, 3803238, 51751, -4104541, -2967673, 2111939, 5004688]
38146E004688j797364k555778J067367L855288K678704j86949j763795k359430
38138C942731l152762l130739j092441J527576K560573K240503J989885J672554
38130F557880O82351J74950J159022J729030l09191l052030k671966M26399J860827
38121F557272J9510j814019j277078n48632j882434l268149j780724J341143K493583
38112a59528J116071m0369N48602J403936J028109K13802M23039J320321J114793
38103F968776r69239l367399l749440j757603N97994J602707J717393J761856
38095B805045P39111k223837m762572l412389R67895L402988J590753q92361j82726
38086a968093K234776K514100O47810j81601P08450N40617j920776l952578k832900
$$ y = [5004688, 3207324, 651546, 1718913, 5574201, 8252905, 8065956, 6302161, 3942731, 789969, -2340770, -3433211, -1905635, 654938, 2895441, 4885326, 6557880, 7240231, 7415181, 8574203, 10303233, 9994042, 6942012, 4270046, 4696445, 6557272, 6576782, 4762763, 3485685, 2937053, 1054619, -2213530, -3994254, -2653111, -159528, 956543, 916174, 1464776, 2868712, 3896821, 4110623, 4533662, 5853983, 6968776, 5999537, 2632138, -1117302, -2874905, -2276911, -674204, 1043189, 2805045, 3544156, 1320319, -3442253, -6854642, -5886747, -2483759, -893006, -1785367, -1968093, 266683, 2780783, 3428593, 3246992, 3955442, 4496059, 2575283, -1377295, -4210195]
38077d210195K53472K066669J626127Q43809J365078K399727K124468L21012j341628
38068E448539j596127j077285q26235l13249J462549L428073L222654P80546j320446
38059I209019j945699l049386n435388n847662j664963L585575L942115k95381
38051a501770k473684P52089M444376K848466k112105m098093j742818L59846
38043c523693m05814j011787J346828M134050L408825L7838j796409q67551J31457
38034A453744m33086q89159K71473J821397K096609J434197P84766m9637j195306
38025E294998j582995p27360N2594j82990m07729L4667l22121k145298k870982
38016b857216l36232L014135L255071R21282l02699J84978k70132j833559j566996
$$ y = [-4210195, -3956723, -1890054, -263927, 579882, 1944960, 4344687, 6469155, 6790167, 5448539, 3852412, 2775127, 1948892, 1635643, 3098192, 6526265, 9748919, 10529465, 9209019, 7263320, 4213934, -1221454, -7069116, -8734079, -5148504, -1206389, -1501770, -3975454, -3223365, 1221011, 4069477, 1957372, -2140721, -3883539, -3523693, -3929507, -4941294, -3594466, 539584, 3948409, 3986247, 2189838, 1322287, 1453744, 1020658, 131499, 402972, 2224369, 4320978, 5755175, 6539941, 6490304, 5294998, 3712003, 2984643, 3037237, 2854247, 2446518, 2481185, 2159064, 13766, -2857216, -3193448, -179313, 3075758, 3997040, 3694341, 3879319, 3609187, 1775628, 208632]
38007B08632O74295J165812j024803j654027J451426L786110J034271l566159
37999B075557l905411k16278J995021O91913p27360k6459P13685k90714j263188
37990i53234l19022J097103O78229q95923r57158J177193L030126J824911k162532
37981B519693n360236m403024o6510L288813K882109O64549m9818O84668N77469
37972G37713m18888k37569J022811P41353j518243k559721n34879J802321J327056
37963C61954n36715l57551J526620J618471o89953j616858J237595M856516M937126
37954A1337205J927203j34948J55513M3641k188372l968768k488505M98163R60068
37945F141200j601173l835484l602595k093480o71018J051296K897300L007033
$$ y = [208632, 882927, 2048739, 1023936, -630091, 821335, 4607445, 5641716, 2075557, -1829854, -2046132, -51111, 640802, -86558, -113017, 600668, 309954, -953234, -1272256, -175153, 503076, -392847, -1350005, -172812, 2857314, 4682225, 2519693, -2840543, -7243567, -7310077, -4021264, -1139155, -474606, -524424, 160244, 737713, 318825, 81256, 1104067, 1845420, 327177, -2232544, -2767423, -965102, 361954, -174761, -532312, 994308, 2612779, 1922826, 305968, 1543563, 6400079, 11337205, 13264408, 13129460, 13284973, 13328614, 11140242, 7171474, 4682969, 5181132, 6141200, 4540027, 704543, -2898052, -4991532, -5662550, -4611254, -1713954, 1293079]
37937A293079Q43474j161080r68355J48814Q9438o60986l93104P38582J381355
37928A311217J328805R32201l46680k380838k929407n31023K486170K856447J045911
37919C772803p6804k3721m49395j025353J50153K106223J435206k044327m297780
37910d52995l126548j219298j226511j533263L53267L194797L920522K173326
37902B083297J48410o86835l15495J017022K334875J496386k220849n843349n498070
37893g484608j277923K787583L626196K118514R56560J203567J779978J403143
37885E113010R3609j169156j760239j903512j805732j070766K77370R20860k13935
37876a518491j883495j683872O24899K660695K622541J223742r7055j063617j752384
$$ y = [1293079, 2136553, 975473, 7118, 155932, 245370, -415616, -808720, -70138, 1311217, 2640022, 3572223, 3225543, 844705, -2084702, -2615725, -129555, 2726892, 3772803, 3695999, 3672278, 3222883, 2197530, 2347683, 4453906, 5889112, 3844785, -452995, -3579543, -4798841, -6025352, -7558615, -7205348, -4010551, -90029, 2083297, 2231707, 1544872, 1229377, 2246399, 4581274, 6077660, 3856811, -1986538, -7484608, -8762531, -5974948, -2348752, -230238, 726322, 1929889, 3709867, 5113010, 5206619, 4037463, 2277224, 373712, -1432020, -2502786, -2225416, -1304556, -1518491, -3401986, -5085858, -4460959, -1800264, 822277, 2046019, 1948964, 885347, -867037]
37867h67037j573069l29820Q50022P85061l28668j396573j486846j96246J765435
37858b777741K280874j4108k953807k596527J355743M464802L419185M21049n58771
37849C040699M10146L18291j330415j890845l29779Q24466n73226k857496k832277
37840e220436j72037K267354K263490Q32478M21204J477155K145311J237465j89471
37831E062513r36139j521126k380447k040968L44330K133808M02696k792939k654351
37822d382623P49120K005000j169774m105596k602358N99273Q43483r06148o19988
37813i589611J560407K282066J536896K377928M481909L810650l79535l417586
37805B663124k057110Q54501J094131q68412j446923N34664K663624K331467n63628
$$ y = [-867037, -2440106, -2769926, -1919904, -1134843, -1463511, -2860084, -4346930, -4543176, -2777741, -496867, -510975, -3464782, -6061309, -4705566, -240764, 3178421, 3599470, 3040699, 3450845, 3769136, 2438721, 547876, 218097, 1042563, 469337, -2388159, -5220436, -5392473, -3125119, -861629, -29151, 392053, 1869208, 4014519, 5251984, 5062513, 4126374, 2605248, 224801, -1816167, -1471837, 661971, 1064667, -1728272, -4382623, -3633503, -1628503, -2798277, -6903873, -9506231, -8906958, -8063475, -8969623, -9589611, -8029204, -5747138, -4210242, -1832314, 2649595, 6460245, 6080710, 2663124, 606014, 1460515, 2554646, 1686234, 239311, 773975, 3437599, 5769066, 5205438]
37796E205438l727789m316866j546209J964095K722184P41180l87791J301439
37788A955681K997905J120050l045059m502225j275175K666479K535573r28122
37780A525107k544957J37475L405385K593409j260732k833875K1868L532121L472843
37771H048644M17366k109676k322424j009484M62733R59302j15934j598772j252028
37762A479727Q40193J732374J85077j045062M7988Q92981j098253l163620j246157
37753a374752K719339L143098o14254l616998l097594j211859K66448K245159
37745a541413M190361L341784l7711j759762k45718R55399m31080j603012l89056
37736B479792L03734k114088m472566k706284J211797K369919N31572m89289N67546
$$ y = [5205438, 1477649, -2839217, -4385426, -2421331, 300853, 1042033, 654242, 1955681, 4953586, 6073636, 3028577, -1473648, -2748823, -82344, 2453229, 1525107, -1019850, -882375, 2523010, 5116419, 3855687, 1021812, 1043680, 4575801, 8048644, 8466010, 6356334, 4033910, 3024426, 3487159, 4446461, 4330527, 2731755, 1479727, 2319920, 4052294, 4237371, 3192309, 3240297, 4133278, 3035025, -128595, -1374752, 1344587, 4487685, 3873431, 256433, -2841161, -4053020, -3786572, -1541413, 2648948, 5990732, 5953021, 4193259, 3947541, 4902940, 4471860, 2868848, 2479792, 2783526, 669438, -3803128, -6509412, -5297615, -2927696, -2396124, -2885413, -2317867]
37727b317867J451329J175812J037206J100533l5132j727117j409007J114507
37719C90264K794103J709808l40957o88923P55792J886210J008407j456189l222448
37710B836067k381412N3855R86002m51519j274400Q27391L360515K376268j373392
37701D959375l195271j138470J547823J370282q71023j918771n54732J328302
37693A527515J435443k29811j541679j038158j971o50756k488106k584353q6119
37684e657995K140910J815337M98702M00378O34575l75051j212635R9158J882594
37675B25973J163043j083415j425576J61559O14139m13134q8182J865641K181564
37666C201612R3460p38052J399048K717223K4752l594291l314093n1422J083633
$$ y = [-2317867, -866538, 309274, 1346480, 2447013, 2411881, 684764, -724243, 390264, 3184367, 4894175, 4553218, 3864295, 4620087, 6506297, 7514704, 6058515, 2836067, 454655, 508510, 1494512, 1042993, -231407, 595984, 3956499, 6332767, 4959375, 1764104, 625634, 2173457, 3543739, 2672716, 753945, 199213, 1527515, 2962958, 2733147, 1191468, 153310, 151339, -499417, -2987523, -5571876, -5657995, -3517085, -1701748, -1203046, -802668, -168093, -543144, -1755779, -1656621, 225973, 1389016, 305601, -1119975, -958416, -344277, -757411, -845593, 1020048, 3201612, 3295072, 2557020, 3956068, 6673291, 6698043, 3103752, -210341, -261763, 821870]
37657H21870j427707l532339j627497K682909M989354L386119Q3481j681044j237113
37648B458033l55584K3453J075022K979428K772404j565010o114878m550420K833515
37639d44037Q118835N745881m69919l218165j245196Q27404J4051k055135k962020
37630D311699k416017j013206Q74817K203404J534627q32049k540333j784149
37622C38793P43191K895708L186210J618055o88809k261483k182976o80631J142021
37613D110079K097934J600907O3201j305584j553765q62021j953O64637R56034
37604E769469L62763r56000j365143K53839K184436J759252o28628j927292r75547
37595D477149J72926P0829L4276J277012K640592K706038J783257M29072j549647
$$ y = [821870, -605837, -4138176, -5765673, -3082764, 1906590, 5292709, 5376190, 3695146, 2458033, 2102449, 2125902, 3200924, 6180352, 8952756, 7387746, 1272868, -3277552, -444037, 7674798, 13420679, 12950760, 9732595, 8487399, 9314803, 9328854, 7273719, 4311699, 1895682, 882476, 1757293, 3960697, 5495324, 4663275, 2122942, 338793, 1081984, 3977692, 7163902, 8781957, 8093148, 5831665, 3648689, 2968058, 4110079, 6208013, 7808920, 7872121, 6566537, 5012772, 4150751, 4148798, 4813435, 5769469, 6132232, 5176232, 3811089, 4064928, 6249364, 8008616, 7379988, 5452696, 4477149, 4650075, 4720904, 4755180, 6032192, 8672784, 11378822, 13162079, 13591151, 12041504]
37586A2041504l302906k926113p66756K31942q02834r98328J178513K895150J845069
37577I395241L29803Q61177J495804n899j025450J419683M096220J898317l305940
37568A5158956n135629k894858j897578l609697l298038Q59561L837749K092147
37560E112613o67362p9528J891021J151700j605679k913611k284612j541201q48711
37551a785370N53007J656510J331323Q54332J574863J988672L80081j555442j152270
37542C845706Q33265J671612J019451M75486J67022p63812j412929l41292J288104
37533F782613J136593m11960r56035p9390M40790j00417q32908j515042k324770
37524B139474k139861j15176J680644N12601k529396l553625j182862K148892
$$ y = [12041504, 8738598, 5812485, 5045729, 5277671, 4474837, 3476509, 4655022, 7550172, 9395241, 9725044, 10586221, 12082025, 12076126, 11050676, 12470359, 16566579, 18464896, 15158956, 10023327, 7128469, 5230891, 1621194, -1676844, -817283, 3020466, 5112613, 4445251, 4365723, 6256744, 7408444, 5802765, 2889154, 604542, -936659, -1785370, -1232363, 424147, 1755470, 2609802, 4184665, 6173337, 6553418, 4997976, 3845706, 4678971, 6350583, 7370034, 7845520, 8012542, 7248730, 5835801, 5494509, 6782613, 7919206, 7507246, 6551211, 6471821, 6912611, 6812194, 5979286, 4464244, 2139474, -387, -115563, 1565081, 2077682, -451714, -4005339, -5188201, -3039309]
37516c039309L819159L034323J06657l006109k709958J645734M606290J130700
37508E587487m836626m711528J864242N931986K654142j931607j235516K144656
37500E467236K507233O73886O10867J054096j618964m880754k624617M359987
37492E548970Q009444M070603k656001n684098m089501n56629K923410M875063
37484A2441261L771310M50916j582069m83474J498325J451289o73461l245009
37476A3629088n023218m680959j238231L166317L989573L01583k710147m72679
37468F961327M034799M101590j113799n224758l367825J514844L087243r5560
37460I897861l358022k393933J336233K823623J55804k994227k322224J295450
$$ y = [-3039309, 779850, 3814173, 3920830, 914721, -1795237, -149503, 4456787, 5587487, 750861, -3960667, -2096425, 3835561, 6489703, 4558096, 3322580, 5467236, 7974469, 8648355, 9259222, 10313318, 8694354, 3813600, 1188983, 5548970, 13558414, 17629017, 14973016, 9288918, 5199417, 4642788, 7566198, 12441261, 16212571, 16663487, 15081418, 14597944, 16096269, 17547558, 16874097, 13629088, 8605870, 3924911, 2686680, 5852997, 9842570, 10144153, 7434006, 6961327, 10996126, 15097716, 13983917, 8759159, 5391334, 6906178, 9993421, 9897861, 6539839, 4145906, 5482139, 8305762, 8461566, 5467339, 3145115, 4440565]
37452D440565L161944J337721j116003j207549k57820r41528k495683k051299
37444H70348M07936J815133P51875o73012m87860K67978j20465q46516J26194
37435B111611K517171L664711K107223m56331j487660p66872j49850p14294j514300
37426E311409j416564q91684j013343j508168j156471J64739J247838J403718
37418B141474J143369P60165k58992j795928k544979j862613r16804q41586q71121
37409e047015K72523J976167K332862P80212j309798k567370k829233k276807
37401h668459n94820K320365N256398N985241L239212j327772l832973k003478
37393C73714J847141L159772O02847k513279k748423m66184J661026J998123M45572
$$ y = [4440565, 7602509, 8940230, 7824227, 6616678, 6358858, 5417330, 2921647, 870348, 1278284, 3093417, 3845292, 3172280, 2684420, 2952398, 2831933, 1985417, 2111611, 4628782, 8293493, 10400716, 9944385, 8456725, 7689853, 7540003, 6825709, 5311409, 3894845, 3003161, 1989818, 481650, -674821, -510082, 737756, 2141474, 3284843, 4045008, 3786016, 1990088, -554891, -2417504, -3334308, -4175894, -5047015, -4774492, -2798325, -465463, 314749, -995049, -3562419, -6391652, -8668459, -9263279, -6942914, -1686516, 4298725, 7537937, 6210165, 2377192, 373714, 2220855, 5380627, 5983474, 3470195, 721772, 255588, 1916614, 3914737, 4360309]
37384D360309k319845m327035l064862J051498L863002K647460K42907Q77332
37376C330766L538997L450211n89304m506957m844231k556279j96525J272672
37368a100650J782037J244532N07398P24982J043599m28637k792349k696455M72501
37359a243042L020434K053622q83477k864316l234523k462137m62084J829650
37351d245873K201700P23663N18705K599827L335266J44259l709993l962320j925432
37342d320198j543288k363833r35642K237233L036161Q41740m14094Q49869J304454
37333a307598j114825l278450j879394J357565K648176J658720Q68982J195178
37325A48354J278499L12530q60309j206149m25873J195384K560615J947314j084532
$$ y = [4360309, 2040464, -2286571, -5351433, -4299935, -436933, 2210527, 2453434, 3330766, 6869763, 10319974, 9730670, 5223713, 379482, -2176797, -2373322, -1100650, 681387, 1925919, 2433317, 3158299, 4201898, 3773261, 980912, -1715543, -1243042, 1777392, 3831014, 2947537, 83221, -3151302, -5613439, -6075523, -4245873, -2044173, -1320510, -801805, 1798022, 5133288, 5277547, 1567554, -2394766, -4320198, -5863486, -8227319, -9162961, -6925728, -3889567, -3047827, -3461921, -2612052, -1307598, -2422423, -5700873, -7580267, -6222702, -3574526, -1915806, -1046824, 148354, 1426853, 1739383, 879074, -327075, -752948, 442436, 3003051, 4950365, 3865833]
37316C865833m194681m203999r46048J985082J305948j718139k604588M33301
37308f077291L754606L185989M5881r12368J070504J787432n39321j874629P45638
37299A186441L632523K297953r24637q88521J494930J128205j995950k741539
37291C189405k7211J454536J7626o4576K912362L894737l47699m843425l978272
37282B207483k05166P64987p48256m64084J498224J191330j698137l342227k276414
37273c072260p96384L7294J497856L005159J922754j530062l633830k619397q47018
37264f035888l93769k09317R42583K120268K349377K213495J925278N87647j354631
37255B145043j795774n39159k97731k339856l898514k221760J066712K289832
$$ y = [3865833, -328848, -4532847, -5478895, -3493813, -2187865, -3906004, -6510592, -6077291, -2322685, 863304, 909185, -3183, 1067321, 2854753, 2315432, 440803, 1186441, 4818964, 7116917, 6192280, 5303759, 6798689, 7926894, 5930944, 3189405, 3162194, 4616730, 4634356, 4569780, 7482142, 11376879, 11029180, 6185755, 2207483, 2002317, 2767304, 2019048, 1554964, 3053188, 4244518, 2546381, -795846, -3072260, -3868644, -3831350, -2333494, 671665, 2594419, 1064357, -2569473, -5188870, -6035888, -6429657, -6638974, -5696391, -3576123, -1226746, 986749, 2912027, 3499674, 2145043, 349269, -189890, -487621, -2827477, -6725991, -8947751, -7881039, -5591207]
37247e591207Q33468p28332p50615j75750j01926J60974J731560L871527M197780
37238C447479J501010k183489l413523j506946N27017J16911j503798j781542
37230d796881r34608p98313q62319R21294L715365M124122J565872n09060j22379
37221B303093J90249j967674m335676l128021J328235N021476N236394K752524
37213G400600j45919j829826j927044j267245j023781j302702j287134q91677
37205b274728p66640n16477Q97424K558236K166680R7320l93803J405937J736196
37196D910145j470502m182773j988596K759522M372124K354477J041288J698766
37188I494451J014297j973347l370321j035405J344765M2805k752909k642035
$$ y = [-5591207, -4757739, -5486071, -6236686, -6412436, -6514362, -6353388, -4621828, -750301, 3447479, 4948489, 2765000, -648523, -2155469, -1628452, -1511541, -3015339, -4796881, -5731489, -6529802, -7392121, -6470827, -2755462, 1368660, 2934532, 2425472, 2303093, 2493342, 525668, -3810008, -6938029, -5609794, -588318, 4648076, 7400600, 7254681, 5424855, 3497811, 2230566, 1206785, -95917, -1383051, -2274728, -3041368, -3557845, -2660421, -102185, 2064495, 2161815, 1768012, 3173949, 4910145, 3439643, -743130, -2731726, 27796, 4399920, 6754397, 7795685, 9494451, 10508748, 8535401, 5165080, 4129675, 5474440, 5517245, 2764336, 122301]
37180A22301R3678J528026M62129n13251J8140K46486j148520k478756j828281
37171c498048k1498J069308J514663K461541L290876K118559r22713l214897l122130
37162c24339j961088j488285j320753m62940K94869k12620q81733J77720K068671
37153d110498J973883l21973j780636o40751J252320J676412Q99837Q9859n11299
37144a472846m88862Q87064K219888N70986l513144n040516j464898K941801L257949
37135b102578J067011P62941J724478K08205k725798k077082K274182M340107
37127C471466J155484k842263k982914o76482M60121K28870O9252n80516k296089
37118c993071k939669p49242K008629K052642M3752q01094L84928J783445K270293
$$ y = [122301, 215979, 1744005, 2206134, 1692883, 1711023, 1957509, 808989, -1669767, -3498048, -3519546, -2450238, -935575, 1525966, 4816842, 6935401, 6012688, 2797791, -324339, -2285427, -3773712, -5094465, -5557405, -5262536, -5475156, -6356889, -6179169, -4110498, -2136615, -2458588, -4239224, -4879975, -3627655, -1951243, -1051406, -961547, -1472846, -1961708, -1074644, 1145244, 1716230, -1796914, -6837430, -8302328, -5360527, -2102578, -1035567, -272626, 1451852, 1660057, -1065741, -3142823, -868641, 3471466, 4626950, 1784687, -1198227, -1874709, -1414588, -1185718, -1116466, -1696982, -3993071, -6932740, -7681982, -5673353, -3620711, -3576959, -4378053, -3993125, -2209680, 60613]
37109F0613K053037Q79153j404501l138707k440738n1487J774014K502873K943160
37100C177417K463070l06401m116971n553739l496399o23114M30099K89584J045439
37091f691015K829515L669299K192340n17802j867838m69664K126488K920585
37083D191908R40262j578740k043422n68053P10067M83832o90340j583564j461919
37074a599969n19812J37207l77998j110207K3951L063432M984171L214299r36903
37065F878171l747738l119664p7717K683829K759197j32626l225634l132663j32396
37056a247241J957654J167460k03702j88297o10502k964659m344693j828599J805731
37047f456848J869287o58289r91721J169367J443592j174850k527699p92482M53172
$$ y = [60613, 2113650, 2992803, 1588302, -1550405, -3991143, -4042630, -2268616, 234257, 3177417, 5640487, 5334086, 1217115, -4336624, -7833023, -8456137, -8026038, -7736454, -6691015, -3861500, -192201, 2000139, 1482337, -385501, -855165, 1271323, 4191908, 5132170, 3553430, 1510008, 941955, 1652022, 2135854, 1445514, -138050, -1599969, -2119781, -1982574, -2360572, -3470779, -3446828, -383396, 4600775, 7815074, 6878171, 3130433, 10769, -66948, 2616881, 5376078, 5243452, 2017818, -1114845, -1247241, 710413, 1877873, 1674171, 1485874, 875372, -2089287, -6433980, -8262579, -6456848, -4587561, -5245850, -6237571, -5068204, -3624612, -4799462, -7327161, -8119643, -7666471]
37038g666471j003536j899641N57323L518825L172954O95155m61257J5161N47725
37029b523762J453135L248540L569765L40568l520554l121074J313447M518197
37021E278262L342215J35244j493705j104195n47072r02054j503993j014846R67118
37012C156974K899367K468948n00366l350185l754928k226534l27370J697329
37004F3235L637898L660274O68276k961923l869152k145765o53955o78453j038774
36995c318339r68457r72314r80897l20400N46788O62551O12853J389954J813675
36986a534586J63881k062871j673207Q96860J800416L2950q42397J127168K671883
36977E80097P04061k277752j924266J324036L352991K612410J168188J76742j566376
$$ y = [-7666471, -8670007, -10569648, -10012325, -6493500, -3320546, -2625391, -3086648, -3071487, -2523762, -1070627, 2177913, 5747678, 6088246, 2567692, -553382, 760065, 5278262, 8620477, 8755721, 7262016, 6157821, 5610749, 4708695, 3204702, 2189856, 3156974, 6056341, 8525289, 8024923, 4674738, 919810, -1306724, -1634094, 63235, 3701133, 7361407, 8029683, 5067760, 1198608, -947157, -1601112, -2279565, -3318339, -4286796, -5259110, -6240007, -6560407, -6013619, -5351068, -4738215, -3348261, -1534586, -1370705, -3433576, -5106783, -4209923, -2409507, -2376557, -3218954, -2091786, 580097, 1284158, -993594, -2917860, -1593824, 1759167, 4371577, 5539765, 5716507, 4150131]
36968D150131m057125m734707k272711Q68158J575147J22215p59341K00225J635311
36959c272697J867651P83420p03037j767825j837753n99089J483684L176377L576394
36950B707125K877371J671813R7196j644011k543415j724339Q3114J198441J125100
36941C848395Q14494P57156L12313o88636j287339j086744j052235j680130j888999
36932a951725q76979M39921J142536J810208K707922K282110l01791k684560k114959
36923D52683L51704J372235K61733p48161p91653j393274k886486l276972j717775
36914h375966q3651K76988O73672K379083M118719L949925J807105j196103m092726
36905e42954n424244l540638O82922L469373K514515l095q03873n6403p0158j043496
$$ y = [4150131, 93006, -4641701, -6914412, -6046254, -4471107, -4348892, -5108233, -4908008, -3272697, -1405046, -621626, -1324663, -3092488, -4930241, -5529330, -4045646, -869269, 2707125, 5584496, 7256309, 7353505, 5709494, 3166079, 1441740, 1524854, 2723295, 3848395, 4662889, 5420045, 5732358, 5043722, 3756383, 2669639, 1617404, -62726, -1951725, -2828704, -2388783, -1246247, 563961, 3271883, 5553993, 5252202, 2567642, 452683, 804387, 2176622, 2438355, 1690194, 898541, -494733, -3381219, -6658191, -8375966, -8459617, -8182629, -7508957, -5129874, -1011155, 2938770, 4745875, 3549772, -542954, -5967198, -9507836, -8824914, -5355541, -2841026, -2844121, -3647994, -3704397, -3774555, -4818051]
36895d818051j147733l1134P96765Q72377J221630J716071Q11448j285539j839029
36886c703195M55260K763278J553574k314635m324271k103581J675037L092059
36878b906474J935910J097981J945233K672085J544057m65597j439274j143123
36870C240798m13708M96446J177808K42665k437025m040103k170159J144793K086547
36861f71938Q51104Q70513K506612K249184q56998k884178j337112O78559k18068
36852A187678k045346j107823J704436K679828J345425L32652M26177O8615p86259
36843C805383m55200Q47866R12409o04603j605181j334818j474893k611448k662275
36834e182760j77638L168897M774383M003468J844456o13827k279224k145165
$$ y = [-4818051, -5965784, -5996918, -5200153, -4327776, -3106146, -1390075, -578627, -1864166, -3703195, -3247935, -484657, 1068917, -1245718, -5569989, -7673570, -5998533, -2906474, -970564, 127417, 2072650, 4744735, 6288792, 5823195, 4383921, 3240798, 2827090, 3323536, 4501344, 4744009, 2306984, -1733119, -3903278, -2758485, -671938, 179166, 1049679, 3556291, 5805475, 4948477, 2064299, 727187, 1405746, 1187678, -857668, -1965491, -261055, 2418773, 3764198, 4096850, 4523027, 4591642, 3805383, 3350183, 4198049, 5110458, 4505855, 2900674, 1565856, 90963, -2520485, -5182760, -5360398, -2191501, 2582882, 6586350, 8430806, 7816979, 5537755, 3392590]
36826C392590n11344Q43179O41711l89813n97117N48093J846337J579516o22984
36817F730168l033889l547773k265967j166645r37364j23995J681564K374389
36809b89512R10672l10221O22513J384635p44611l551004k999562j05234O76322
36800d406002p92905k40907K853143L475501m03624l622359j706888K221020K901843
36791B78822J082455R78857K656893K637109M71494p84511j31877L25301q2455
36782G432088K60995J025380m34659l810719m661647r14857L223593L024636p8647
36773E066163j366125k58415k70928k233925k531104O71692L775246K978145p6179
36764E754570j308176n09427m65734j119953M25726L848484M618401Q62713l281489
$$ y = [3392590, 2881246, 3724425, 4366136, 3976323, 3379206, 3927299, 5773636, 7353152, 6730168, 3696279, 148506, -2117461, -3284106, -4221470, -4345465, -2663901, -289512, 621160, 310939, 933452, 2318087, 1573476, -1977528, -4977090, -5082324, -4406002, -5198907, -5439814, -2586671, 888830, 485206, -3137153, -4844041, -2623021, 278822, 1361277, 2340134, 4997027, 7634136, 8105630, 7321119, 7189242, 7514543, 7432088, 7693083, 8718463, 8283804, 4473085, -188562, -1103419, 2120174, 5144810, 5066163, 3700038, 3441623, 3170695, 936770, -1594334, -922642, 2852604, 5830749, 5754570, 4446394, 3936967, 3471233, 2351280, 2777006, 6625490, 11243891, 12106604, 8825115]
36755H825115l913281k886754l420389l870188q79612L651691M418470P32113
36747B657165k638890k735570j515989j015106k27990J668643L100004K865013
36739B157280J761776J71704k480045m728264l522992P06221L453496K529463
36731D8639R68385J331120J519113o60148k970105k610230r69515m44771J09382
36722c678130K281747L624592J429221j517941n56682L121539M081716J075164
36714I861226j822101k247248k077198k447866j716345L45915J240004K55042
36706A391429j45556Q07359L60174k443190l850933r48055L273883L911866Q16983
36697C173960k134602k676627j744368n64947O49531J450051J227197O02200P37593
$$ y = [8825115, 4911834, 2025080, -1395309, -5265497, -6145109, -2493418, 1925052, 2657165, 18275, -2717295, -4233284, -5248390, -5476380, -3807737, -707733, 2157280, 3919056, 4090760, 1610715, -3117549, -6640541, -5934320, -2480824, 48639, 1017024, 2348144, 3867257, 3207109, 237004, -2373226, -3342741, -3787512, -3678130, -1396383, 2228209, 3657430, 2139489, 1582807, 4704346, 8786062, 9861226, 8039125, 5791877, 3714679, 1266813, -449532, -103617, 1136387, 1391429, 1245873, 2053232, 2413406, -29784, -3880717, -4828772, -1554889, 2356977, 3173960, 1039358, -1637269, -3381637, -3946584, -3297053, -1847002, -619805, -17605, 719988]
36688G19988J215762M09047j789846l189725j875837J402932M006450M054553
36680D953324J939999m26499j439659r17985J40737M73037o07469k497794l239014
36671a621323j185132K552152M358721K061538k122982m110309k923834j274191
36663d265360j201834j393180Q6842K165220J942475q55899k697914o56306L134899
36654c741057L527749p84058m709040k971930K728983N845812L706501L58059
36646C961019m3550J276277J000325q74535k053585k006167j742864j243799k31362
36637a958241j3076j434038k409723p80725J662643J492267j094910k896276k621011
36628a0053090j483504J60524K686099M422376L389423J407577J887172L759066
$$ y = [719988, 1935750, 2344797, 554951, -2634774, -4510611, -3107679, 898771, 4953324, 6893323, 6466824, 5027165, 4109180, 4249917, 4722954, 4115485, 1617691, -1621323, -2806455, -254303, 4104418, 6165956, 4042974, -67335, -2991169, -4265360, -5467194, -6860374, -6773532, -4608312, -2665837, -3521736, -6219650, -6875956, -3741057, -213308, -997366, -5706406, -8678336, -5949353, -103541, 3602960, 3961019, 3917469, 5193746, 6194071, 5319536, 3265951, 1259784, -483080, -1726879, -1958241, -1971317, -3405355, -5815078, -6595803, -4933160, -3440893, -4535803, -7432079, -10053090, -11536594, -11376070, -8689971, -4267595, -878172, 529405, 2416577, 6175643]
36620F175643K706514j295901l282365j313834M75428r84030k842063j618778
36612a979386J273545K705431K608956K146112O32380k144016l609866j976706
36604c43550N02360J070443N81593Q77231R01672r28452l016259l068184k114578
36595e537724k266558k475504m63765K748680M074049K819272O26870j371157
36587a845837k152139L7574M195722M932406n85276o346749m392175L220038O333837
36578C397401R16342n728939n912065j148680K556569L396145L151955K014159
36570B642887p76623l350829l083408j063273o27570j890402j570742J411666
36562h308294L728198K405367q42917k075032l95475J437551J171553l03101q97200
$$ y = [6175643, 8882157, 7586256, 4303891, 2990057, 3465485, 2481455, -360608, -1979386, -705841, 1999590, 4608546, 6754658, 7387038, 5243022, 1633156, -343550, 158810, 1229253, 1810846, 2688077, 3589749, 2661297, -354962, -3423146, -5537724, -7804282, -10279786, -10743551, -7994871, -3920822, -1101550, -474680, -1845837, -3997976, -3960402, 235320, 5167726, 4582450, -1764299, -6156474, -2936436, 3397401, 4313743, -1415196, -7327261, -8475941, -5919372, -2523227, 628728, 2642887, 1866264, -1484565, -4567973, -5631246, -6258816, -8149218, -9719960, -8308294, -4580096, -2174729, -3017646, -5092678, -5488153, -4050602, -2879049, -3182150, -4079350]
36553d079350j35849J065324K112239K670525J817594p85611l294301l341748
36545c971177j175543J025319K694816M806476O157735L671166k139540o010327
36537E058925m856407k232865k449369l637306j306613L646812N937557L906369
36529D067103J238131O31884O69132k48162j281271j722265k302406k580870o72550
36520b201274K810207L990022R75276k940846l499745o89115K185417K715871
36512C345813R36415j614413k748795j052736K123256L443710J487433j516019
36504D404664k748530j980876o98352K22072O37161K95846p82727j865510k189194
36495d705446j425145N31845L051350M301541L019846N80862o61872q21076j859198
$$ y = [-4079350, -4215199, -3149875, -1037636, 1632889, 3450483, 2664872, -629429, -3971177, -5146720, -4121401, -1426585, 3379891, 9537626, 13208792, 11069252, 5058925, 202518, -2030347, -4479716, -8117022, -9423635, -5776823, 160734, 4067103, 5305234, 5937118, 6606250, 6358088, 5076817, 3354552, 1052146, -1528724, -2201274, 608933, 4598955, 5574231, 2633385, -866360, -1555475, 629942, 3345813, 4282228, 2667815, -80980, -1133716, 989540, 4433250, 5920683, 4404664, 1656134, -324742, -1023094, -801022, -163861, 131985, -650742, -2516252, -4705446, -6130591, -5598746, -2547396, 1754145, 4773991, 5354853, 4692981, 3871905, 2012707]
36486B012707l767106m348454l030122j660696r31623N75039K813564L367031
36478d969660J596513J43094M42038L28840j578649k751603j038869J190075Q08130
36469e830091q45874m55250J624368K335222J155075K61384K13844n93314k300089
36460d434725k911250j549732M70785K027700L113935L360223K186176N65055
36452B828167J98119P21930J10188j850295k900623j757883j8219L61738k74807
36443b581685l08888O29156J287989N24747j203823k095618r27683J194352J770472
36434a710981J6932j989508k028797m30996J001094J541850J609668J321905N76389
36425i2444j13847k39777j20575p8988K29241O82568L02274p93768p85353Q94125
$$ y = [2012707, -1754399, -6102853, -9132975, -10793671, -11725294, -11150255, -8336691, -4969660, -3373147, -3230053, -2788015, -2459175, -4037824, -6789427, -7828296, -6638221, -5830091, -6675965, -7131215, -5506847, -3171625, -2016550, -1755166, -1541322, -2134636, -4434725, -7345975, -8895707, -8424922, -6397222, -3283287, 76936, 2263112, 2828167, 3026286, 3748216, 3858404, 2008109, -892514, -2650397, -2668616, -2306878, -2581685, -2890573, -2261417, -973428, -448681, -1652504, -3748122, -4675805, -3481453, -1710981, -1694049, -3683557, -5712354, -6143350, -5142256, -3600406, -1990738, -668833, -92444, -206291, -446068, -566643, -645631, -416390, 266178, 568452, -225316, -1010669, -116544]
36415a16544J920068N04005j457618j280334J94734K72012r74078j165899J10887
36406a992767R48179O31462K69681J55570l63312n99201O94840K393579K089168
36397D227199M2550j231416j167672j355993j691912m68801J415955R35708j476443
36388g70825j673447J174191K288221j186460m962953l729463J144355M196922
36380c519459L423894J061995r65869k088379j168058K082639M604180K989988
36372F420931j337515l620031k247424j47934L60300L51917J116912J605156O02808
36363C105120r72198j521487r08783q6354J20692o68330j892532j776200N49459
36354d050613K606091R08133l524664n046721o83026N109245N868156J564263
$$ y = [-116544, 1803524, 2307529, 849911, -430423, -235689, 36323, -937755, -2103654, -1992767, -1044588, -413126, -143445, 12125, -351187, -950388, -255548, 2138031, 4227199, 4269749, 3038333, 1870661, 514668, -1177244, -1646045, -230090, 705618, -770825, -2444272, -1270081, 1018140, -168320, -5131273, -8860736, -7716381, -3519459, -95565, 966430, 561, -2087818, -3255876, -1173237, 3430943, 6420931, 5083416, 1463385, -784039, -931973, -571673, -219756, 897156, 2502312, 3105120, 2132922, 611435, -297348, -383702, -263010, -931340, -2823872, -4600072, -4050613, -1444522, -536389, -4061053, -9107774, -9790800, -4681555, 1186601, 2750864]
36346B750864j878280q70601J825524K211344P18287L82404J550886J634514l61593
36337G963349k132839j721269m70981o99562k013593k080275l97161R18983K90267
36328c43081j229052j687581o72108Q11079J812956J926743J124966j8924n29287
36319A195711j38290L47451K97222J17653K47849J61228p45859j959552k455214
36310b931801j936491p18844Q33657J878921J174199j022224k104473j13974K973632
36301a967398L261953K83892k116986j010708J853463K948183J640661q1755j101511
36292C709794j826094j995360o06055J645784K329030O75872j038637q79339j87306
36283A827689j207481l159241l200795q43199J219876J078895M7385J22561J007046
$$ y = [2750864, 872584, 1983, 1827507, 4038851, 4757138, 5139542, 6690428, 8324942, 7963349, 5830510, 4109241, 3638260, 2938698, 925105, -1155170, -1552331, -633348, -343081, -1572133, -3259714, -3931822, -3120743, -1307787, 618956, 1743922, 1724998, 1195711, 1057421, 1404872, 1702094, 1819747, 2067596, 2228824, 1482965, -476587, -2931801, -4868292, -5587136, -4753479, -2874558, -1700359, -2722583, -4827056, -4941030, -1967398, 1294555, 1578447, -538539, -1549247, 304216, 3252399, 4893060, 4811305, 3709794, 1883700, -111660, -717715, 928069, 3257099, 3932971, 2894334, 2014995, 1827689, 620208, -2539033, -5739828, -6583027, -5363151, -4284256, -4236871, -4114310, -3107264]
36274c107264J241129Q75995J036369J417773K26776k987951n764332m958853
36266a2020358m30811M118988M723083J738482l10368J382133L634278J626731
36258D462158l260918m319060N71833M716452J903698m042619m566930R52130
36250c583256M529833J715899k337536j465012K489011L492313M66695k236049
36242C071898j749049L27446J475553J284437N69872o9783l17528k61771n01932
36233C829143j077339r03421N04953J702740J271189P7285l12304m21358j634792
36224C036096k907502j695144J664413L448891J451388j993000l263633j851636
36216b110127R6269J135701J489933J436063O85892n62305j360665j164024l65721
$$ y = [-3107264, -1866135, -990140, 46229, 1464002, 1690778, -1297173, -7061505, -12020358, -12451169, -8332181, -3609098, -1870616, -2180984, -798851, 2835427, 4462158, 1201240, -3117820, -2545987, 2170465, 4074163, 31544, -4535386, -3583256, 946577, 2662476, 324940, -1140072, 1348939, 4841252, 5307947, 3071898, 1322849, 1650295, 3125848, 4410285, 4980157, 4910374, 4592846, 4331075, 3829143, 2751804, 1848383, 2353336, 4056076, 5327265, 5404550, 5092246, 4670888, 3036096, 128594, -1566550, 97863, 3546754, 4998142, 3005142, -258491, -2110127, -2013858, -878157, 611776, 2047839, 2733731, 2171426, 810761, -353263, -718984]
36207g18984N61533J614491K563084K555719J219045l83010r39006q45527j702933
36198C924412l623149m500169k839709n669J692225K028447K236452K294843J130379
36189B338062q48147j869935j504897q31943J47083K341984M365860L017711j514962
36180E640816m378298k385996J380039K233571L81904q63439j002834j934149
36172i28386k962065j279819K475147L921989J377596j516200j413146R9195L519
36163b22170q90446M61343L846629N223485J984744l328895n719262l449267O9180
36154b024659O27919j356243j578277J738318M774440L425672o21905k424192
36146B561073r86396J64498o82572j044032P18630K234189J245080n31616n09487
$$ y = [-718984, -157451, 1457040, 4020124, 6575843, 7794888, 7411878, 6472872, 5627345, 3924412, 301263, -4198906, -7038615, -7044284, -5352059, -3323612, -1087160, 1207683, 2338062, 1489915, -380020, -1884917, -2716860, -2569777, -227793, 4138067, 7155778, 5640816, 1262518, -1123478, 256561, 2490132, 2872036, 2008597, 1005763, -928386, -3890451, -5170270, -2695123, 1226866, 2604462, 1088262, -324884, -225689, -222170, -1112616, -651273, 3195356, 8418841, 10403585, 7074690, 1355428, -2093839, -2024659, -1396740, -2752983, -4331260, -2592942, 2181498, 5607170, 4985265, 2561073, 1574677, 1739175, 1056603, 12571, 731201, 2965390, 4210470, 3678854, 3169367]
36137C169367L85601m07781k511631l067139j048857J479375K220428Q89096j178211
36128f9752k233459j279703Q29593J927395J059947k73144k51253Q76400J501121
36119B087145P89934p97704k153685k023005j38838J614073R41026j321188j751108
36110b753350N15194K062436M65305j788996j451225K92283N03213k21J543425
36101f11936L899903K919007j422057m047232k068625J212686J513965o23421
36093G72290j562014K32392K879858L609796J271189k561398m506889k816980
36085b681756J96592J154866N16541J435282L932536M336083J454775j082473
36077I262446o97557R4274j556686l754258l220430p34752Q45768J589172L129334
$$ y = [3169367, 3554968, 3147187, 635556, -2431583, -3480440, -2001065, 219363, 1108459, -69752, -2303211, -3582914, -2753321, -825926, 234021, -39123, -290376, 586024, 2087145, 2877079, 2079375, -74310, -2097315, -2236153, -622080, 318946, -1002242, -2753350, -2238156, -175720, 289585, -1499411, -2950636, -2658353, -2155140, -2155361, -611936, 3287967, 6206974, 4784917, 737685, -1330940, -118254, 1395711, 772290, -789724, -557332, 2322526, 5932322, 7203511, 4642113, 135224, -2681756, -2485164, -1330298, -813757, 621525, 4554061, 8890144, 10344919, 9262446, 8564889, 8659163, 7102477, 3348219, 127789, -606963, 238805, 1827977, 4957311]
36068D957311M117510J797680k660510m908796l415034p94096P77301J588919
36060A460285J741538M56665j398068j833204j412304k600395m728287l896228
36052a2209998O04385M072897K937293l49693j754874j402733j409762j123822
36044a0636307J201770L998762M061126J679797R1106K19823k06899k148735l456339
$$ y = [4957311, 9074821, 10872501, 8211991, 3303195, -111839, -905935, -128634, 1460285, 3201823, 3658488, 2260420, 427216, -985088, -3585483, -8313770, -12209998, -11605613, -7532716, -4595423, -4945116, -6699990, -8102723, -9512485, -10636307, -9434537, -5435775, -1374649, 305148, 396254, 616077, 409178, -1739557, -5195896]
$$ [...]
##END NTUPLES=NMR SPECTRUM
##END=
