##TITLE=31Pdec_SR10P_2
 CDCl3, 124 sc
 10.2.2022
##JCAMPDX= 6.0         $$ Bruker NMR JCAMP-DX V2.0
##DATA TYPE= NMR SPECTRUM
##DATA CLASS= NTUPLES
##ORIGIN= UXNMR, Bruker Analytische Messtechnik GmbH
##OWNER= root
$$ XWIN-NMR		Version 3.5
$$ Thu Feb 10 11:53:03 2022 Russian Standard Time (UT+4h)  she@DPX200
##.OBSERVE FREQUENCY= 81.013821
##.OBSERVE NUCLEUS= ^31P
##.ACQUISITION MODE= SIMULTANEOUS
##.ACQUISITION SCHEME= undefined
##.AVERAGES= 124
##.DIGITISER RES= 16
##SPECTROMETER/DATA SYSTEM= spect
##.PULSE SEQUENCE= zgpg30
##.SOLVENT NAME= CDCl3
##.SHIFT REFERENCE= (INTERNAL, CDCl3, 0, 248.564)
##AUDIT TRAIL= $$ (NUMBER, WHEN, WHO, WHERE, WHAT)
$$ ##TITLE= Audit trail, XWIN-NMR		Version 3.5
$$ ##JCAMPDX= 5.01
$$ ##ORIGIN= Bruker BioSpin GmbH
$$ ##OWNER= she
$$ F:/spectra/data/she/nmr/P31/1/pdata/1/auditp.txt
$$ ##AUDIT TRAIL=  $$ (NUMBER, WHEN, WHO, WHERE, WHAT)
(   1,<2022-02-10 11:51:27.62 +0400>,<she>,<DPX200>,
      <continue with go, POWCHK disabled, PULCHK disabled
       configuration hash MD5:
       00 E9 B6 7A A2 85 ED C7 34 08 36 98 17 FE 4E 26
       data hash MD5: 32K
       26 A0 59 4D BB 4E 35 42 B0 11 46 3E EE 78 FE 2A>)
(   2,<2022-02-10 11:51:36.01 +0400>,<she>,<DPX200>,
      <Start of raw data processing
       efp BC_mod = 2 LB = 1 FT_mod = 6 PKNL = 1 PHC0 = -9710.421 PHC1 = 510.6746 SI = 64K 
       data hash MD5: 64K
       0A 97 DE BB 48 78 44 6D 22 2B 51 96 3F 44 24 25>)
(   3,<2022-02-10 11:52:13.28 +0400>,<she>,<DPX200>,
      <pk PHC0 = -15.68949 PHC1 = 0 
       data hash MD5: 64K
       62 72 F2 FA 8C FA 72 98 AD 02 7A 61 A0 45 9F E0>)
$$ ##END=
$$ 
$$ hash MD5
$$ E5 58 7E 8A 34 03 54 7E 86 D5 C4 B4 30 2B 0B 45
##$RELAX= 
##$RELAX= 
##$RELAX= 
##$RELAX= 
##$RELAX= 
##$RELAX= 
##$RELAX= 
##$RELAX= 
$$ Bruker specific parameters
$$ --------------------------
##$DU= <F:/spectra>
##$EXPNO= 1
##$NAME= <P31>
##$PROCNO= 1
##$TYPE= <nmr>
##$USER= <she>
##$AMP= (0..31)
100 100 100 100 100 100 100 100 100 100 100 100 100 100 100 100 100 100 
100 100 100 100 100 100 100 100 100 100 100 100 100 100 
##$AQSEQ= 0
##$AQ_mod= 1
##$AUNM= <au_zg>
##$AUTOPOS= <>
##$BF1= 81.014009
##$BF2= 200.13
##$BF3= 200.13
##$BF4= 200.13
##$BF5= 200.13
##$BF6= 200.13
##$BF7= 200.13
##$BF8= 200.13
##$BYTORDA= 1
##$CFDGTYP= 0
##$CFRGTYP= 5
##$CHEMSTR= <none>
##$CNST= (0..31)
1 1 145 1 1 1 1 1 1 1 1 1 1 1 1 1 1 1 1 1 1 1 1 1 1 1 1 1 1 1 1 1 
##$CPDPRG= <waltz16>
##$CPDPRG1= <>
##$CPDPRG2= <waltz16>
##$CPDPRG3= <>
##$CPDPRG4= <mlev>
##$CPDPRG5= <mlev>
##$CPDPRG6= <mlev>
##$CPDPRG7= <mlev>
##$CPDPRG8= <mlev>
##$CPDPRGB= <>
##$CPDPRGT= <>
##$D= (0..31)
0 1 0 0 0 0 0 0 0 0 0 0.03 2e-05 3e-06 0 0 0 0 0 0 0 0 0 0 0 0 0 0 0 0 
0 0 
##$DATE= 1644479279
##$DBL= (0..7)
120 120 120 11 120 120 24 19 
##$DBP= (0..7)
150 150 150 150 150 150 150 150 
##$DBP07= 0
##$DBPNAM0= <>
##$DBPNAM1= <>
##$DBPNAM2= <>
##$DBPNAM3= <>
##$DBPNAM4= <>
##$DBPNAM5= <>
##$DBPNAM6= <>
##$DBPNAM7= <>
##$DBPOAL= (0..7)
0.5 0.5 0.5 0.5 0.5 0.5 0.5 0.5 
##$DBPOFFS= (0..7)
$$ [...]
##$SUBNAM2= <"">
##$SUBNAM3= <"">
##$SUBNAM4= <"">
##$SUBNAM5= <"">
##$SUBNAM6= <"">
##$SUBNAM7= <"">
##$SUBNAM8= <"">
##$SUBNAM9= <"">
##$SW= 501.771253377433
##$SWIBOX= (0..15)
0 1 3 0 0 0 0 0 0 0 0 0 0 0 0 0 
##$SW_h= 40650.406504065
##$TD= 32768
##$TD0= 1
##$TE= 0
##$TE2= 300
##$TE3= 300
##$TEG= 300
##$TL= (0..7)
0 120 53 12 22 120 120 120 
##$TP= (0..7)
150 150 150 150 150 150 150 150 
##$TP07= 0
##$TPNAME0= <>
##$TPNAME1= <>
##$TPNAME2= <>
##$TPNAME3= <>
##$TPNAME4= <>
##$TPNAME5= <>
##$TPNAME6= <>
##$TPNAME7= <>
##$TPOAL= (0..7)
0.5 0.5 0.5 0.5 0.5 0.5 0.5 0.5 
##$TPOFFS= (0..7)
0 0 0 0 0 0 0 0 
##$TUNHIN= 0
##$TUNHOUT= 0
##$TUNXOUT= 0
##$USERA1= <user>
##$USERA2= <user>
##$USERA3= <user>
##$USERA4= <user>
##$USERA5= <user>
##$V9= 5
##$VALIST= <valist>
##$VCLIST= <CCCCCCCCCCCCCCC>
##$VD= 0
##$VDLIST= <DDDDDDDDDDDDDDD>
##$VPLIST= <PPPPPPPPPPPPPPP>
##$VTLIST= <TTTTTTTTTTTTTTT>
##$WBST= 1024
##$WBSW= 4
##$XGAIN= (0..3)
0 0 0 0 
##$XL= 0
##$YL= 0
##$YMAX_a= 11720
##$YMIN_a= -16187
##$ZGOPTNS= <>
##$ZL1= 120
##$ZL2= 120
##$ZL3= 120
##$ZL4= 120
##$ABSF1= 0
##$ABSF2= 0
##$ABSG= 0
##$ABSL= 0
##$ALPHA= 0
##$AQORDER= 0
##$ASSFAC= 0
##$ASSFACI= 0
##$ASSFACX= 0
##$ASSWID= 0
##$AUNMP= <proc_1d>
##$AZFE= 0.1
##$AZFW= 0.5
##$BCFW= 0
##$BC_mod= 2
##$BYTORDP= 0
##$COROFFS= 0
##$CY= -3
##$DATMOD= 1
##$DC= 0
##$DFILT= <>
##$DTYPP= 0
##$F1P= 0
##$F2P= 0
##$FCOR= 1
##$FTSIZE= 65536
##$FT_mod= 6
##$GAMMA= 0
##$GB= 0
##$INTBC= 1
##$INTSCL= 5.30512e-09
##$ISEN= 30
##$LB= 1
##$LEV0= 0
##$LPBIN= 0
##$MAXI= 10000
##$MC2= 0
##$MEAN= 0
##$ME_mod= 0
##$MI= 50
##$NCOEF= 0
##$NC_proc= -8
##$NLEV= 6
##$NOISF1= 182.463
##$NOISF2= 159.3651
##$NSP= 0
##$NTH_PI= 0
##$NZP= 0
##$OFFSET= 248.5645
##$PC= 4
##$PHC0= -9726.11
##$PHC1= 510.6746
##$PH_mod= 1
##$PKNL= yes
##$PPARMOD= 0
##$PSCAL= 0
##$PSIGN= 0
##$REVERSE= no
##$SF= 81.014009
##$SI= 65536
##$SIGF1= 159.3651
##$SIGF2= -187.1042
##$SINO= 113.3802
##$SIOLD= 16384
##$SREGLST= <1H.CDCl3>
##$SSB= 0
##$STSI= 65536
##$STSR= 0
##$SW_p= 40650.406504065
##$SYMM= 0
##$S_DEV= 0
##$TDeff= 32768
##$TDoff= 0
##$TI= <>
##$TILT= no
##$TM1= 0
##$TM2= 0
##$TOPLEV= 0
##$USERP1= <user>
##$USERP2= <user>
##$USERP3= <user>
##$USERP4= <user>
##$USERP5= <user>
##$WDW= 1
##$XDIM= 65536
##$YMAX_p= 568700853
##$YMIN_p= -74931816
$$ End of Bruker specific parameters
$$ ---------------------------------
##NTUPLES= NMR SPECTRUM
##VAR_NAME=  FREQUENCY,     SPECTRUM/REAL,   SPECTRUM/IMAG
##SYMBOL=    X,             R,               I
##VAR_TYPE=  INDEPENDENT,   DEPENDENT,       DEPENDENT
##VAR_FORM=  AFFN,          ASDF,            ASDF
##VAR_DIM=   65536,         65536,           65536
##UNITS=     HZ,            ARBITRARY UNITS, ARBITRARY UNITS
##FACTOR=    0.620285442955139, 1,           1
##FIRST=     20137.2065510759, 0,            0
##LAST=      -20513.1999529892, 0,           0
##MIN=       -20513.1999529892, -74931816,   0
##MAX=       20137.2065510759, 568700853,    0
$$ Real data points
##PAGE= N=1
##DATA TABLE= (X++(R..R)), XYDATA
$$ [...]
12933h977946J0857429R03938n865425L662879J3320314M212776j2149770j2504594
12925f540399m75669J980177o336143o276590M341956N746673p016233j2816503
12917b7392731k95089J2328411P953541k493608j713267N059065L250422l975725
12909g278981l732242J645115l14770p715283o182059N671430J1944626L757534
12901b204630p901066r146084j022503O052637O961933M440335K591562L467212
12893C239396O619979Q067526K896734p389633j3266198p841127K493177M126739
12885a053407n767149j3439917n865388J0386141J6074698M892474p748875n987392
12877h508815N447553R949793K489845o536665q114117l923211J300912N993443
$$ y = [-8977946, 1879483, 2783421, -3082004, 580875, 13901189, 18113965, 5964195, -6540399, -7016068, -5035891, -11372034, -17648624, -13306668, -7559995, -14576228, -27392731, -27687820, -15359409, -7405868, -9899476, -11612743, -6553678, -3303256, -7278981, -11011223, -9366108, -9680878, -17396161, -23578220, -17906790, -5962164, -2204630, -10105696, -19251780, -20274283, -14221646, -7259713, -2819378, -227816, 3239396, 9859375, 17926901, 20823635, 13434002, 167804, -7673323, -5180146, -1053407, -6820556, -20260473, -26125861, -15739720, 334978, 5227452, -2521423, -8508815, -3061262, 6888531, 9378376, 2841711, -5272406, -9195617, -7894705, -1901262]
12869a901262P914426L601542m249459o634825j90668O994012O349405L36583
12861A2219754k278825J126392M782396L247760j854970m343872j182410L232861
12853A4949086J906486n213728r915678o513290J19402J894649j131220l128689
12845g032982k810110l397347m243730j101634N507133R970179R723022O798011
12837A3412542K110227m266455q278982n788980n44304K71744k662912l086451
12829h833571q80818p17128p86452M208470R663193N630988m370624n854358K135810
12820A95510L496363p105752j2189403O88925J6384572J4041382j594901r570921
12812D345775m764942o38073l675342m583819L048613J1312203J0822877M198790
$$ y = [-1901262, 6013164, 9614706, 5365247, -1269578, -1460246, 5533766, 11883171, 12219754, 9940929, 11067321, 15849717, 19097477, 17242507, 12898635, 11716225, 14949086, 16855572, 11641844, 1726166, -4787124, -4667722, -2773073, -3904293, -7032982, -9843092, -13240439, -17484169, -18585803, -13078670, -3108491, 6614531, 13412542, 15522769, 11256314, 2977332, -2811648, -3355952, -3084208, -5747120, -8833571, -9714389, -10431517, -11217969, -7009499, 2653694, 8284682, 3914058, -1940300, 195510, 3691873, -3413879, -15603282, -14914357, 1470215, 15511597, 13916696, 4345775, -419167, -1057240, -4732582, -9316401, -6267788, 5044415, 15867292, 20066082]
12804B0066082L60278J690409K578864j403086o547844m862361M445036J0412282
12796B6739660L051705j0985111j4991448n543581K797025O25097k273104M563594
12788C983837J2865899R082691k411844o481795j907291r78615o286462o054165
12780A812255M621233J3851976J0445524p02661p518178o192743j534407J308025
12772A6091024J91353l721506n451404j109581M601220K423489p314256j2401560
12764f691221n258740N608171P389504N27137l700009Q7627N859145P026470M380530
12755A5228614Q15542m417545j0926254j2143301l113541Q727256J0031687N99211
12747D801669l999243N093616J4392263O252539j3452333k1127234q239205P963255
$$ y = [20066082, 20426360, 22116769, 24695633, 23292547, 16744703, 11882342, 16327378, 26739660, 29791365, 18806254, 3814806, -1728775, 1068250, 1693347, -579757, 3983837, 16849736, 25932427, 23520583, 17038788, 15131497, 14152882, 7866420, 1812255, 6433488, 20285464, 30730988, 30028327, 22510149, 16317406, 14782999, 16091024, 16282377, 12560871, 7109467, 5999886, 10601106, 13024595, 5710339, -6691221, -11949961, -6341790, 1047714, 1574851, -2125158, -2037531, 3821614, 10848084, 15228614, 16044156, 11626611, 700357, -11442944, -14556485, -5829229, 4202458, 4801669, 802426, 5896042, 20288305, 26540844, 13088511, -8038723, -16277928, -8314673]
12739h314673J0732366M846393K362862J812179m262782j0982461p139236M854399
12731f090953J0984844O760072J887223K754780L979780Q65649k186110j298753
12723A7656532o98098l842911n536147p28680N234415L609203m428730r417043
12715A848541o576899k01792L988611M554937K408183r57426k341581P20744M731957
12706H175275K732357n154751r134090k743185O234167N563613l271792o647536
12698d245942O59964P676829M939473q86874N70894N172495J521273q516010j1284871
12689d392769k603810O532524P341927L283341l58354l927335n828681m53891
12681d07048R697910J1919026J431616r383911q802278k220280p14325l187139
$$ y = [-8314673, 2417693, 7264086, 9626948, 11439127, 7176345, -3806116, -10945352, -6090953, 4893891, 11653963, 13541186, 16295966, 20275746, 21141395, 18955285, 17656532, 16958434, 13115523, 7579376, 6850696, 12085111, 15694314, 11265584, 1848541, -4728358, -4930150, -941539, 3613398, 6021581, 5064155, 2722574, 3443318, 8175275, 10907632, 5752881, -3381209, -6124394, 109773, 5673386, 2401594, -4245942, -3585978, 4090851, 9030324, 8143450, 8714344, 13886839, 15408112, 6892102, -4392769, -6996579, -464055, 6877872, 10161213, 9802859, 5875524, 46843, -407048, 9290862, 21209888, 22641504, 13257593, 4455315, 2235035, 1520710, -1666429]
12673a666429j806009K989214N319623N092391M685838J114191o513728r019479
12665A95612l83001P968338K009538j1159572j2343257j25744P490513J912213
12657d435360m641977p43247Q293385J2351527R999824L591010o039599j3545277
12649D830286j0372646Q87798N473403k741739j1125181p262441L424320Q700346
12641h185854P468261N513014K579194l669494p656494k850315N617547P233645
12633F049504J887641j668881l94224J122314J284773K555845K688737l282594
12625A0243115j1218980r700279K922409J3577135J1554513J918359m015517m076097
12617A1204658l690579m453785l095067J41196L78600l567630o054895k580539
$$ y = [-1666429, -3472438, -483224, 4836399, 9928790, 14614628, 15728819, 9215091, 195612, -187389, 7780949, 9790487, -1369085, -13712342, -13838086, -6347573, -4435360, -9077337, -9820584, -1527199, 10824328, 20824152, 24415162, 18375563, 4830286, -5542360, -4654562, 818841, -1922898, -13048079, -20310520, -16886200, -8185854, -717593, 4795421, 7374615, 3705121, -3951373, -6801688, -1184141, 6049504, 7937145, 6268264, 5874040, 6996354, 8281127, 10836972, 13525709, 10243115, -975865, -10676144, -7753735, 5823400, 17377913, 19296272, 15280755, 11204658, 7514079, 3060294, -34773, 106423, 485023, -3082607, -9137502, -11718041]
12609a1718041L257111M443943K53657k711181L46852N566938N535861p8449l214133
12600A682558J591901Q661126Q059377n69928o850025l501106M329221P109943
12592B0513067L654607L20592L85024Q63880q22877l580701o480112r344561q578510
12583c069591j34850J0714956J1254901j543523j3795434j2255089k010419K765427
12575h073622o02731l624561k691762r82367K918818J2600357K0061837J1647378
12567C1253347q515788j8316576p984863O003687O955165J065119Q85588J711574
12559A3057253o376760j4668470o989204J0661672J5069898R18156j0785245m546934
12551c659634Q266716Q903386k532863j1230349q732732O4581N701829L031745
$$ y = [-11718041, -8460930, -4016987, -3763330, -6474511, -6127659, -560721, 4975140, 4896691, 1682558, 3274459, 11935585, 19994962, 19425034, 12575009, 9073903, 13403124, 20513067, 24167674, 24488266, 24873290, 25737170, 24914293, 21333592, 14853480, 5508919, -3069591, -3204441, 7510515, 18765416, 17221893, 3426459, -8828630, -10839049, -8073622, -8676353, -12300914, -14992676, -15975043, -13056225, -455868, 19605969, 31253347, 22737559, 4420983, -3563880, 2439807, 9394972, 10460091, 11345679, 13057253, 6680493, -7987977, -14977181, -4315509, 10754389, 11672545, 887300, -3659634, 4607082, 13510468, 10977605, -252744, -8985476, -8920895, -3219066, -187321]
12543a87321n070660r277264l242171P340401J1238603P458582N558275Q737524
12535B2555969P840616k790563j4004751j4106673m624180M013000O291588L713760
12527H888766j099421m665933k021966O257060J0709613M644431m779141n745197
12519A2188212J208435N094498J640368k167863j492259p89536l688803n268554
12511F724498j093650L210541K0546o885736o693115J665347O993709K441689
12503F383829m581523m503086K03638J038481j989230k129162Q81311R62891j447106
12494e179957P85675O764977N983108l457837q566753j718953N889636K706249
12486C206145l350058R17473R511548O129218p475330j2695451l558548N172081
$$ y = [-187321, -5257981, -14535245, -17777416, -10437015, 801588, 8260170, 13818445, 22555969, 30396585, 27606022, 13601271, -505402, -5129582, -1116582, 5175006, 8888766, 7789345, 3123412, 1101446, 7358506, 18068119, 22712550, 17933409, 12188212, 13396647, 18491145, 20131513, 17963650, 16471391, 15681855, 11993052, 6724498, 5630848, 8841389, 8861935, 1976199, -4716916, -3051569, 3942140, 6383829, 1802306, -2700780, -2497142, -1458661, -3447891, -5577053, -4695742, -3732851, -5179957, -4394282, 2370695, 8353803, 4895966, -3670787, -5389740, 499896, 3206145, -143913, 773560, 10285108, 16414326, 8938996, -3756455, -7315003, -2142922]
12478b142922L318963k53458L755545Q640024M894432k765585l911728N41452
12470A2076723J488857l366219p709255o921753k530093J884283M114344M370165
12462C407052N461314R048822J1060253O068045l334651q598137p458211n724996
12454I929491n762187l378006J460902K279592j594641k319631J910159K631794
12446E157473k188235j990630O355395Q067109n809778j8358986r302160J2487896
12438e581916K0187145P502578n668988n241192M25508l33018n102851o370154
12430a82888l863229k33988M961142J0263152J0098434L251529m005340p324492
12422A2964320q856954r112568l862444N769879R648396K178600q096699r940663
$$ y = [-2142922, 1176041, 922583, 4678128, 13318152, 18212584, 15446999, 11535271, 12076723, 13565580, 10199361, 2490106, -4431647, -6961740, -5077457, -963113, 3407052, 8868366, 17917188, 28977441, 35045486, 31710835, 23112698, 15654487, 9929491, 4167304, 789298, 2250200, 4529792, 2935151, 615520, 2525679, 5157473, 2969238, 978608, 7334003, 15401112, 9591334, -8767652, -18069812, -5581916, 14605229, 22107807, 16438819, 11197627, 11623135, 11290117, 6187266, -182888, -4046117, -4280105, 681037, 10944189, 21042623, 24294152, 20288812, 12964320, 4107366, -5005202, -8867646, -3097767, 6550629, 8729229, 632530, -9308133]
12414i308133m133477Q95483K617425M981847Q872983J0445154P839352K864208
12406B5074842l212696r591254j2367831p372320K487208Q066015M306980l906168
12398C484776q207647n983979p07693M298488Q382749J0237844O559678l127623
12390A4936593j2692192j4467421p894636M18378N317879P448424Q175099N920454
12382G162578Q10010k516209j826385k148748p014781r298825k78265J4051731
12374a058894J6988173L736240j0280199r234802K954287R698522L714876o418656
12366A0099547r659855m655801K374448O037488N384953K334446o24455j845249
12358I445522j271506p4723P96096J725015L585367N330906L556427l139780r636985
$$ y = [-9308133, -13441610, -12546127, -9928702, -4946855, 3926128, 14371282, 22210634, 25074842, 21862146, 12270892, -96939, -7469259, -4982051, 3083964, 7390944, 3484776, -4722871, -10706850, -11414543, -7116055, 1266694, 11504538, 18064216, 14936593, 2244401, -12223020, -20117656, -19699278, -14381399, -6932975, 1242124, 7162578, 7972588, 5456379, 3629994, 1481246, -5533535, -14832360, -15110625, -1058894, 15929279, 19665519, 9385320, 150518, 3104805, 12803327, 16518203, 10099547, 439692, -4216109, -1841661, 4195827, 9580780, 11915226, 11290771, 9445522, 8174016, 8099293, 8895389, 10620404, 14205771, 19536677, 23093104, 19953324, 10316339]
12349A0316339q456074m33424L930217j419652p680322l014509Q593186J1666893
12341A3502654K706692l861389J581871Q087138J762961j0683474j0944119K741228
12333D893562J2590665P469137l082505o330190m483272n968974q699709m638447
12325h249733M016168O323304j59846n214265j589570M998664O162712L016524
12317I303958J424859J083272k282501o779233n437625K028775O487601J606199
12309G435305o936457q767759j614340P556522J1480607Q267432M14627o612531
12301A1223406o280287K222440R134497L422205j0959204j6227416l596078J2562943
12293A502506J2399210k639923j2506175o595241M212996O488590K002056q09848
$$ y = [10316339, 1860265, 1426841, 5357058, 3937406, -3742916, -6757425, 1835761, 13502654, 16209346, 12347957, 13929828, 22016966, 23779927, 13096453, 2152334, 4893562, 17484227, 24953364, 21870859, 15540669, 11057397, 5088423, -3611286, -8249733, -4233565, 2089739, 1929893, -3284372, -4873942, 124722, 6287434, 9303958, 10728817, 11812089, 9529588, 2750355, -2687270, -658495, 5829106, 7435305, 498848, -8268911, -9883251, -2326729, 9153878, 17421310, 17835937, 11223406, 4943119, 7165559, 16300056, 19722261, 8763057, -7464359, -11060437, 1502506, 13901716, 11261793, -1244382, -7839623, -3626627, 2861963, 4864019, 4054171]
12285D054171j723505m183175m306489K539124R386653N820123m050576o139476
12277A396850J390009N512020K54029m365195r36647K914423k86675l809025K83553
12268B353342N361778J517483n970288n007929K163883K685773m522055o711578
12260h129591J327627R252868Q214301K451101j429358m846285r877469j1125067
12252a4161873l390386Q406454J4233608J0507455J958660m795982o085661k746455
12244C925820N78470K52058j801360j831301j074705k783407m036242Q32864Q778190
12235B840387J0118652L639188j131250L33759J135552k896466m795380K59077
12227I503519M597047P18325n517399n292033j789289k632076m803503o50281
$$ y = [4054171, 2330666, -1852509, -6158998, -3619874, 5766779, 11586902, 7536326, 1396850, 2786859, 8298879, 8552908, 4187713, 3251066, 6165489, 5878814, 2069789, 2353342, 7715120, 9232603, 3262315, -1745614, 418269, 3104042, -1418013, -8129591, -6801964, 2450904, 10665205, 13116306, 11686948, 6840663, -3036806, -14161873, -17552259, -9145805, 5087803, 15595258, 17553918, 12757936, 6672275, 3925820, 4504290, 4756348, 2954988, 1123687, 48982, -2734425, -6770667, -5937803, 2840387, 12959039, 16598227, 15466977, 15800736, 16936288, 14039822, 9244442, 9503519, 14100566, 14818891, 9301492, 4009459, 2220170, -411906, -5215409, -5865690]
12219e865690O588866P395745K214360j179735l154280r152849j3213887l329638
12211a9697108J4637508J8343627J728774j2371774m862545J0577040Q690136
12204A7045658q419122j5154172j605213J3068096J0564577j916439o728057j788206
12196E067122J571225j154972l543616j927822o34967k174274k352175J332763
12188c816716M360316K805962J26990J187364M211020M222195J132387j194624
12180A3034894j655531k215967k936772j997943j45424k72840k439405l413036
12172b042024j593552Q88564J295038q81492l819087m390854r27395L402694L170422
12163d897686j049329j812885L859590Q243165M340891k527568l420168o16729
$$ y = [-5865690, 723176, 8118921, 10333281, 9153546, 5999266, -3153583, -16367470, -19697108, -5059600, 13284027, 15012801, 2641027, -2221518, 8355522, 17045658, 8626536, -6527636, -8132849, 4935247, 15499824, 13583385, 6855328, 5067122, 6638347, 5483375, 1939759, 11937, -623030, -2797304, -5149479, -3816716, 543600, 3349562, 3476552, 4663916, 8874936, 13097131, 14229518, 13034894, 11379363, 9163396, 6226624, 4228681, 4083257, 3810417, 1371012, -2042024, -3635576, -2747012, -1451974, -2333466, -6152553, -10543407, -11470802, -8068108, -4897686, -5947015, -7759900, -3900310, 4342855, 8683746, 6156178, 2736010, 2119281]
12155B119281k369395o625387l577086O591445J2748521J0765917Q029659P333772
12147C5016727J727032r075552j2816537m198817L829556m07675q853670p959309
12139b738245q45906N8464n058518n238916J523322O170967M748244K283881P98470
12130A701763k683717n325897J62461J0385226J1326793p21659j0729010n630750
12122a514790O737382R673716J233447n966861m804720j171678j192113k422436
12114E71947j602292j425116l168302q52260P997173J2342817J371509j4836354
12106C99122j4558180L508545J5220199O015248p144094l596889P692493M765175
12098A2301619q704649r246511N455424J1477344q52210j0528567j716807J0050473
$$ y = [2119281, -250114, -6875501, -10452587, -3861142, 8887379, 19653296, 27682955, 35016727, 36743759, 27668207, 14851670, 10652853, 14482409, 14074734, 5221064, -2738245, -3584151, -3525687, -8584205, -13823121, -12299799, -6128832, -1380588, 903293, 1701763, -981954, -6307851, -6145390, 4239836, 15566629, 14844970, 4115960, -1514790, 5222592, 14896308, 16129755, 10162894, 5358174, 4186496, 2994383, 571947, -1030345, -2455461, -5623763, -6476023, 1521150, 13863967, 15235476, 399122, -14159058, -10650513, 4569686, 10584934, 3440840, -156049, 7536444, 12301619, 3596970, -5649541, -194117, 11283227, 10431017, -97550, -1814357, 8236116]
12090H236116M961417r003246j1746905k833943L796332M867537O280904N750816
12082A0309028k021913r335185m940616N111917N470778l335268o986868k067944
12074g796071J049025o41898J453183Q540748R748923R47829p416012o432712
12066e46985J47781M828709N022716N16953o565587q483475l40256Q672463N949491
12057I201810l699148m066672N599945Q740264l93204p113645k172755K512964
12049H609559m344608j2980473q809680L643827Q779970L446435k233653k259039
12041f147662j31951K10230j281376l475866m008497K09662O800935P479134k0240
12032c65631n830924j441950O683382O181857k927351r023478n861520P69680
$$ y = [8236116, 13197533, 4194287, -7552618, -10386561, -6590229, -1722692, 4558212, 10309028, 8287115, -1048070, -5988686, -876769, 4594009, 1258741, -5728127, -7796071, -6747046, -7388944, -5935761, 2604987, 12353910, 13301739, 5885727, -546985, -399204, 4429505, 9452221, 9969174, 3403587, -5079888, -5420144, 3252319, 9201810, 5502662, 1435990, 7035935, 15776199, 15382995, 8269350, 6096595, 8609559, 4264951, -8715522, -17525202, -13881375, -5101405, -1654970, -3888623, -6147662, -6279613, -6069383, -7350759, -10826625, -14835122, -14625460, -7824525, -345391, -365631, -6196555, -7638505, -955123, 5226734, 2299383, -6724095, -12585615, -11815935]
12024a1815935L541803K655442K325465L702674M166572J405181l427657o375973
12016c822428m843541q14060J768029K272506L075110M344831L247044r13007
12008D314484m607620m386129m84370M118663N804857K741735j748970r63344
12000D789306N643981Q574835N73286j1175401j3942645p190665o82082K543368
11992a0866017P947926J4287831J1592515j627980j2685038j2354599o555371
11985a0260733l846223k558605J547389M917943L010971k41754R31941L944466
11977b554605K654599k469918o291783o733676m392492R03258P348451R678581
11969a857585N869308P59694j423804k537483m201804k995691K346632N805199
$$ y = [-11815935, -8274132, -5618690, -3293225, 409449, 4576021, 5981202, 2553545, -3822428, -8665969, -9480029, -7712000, -5439494, -2364384, 1980447, 5227491, 4314484, -293136, -4679265, -5163635, -1044972, 4759885, 7501620, 5752650, 4789306, 10433287, 19008122, 19581408, 8406007, -5536638, -12727303, -13409385, -10866017, -2918091, 11369740, 22962255, 21334275, 8649237, -3705362, -10260733, -14106956, -16665561, -15118172, -10200229, -7189258, -7431012, -6499071, -2554605, 99994, -2369924, -8661707, -15395383, -19787875, -18884617, -11536166, -1857585, 4011723, 4771417, 3347613, 810130, -3391674, -6387365, -4040733, 1764466]
11961A764466K800225k039413k493146j65543N72080R21117L182615L629488j354958
11952F816931o358131l355969N490053R941052N363059k853364p688280p025224
11944C30127k298212L872278Q374821R534091Q219978N286450M3422o650437j0759174
11935A5953344r415196m641589n51127J031387R13626R94597K862359N342333
11927A2489734M456839o84341m572814l193644j448820m849574q089316l049508
11919h941444N167480M436359l361553l918340N208399R380147P92768r438500
11911f74684r984558l890378K935171J0867365J5602232O476396j2745821k0038787
11903a1453064o415177P382007K689018p216212j058705J3290010J2883342m79263
$$ y = [1764466, 4564691, 2525278, 32132, -133411, 438669, 1359786, 4542401, 8171889, 6816931, 458800, -2897169, 2592884, 12533936, 17896995, 15043631, 7355351, 330127, -1968085, 1904193, 10279014, 19813105, 28033083, 33319533, 33362955, 26712518, 15953344, 6538148, 1896559, 1345432, 2376819, 3290445, 4285042, 7147401, 12489734, 16946573, 16262232, 11689418, 8495774, 7046954, 2197380, -5891936, -8941444, -3773964, 662395, -2699158, -6617498, -1409099, 7971048, 8763816, -674684, -10659242, -14549620, -11614449, -747084, 14855148, 21331544, 8585723, -11453064, -17868241, -10486234, -7797216, -15013428, -16072133, -2782123, 10101219, 9621956]
11895I621956m574955M162313O241806n145398j2627894n338118L986745K676480
11887i97065k068636N31352N395024K345287n233362o048704J379246P721483
11879C024625O306316k74819n564047o373312m688926l772769k495300L438428
11871a0399804J2403889J4757981N832576m668071m957987J748664K803213m386865
11863A3133596r801466o675944Q58977O215475O968929K839811m251606q078667
11855A209105m037764L197749N133158J028985l062562m071260l051459n7213
11847c711261L882999L722596k072553n833065j551027M709755N132084K956087
11839G235615L215509M15143r201510j3315804j282901J2500647O883420j0085002
$$ y = [9621956, 5047001, 9209314, 15451120, 10305722, -2322172, -7660290, -3673545, -997065, -3065701, -2534349, 2860675, 5205962, -27400, -6076104, -4696858, 3024625, 9330941, 9056122, 3492075, -2881237, -7570163, -11342932, -13838232, -10399804, 2004085, 16762066, 22594642, 17926571, 12968584, 14717248, 17520461, 13133596, 3332130, -3343814, -2484837, 3730638, 10699567, 13539378, 9287772, 1209105, -2828659, 369090, 5502248, 6531233, 3468671, -602589, -3654048, -3711261, 171738, 3894334, 1821781, -4011284, -5562311, -852556, 4279528, 7235615, 10451124, 10866267, 1664757, -11651047, -12933948, -433301, 6450119, -3634883]
11831c634883j0781692P634281J7891124O199307p835707n130040N159850O110471
11823A5612711l92669l321470j774559j39592J796121K238978m613918j4041360
11815d635758j0984064M558468J1111592j850771j4476963o650190J0593752J4265158
11807A931224M822365l21545K748085L825330Q58416O36778J984968j631895o551003
11798H302723m520934J96105k293934p746088m250544M840354N020460l625248
11790d077106n849873K390448P787800L574359l70967K580677M322562j059340
11782I298560n072399Q4010P169668N535109k614900p574333o310332k633294
11774b117911Q00740L225465L236439J279430O03888K137818L156916L058073
$$ y = [-3634883, -14416575, -6782294, 11108830, 17308137, 9472430, 4342390, 9502240, 15612711, 15220042, 11898572, 10124013, 9984421, 11780542, 14019520, 9405602, -4635758, -15619822, -11061354, 50238, -1800533, -16277496, -22927686, -12333934, 1931224, 6753589, 6432044, 9180129, 13005459, 13863875, 14500653, 16485621, 14853726, 8302723, 3781789, 3977894, 1683960, -6062128, -10312672, -5472318, -451858, -4077106, -9926979, -7536531, 251269, 3825628, 3454661, 6035338, 10357900, 9298560, 4226161, 4310171, 11479839, 17014948, 14400048, 6825715, 515383, -2117911, -1317171, 1908294, 5144733, 6424163, 7028051, 9165869, 12322785, 15380858]
11766A5380858M031252M459684Q1668o070052n189694J860837K294286q396753
11758H452086j5621887n841359J1787917J7190706O888960m418201p015571o214113
11750E208538q021668q480179k840926M418648N744539R10138m456235o641080
11742a4158225n407994j274514M198685P825267Q211385P429144O211350R84801
11734A4019899r625307j8369645j5967864l512113P881022J0538472P634214N629396
11726a771926N341043M143936K390689K721210N197946P032801N858931R50534
11718C1865164o453229j1811311r875471j991977L176993P69941k720001P08242
11710C668351P227917O543427j369103n265958L90077P405607O478292p40813
$$ y = [15380858, 19412110, 23871794, 23953462, 17883410, 12693716, 14554553, 16848839, 8452086, -7169801, -13011160, -1223243, 15967463, 22856423, 18438222, 11422651, 5208538, -2813130, -11293309, -14134235, -9715587, -3971048, -3060910, -7517145, -14158225, -19566219, -20840733, -16642048, -8816781, -605396, 6823748, 13035098, 14019899, 4394592, -13975053, -29942917, -33455030, -25574008, -15035536, -7401322, -1771926, 3569117, 7713053, 10103742, 12824952, 18022898, 25055699, 30914630, 31865164, 25411935, 13600624, 3725153, 1733176, 4910169, 5680110, 2960109, 3668351, 10896268, 17439695, 16070592, 10804634, 11194711, 18600318, 25078610, 24337797]
11702B4337797p172290j0373432j0944076p277215O32153O551961M976328J32062
11694H63288N74022O225301Q399089L072998l066036k341386L623560P104196
11686B4455032M448998j079571n339972p978060r821319q771564k169390O854008
11678E98162R916617L533344m310550k997286O200700J0597595K644397r869239
11670A6313740j3948909p281908J146745L656314J164123j720445l054593k796952
11662f521885R1277N788521J0530430R588013L722211j013822j445974j462714
11654A9276057m911964q212264n749007r5219Q21446l788317o597955m690431
11646a3947654l157318l440327K57564P166604N540561p660625j4987863j471630
$$ y = [24337797, 17165507, 6792075, -4152001, -11429216, -10797063, -4245102, 731226, 863288, 1437310, 7662611, 16061700, 19134698, 16068662, 13727276, 17350836, 24455032, 28904030, 27824459, 22484487, 14506427, 4685108, -4086456, -6255846, 598162, 10514779, 14048123, 9737573, 6740287, 12940987, 23538582, 26182979, 16313740, 2364831, -4917077, -3770332, -114018, 1050105, -670340, -3724933, -6521885, -6430608, -642087, 9888343, 19476356, 23198567, 22184745, 20738771, 19276057, 14364093, 6151829, 402822, 307603, 1129049, -2659268, -9257223, -13947654, -17104972, -20545299, -20287735, -13121131, -7580570, -15241195, -30229058, -31700688]
11638c1700688J9814400K3268986O593167q213827p801485j292615O46144N69644
11630A883726K122136O57760n668948r352806n703365L98396N143063J0046412
11622d73626J1539050K545961j0077502q513755P256018J4090179R86718j1848741
11614E504302n926171N043906K97976j1093609o776045Q698754J1667086M53315
11606G869514l464635N656586R142901j581372j0789889p048113k30115L28334
11598a16789J166515O332690N612538n047170j1248829l531557N120352J583267
11590a28983m845599q87210N595893Q50476p249145j795326J1373262J1049726
11582A3963094l180507q939607K183583J1332838L894904q076422p483413J650500
$$ y = [-31700688, -11886288, 11382698, 17975865, 9762038, 1960553, 667938, 1314082, 1883726, 4005862, 4663622, -1005326, -10358132, -16061497, -15663101, -10520038, -473626, 11065424, 13611385, 3533883, -4979872, 2276146, 16366325, 17353043, 5504302, -421869, 4622037, 4920013, -6173596, -12949641, -4250887, 7416199, 7869514, 4404879, 10061465, 19204366, 17622994, 6833105, -215008, -445123, -116789, 1049726, 7382416, 12994954, 7947784, -3301045, -6832602, -1712250, -128983, -4974582, -5861792, -265899, 584577, -6664568, -8459894, 2913368, 13963094, 10782587, 1842980, 4026563, 15359401, 19254305, 11177883, 3694470, 5344970]
11574E344970M845668R03947j289809r31139l805692p413244l397687O314728
11566E71742R943251L593483l851961n851246o157800p675956n498491J825262
11558a3101716N002062j713826p513947N18382J5098139J6266347Q58437j1435340
11550C978538o267647N528260N759441m689799j0261891n149946J002079N29278
11542i571687k265117j168088K329175M061623M305456N032737N484748M637308
11534A2846155L591198K180050j988872p643139q424021k177459L408435P94455
11526B586802n621850n140993L863094J1919895J1454966M428664l574666r234670
11518A0681242r578450k284716P838513R985591J157480p185814l867039N669151
$$ y = [5344970, 10190638, 11094585, 9804776, 8873637, 5067945, -2345299, -5742986, 571742, 10514993, 14108476, 10256515, 4405269, -1752531, -9428487, -14926978, -13101716, -8099654, -9813480, -17327427, -16809045, -1710906, 14555441, 15413878, 3978538, -2289109, 3239151, 8998592, 4308793, -5953098, -11103044, -10100965, -9571687, -11836804, -13004892, -10675717, -6614094, -2308638, 2724099, 8208847, 12846155, 16437353, 18617403, 16628531, 8985392, 561371, -1616088, 1792347, 2586802, -3035048, -8176041, -4312947, 7606948, 19061914, 23490578, 19915912, 10681242, 1102792, -1181924, 6656589, 16642180, 17799660, 10613846, 6746807, 12415958]
11510A2415958P424473Q6900l746279J812554O659516J213394q332243r684314
11502G849959k332339L640305K774731p17192j836254j168389j803073m666189
11494A741559p277083n123293L384605J1780866J0689785J051575n180332k382503
11486H685179K17880m576048p596040Q55154J0640953N479114r097634j2482191
11478g873633j574976N933007K381885K31708N391428N152621n897113j1242132
11470g497205J47600J2238453P280591m726474m269965M154335J911786r855213
11462f16092j2585307k392186N516576M241155L457481P696877Q076120R12346
11454A4306970m407966k541218o30478l161426l526929K284733P123066M967673
$$ y = [12415958, 19840431, 19927331, 16181052, 17993606, 24653122, 25866516, 17534273, 7849959, 5517620, 9157925, 11932656, 11215464, 9379210, 8210821, 6407748, 1741559, -5535524, -10658817, -7274212, 4506654, 15196439, 16248014, 11067682, 8685179, 8903059, 4327011, -3269029, -2413875, 8227078, 13706192, 4608558, -7873633, -9448609, -3515602, -1133717, -902009, 4489419, 9642040, 3744927, -7497205, -7349605, 4888848, 12169439, 7442965, 3173000, 7327335, 9239121, -616092, -13201399, -15593585, -10077009, -5835854, -2378373, 5318504, 13394624, 14306970, 9899004, 7357786, 6727308, 3565882, 38953, 2323686, 9446752, 14414425]
11446A4414425K4528k786968n333959q427548p272775o60430M949516N314618
11438B21407L109011o5620n327720p900821l98861J1535899J1886430j606653
11430A1453072j1372417n727707M989506P589714N348950N668422L617219o399523
11422A5167236j4912375j0705254n13113J879589j603783O76832P695138Q386834
11414F071104K848452J561037M651387J194834r231424j2905221m292206M775003
11406e327034M556525R37576J591888K234670l094955q726739n923404K150479
11398a1600994N108754J063909k247508l48481K742940K805871K014213M300317
11390C839021P807604N966616l321068j2108410r867841K743812J2416947R088395
$$ y = [14414425, 14438953, 11651985, 6318026, -2109522, -9382297, -10042727, -5093211, 221407, 3330418, 3264798, -2062922, -9963743, -10362604, 1173295, 13059725, 11453072, 80655, -5647052, -657546, 6932168, 12281118, 17949540, 21566759, 15167236, 254861, -10450393, -10963506, -9083917, -10687700, -10010868, -2315730, 6071104, 8919556, 10480593, 15131980, 16326814, 7095390, -5809831, -10102037, -5327034, -770509, 167067, 1758955, 3993625, 898670, -7828069, -13751473, -11600994, -6492240, -5428331, -7675839, -8024320, -5281380, -2475509, -461296, 3839021, 11646625, 17613241, 14292173, 2183763, -7684078, -4940266, 7476681, 16565076]
11382A6565076j447489o786677n188782m442177o116756k942032O535262J2618347
11374H794772Q925687K115008L27267P40893k775077o949442m637257J490817
11366H032668K074724l701362o766650k740853K070970J860670l96802k23050
11358B10315L58721j741823k809694K465733J0436655J0912554Q30232j0548306
11350A0114387j2604454n502199J749053K840989J19699m19507L088793O633908
11342F020669M893128l076554j1730681j2882412l871433P610194R973741J254163
11334a809185o904220l077942Q239008J1417448Q36719j0557320q573168K867974
11326g560686P990578J567291n118162j906066O268285Q182555K153817m108431
$$ y = [16565076, 15117587, 8330910, 3142128, -1300049, -7416805, -10358837, -3823575, 8794772, 17720459, 19835467, 20162734, 20903627, 18128550, 11179108, 6541851, 8032668, 10107392, 6406030, -360620, -3101473, -1030503, 830167, 433365, 210315, 569036, -1172787, -3982481, -1516748, 8919907, 19832461, 20662693, 10114387, -2490067, -7992266, -6243213, -3402224, -3282525, -3702032, -613239, 6020669, 10913797, 7837243, -3893438, -16775850, -20647283, -13037089, -3063348, -1809185, -8713405, -11791347, -3552339, 7865109, 8701828, -1855492, -10428660, -7560686, 429892, 1997183, -3120979, -5027045, 1241240, 9423795, 11577612, 7469181]
11318G469181n630443m530180l234081l51709M988252R452341Q921015L646210
11310B0730586j637997k189114K136164O244392M882146j090740n745537o157677
11302A7172223n462384n747438l399966L540782Q627776N059599l134030o526422
11294A0130140m412965l899250o374667n877604j247848J694549J816723M237446
11286c933476P342122K196650r424972j1460450K299822J4699765R302801m208679
11278F813583n472943M880414Q563172R5375o518956k259032M448616M159597
11270A4709826j95230k414731l094373m338275m273705k065062j49129J629160
11262a91519N335436O844528m77539j1604566j2185436L81794J1178029R330335
$$ y = [7469181, 1838738, -2691442, -5925523, -6277232, -1288980, 8163361, 17084376, 20730586, 19092589, 16903475, 19039639, 25284031, 30166177, 29075437, 23329900, 17172223, 11709839, 5962401, 2562435, 6103217, 14730993, 19790592, 16656562, 10130140, 5717175, 1817925, -4556742, -10434346, -11682194, -9987645, -8170922, -3933476, 3408646, 5605296, -3819676, -15280126, -12980304, 1719461, 11022262, 6813583, 1340640, 6221054, 14784226, 14879601, 8360645, 6101613, 10550229, 14709826, 14514596, 12099865, 9005492, 4667217, 393512, -1671550, -1820679, -191519, 5143917, 11988445, 11510906, -93660, -12279096, -11897302, -719273, 8611062]
11254H611062K402135J148783K697878l27718m950051m559165j921229k792657
11246C09038l507999K092295Q763356O172643m100545j0165528o603962R56338
11238f084364O078374O535309J708021n251126n973018K038235P228162o03460
11230E676133j1217544o330321J0853485J7324674M148512j0543582r781112j041722
11222i11477M21909l585415j563243N835444Q174758L907749P54835Q7825l816130
11213I306255r227684o699289L929004J0052850N089873j466218l108M213562
11205A5195245J889722l365286j602007N293371O104769l79012l066039J729775
11197B1800538K540658p969317j8152294j3351679J415357Q492926L379126j242182
$$ y = [8611062, 11013197, 12161980, 14859858, 14532140, 9582089, 5022924, 3101695, 309038, -3198961, -1106666, 7656690, 13829333, 9728788, -436740, -7040702, -6084364, -5990, 6529319, 8237340, 2986214, -2986804, -948569, 6279593, 5676133, -5541411, -11871732, -1018247, 16306427, 20454939, 9911357, 130245, -911477, -489568, -4074983, -5638226, 197218, 8371976, 12279725, 13034560, 13122385, 9306255, 78571, -6620718, -2691714, 7361136, 12451009, 10984791, 10981683, 15195245, 17084967, 13719681, 12117674, 17411045, 23515814, 23136802, 20070763, 21800538, 24341196, 16371879, -1780415, -15132094, -13716737, -5223811, -1844685, -3086867]
11189c086867K308583N223742j451740j0884467j0133113J182066J1153489J1179020
11181E490713L824237k925150l335304K461961P692301M071680p566707j4961765
11173e248034q727474M073726Q329368J160645n251945j976752M912477N099433
11165B371444j048226m994098l060265L41198J125027N49282P96144R29689J87825
11156b801980J500977P030890J1541371O111091r018309j9943417j3230275O467819
11148a2341833J9023516J1142001q420304j9178619j1375410N616271J5489261
11141d5117J1551967J030565m296077m17775N699771N016999k813100r750172
11133E977061r543716l917389J564733L418836R99032l793855n726342m47024
$$ y = [-3086867, -778284, 4445458, 2993718, -7890749, -18023862, -16841796, -5688307, 5490713, 9314950, 6389800, 3054496, 5516457, 13208758, 17280438, 9713731, -5248034, -13975508, -9901782, -1572414, -411769, -5663714, -7640466, -2727989, 2371444, 1323218, -3670880, -6731145, -6389947, -5264920, -4715638, -3919494, -2989805, -2801980, -1301003, 5729887, 17271258, 23382349, 14364040, -5579377, -18809652, -12341833, 6681683, 17823684, 9403380, -9775239, -21150649, -15534378, -45117, 11506850, 12537415, 8241338, 7823563, 13523334, 18540333, 15727233, 5977061, -3566655, -7484044, -5919311, -2500475, -1501443, -5295298, -11021640, -11468664]
11125a1468664P925440R371103J828005m233499p48182N381008L079051n232511
11117E901751p678150j632911L635860K901611J429235K857477K141198l957377
11109E598694r006954o853979k043397k078209m626189j547318O930382J1079359
11101b547611N257321m365784p914823l164884L728324O340255M399951K432214
11093D164963L169217L772950K19345n598402p004655j710322M523720N932907
11085G469723M021754K725348P96173m399613q489846m380108M856373O856269
11077I456073k483133j0876618o055716O209934J0206657L047329k277278K296136
11069I523384P767259K772007q673023j3418914p999089j009578J342605J816299
$$ y = [-11468664, -3543224, 5827879, 7655884, 3422385, 2674203, 8055211, 11134262, 5901751, -1776399, -3409310, 226550, 3128161, 4557396, 7414873, 9556071, 5598694, -3408260, -10262239, -12305636, -14383845, -19010034, -20557352, -13626970, -2547611, 2709710, -1656074, -9570897, -12735781, -9007457, -2667202, 1732749, 4164963, 7334180, 11107130, 11326475, 5728073, -1276582, -2986904, 1536816, 7469723, 11491477, 14216825, 15012998, 10613385, 2123539, -2256569, 2599804, 9456073, 6972940, -3903678, -9959394, -3749460, 6457197, 9504526, 7227248, 9523384, 17290643, 20062650, 11389627, -2029287, -10028376, -11037954, -9695349, -7879050]
11061g879050L327661L076628r08761m710355m452494j742518P27126L506883
11053i054880O185906M845226p68441l234941K241125Q316186N083776l937547
11045I676410n738742K323269P195998j483554j5820732j8826103n231624J2523752
11037a5381326J8317346Q980295l604822o082998J680068P594412L440094m845960
11029A0097109o964283l140710j267118k359447K40916O709134P707295J1918
11021A1034814n776061q91402P200767O171602k018323n360572j655665q90913
11013G814247p401552j2540983r304651l187174j556344j101995M803933J2095631
11005a0378888J0347899n94676q807406o694043k42075J822508M15229J608222
$$ y = [-7879050, -4551389, -1474761, -2383522, -7093877, -11546371, -13288889, -12561763, -9054880, -2868974, 1976252, 1207811, -2027130, 213995, 8530181, 13613957, 9676410, 3937668, 6260937, 13456935, 11973381, -3847351, -22673454, -27905078, -15381326, 2936020, 11916315, 8311493, 2228495, 3908563, 11502975, 14943069, 10097109, 3132826, -7884, -1275002, -3634449, -3393533, 3315601, 11022896, 11034814, 5258753, 4367351, 11568118, 17739720, 15721397, 10360825, 8705160, 7814247, 412695, -12128288, -21432939, -24620113, -26176457, -27278452, -22474519, -10378888, -30989, -625665, -9433071, -16127114, -16369189, -14546681, -14131452, -12523230]
10997a2523230N294915O081605L185341J791746M250780O403597M401292p7333
10989A8808713l702094o037552p420134o197993j381966M819104R776508J2644682
10981B1309268J1505628L176301r609650j5669400p398419P035262J1719917L103032
10973B5171939o206968n560619K84106P40503m496379o711471k368118K287528
10965C140521J513331j796550j586067K035343L598068Q31448k443719k780571
10957B511804j933554k208657q99949M874830R686492M310630r322966j6127724
10949i109094o763921P950972J0058930j923650j2171382r253165J411531Q439861
10941a1359918Q407316M837595R82227r19912J409269O698412R238542N918640
$$ y = [-12523230, -7228315, -1146710, 2038631, 3830377, 8081157, 14484754, 18886046, 18808713, 15106619, 9069067, 1648933, -4549060, -5931026, -1111922, 8664586, 21309268, 32814896, 35991197, 26381547, 10712147, 3313728, 10348990, 22068907, 25171939, 18964971, 13404352, 13688458, 14428961, 9932582, 3221111, 852993, 3140521, 4653852, 2857302, 1271235, 3306578, 6904646, 7736094, 5292375, 2511804, 578250, -1630407, -2530356, 2344474, 12030966, 16341596, 7018630, -9109094, -15873015, -7922043, 2136887, 213237, -11958145, -21211310, -19799779, -11359918, -2952602, 1884993, 2867220, 1947308, 3356577, 10054989, 19293531, 25212171]
10933B5212171P19016j501782j872523m061512p400120p780307l127511M912959
10925E100391J1976925J2125976L047447p597726p860922K282750Q014643p28603
10917B6360881j4493384j7844911j0510020l815380j649605J555836O763455Q594420
10909e038708P286474Q227115Q682163K21779j2637198j2879181K921743J5047101
10901A1831288Q100387o111776p484421J898740L752764o300485j3296504p133640
10893a4743647M124951Q590954N673792J944103O91826M75607r66813l764449
10885B026324l955118L536299J5523116J9196514Q209304n506356p543626l172487
10877B8313970p588628j7266784j2502853Q021101J8467858L238533j7254967
$$ y = [25212171, 25931187, 24429405, 22556882, 18495370, 11095250, 3314943, 187432, 5100391, 17077316, 29203292, 32250739, 24653013, 16792091, 19074841, 27089484, 26360881, 11867497, -5977414, -16487434, -20302814, -21952419, -20396583, -13633128, -5038708, 2247766, 10474881, 19157044, 19378823, 6741625, -6137556, -3215813, 11831288, 19931675, 13819899, 6335478, 8234218, 11986982, 5686497, -7610007, -14743647, -10618696, -2027742, 3646050, 5590153, 6281979, 6757586, 5790773, 2026324, -1928794, 1607505, 17130621, 36327135, 44536439, 39030083, 31486457, 28313970, 20725342, 3458558, -9044295, -1023194, 17444664, 20683197, 3428230]
10870C428230j5857411J984044J0032902K469968j672459O804295J2867343L906566
10862B3963478r042419q556993L239898R008940O14613j1832171j4296297m805843
10854a1706794O265275Q561277K496708k868194k038034N81137r05016l962457
10846c576098k420281K136819K342329k288487l710196J898501P881554O880270
10838I144411K38890n886494q147905o279962r58311N015357P812009P804001
10830H741996R066668J1171087P614803l254127j1890395q889954J195541M887712
10822A8643331k746393j2595517j3976643o544235K483302Q126223J0371371R338342
10814A3099781L318472o329481j2268271q173907K059285P561199M273552k88900
$$ y = [3428230, -12429181, -10445137, -412235, 2057733, 385274, 7189569, 20056912, 23963478, 14921059, 6364066, 9603964, 18612904, 19227517, 7395346, -6900951, -11706794, -5441519, 3119758, 5616466, 2748272, 710238, 1291375, 386359, -3576098, -5996379, -3859560, -1517231, -3805718, -7515914, -5617413, 2264141, 9144411, 9383301, 3496807, -4651098, -10931060, -11889371, -6874014, 937995, 8741996, 17808664, 28979751, 36594554, 33340427, 21450032, 12560078, 13755619, 18643331, 15896938, 3301421, -10675222, -17219457, -14736155, -6609932, 3761439, 13099781, 16418253, 10088772, -2179499, -10353406, -8294121, -732922, 3540630, 3251730]
10806C251730Q33084L681247J322985l519111k961960J943354K206145l958576
10798B798898p426296k381195M745770M952124j564193p664745p935689j744259
10790a6219585P085232J0920926M583746o074800q314983J109066J0443659Q519181
10782A2052442p55747n539447k129544L126118M257174J251943k724076m405270
10774E133593k341334O90949j70220m502376n731997j185932K651696L85583k541237
10765g611275J861443J0257495J1699142L698555m535179n596418k384616o89916
10757F699231l69103J630652L951889J895561n130687j1038448r235361l29028
10749a1925294P618891P290755J71133n005441k277444M581099O480447m8349
$$ y = [3251730, 4084814, 7766061, 9089046, 5569935, 2607975, 4551329, 6757474, 2798898, -4627398, -7008593, -2262823, 2689301, 1125108, -6539637, -14475326, -16219585, -9134353, 1786573, 6370319, 295519, -8019464, -6910398, 3533261, 12052442, 11296695, 5757248, 3627704, 6753822, 11010996, 12262939, 9538863, 5133593, 2792259, 3483208, 3312988, -1189388, -6921385, -8107317, -5455621, -5070038, -7611275, -5749832, 4507663, 16206805, 19905360, 15370181, 9773763, 7389147, 6699231, 6330128, 7960780, 11912669, 13808230, 8677543, -2360905, -11596266, -11925294, -4306403, 2984352, 3155485, -1849956, -4127400, 453699, 6934146, 6885797]
10741F885797p833708o578870M036777J1389018M236079j1104496j6177969m220178
10733a9367550J0177129J1421241M039928K623154P541098N880952n273456j2781640
10725D260856p909695J247725L586065l86741m225993n812655n111668l83782
10717a4735888O536763Q692208L892061q70416k29493J784251J55507k562250
10709B662743j868529J353631M043103M847669J712499o010912j0771274l347484
10701g378554J0523989J3455266J490525r009571o692455r19498j984052l083300
10693c597650L479468Q316618J297791p663413m280092M682700L160178n793172
10685c97572o270158J755373L773741j992575k575820M210541N676017r79645
$$ y = [6885797, -947911, -7526781, -3490004, 7899014, 12135093, 1030597, -15147372, -19367550, -9190421, 2230820, 6270748, 8893902, 16435000, 22315952, 17042496, 4260856, -3648839, -2401114, 1184951, 798210, -3427783, -9240438, -14352106, -14735888, -8199125, 493083, 4385144, 3514728, 3285235, 5069486, 5224993, 2662743, 794214, 2147845, 6190948, 11038617, 12751116, 6740204, -4031070, -7378554, 3145435, 16600701, 18091226, 9081655, 2389200, 1469702, -514350, -3597650, -118182, 8198436, 9496227, 1832814, -2447278, 2235422, 5395600, -397572, -6667730, -4912357, -1138616, -3131191, -5707011, -1496470, 4179547, 3199902]
10677C199902k197655P145434J2773276M079368q822751j1627538n827760j617970
10669b895694j603581j946236j927457k991684l120358P47158P396462J2065841
10661E724451J0100117j53612j3667416j9276225j0362761N825551J5867060J5315102
10653I372267R373266K098759n515678r462632n836171P76624K226377p52528
10645B280284r41532K216001K840646N41025L72527J700648q36357n553054n175344
10636b555156k52774J199056k012608k769891N98938J610138j704992l554671
10628i441960j717078m21976r6169M028469J0786392J1813692M161942n467337
10620A3645975j0575194r961713l575480O485762J1981419O637058l037879o068914
$$ y = [3199902, 1002247, 8147681, 20920957, 25000325, 16177574, 4550036, -1277724, -2895694, -4499275, -6445511, -8372968, -11364652, -14485010, -13737852, -6341390, 5724451, 15824568, 15670956, 2003540, -17272685, -27635446, -21809895, -5942835, 9372267, 18745533, 20844292, 15328614, 5865982, 29811, 806435, 3032812, 2280284, 1338752, 3554753, 6395399, 6936424, 7308951, 9009599, 8173242, 2620188, -2555156, -2807930, -1608874, -3621482, -6391373, -5792435, -4182297, -5887289, -9441960, -11159038, -11581014, -11677183, -7648714, 3137678, 14951370, 19113312, 13645975, 3070781, -6890932, -10466412, -3980650, 8000769, 14637827, 11599948, 5531034]
10612E531034l311484l039233m376644l49379N860551M753947j350930j573342
10604B144520L686335M464224J186631K955841P006038J882788q575978q253739
10596F496660K077856L985593n658732p839257M233068J1095073N8792j2932745
10588A516308j0512432r99231m74130o111828n676375R65066O492940R958595
10580d841087J1808668P206436l138052p984294k868039J061417l482139o656357
10572h893447M649P305797M748345j154406J24353M708665L902815M80062O40800
10563A1867633L65999n769435j1571105q596984m60378L921383L570133K240200
10555d432554M42729r28704J953624P693750Q534184K562555l690236p572709
$$ y = [5531034, 2219550, -819683, -5196327, -5545706, 314845, 5068792, 3717862, 2144520, 5830855, 10295079, 11481710, 14437551, 21443589, 23326377, 14750399, 6496660, 8574516, 12560109, 6901377, -937880, 3295188, 14390261, 14449053, 1516308, -8996124, -9995355, -10469485, -16581313, -22257688, -21292622, -14799682, -4841087, 6967581, 14174017, 11035965, 3051671, 183632, 1245049, -2237090, -8893447, -8888798, -1583001, 3165344, 2010938, 2135291, 6843956, 10746771, 11226833, 11867633, 12233632, 6464197, -5106908, -13703892, -14164270, -10242887, -6672754, -4432554, -3989825, -4918529, -2964905, 4728845, 13263029, 15825584, 12135348, 4562639]
10547D562639j1588349j1329045k15022J2128347Q323734o524223q444962N713927
10539g372954J0956856l416916j4542409m709358R838193Q429779j807037m428457
10531g052303j233796n25172R19806M902315J939028q226376r025721L481299
10523a4820920R206031p07644o059905N232998J3187178K346429r072321l107783
10515c795937N584343k63238q124074k722740M068389k64942l012658M099360
10507d431497K863010j3673972j8427901K235945J8446134R051417p35333Q266566
10499C594369J0131398r438858j4958234R377467J7452870j1190714j8662933
10492a3694635J9332559K1461266m7892521n4138485J14167802K98382821K31082046
$$ y = [4562639, -7025710, -18354755, -18569777, -6441430, 1882304, -4641919, -13086881, -7372954, 3583902, 166986, -14375423, -19084781, -9246588, -816809, -2623846, -7052303, -8286099, -8811271, -7891465, -2989150, -1050122, -9276498, -18302219, -14820920, -5614889, -6322533, -12382438, -7149440, 6037738, 8384167, -688154, -3795937, 1788406, 1525168, -6598906, -9321646, -5253257, -5518199, -8530857, -4431497, -1568487, -15242459, -33670360, -31434415, -12988281, -3936864, -4672197, 3594369, 13725767, 4286909, -10671325, -1293858, 16159012, 4968298, -13694635, 5637924, 27099190, -20793331, -74931816, 39235986, 337618807, 568700853]
10485E68700853o5269919k67465262j88203097o615340L5094518l6279330m9169946
10478i207523J4581851L8383469k072643k0307261P879876J6475377j2846732
10471C2886414k2760364L327149J4205650o969283j5294795N045705J3074138
10464B3514614p142776j7616181Q6854J3947238M535510m828381J06989Q84132
10456A3487999q271019o042785R126763R769645q211305j4161099K068628J2834362
10448A0601189M955541N3926P113656M013650j4765296j9715309J862568J9346036
10440A3465961Q741086j0044791j0860505q80935K340573J671250M096601J696149
10432A0225389q872578j3174006m391211K678089o74989j395816P595797J1424361
$$ y = [568700853, 503430934, 235965672, 47762575, 41147235, 76241753, 39962423, -9207523, 5374328, 43757797, 41685154, 21377893, 29257769, 45733146, 32886414, 10126050, 13453199, 27658849, 20689566, 5394771, 10440476, 23514614, 16371838, -1244343, -1157489, 12789749, 17325259, 12496878, 12603867, 13487999, 5216980, -825805, 8300958, 18070603, 9859298, -4301801, -2233173, 10601189, 15556730, 15610656, 22724312, 26737962, 11972666, -7742643, -5880075, 13465961, 22207047, 12162256, 1301751, 420816, 2761389, 4432639, 8529240, 10225389, 1352811, -11821195, -16212406, -13534317, -14209306, -15605122, -8009325, 3415036]
10424C415036J923870m984633J605188P770258K277968k651246K765563N750430
10416A7872434k564851o625557M725646J3658132K737858j3348493j2149714k01202
10408D104253K128004l816711k732952M142186M089893q01353J204745O589961
10400A4908026J840760j0214270j2574854j696029P267224L898113n347022j0014213
10392a1932265p460749o03846N799155O413131P35572m265977l109858M10778
10384a4014059L48800j961419k112030l12858J658508M843512Q203451O490597
10376C144502o58532n334973l518570j888054n379089p555177k081579N470114
10368a7801358P119101N285623N680268N409401j74818n351949j377042Q033029
$$ y = [3415036, 5338906, 354273, 1959461, 9729719, 12007687, 9356441, 12122004, 17872434, 15307583, 8682026, 13407672, 27065804, 29803662, 16455169, 4305455, 4104253, 6232257, 2415546, -317406, 3824780, 7914673, 7113320, 8318065, 14908026, 16748786, 6534516, -6040338, -7736367, -469143, 3428970, -1918052, -11932265, -19393014, -19996860, -14197705, -7784574, -7049002, -11314979, -14424837, -14014059, -13665259, -15626678, -17738708, -18051566, -16393058, -11549546, -3346095, 3144502, 2485970, -2849003, -6367573, -8255627, -13634716, -21189893, -23271472, -17801358, -10682257, -5396634, 283634, 5693035, 5518217, 166268, -1210774, 6822255]
10360F822255J0444115K228467p505989r684135m113888L567246P391699M529182
10352A3678952j782144m404336j049228K284895K52293l863013l960695q08732
10344C47992k4432k806596m280746o79059N467520P851636L115355n027215r460838
10335e496383q014955m909515k394390K815951J0373180J1712640L203008l956094
10327C333442R32894R297145M823022j0405003j8058746j0476001J486262P687905
10319a1379080Q685346N251307m133760j2221404p358440O428310J1031807J136785
10311b559129q016030n584159M26765J136113Q67706L961715M899111J671496
10303c196412K313756P958411O546944n602073j3703171q223669n18950j038027
$$ y = [6822255, 17266370, 19494837, 11988848, 2304713, -1809175, 1758071, 9149770, 13678952, 11896808, 7492472, 6443244, 8728139, 8980432, 5117419, 1156724, 347992, 323560, -2483036, -6763782, -7442841, -1975321, 5876315, 8991670, 3964455, -5496383, -13511338, -18420853, -20815243, -17999292, -7626112, 4086528, 7289536, 3333442, 4266336, 13563481, 18386503, 7981500, -10077246, -20553247, -19066985, -11379080, -2693734, 2557573, -1576187, -13797591, -21156031, -14727721, -3695914, -2559129, -10575159, -16159318, -15732553, -14596440, -13728734, -9767019, -4867908, -3196412, -882656, 7075755, 13622699, 8020626, -5682545, -13906214, -14425164, -15463191]
10295a5463191j016943P350656J1565023N04879j1213848m573987J1071305J2221783
10287A0445677p00770n932229L257809J0326817M091537o633400j0391052p241001
10279b776612j886813L110102M669382J477038n43569M175751R409034M933297
10271B2567610o387607j1775227p200166n96738K252459L045419L152400J778046
10263F836196J095657L262463M267884J45296m272030k715317J237566J159775
10255A1017490K75066M448762Q617869M360278m225595o996884m864554m786177
10247G846255l673020M515903J1005313K758104j2121825j2624912J444244Q080898
10239G230960j298337r520981m226403L119488J78559n578935l410056J385129
$$ y = [-15463191, -16480134, -9129478, 2435545, 2940424, -8273424, -12847411, -1776106, 10445677, 9744907, 3812678, 7070487, 17397304, 21488841, 14855441, 4464389, -2776612, -4663425, -1553323, 3116059, 4593097, 4049528, 8225279, 17634313, 22567610, 16180003, 4404776, -2795390, -3392128, -1139669, 1905750, 5058150, 6836196, 7931853, 11194316, 15462200, 15607496, 11335466, 8620149, 9857715, 11017490, 11292556, 15741318, 24359187, 28719465, 24493870, 17496986, 12632432, 7846255, 4173235, 8689138, 19694451, 22452555, 10330730, -2294182, -849938, 7230960, 5932623, -3588358, -7814761, -4695273, -4516714, -10095649, -13505705, -12120576]
10231a2120576K26488j630578L066113P100084J088320p383705m171921Q146439
10223e679336J3756290P066696j910501m485651k888759k129350k339307j474630
10215h4548N92387K153205Q66553l884230p993824n866831J124319M963230K568292
10206e561447m4209J059592J177699k380338k552428N509370J2919661Q637877
10198A8765777l494382j0955072j0848641r413194p113987J097295J1318545J1701061
10190A057402J084483o870398l572196K411420M42648n414798m451470L103328
10182a2209581P356652M134743o69976j141980K216599O037705P524876M358052
10174A7607090k796772p835957n571869m06350j220473o862105o003570M798732
$$ y = [-12120576, -11894088, -13524666, -10458553, -3358469, -2270149, -9653854, -13825775, -5679336, 8076954, 15143650, 13233149, 8747498, 5858739, 3729389, 1390082, -84548, 507839, 2661044, 3527597, -356633, -8350457, -14217288, -13092969, -8129739, -5561447, -5605656, -4546064, -3368365, -5748703, -8301131, -2791761, 10127900, 18765777, 15271395, 4316323, -6532318, -15945512, -23059499, -21962204, -10643659, 1057402, 2141885, -4728513, -8300709, -5889289, -5446641, -10861439, -15312909, -12209581, -4852929, -718186, -1388162, -2530142, -313543, 5724162, 13249038, 17607090, 14810318, 6974361, 1402492, 996142, -224331, -7086436, -13090006, -8291274]
10166h291274J2671030N967937p340987r970486k68414N729676j829055j2376258
10158a5707831r968187N354620J8306725J6828392M110740o702621o327312K169282
10150H063808P870497N139179j26910j28659K950813J514283l884975n518458
10142A5879578k663526k914906o614536l021754J1155088K1563288J4949811j386120
10134D6946923j0805780j0424620r595936j0874666p816993j34883L895017J830272
10126C019334Q42323L935859M199879k388500q622169o719452L88711M523878
10118h20137L111498p91579m188163m795416n69819O291200Q601912K544304o004902
10109C378898q272055l532198J502174K749825K889550M903173O372445L339572
$$ y = [-8291274, 4379756, 10347693, 3006706, -6963780, -7232194, -1502518, -3331573, -15707831, -25676018, -20321398, -2014673, 14813719, 18924459, 12221838, 5894526, 8063808, 15934305, 21073484, 20946574, 20817915, 23768728, 25283011, 21398036, 15879578, 13216052, 10301146, 3686610, 664856, 11819944, 33383232, 48333043, 46946923, 36141143, 25716523, 16120587, 5245921, -2571072, -2705955, 1189062, 3019334, 3861657, 7797516, 11997395, 9608895, 986726, -5732726, -5344015, -820137, 2291361, 1499782, -2688381, -7483797, -8053616, -1762416, 6839496, 9383800, 3378898, -4893157, -8425355, -6923181, -4173356, -1283806, 3619367, 9991812, 13331384]
10101A3331384k634805n588228l579903j603963l388168m489252P53882Q182439
10093I83386Q151669Q07846k964543J188750L786246j906264o670824K99754J1742031
10084A5418051J0867669l972773j6814872j5744206m796983O367595J2831536
10077D156017J2457397M721480m954715q729285o849538o106761o793461k185817
10069a4284683O779034R333070K699227r70793O126898J3278632P840812l748679
10061B7053518n613424K957178P628543J695128n996043p368058o134835p598733
10053F623274q092541k116444O772686J0240547O983653L085108J834557r8500
10045B5232340n226054r636468q401724l411599j153582l272456m119149M05771
$$ y = [13331384, 10696579, 5108351, 1528448, -75515, -3463683, -7952935, -7199053, 983386, 9135055, 9942901, 6978358, 8167108, 11953354, 10047090, 3376266, 3676020, 15418051, 26285720, 22312947, 5498075, -10246131, -15043114, -8675519, 4156017, 16613414, 21334894, 16380179, 7650894, 801356, -5305405, -12098866, -14284683, -7505649, 1827421, 4526648, 3555855, 9682753, 22961385, 30802197, 27053518, 21440094, 24397272, 32025815, 33720943, 27724900, 20356842, 14222007, 6623274, -1469267, -3585711, 3186975, 13427522, 20411175, 23496283, 25330840, 25232340, 20006286, 10369818, 1968094, -1443505, -2597087, -5869543, -9988692, -9582921]
10037i582921N671360M391329k060194m288112J999530R134676P899237P83797
10029A3948702j819406K375425L642473m229372j2203859p936173M959964J0604222
10021I341976L562241m378272l882053j496417m796890o460024K758190J4206577
10013H855328J2330713O12340l318612K661734K218068r375603j5215836n832713
10005g064581L691056l36693o719948O8560J1900197J0626290j809262q554010
9997A801609n292330j529346j65598L624134P018729K981023l681568k711230
9989B045423K084929p37079p329045l495426Q756741J2164727K718227n037959
9981A1170538l488940o98247r53742O70485J120701q655835j9915938j1478686
$$ y = [-9582921, -3911561, 479768, -1580426, -5868538, -3869008, 5265668, 13164905, 13948702, 12129296, 14504721, 18147194, 13917822, 1713963, -6222210, -1262246, 9341976, 12904217, 8525945, 4643892, 3147475, -1649415, -8109439, -5351249, 8855328, 21186041, 21798381, 18479769, 21141503, 23359571, 13983968, -1231868, -7064581, -3373525, -3710218, -10430166, -10361606, 1538591, 12164881, 10355619, 1801609, -3490721, -5020067, -5185665, -1561531, 5457198, 8438221, 4756653, 2045423, 4130352, 3393273, -3935772, -7431198, 1325543, 13490270, 16208497, 11170538, 7681598, 6983351, 6029609, 6700094, 7820795, -835040, -20750978, -32229664]
9973c2229664J3056838K2217899L545257j5103050q717401P810752Q542017j846189
9965b723541k650302N214169N545239j614091l092419Q25634j028835p198652
9957f722798o585484m97718N58193k044311J218859P256889N087874k111377j767780
9948e607653L997715J915310o268504n184083N538320Q273622k758640j1559135
9940a1653048o864613K174359M687143L668881M445917M556306L441900O363431
9932A0820276J0918843N774585q963886j6647794q937738N83778j068436o064662
9924a3585034j842579O728863P340760J571822l30222J926665J437832l48555
9916B899552L116543Q176947M544203o594380j2151778o145110K797285N081325
$$ y = [-32229664, -19172826, 3045073, 6590330, -8512720, -17230121, -9419369, -877352, -2723541, -5373843, -159674, 5385565, 3771474, 679055, 1504689, 475854, -6722798, -13308282, -13806000, -13247807, -15292118, -14073259, -6816370, -1728496, -3839873, -5607653, -1609938, 305372, -5963132, -11147215, -5608895, 2664727, -93913, -11653048, -18517661, -16343302, -11656159, -7987278, -3541361, 1014945, 4456845, 10820276, 21739119, 27513704, 18549818, 1902024, -7035714, -6451936, -7520372, -13585034, -15427613, -8698750, -1357990, 213832, -116390, 1810275, 3248107, 2899552, 6016095, 14193042, 18737245, 12142865, -8913, -6154023, -3356738, 1724587]
9908A724587R94847m677193r437031j0742011m973435O276041J4511120J3610399
9900G287324O842462J011902k195933m660415n562058k936545L11680r58523m914295
9891e774401l528958M504243R225619L712647m191898l756139R54980j536312
9883c90219q318105m794565R193987J5199398N427140l289142K428366R110866
9875B4567726j76531j5081495j4712573l628579k951006j1642143p872580J0285981
9867b1211200J7840692M661590o389930K181029J3414591N705553j0466186j0411935
9859d675796N175154J4162604Q119918l76254j924712o12058n38398J23075M07656
9850A9861189l517702q663959p934723k736837j172931m058400m556901j373028
$$ y = [1724587, 2719434, -1957759, -11394790, -22136801, -27110236, -20834195, -6323075, 7287324, 14129786, 15141688, 12945755, 8285340, 2723282, -213263, 98417, -860106, -5774401, -9303359, -4799116, 4426503, 8139150, 3947252, 191113, 1146093, -390219, -8708324, -13502889, -4308902, 10890496, 16317636, 13028494, 15456860, 24567726, 24391195, 9309700, -5402873, -9031452, -11982458, -23624601, -31497181, -21211200, -3370508, 1291082, -5098848, -2917819, 10496772, 16202325, 5736139, -4675796, 499358, 14661962, 22781880, 22405626, 20480914, 19868856, 19330458, 19453533, 19861189, 16343487, 7679528, -255195, -2992032, -4164963, -8223363, -12780264, -14153292]
9842a4153292n9705q07604K554205R621702J1507021M993654k048394k910791
9834H696796j22109K053434L723564M164614j05127p082304p680404J549930J1110647
9825A6309041J0325508Q67992p483473r680576p682315l875172Q57314M271209
9817C909528L945861J212366M3891K234235N949795P689760L894736o278766j6734405
9808E867001j7028914m733174P966883P750040j197054k056822R265248J5684990
9800B1518198L636771j4466028j6281867j983171O954255J156546m099558L551397
9792a3457J2644248Q387334j566231r76170O078746K651766r961351j2855519
9784D389366j859915M947630j971284q033086m45796J0139392Q184308k316263
$$ y = [-14153292, -14212997, -15020601, -12466396, -2844694, 8662327, 13655981, 11607587, 8696796, 8574687, 10628121, 14351685, 18516299, 18411172, 11328868, 3648464, 5198394, 16309041, 26634549, 27502541, 20019068, 10338492, 2656177, -1218995, -361681, 3909528, 7855389, 9067755, 9111646, 11345881, 17295676, 24985436, 28880172, 22601406, 5867001, -11161913, -15895087, -7928204, -178164, -1375218, -3432040, 5833208, 21518198, 25154969, 10688941, -5592926, -7576097, -621842, 534704, -3564854, -13457, 12630791, 21018125, 19451894, 18475724, 24554470, 27206236, 17244885, 4389366, 2529451, 7477081, 5505797, -2527289, -2973085, 7166307, 15350615, 13034352]
9776A3034352p696917o742165p100458q843196o780549k280534M73715L419894
9768b2515858Q083017Q195565J070095k964709L562192R787418L256001p480645
9760I93076o462866J619248k26335r784502p937761P313988J4958214M655024
9752E128086p395633n679957K246928K550174l060950n609430n052669m891360
9744b1764811j841110O272760J1606622P503534P28131Q56553M479365J986316
9736I827360n289860p062865p18525N090597L650668j267385j779591L746446
9728F196845Q298034L670546q722387j6348102r501470N147498J2361737Q397412
9720I500113L354462L491027L581738r5301k100983R12554K879030p35266n054924
$$ y = [13034352, 5337435, -1404730, -8505188, -17348384, -24128933, -26409467, -25935752, -22515858, -14432841, -6237276, -5167181, -8131890, -4569698, 5217720, 8473721, 993076, -5469790, -3850542, -4076877, -13861379, -21799140, -14485152, 473062, 5128086, -2267547, -7947504, -5700576, -3150402, -6211352, -11820782, -16873451, -21764811, -23605921, -17333161, -5726539, 1776995, 2505126, 3361679, 7841044, 9827360, 4537500, -2525365, -3243890, 1846707, 5497375, 4229990, 2450399, 6196845, 14494879, 18165425, 9443038, -6905064, -16406534, -11259036, 1102701, 9500113, 12854575, 16345602, 19927340, 19832039, 17731056, 18643610, 21522640, 20787374, 15732450]
9711A5732450n759398o495265r264011q349365j577209L680282L804716N516018
9703b711782R992586N623505j0160571j7566462j588195K0385940K0406956O19691
9695B5001668j2051473o893754O26737l38282j398552L351647M816727j866040
9687A1248678n496062J461723P627931Q93832j0937910j2105660k400216N194259
9679d513425M448134P20106q75557j041774j011574j39296J118368J273337L64124
9670C42443r11609k615285l521939j095424L611559N163261J276638l001306k362148
9661c113810J515486L606880K660318Q28693n00717j071452q62729j113577k822945
9652h73853l243702P42266M864225J126288q002636q959581L227506J4478944
$$ y = [15732450, 9973052, 3477787, -5786224, -14135589, -15712798, -12032516, -8227800, -2711782, 7280804, 12904309, 2743738, -14822724, -16410919, 3975021, 24381977, 25001668, 12950195, 6056441, 6683178, 6344896, 4946344, 8297991, 13114718, 11248678, 5752616, 7214339, 14842270, 15736102, 4798192, -7307468, -9707684, -4513425, -65291, 654815, -220742, -1262516, -2274090, -2413386, -1295018, -21681, 342443, -569166, -3184451, -6706390, -7801814, -4190255, 973006, 2249644, -751662, -3113810, -1598324, 2008556, 4668874, 5497567, 4996850, 3925398, 3062669, 1949092, -873853, -4117555, -3375289, 1488936, 2615224, -5387412, -14346993, -11119487, 3359457]
9644C359457J0411221k696597p908509k812536j20923m958577p099879P06423
9636a1119920R951312R053414k16696o841406n378604M80351N491347P420303
9628H840101N713526Q35953n235063j0464490j3602244j2362732m313184P509642
9620b3078491J3785499Q725107j504804n408553m6770O934677Q451876N126484
9612A2985025O44633l490978n854079l699764J818834L782065j456032o893095
9604b163391l367711O541094J0818690M363262m697668p025629l053784J605436
9596C020299M794086O457249M474468j272866m756304j117410M697271M300137
9588B0596930j287121l837244j950531k640835p350016p437689J016855P794008
$$ y = [3359457, 13770678, 11074081, 3165572, 353036, 232113, -4726464, -11826343, -11119920, -1168608, 7884806, 7668110, 826704, -4551900, -4071549, 1419798, 8840101, 14553627, 15389580, 10154517, -309973, -13912217, -26274949, -30588133, -23078491, -9292992, -567885, -2072689, -7481242, -7528012, -593335, 7858541, 12985025, 13629658, 10138680, 4284601, 584837, 2403671, 6185736, 4729704, -2163391, -5531102, 1009992, 11828682, 16191944, 11494276, 4468647, 1414863, 3020299, 7814385, 14271634, 18746102, 17473236, 12716932, 11599522, 16296793, 20596930, 19309809, 15472565, 13522034, 10881199, 3531183, -3906506, -2889651, 4904357]
9580D904357K781014p290212p439669L308096J0096852L798900o487447p541025
9572c869134l19522L667861k52692n018324l778152J240463M315521M552025M289502
9563D827548L300125r1273m134058n223049l599559k403222j454349K033413N989518
9554g54906M099706l193194o053428N63900P156529K947739o291332n489963O251806
9545g63143J2877609N249967n070706l773710M849066O107665j790481o424532
9537A1261735j975965K420738j067932o247985m203597J412431R84689m018910
9529a434796k852124N951888J0137226K224840q037580p836965l49476J183598
9521a013389n238308p230909K513404J4403761J4700743K992868q772914j0444045
$$ y = [4904357, 7685371, 395159, -7044510, -3736414, 6360438, 10159338, 3671891, -3869134, -4188656, -520795, -773487, -5791811, -9569963, -8329500, -4013979, 538046, 4827548, 8127673, 8036400, 3902342, -1320707, -4920266, -7323488, -8777837, -6744424, -754906, 3344800, 151606, -5901822, -5337922, 1818607, 4766346, -1524986, -7014949, -763143, 12114466, 17364433, 12293727, 8520017, 13369083, 19476748, 17686267, 11261735, 9285770, 11706508, 10638576, 4390591, 186994, 1599425, 2584114, -1434796, -4286920, 1664968, 11802194, 14027034, 5989454, -1847511, -2196987, -1013389, -6251697, -13482606, -10969202, 3434559, 18135302, 21128170, 12355256, 1911211]
9513A911211k256645P477242R714519K635201n390287m496886L456084O211142
9505A9261581j590894r937770p854207Q57329M464083N99435k871178j345083
9497A583296J831967L270782L343199J912952j929427n285640l680515J396375
9489B442989L592252Q40355k606950l288052j599461J704352N511153N793512
9481A2390150M83366m262440j512321L595194n92773j2791785j7319141o586184
9473b6595934O670105P218514j955662o106929L34942Q931957J0472245M923801
9465C893039j401392l293275q73222J354550J45888k039255r31651K480661L794873
9456C130216K808250K321529M35433o591581j3599605j0063506L085829J2267335
$$ y = [1911211, -345434, 7131808, 16846327, 19481528, 14091241, 9594355, 13050439, 19261581, 17670687, 7732917, -121290, 736039, 5200122, 5799557, 2928379, 1583296, 3415263, 6686045, 10029244, 11942196, 10012769, 4727129, 1046614, 2442989, 6035241, 6875596, 4268646, 980594, -618867, 1085485, 6596638, 12390150, 12873516, 8611076, 7098755, 10693949, 10101176, -2690609, -20009750, -26595934, -19925829, -12707315, -14662977, -20769906, -20434964, -11503007, -1030762, 3893039, 2491647, -801628, -1674850, -320300, -174412, -2213667, -3145318, -664657, 3130216, 5938466, 8259995, 8695428, 2103847, -11495758, -21559264, -18473435, -6206100]
9448f206100J1082168Q214710R281067N695332p434321j6319239p226845R601354
9440F688126J2472845r12062j2695192j2130734o066627k061434J795489O590558
9432f319031P107326K423887p0556K846499M383100M67693j844534L611511J0194135
9423B2800030P669697k296662q958626p743781m345472m345368n894387m342611
9415g457180L91795L723817K194001k419460n148759l492377J37843J972206J096122
9406i001992j002836k752807k415593J519960O942925Q141518L149844k063883
9398B517136j816382J80966l042477q845717p431592K387226R406476N463499
9390a180865l325241n791111m0698O933633R152161N519482k251096r587893r883456
$$ y = [-6206100, 4876068, 13090778, 22371845, 28067177, 20632856, 4313617, -2913228, 6688126, 19160971, 18248909, 5553717, -6577017, -12643644, -14705078, -12909589, -6319031, 788295, 3212182, 3141626, 5988125, 10371225, 10838918, 8994384, 12605895, 22800030, 30469727, 28173065, 19214439, 11470658, 7125186, 2779818, -3114569, -7457180, -7065385, -3341568, -1147567, -3567027, -8715786, -12208163, -12070320, -10098114, -9001992, -10004828, -12757635, -15173228, -13653268, -6710343, 1431175, 4581019, 2517136, 700754, 881720, -2160757, -11006474, -18438066, -16050840, -6644364, -1180865, -4506106, -10297217, -10337915, -3404282, 5747879, 11267361, 9016265, -571628, -10455084]
9381a0455084j566672P573720R101482N098538L743133N291378J930608o850221
9373A3866882r560671R1022J0250149N711863r476750j6612906q187861L874695
9365a0043577P783279O257354N593022L236234l772133q232267l205949M173606
9357A789569K637006m689456n820428l05358J420704k264749j559818N983791
9349b808739J0059229N210467p17829j235065r34002m283547o949354m907032
9341f565872j198030K025589O963650J1014019O997670k399345m630862K391467
9333A4598286N534905j169871o695476m139886k587031o647877m727737P332673
9325A497986J1868640k180548j6215857r978489N429728P943129J373185L094056
$$ y = [-10455084, -12021756, -4448036, 4653446, 9751984, 13495117, 18786495, 20717103, 13866882, 4306211, 4397233, 14647382, 20359245, 10882495, -5730411, -13918272, -10043577, -2260298, 3997056, 9590078, 12826312, 9054179, 821912, -2384037, 1789569, 4426575, -262881, -6083309, -6388667, -4967963, -7232712, -8792530, -2808739, 7250490, 12460957, 11743128, 10508063, 9574061, 5290514, -1658840, -6565872, -7763902, -5738313, 1225337, 12239356, 19237026, 16837681, 12206819, 14598286, 20133191, 18963320, 12267844, 8127958, 5540927, -1106950, -5834687, 1497986, 13366626, 11186078, -5029779, -15008268, -9578540, -1635411, -262226, 2831830]
9317B831830R094717L411269p917094o138447L871835J353424j0408540q234743
9309a2135749P661167J2212355M20394m724937L699742L962111j0665801j4985414
9301a4556132K969636J6773625N461772j0561919n617233P950166M602040r020183
9293a998228q033684O736583J2495816L416652m606969l555043r50880j95742
9285C308505L422581P729388M518898m721996j0150735r157733o582770k911701
9277a4545563L748536Q140267M344037k181510k070035K931306M490928J584000
9269F441966j899862o377245j1244716q687476L826484J3627005R700589L86329
9261E773074q14440K887102Q55982l835618j900533K184524j583071p547181k858172
$$ y = [2831830, 11926547, 15337816, 7420722, 1282275, 5154110, 6507534, -3901006, -12135749, -4474582, 7737773, 8158167, 3433230, 7132972, 11095083, 429282, -14556132, -11586496, 5187129, 10648901, 86982, -5530251, 2419915, 7021955, -1998228, -10031912, -3295329, 9200487, 12617139, 8010170, 4455127, 3504247, 3308505, 6731086, 14460474, 18979372, 14257376, 4106641, -5051092, -11633862, -14545563, -10797027, -2656760, 1687277, -494233, -2564268, 367038, 4857966, 6441966, 4542104, -1835141, -13079857, -21767333, -17940849, -4313844, 5386745, 5773074, 4958634, 7845736, 8701718, 4866100, 2965567, 5150091, 3567020, -3980161, -6838333]
9252f838333Q425542J1239568M909670J080747P16858m207959r806841n075287
9244D43965M710767M170918l831707k199666P741130O030889r543276j6170916
9236h647896l604089R091945O482931O9854L169880O671036r06372r273220l972858
9227i18789O921163N846467m774900p567553J117486P472062L742272j547238
9219A0290970O40211O222192M970478n132601j4650260j2985017j033524Q601172
9211c076379O632831j357412m238778j562322o82375j517939K353521Q459432
9203E010579O358955m246483j0960697p707881k216766n28598J490010N914177
9195f886704O375166N44473l990446k785994j075110j707794Q2658M235711K755101
$$ y = [-6838333, 1587209, 12826777, 17736447, 18817194, 19534052, 15326093, 5519252, 443965, 5154732, 9325650, 5493943, 3294277, 11035407, 17066296, 7523020, -8647896, -12251985, -3160040, 3322891, 3392745, 6562625, 13233661, 12327289, 3054069, -918789, 6002374, 11848841, 7073941, -493612, 623874, 8095936, 11838208, 10290970, 10931181, 17153373, 22123851, 16991250, 2340990, -10644027, -11677551, -3076379, 3556452, 2199040, -2039738, -3602060, -4284435, -5802374, -3448853, 5010579, 11369534, 7123051, -3837646, -11545527, -13762293, -14290891, -12800881, -6886704, -511538, 32935, -3957511, -6743505, -7818615, -9526409, -9443751, -5208040, -2452939]
9186b452939m309777n037664M253163J0564419N131808k686045k836430m06476
9178B220059k195386k693731K942874O086849m06772p262023m069595K436075
9170b941650J239514l010033K32703P317276P239599Q30742l036467l362468m146459
9161C62757l185486J553074K839391l373892o041135L603331J3049255O644041
9153A5451336o622952o309145N124699O175204p882149j8109471j2619269j190775
9145b5982522M924617P055681P639508L561248k901412l268036J415768K60946
9137g294202o811718n433430Q658143J8262890Q805382r520024j5740716n187056
9129a4260731Q315543J1542770M395372l516856l425711L637604P481939J428977
$$ y = [-2452939, -6762716, -11800380, -7547217, 3017202, 8149010, 5462965, 2626535, 2220059, 24673, -2669058, 273816, 6360665, 5953893, -1308130, -5377725, -2941650, -1702136, -4712169, -4479466, 2837810, 10077409, 10908151, 7871684, 4509216, 362757, -2822729, -1269655, 1569736, -1804156, -7845291, -4241960, 8807295, 15451336, 8828384, 2519239, 7643938, 13819142, 5936993, -12172478, -24791747, -25982522, -21057905, -14002224, -6362716, -2801468, -5702880, -8970916, -7555148, -7294202, -14105920, -19539350, -10881207, 7381683, 16187065, 6667041, -9073675, -14260731, -5945188, 5597582, 9992954, 6476098, 3050387, 6687991, 14169930, 15598907]
9121A5598907q176556j1086935p515811m240574j214201N232882R683563L896596
9113B177871n680262m030398P795047J2368986L573325m242131j038250L625002
9105A4549190l26077n967912l199970L646465N067959K446228K235961K889625
9097B1341469l66190m544592l578806J168256L770670K355963j532893o365509
9089A2248368q294747k693591P146059J1123581O450275R09047j828557p408690
9081A7651745j5711498j5537759l500510O499280M181973r74914K047867N781415
9073D37599o37238q805100l606552R983540J3408523L092893p118742r143056
9065b388133p287960l356989N578141J3686177R296255n126039j2284503m082550
$$ y = [15598907, 7422351, -3664584, -11180395, -15420969, -16635170, -11402288, -1718725, 2177871, -3502391, -7532789, 262258, 12631244, 16204569, 11962438, 10924188, 14549190, 14223113, 8255201, 5055231, 8701696, 13769655, 16215883, 18451844, 21341469, 20975279, 16430687, 12851881, 14020137, 17790807, 20146770, 18613877, 12248368, 3953621, 1260030, 8406089, 19529670, 25979945, 26888992, 25060435, 17651745, 1940247, -13597512, -17098022, -10598742, -6416769, -7391683, -5343816, 437599, -199639, -9004739, -12611291, -2627751, 10780772, 13873665, 6754923, -2388133, -9676093, -13033082, -7454941, 6231236, 15527491, 10401452, -1883051, -5965601]
9057e965601P838679J0413199M921145q74358m376259n682762l356914J061958
9049C979087J836780k813817p504399p536843l864919J156512O141210Q097912
9041e08477M961650J046341K124922N436431L528639k535081m233451j1582K645187
9032A2454579O87987o67901M60755o95442m475502m774974j681257l131680r175894
9023a0999329q275874L697858J4071818J2050047M723731L818189P188691N692898
9015C1968029j83458l636734n134555r622500j4383155j2319195m999562o88051
9007a8999181m87525K303163Q679553J0650922M284634k859196k067124M539133
8999F044379P573806L198597k583877k834104R01427J623631j966378l440268
$$ y = [-5965601, 1873078, 12286277, 17207422, 16333064, 11956805, 6274043, 2917129, 3979087, 5815867, 3002050, -4502349, -12039192, -15904111, -14747599, -8606389, -508477, 4453173, 5499514, 7624436, 13060867, 16589506, 14054425, 9820974, 9809392, 12454579, 13142566, 12474665, 12935420, 12239978, 7764476, 2989502, 1308245, -1823435, -10999329, -19275203, -15577345, -1505527, 10544520, 15268251, 19086440, 26275131, 31968029, 31784571, 28147837, 23013282, 13390782, -992373, -13311568, -18311130, -18999181, -19486706, -17183543, -8503990, 2146932, 6431566, 3572370, 1505246, 6044379, 13618185, 16816782, 14232905, 11398801, 12300228, 13923859, 11957481, 8517213]
8991H517213j04407R07164n352327j0597699n026941N310145O878532J127230
8983A658910J548225Q723188Q216719k904900q948039l168056l45634q828298
8975d047885j2056034L107706J9090315J2673171p365556j4189743m203002L397504
8967c593524J801136K169125O236342K789330o256596m819549O722736P727415
8959A2776415o901266j4383254j012488J3789634Q318400p808704j1908747l477362
8951a0607372J574739K56222K610298Q561227O817334l789277j0324765n573231
8943a0474825K269281L346248p01683j424075M600142J1465284R637797k929150
8935A5789019j4884805j2141278L492662J4127385Q418795m384186r160331m530433
$$ y = [8517213, 8412806, 9319970, 3967643, -6630056, -11656997, -6346852, 531680, 1658910, 3207135, 11930323, 20147042, 17242142, 8294103, 5126047, 4780413, -4047885, -16103919, -12996213, 6094102, 18767273, 11401717, -2788026, -6991028, -3593524, -1792388, 376737, 6613079, 9402409, 3145813, -1673736, 5049000, 12776415, 5875149, -8508105, -9520593, 4269041, 12587441, 4778737, -7130010, -10607372, -9032633, -8776411, -6166113, 2395114, 9212448, 5423171, -4901594, -10474825, -8205544, -4859296, -5560979, -6985054, -2384912, 9080372, 18718169, 15789019, 904214, -11237064, -7744402, 6382983, 14801778, 10417592, 1257261, -3273172]
8927c273172P26816K656055L163312J930322k315415n971288m480449P43682N205442
8918a614695O889687M706378j709449o603133k375772N800967K887438j0949473
8910b968052j4674363J496314J5985008P079915j1495377j1450738N007568J0796220
8902b23505l93295o372893K911628Q830335j301694j0904988k081016J4368045
8894D832617J6134105K445747q617530p266555m57797K227244j046855n746802
8886B504174n311668K639845J0607570P981240l428166r544327l628464M809338
8878F629542O033948L463789L517676L396629j221718n674785m000149J27519
8870A2272451k01863m055189o472955p037143o807427l499464K615180N208294
$$ y = [-3273172, -2546356, 109699, 3273011, 5203333, 2887918, -3083370, -7563819, -6820137, -1614695, 5274992, 9981370, 8271921, 1668788, -706984, 5093983, 7981421, -2968052, -17642415, -16146101, -161093, 6918822, -4576555, -16027293, -11019725, -223505, -616800, -6989693, -4078065, 4752270, 3450576, -7454412, -9535428, 4832617, 20966722, 23412469, 14794939, 7528384, 7070587, 9297831, 8250976, 2504174, -2807494, -167649, 10439921, 18421161, 14992995, 5448668, 1820204, 6629542, 12663490, 16127279, 19644955, 23041584, 21819866, 16145081, 12144932, 12272451, 12070588, 8015399, 1542444, -5494699, -12302126, -15801590, -13186410, -7978116]
8862g978116J780779r52540R95079J307349l363460l798515O046815J4485824
8854H523215Q395488m703784p850023j317023M29867n525526p564280j883712
8846a1495778J588679j416730k184211L535749P036652K911259q06935K195131
8838A363816M048625l436646j2430313r351723M322468J3759447J1022804L113439
8830A2411917l46226J305905K816298J459528j053483j905260N31429N975021
8822B1195129J1106772J0130332J21667j3011066j7736236r809506Q19461J634391
8814D450944n681822p943041j24389P513570N630138q64351k638854l67942j9034
8805d4781n78271K736641P596131P767401M049381J569564p55009o789990j1845718
$$ y = [-7978116, -6197337, -7149877, -6154798, -4847449, -8210909, -12009424, -5962609, 8523215, 16918703, 12214919, 4364896, 3047873, 3477740, -2047786, -9612066, -11495778, -9907099, -11323829, -13508040, -9972291, -2935639, -24380, -831315, 1363816, 5412441, 1975795, -10454518, -19806241, -15483773, -1724326, 9298478, 12411917, 12065691, 13371596, 16187894, 17647422, 16593939, 14688679, 15220108, 21195129, 32301901, 42432233, 42553900, 29542834, 11806598, 1997092, 2816553, 4450944, -1230878, -9173919, -9298308, -1784738, 3845400, 2981049, 342195, -25747, -44781, -623052, 2113589, 9709720, 17477121, 21526502, 23096066, 22341057, 15551067, 3705349]
8796C705349p584895K546732O257777J744264J31382N607351P747212K05419o432759
8787A3927832p30417J0639245J2022484J182827r064611r433437m103870j316518
8779A3123535k165068k178261L41187J787763j168154o081335p294805l884938
8771g520076j379136l316807n177922j366423N143453O636671K364585n79706
8763e195361K185034P234256Q959910M999341l051274r116137n553094O439359
8755F902034J3034687M118432r910837j0318050K657865R999587K815205o036673
8747A3262250m844406m37975k532490n867153j926727L195934j093068r388958
8739i632593o834255O829098J5492371R662825j911544o483918k957726Q22456
$$ y = [3705349, -3879546, -1332814, 4924963, 6669227, 6800609, 12407960, 20155172, 20360591, 13927832, 13197415, 23836660, 35859144, 37041971, 27977360, 18543923, 14440053, 13123535, 10958467, 8780206, 9121393, 10909156, 9741002, 3659667, -3635138, -7520076, -8899212, -12216019, -17393941, -18760364, -13616911, -6980240, -4615655, -5195361, -3010327, 4223929, 13183839, 18183180, 15131906, 6015769, 462675, 6902034, 19936721, 24055153, 14144316, 3826266, 6484131, 16483718, 19298923, 13262250, 8417844, 7979869, 5447379, -419774, -2346501, 849433, -243635, -9632593, -16466848, -9637750, 5854621, 15517446, 13605902, 7121984, 4164258, 4986714]
8731D986714m39306m769590o452146k515056L074952L308316k178953n484258
8723a0469327j808270L017869J863397k327060k052144K147774L392454K31258
8715f004049k139656j376593m38745n51158R55437N013077Q614400Q470790L000051
8706A5543554p110397j5917370j4219263j421028R169389N912325m267457n484908
8698a7795155L545393Q862919M005542j152495J900495P161747N556613j091739
8690A0993320n481814o017923m803508j385042L691291N025339J51914l662839
8682a489262J245336J0402789J2525318N356201k169029l321285j467437k827141
8674A8255490p167184q848366m391146L369495Q096634O417951J485086j012854
$$ y = [4986714, 4547408, -222182, -6674328, -9189384, -6114432, -2806116, -4985069, -10469327, -12277597, -9259728, -7396331, -9723391, -11775535, -9627761, -6235307, -6004049, -8143705, -9520298, -9959043, -10510201, -9554764, -4541687, 4072713, 12543503, 15543554, 8433157, -7484213, -21703476, -23124504, -13955115, -8042790, -12310247, -17795155, -14249762, -5386843, -1381301, -2533796, -633301, 6528446, 12085059, 10993320, 5511506, -506417, -5309925, -6694967, -3003676, 2021663, 2173577, -1489262, -243926, 10158863, 22684181, 28040382, 25871353, 22550068, 21082631, 18255490, 11088306, 2239940, -2151206, 1218289, 9314923, 15732874, 17217960, 16205106]
8666A6205106q7005J72357k088737l208904n83703J781158j231533p395606r059527
8657e496394k798466O443815J0642545O142203k861445o827591J88157J1766732
8649A7199556J3435777M6892j5192033j5458011j408475J0302365Q889483R94818
8641A8810372j908141O78525Q24169m604124j0106778r555419k932363N015748
8633c778011R475617Q549675L889104r82751l842190n043860n392387m373666
8625a498469j733554Q38309J509126P49870L12790Q39946K081106L986203N436823
8616A2522150L609376k159167p016390n340410R62163L460945j701372p860518
8608c523223o296851K292100R006236P984184J947242l415094n945226o045863
$$ y = [16205106, 16118101, 16290458, 14201721, 10992817, 10409114, 12190272, 10958739, 3563133, -5496394, -8294860, -1851045, 8791500, 14933703, 12072258, 5244667, 5432824, 17199556, 30635333, 30682225, 15490192, 32181, -1376294, 8926071, 17815554, 18810372, 16902231, 17580756, 18404925, 13800801, 3694023, -5861396, -8793759, -3778011, 5697606, 14247281, 18136385, 17153634, 13311444, 8267584, 2875197, -1498469, -3232023, -2393714, -884588, -134718, 178072, 1018018, 3099124, 7085327, 12522150, 16131526, 13972359, 6955969, 1615559, 2577722, 6038667, 4337295, -3523223, -9820074, -7527974, 1478262, 9462446, 11409688, 7994594, 2049368, -3996495]
8600c996495l072973L401378J0060580J1656745P340826K234922N71448m73605
8592B7722826o356816j5293206j8130048j0510726q9908L637919K602511N077412
8584a1340036R661720O264035m494943o708440O882126J8657144R163942j1584039
8576A6501509j5949368r0746R516184k603875j6245816q003860J0299487R634042
8568C057557r723849j7601792n72667J7527706J2079386o602855j1019191L348928
8560i506777J5186525R730942m106275j0658109p362101k032035M52926J402765
8552f892139K290323J701976j592320n403370n440151l82503N019017M526037
8544f173130j003200l344583J890083P691968M564575n388183r975746k856926
$$ y = [-3996495, -7069468, -3668090, 6392490, 18049235, 25390061, 27624983, 28196431, 27722826, 21366010, 6072804, -12057244, -22567970, -22657878, -19019959, -16417448, -11340036, -1678316, 4585719, 90776, -6617664, 264462, 18921606, 28085548, 16501509, 552141, 461395, 9977579, 7373704, -8872112, -16875972, -6576485, 3057557, -6666292, -24268084, -24840751, -7313045, 4766341, -1836514, -12855705, -9506777, 5679748, 15410690, 11304415, 646306, -6715795, -8747830, -8294904, -6892139, -4601816, -2899840, -4492160, -9895530, -15335681, -15718184, -10699167, -6173130, -7176330, -10520913, -8630830, -938862, 3625713, -1762470, -11738216, -14595142]
8536a4595142P946478R684528o78170j3612679j6422736m969272J1733907J9025666
8528a887420J1385356j422909o317655k557408L94291j448243k038618K433417
8520a459189O405747M677724J094410J088804K188865m23315l956667k175612
8512G440767L410219M876529o41646p743794j0323453o543359K167867J1022429
8504C665559J2748251N258793l520681n472164l973077o966301j1698343q584972
8496a8542935Q63936M628453R35470K640129J4474524K1404358J0660073p325846
8488B9738162j3632473p041721r09009r32873j677522r21756j606017j370464
8480A646327M490107J0228800N420957n708596p341801K373813O281295m359076
$$ y = [-14595142, -6648664, 3035864, 2357694, -11254985, -27677721, -32646993, -20913086, -1887420, 9497936, 8075027, 1757372, -800036, -405745, -1853988, -3892606, -1459189, 4946558, 9624282, 10718692, 11807496, 13996361, 13573046, 9616379, 7440767, 10850986, 15727515, 15085869, 7342075, -2981378, -9524737, -7356870, 3665559, 16413810, 21672603, 18151922, 12679758, 8706681, 1740380, -9957963, -18542935, -17678999, -13050546, -12115076, -9474947, 4999577, 26403935, 37064008, 29738162, 16105689, 9063968, 8154959, 7222086, 5544564, 4622808, 3016791, 1646327, 6136434, 16365234, 21786191, 16077595, 8735794, 11109607, 17390902, 13031826]
8472A3031826j4391755q067354O384965J0103863J475263n246636l298323L87881
8464C79730K03751j165009j314671j796327j901648R74824L643898j09211p600735
8455h685398q650978j573359L192985J2374k440652L913374J1957317J0222556
8447G948219J515492j643198K990881M927161q16268n426147j086120N881829
8439A4291849M452336m741417j1129535r343103m224426j068834J305612N425946
8431e031572R095615Q433796L707697j424330m689905o482911p590612p778570
8423a1760792n929398p41816P081962J2932396J1797831N230726R67197K701878
8415B2279984M325240j026993r841717j2805209q580509n034359o130914n922170
$$ y = [13031826, -1359929, -9427283, -3042318, 7061545, 8536808, 3290172, -8151, 379730, 583481, -581528, -1896199, -3692526, -5594174, -4619350, -975452, -1084663, -8685398, -17336376, -18909735, -15716750, -15704376, -18145028, -14231654, -2274337, 7948219, 9463711, 7820513, 10811394, 15738555, 14922287, 9496140, 8410020, 14291849, 18744185, 14002768, 2873233, -6469870, -10694296, -11763130, -10457518, -5031572, 4064043, 12497839, 16205536, 14781206, 10091301, 3608390, -3982222, -11760792, -17690190, -18432006, -11350044, 1582352, 13380183, 18610909, 19578106, 22279984, 26605224, 25578231, 15736514, 2931305, -5649204, -10683563, -16814477, -22736647]
8407b2736647P59937Q670772R429745M190885J834090N620331Q467211L390980
8399A9627304o297806j1070148p285754r76432Q58960j082765j217433J883193
8391e560881L816493J615106k110714l914245l974162l391457j535406P65277
8383a4289989M64573j015051L480796J4612466J9523213P712619j0345273j4034828
8375F108526j358911Q052203J820646q690300q448391j148954P46133k303984
8367e223032o13078N138073M393431l865969p409521p2199P705802M239600o343750
8358b050643j0380938l128934O603275Q694647K722231l788507m508686l30066
8350f167621K490828m29390o138809o942373O03024J0109641J1063180J232559
$$ y = [-22736647, -21976710, -13305938, -3876193, 314692, 2148782, 7769113, 16236324, 19627304, 13329498, 2259350, -5026404, -6002836, -5143876, -6226641, -7444074, -5560881, -1744388, -129282, -2239996, -6154241, -10128403, -13519860, -15055266, -14289989, -13825416, -14840467, -11359671, 3252795, 22776008, 30488627, 20143354, 6108526, 4749615, 12801818, 14622464, 5932164, -2516227, -3665181, -2919048, -5223032, -5836110, -698037, 3695394, -170575, -7580096, -7652295, 53507, 4293107, -2050643, -12431581, -15560515, -8957240, -262593, 2459638, -1328869, -5837555, -6167621, -3676793, -4106183, -10244992, -17187365, -16584341, -6474700, 4588480, 5821039]
8342E821039q709294o375548O754190J5615431R686596l989916j0664251o570500
8334A567747m98615R40042M07148J405515J797348o75037l282220k706605N78298
8325d66379M914148R004721R198352K160686p567906j0503157n364606o42820
8317G33039k90348J310035N734166M924119l023456o105546K042456P872597j418096
8308A1778966j4047040r614354Q294854J6644545P372414m022626n439208k971215
8300G996336l838732l601132J206590L441405j698647o424138k819995M335591
8292a402722O171579K779746l43824j461946j101142J663240N319270N262351
8284A6886552K007454J984855N394841L157543p710839j6279166j3622510o412763
$$ y = [5821039, -2888255, -9263803, -2509613, 13105818, 22792414, 18802498, 8138247, 1567747, 1069132, 2009174, 2416322, 3821837, 5619185, 4944148, 1661928, -1044677, -466379, 4447769, 13452490, 22650842, 24811528, 17243622, 6740465, 1375859, 733039, 442691, 1752726, 7486892, 12411011, 9387555, 3282009, 5324465, 13197062, 11778966, -2268074, -11882428, -3587574, 13056971, 20429385, 16406759, 10967551, 7996336, 4157604, 556472, 1763062, 5204467, 3505820, -2918318, -5738313, -1402722, 4768857, 7548603, 7204779, 5742833, 4641691, 6304931, 11624201, 16886552, 18894006, 20878861, 26273702, 29431245, 21720406, 5441240, -8181270, -14594033]
8276a4594033m610879n172125j04995P214049P653176K969831K602253O642092
8268B599369O085774l73692l332612J425823N880539K720332m095628o682347
8260D227558m039416m70002J650382K552769J696789j728070n813699o487972
8252h411661j823705M936963P733655M195290j048577k104457j25488j375965
8244A976055o471072p617084J85766J0422368J2368819M046884o135595q567618
8236B08523q75738J0117299J3611347N776572m285524n197127N95882N33573p338288
8227A3146519j0015241r48065P819310M479945l794301l676225K798840M435468
8219A4246250J047262J121889M038224J317356o243762q506987l000040K352480
$$ y = [-14594033, -19204912, -24377037, -24482032, -17267983, -9614807, -6644976, -4042723, 2599369, 8685143, 8311451, 4978839, 6404662, 12285201, 15005533, 10909905, 4227558, 188142, -281860, 1368522, 3921291, 5618080, 3890010, -1923689, -8411661, -10235366, -5298403, 2435252, 6630542, 5581965, 3477508, 3352020, 1976055, -4495017, -12112101, -11926335, -1503967, 10864852, 14911736, 8776141, 208523, -667215, 9450084, 23061431, 28838003, 24552479, 19355352, 19951234, 20484807, 13146519, 3131278, 2183213, 10002523, 14482468, 10688167, 7011942, 9810782, 14246250, 15293512, 16415401, 20453625, 21770981, 15527219, 7020232, 4020192, 6372672]
8211F372672L708391M634505M743920n20773p534476o526947J685779N191110
8203A1754181j3403m723928l416462j658685k575300j194848K421669J10531p739628
8194g035873q665584M12900N003124k740359q458024J075866J4181476J2101335
8186E874861q49428n225879K442550P012361P26836p064698p427777l382206r10178
8177h803558o06383j249398k377624j703504K383533O066809N107118K346923
8169A163916K285106K007314k675514o366343j523889O487482N546645l529169
8161C395548p793681k688581K835736K985963K104705K493582K93942k762512
8153H64702J044468Q923137O909849o701622j3783242l166428J0466571Q840495
$$ y = [6372672, 10081063, 14715568, 19459488, 18938715, 11404239, 4877292, 6563071, 11754181, 11740778, 7016850, 3600388, 1941703, -633597, -1828445, 593224, 703755, -7035873, -15701457, -15288557, -10285433, -13025792, -21483816, -20407950, -6226474, 5874861, 5025433, -200446, 2242104, 9254465, 9981301, 2916603, -4511174, -7893380, -8803558, -9409941, -10659339, -13036963, -14740467, -12356934, -6290125, -1183007, 1163916, 3449022, 5456336, 2780822, -3585521, -5109410, 1378072, 6924717, 3395548, -4398133, -7086714, -4250978, -1265015, 839690, 3333272, 3627214, 864702, 1909170, 10832307, 17742156, 11040534, -2742708, -5909136, 4557435, 13397930]
8145A3397930k050093l995206L119549L368096o738152j2176629m077243O560640
8137b591108N962332l885299j0915057q850609q43623O989522R885092O057208
8129A808458j184057n054651k326000K826760M260573J519633m56038J271364
8121B666042L149357j16317p113598r510412k607013P153257J0066365O158315
8113I845996L241688L260232L60245n834510o481250J433864P301889K776250
8105A5904404m410649l697753k6322m462584j2459099q772335O942750J6740167
8097E758579J0011688k660613p220739m431029k319881j301182K986231Q953944
8089I776998J0892139P890960L816406J229717L63369P48655J0369m378936q736178
$$ y = [13397930, 11347837, 7352631, 10472180, 13840276, 7102124, -5074505, -9151748, -2591108, 3371224, -514075, -11429132, -20279741, -21123364, -14133842, -4248750, 1808458, 624401, -4430250, -6756250, -3929490, 331083, 1850716, 1394678, 2666042, 5815399, 5699082, -1414516, -10924928, -13531941, -6378684, 3687681, 9845996, 13087684, 16347916, 16708161, 10873651, 4392401, 5826265, 13128154, 15904404, 11493755, 7796002, 7769680, 3307096, -9152003, -17924338, -10981588, 5758579, 15770267, 13109654, 5888915, 1457886, -861995, -2163177, 823054, 9776998, 20669137, 28560097, 32376503, 33606220, 33969589, 34718244, 34728613, 30349677, 21613499]
8080B1613499n143572N386700R621129k74951j3063863j2859678k041089K792814
8072F030989m252496j0982199o686554L271766P881483N710467K432763K56404
8064C662623j949425k462447R80008M823159L396333j757119l618308r64944o648
8055B103232k771539k412036M631113R399967K184922j0955302j4107628l190679
8047a5117950Q895894J0745081N671410K066162O31235j284601j043531L783965
8039A4347665P237870L011956l317591j429485O672138Q664130P31845p519706
8031B8398822q541737n699495l586037n88089M041140N416372J062704m102801
8023A6400879n532944m183194n28820O899278J2873432P129399q429702j6404894
$$ y = [21613499, 16469927, 21856627, 31477756, 31202805, 18138942, 5279264, 3238175, 6030989, 1778493, -9203706, -15890260, -12618494, -4737011, 973456, 3406219, 3662623, 1713198, -749249, 230759, 5053918, 8450251, 6693132, 3074824, 2109880, 2103232, -668307, -3080343, 1550770, 10950737, 13135659, 2180357, -11927271, -15117950, -6222056, 4523025, 10194435, 12260597, 12891832, 11607231, 10563700, 14347665, 21585535, 24597491, 21279900, 19850415, 26522553, 35186683, 35918528, 28398822, 19857085, 14157590, 10571553, 9983464, 14024604, 19440976, 20503680, 16400879, 10867935, 6684741, 6155921, 13055199, 25928631, 33058030, 24628328, 8223434]
8015H223434p680844L059557j513445j4778675j6681169l968516P859165R921110
8007a5559383R247609J1562137J1489430M779237k959163n647129m884998m028669
$$ y = [8223434, 542590, 3602147, 2088702, -12689973, -29371142, -33339658, -25480493, -15559383, -6311774, 5250363, 16739793, 21519030, 18559867, 12912738, 8027740, 3999071]
$$ [...]
##END NTUPLES=NMR SPECTRUM
##END=
