##TITLE=31Pdec_SR10P
 CDCl3, 24 sc
 10.2.2022
##JCAMPDX= 6.0         $$ Bruker NMR JCAMP-DX V2.0
##DATA TYPE= NMR SPECTRUM
##DATA CLASS= NTUPLES
##ORIGIN= UXNMR, Bruker Analytische Messtechnik GmbH
##OWNER= root
$$ XWIN-NMR		Version 3.5
$$ Thu Feb 10 11:07:36 2022 Russian Standard Time (UT+4h)  she@DPX200
##.OBSERVE FREQUENCY= 81.013821
##.OBSERVE NUCLEUS= ^31P
##.ACQUISITION MODE= SIMULTANEOUS
##.ACQUISITION SCHEME= undefined
##.AVERAGES= 24
##.DIGITISER RES= 16
##SPECTROMETER/DATA SYSTEM= spect
##.PULSE SEQUENCE= zgpg30
##.SOLVENT NAME= CDCl3
##.SHIFT REFERENCE= (INTERNAL, CDCl3, 0, 248.564)
##AUDIT TRAIL= $$ (NUMBER, WHEN, WHO, WHERE, WHAT)
$$ ##TITLE= Audit trail, XWIN-NMR		Version 3.5
$$ ##JCAMPDX= 5.01
$$ ##ORIGIN= Bruker BioSpin GmbH
$$ ##OWNER= she
$$ F:/spectra/data/she/nmr/P31/1/pdata/1/auditp.txt
$$ ##AUDIT TRAIL=  $$ (NUMBER, WHEN, WHO, WHERE, WHAT)
(   1,<2022-02-10 11:05:31.76 +0400>,<she>,<DPX200>,
      <created by zg, POWCHK disabled, PULCHK disabled
       configuration hash MD5:
       00 E9 B6 7A A2 85 ED C7 34 08 36 98 17 FE 4E 26
       data hash MD5: 32K
       A1 D1 0F 86 78 51 96 EA F7 F6 FF 6B 2A 8D A1 5E>)
(   2,<2022-02-10 11:05:48.70 +0400>,<she>,<DPX200>,
      <Start of raw data processing
       efp BC_mod = 2 LB = 1 FT_mod = 6 PKNL = 1 PHC0 = -9317.77 PHC1 = -152.1264 SI = 64K 
       data hash MD5: 64K
       50 AD 30 E3 8E CE 84 29 55 E1 E0 CF A0 C3 AC 85>)
(   3,<2022-02-10 11:06:30.71 +0400>,<she>,<DPX200>,
      <pk PHC0 = -392.6515 PHC1 = 662.801 
       data hash MD5: 64K
       4B 69 9A D6 B8 9A A9 70 6E 05 2F 66 C7 6C 44 CB>)
$$ ##END=
$$ 
$$ hash MD5
$$ 1E D0 72 51 01 19 16 33 7B BD 1A 62 95 DB 31 D6
##$RELAX= 
##$RELAX= 
##$RELAX= 
##$RELAX= 
##$RELAX= 
##$RELAX= 
##$RELAX= 
##$RELAX= 
$$ Bruker specific parameters
$$ --------------------------
##$DU= <F:/spectra>
##$EXPNO= 1
##$NAME= <P31>
##$PROCNO= 1
##$TYPE= <nmr>
##$USER= <she>
##$AMP= (0..31)
100 100 100 100 100 100 100 100 100 100 100 100 100 100 100 100 100 100 
100 100 100 100 100 100 100 100 100 100 100 100 100 100 
##$AQSEQ= 0
##$AQ_mod= 1
##$AUNM= <au_zg>
##$AUTOPOS= <>
##$BF1= 81.014009
##$BF2= 200.13
##$BF3= 200.13
##$BF4= 200.13
##$BF5= 200.13
##$BF6= 200.13
##$BF7= 200.13
##$BF8= 200.13
##$BYTORDA= 1
##$CFDGTYP= 0
##$CFRGTYP= 5
##$CHEMSTR= <none>
##$CNST= (0..31)
1 1 145 1 1 1 1 1 1 1 1 1 1 1 1 1 1 1 1 1 1 1 1 1 1 1 1 1 1 1 1 1 
##$CPDPRG= <waltz16>
##$CPDPRG1= <>
##$CPDPRG2= <waltz16>
##$CPDPRG3= <>
##$CPDPRG4= <mlev>
##$CPDPRG5= <mlev>
##$CPDPRG6= <mlev>
##$CPDPRG7= <mlev>
##$CPDPRG8= <mlev>
##$CPDPRGB= <>
##$CPDPRGT= <>
##$D= (0..31)
0 1 0 0 0 0 0 0 0 0 0 0.03 2e-05 3e-06 0 0 0 0 0 0 0 0 0 0 0 0 0 0 0 0 
0 0 
##$DATE= 1644476731
##$DBL= (0..7)
120 120 120 11 120 120 24 19 
##$DBP= (0..7)
150 150 150 150 150 150 150 150 
##$DBP07= 0
##$DBPNAM0= <>
##$DBPNAM1= <>
##$DBPNAM2= <>
##$DBPNAM3= <>
##$DBPNAM4= <>
##$DBPNAM5= <>
##$DBPNAM6= <>
##$DBPNAM7= <>
##$DBPOAL= (0..7)
0.5 0.5 0.5 0.5 0.5 0.5 0.5 0.5 
##$DBPOFFS= (0..7)
$$ [...]
##$SUBNAM2= <"">
##$SUBNAM3= <"">
##$SUBNAM4= <"">
##$SUBNAM5= <"">
##$SUBNAM6= <"">
##$SUBNAM7= <"">
##$SUBNAM8= <"">
##$SUBNAM9= <"">
##$SW= 501.771253377433
##$SWIBOX= (0..15)
0 1 3 0 0 0 0 0 0 0 0 0 0 0 0 0 
##$SW_h= 40650.406504065
##$TD= 32768
##$TD0= 1
##$TE= 0
##$TE2= 300
##$TE3= 300
##$TEG= 300
##$TL= (0..7)
0 120 53 12 22 120 120 120 
##$TP= (0..7)
150 150 150 150 150 150 150 150 
##$TP07= 0
##$TPNAME0= <>
##$TPNAME1= <>
##$TPNAME2= <>
##$TPNAME3= <>
##$TPNAME4= <>
##$TPNAME5= <>
##$TPNAME6= <>
##$TPNAME7= <>
##$TPOAL= (0..7)
0.5 0.5 0.5 0.5 0.5 0.5 0.5 0.5 
##$TPOFFS= (0..7)
0 0 0 0 0 0 0 0 
##$TUNHIN= 0
##$TUNHOUT= 0
##$TUNXOUT= 0
##$USERA1= <user>
##$USERA2= <user>
##$USERA3= <user>
##$USERA4= <user>
##$USERA5= <user>
##$V9= 5
##$VALIST= <valist>
##$VCLIST= <CCCCCCCCCCCCCCC>
##$VD= 0
##$VDLIST= <DDDDDDDDDDDDDDD>
##$VPLIST= <PPPPPPPPPPPPPPP>
##$VTLIST= <TTTTTTTTTTTTTTT>
##$WBST= 1024
##$WBSW= 4
##$XGAIN= (0..3)
0 0 0 0 
##$XL= 0
##$YL= 0
##$YMAX_a= 4275
##$YMIN_a= -5111
##$ZGOPTNS= <>
##$ZL1= 120
##$ZL2= 120
##$ZL3= 120
##$ZL4= 120
##$ABSF1= 0
##$ABSF2= 0
##$ABSG= 0
##$ABSL= 0
##$ALPHA= 0
##$AQORDER= 0
##$ASSFAC= 0
##$ASSFACI= 0
##$ASSFACX= 0
##$ASSWID= 0
##$AUNMP= <proc_1d>
##$AZFE= 0.1
##$AZFW= 0.5
##$BCFW= 0
##$BC_mod= 2
##$BYTORDP= 0
##$COROFFS= 0
##$CY= -3
##$DATMOD= 1
##$DC= 0
##$DFILT= <>
##$DTYPP= 0
##$F1P= 0
##$F2P= 0
##$FCOR= 1
##$FTSIZE= 65536
##$FT_mod= 6
##$GAMMA= 0
##$GB= 0
##$INTBC= 1
##$INTSCL= 5.30512e-09
##$ISEN= 30
##$LB= 1
##$LEV0= 0
##$LPBIN= 0
##$MAXI= 10000
##$MC2= 0
##$MEAN= 0
##$ME_mod= 0
##$MI= 50
##$NCOEF= 0
##$NC_proc= -9
##$NLEV= 6
##$NOISF1= 182.463
##$NOISF2= 159.3651
##$NSP= 0
##$NTH_PI= 0
##$NZP= 0
##$OFFSET= 248.5645
##$PC= 4
##$PHC0= -9710.421
##$PHC1= 510.6746
##$PH_mod= 1
##$PKNL= yes
##$PPARMOD= 0
##$PSCAL= 0
##$PSIGN= 0
##$REVERSE= no
##$SF= 81.014009
##$SI= 65536
##$SIGF1= 159.3651
##$SIGF2= -187.1042
##$SINO= 113.3802
##$SIOLD= 16384
##$SREGLST= <1H.CDCl3>
##$SSB= 0
##$STSI= 65536
##$STSR= 0
##$SW_p= 40650.406504065
##$SYMM= 0
##$S_DEV= 0
##$TDeff= 32768
##$TDoff= 0
##$TI= <>
##$TILT= no
##$TM1= 0
##$TM2= 0
##$TOPLEV= 0
##$USERP1= <user>
##$USERP2= <user>
##$USERP3= <user>
##$USERP4= <user>
##$USERP5= <user>
##$WDW= 1
##$XDIM= 65536
##$YMAX_p= 316394101
##$YMIN_p= -273415880
$$ End of Bruker specific parameters
$$ ---------------------------------
##NTUPLES= NMR SPECTRUM
##VAR_NAME=  FREQUENCY,     SPECTRUM/REAL,   SPECTRUM/IMAG
##SYMBOL=    X,             R,               I
##VAR_TYPE=  INDEPENDENT,   DEPENDENT,       DEPENDENT
##VAR_FORM=  AFFN,          ASDF,            ASDF
##VAR_DIM=   65536,         65536,           65536
##UNITS=     HZ,            ARBITRARY UNITS, ARBITRARY UNITS
##FACTOR=    0.620285442955139, 1,           1
##FIRST=     20137.2065510759, 0,            0
##LAST=      -20513.1999529892, 0,           0
##MIN=       -20513.1999529892, -273415880,  0
##MAX=       20137.2065510759, 316394101,    0
$$ Real data points
##PAGE= N=1
##DATA TABLE= (X++(R..R)), XYDATA
$$ [...]
43031 -4481914 -5712671 -3667254 2747056 5155038 -922592 -7767935 -7143926 -2534001
43023 -2534001 -1961960 -4667725 -3630548 2573127 9007285 13042695 15664742 15636644 10471533
43014 10471533 3104058 185732 2932047 6066988 6706927 7967510 12162854 16227099
43006 16227099 16319231 12593179 7380148 2327840 -1158450 -2023161 -1227188 -409462 1095522
42997 1095522 4430503 7108408 5387895 494979 -2542441 -2144392 -919758 424896
42989 424896 3387628 5734272 2869651 -3433651 -5593845 -1955223 174822 -3308473
42981 -3308473 -6550296 -4126957 -74713 -103311 -1913147 -411532 3645718 7304412
42973 7304412 11166393 13733098 7440307 -9210889 -22022051 -16669396 -179958 7182293
42965 7182293 183515 -5946352 185432 11345907 16275793 15679428 15538492 14928691
42957 14928691 10101727 3645954 439189 -723103 -3561400 -6452596 -5533027 -2178436
42949 -2178436 -181410 1654483 6836468 13057761 13888891 7976888 624293 -3442702
42941 -3442702 -3831910 -1665176 2111393 5896512 8809709 11922910 14860913 13978606
42933 13978606 8585436 5499563 10687067 19090004 20851489 15833902 12427891 12459426
42925 12459426 8759229 314798 -2268936 6886983 17266615 15952879 5975425 311342
42917 311342 2770762 6379539 8088943 12505759 19896969 22165646 15210989 6335943
42909 6335943 3788742 5884995 6535825 5749340 7381069 10103708 8307985 1162613
42901 1162613 -5278140 -5344042 848321 8655441 11961471 6665789 -4088983 -9667160
42893 -9667160 -2874123 9435495 13409866 6216783 -882066 342452 3837835 728231
42885 728231 -6071103 -7613230 -3898348 -2214028 -2620919 3039746 15688733 23437754
42877 23437754 17008450 2846884 -5824041 -5407958 -2314318 -1064098 6021 2678267
42869 2678267 5829082 8852900 12285199 14211688 11316602 4992908 1807346 5616267
42861 5616267 12483994 15478620 12125069 5798040 2090526 4612852 11551658 15557614
42853 15557614 10471498 -422714 -6557279 -2729636 4110637 4080562 -2801058 -7614159
42845 -7614159 -4773307 1779849 5105727 3929573 2776744 5379623 9820331 10239985
42837 10239985 3227624 -7545751 -14000338 -11465695 -2722769 6064317 11236708 12365091
42829 12365091 10190688 6937345 6644501 11262639 16918127 17352700 11014771 2220127
42821 2220127 -3996905 -5378266 -2089160 3173150 5483568 2676911 -193197 3489992
42813 3489992 11586594 14832808 10414653 6723684 10484085 15991717 13952042 6071159
42805 6071159 2345594 6111928 10630122 10615208 8603342 7591797 5160163 -569763
42797 -569763 -5068117 -3366649 1639469 2850462 -589892 -2025254 3317547 12096876
42789 12096876 17388986 16519177 12750966 10860362 12408957 14645634 13354496 7220715
42781 7220715 -469466 -4931252 -4380175 -581458 4543638 10806901 17286972 19855991
42773 19855991 14257949 2590717 -5822227 -3295513 6678604 12345833 7785823 611141
42765 611141 1962067 11384907 17273421 12125737 1285749 -5555510 -6053230 -4564402
42757 -4564402 -4174244 -4577052 -5497596 -6970367 -7136723 -4267608 -504735 406328 -1455437
42748 -1455437 -3047259 -3898062 -6020806 -8440916 -7095640 -1233035 4810572 7431243
42740 7431243 6804504 3291116 -3475347 -10107057 -10606844 -5579436 -3971873 -10506190
42732 -10506190 -17271147 -14763600 -6665904 -5064345 -13138648 -21267166 -20395513 -11825809
42724 -11825809 -2851968 904194 -1971875 -7551956 -7282532 3561443 17273079 20773821
42716 20773821 12492833 3835092 1672050 -204998 -6706497 -9486247 246935 14609695
42708 14609695 17715087 8221212 336846 2461334 7329828 6374313 2480482 2301089
42700 2301089 4461783 3303328 -652113 -1497713 3077602 9410983 13211249 12941953
42692 12941953 9107153 3844892 81074 -1815394 -4735042 -9428297 -11400561 -7494479
42684 -7494479 -2710806 -4334023 -10535570 -11951210 -5505762 559640 -1236392 -6812547
42676 -6812547 -7322564 -2388434 573063 -1453256 -3312234 -1452192 -154808 -3407410
42668 -3407410 -5923363 412308 12866226 18596309 11031066 -1269491 -6498315 -4803671
42660 -4803671 -4803660 -8418257 -8457712 -1917818 3698867 1904326 -2299783 -365971 6449049
42651 6449049 10049608 9100396 10154445 14885984 15834984 8661371 723699 1350836 8903216
42642 8903216 14264094 13725944 11237814 9643244 7371297 4513403 5239023 11278442
42634 11278442 17894861 19813859 17849779 16083045 14638335 9292676 -1659353 -13000650
42626 -13000650 -16913360 -11667634 -4584505 -4338964 -10546564 -14541110 -11786803 -8156101
42618 -8156101 -9339153 -9892238 -1936880 8714241 7761728 -5240538 -13372487 -6564550
42610 -6564550 3811201 3876074 -1123173 2374669 12454233 15155635 7755430 2116903
42602 2116903 5100694 10757606 13267121 13172630 8891688 -2642299 -13508350 -9522548
42594 -9522548 6410141 12515352 -1031467 -16055703 -13833709 -3041953 -3474086 -14350456
42586 -14350456 -18808530 -12058065 -4346932 143594 6995510 14972442 15130885 8337962
42578 8337962 6026559 10448089 10864576 3271242 -2665209 -1617920 -1208508 -5685619
42570 -5685619 -6920107 -716393 2737044 -4229171 -12416092 -10670850 -4081908 -3947144
42562 -3947144 -8528380 -7785301 -943660 4127675 4831615 5024119 5526258 4368510 3737567
42553 3737567 6735240 9849125 7748876 2587327 -106420 -944479 -2905934 -2385134
42545 -2385134 5330685 14781554 15600220 7558717 576167 1128491 7293604 14698418
42537 14698418 18551206 13535213 1624388 -4387464 3543108 14486298 13110247 3402667
42529 3402667 1527177 8705565 10864714 5072986 4683407 13660150 17247008 7193397
42521 7193397 -3163612 -1084770 5254954 2857443 -4082056 -4294800 -273250 -1872968
42513 -1872968 -6792949 -4283850 5932705 13427508 13427412 10815840 9750438 10168518 12253528
42504 12253528 14646852 11901897 3549938 382711 9840052 20664527 16768924 2525941
42496 2525941 -2706971 5548874 10631078 1510477 -11620709 -15616587 -13178340 -13430670
42488 -13430670 -15229545 -11318003 -2044585 5348745 7132388 5165975 1938197 -597531
42480 -597531 -539977 1187076 1458523 1387697 6057991 14005687 14962596 4727420 -5372361
42471 -5372361 -3056872 6848011 9788455 3096302 -1899485 1446910 6522253 5940553
42463 5940553 1730570 -1663754 -5440249 -10977228 -13315136 -7987016 -141328 1196965
42455 1196965 -3840675 -6192728 -1129723 5687670 7320997 4858876 4108108 7190847
42447 7190847 11808293 16295966 20511243 22483475 19126932 11572203 6090999 7389248
42439 7389248 13047581 16574719 14384649 7996198 981569 -3918360 -5514871 -4254169
42431 -4254169 -1507428 2263689 7644892 13503804 16125626 13500882 8768092 6318818
42423 6318818 5865029 3997882 349550 -2543319 -4944376 -9578008 -14715328 -14251196
42415 -14251196 -7511834 -2190526 -2510161 -1004301 10018124 23618108 25294757 13523226
42407 13523226 2144736 642481 3269756 2522972 2287305 8483577 15097762 11792325
42399 11792325 1370520 -3008348 2724614 9129841 9849725 10373984 15632849 20026012
42391 20026012 17305129 11658474 10346432 12205198 12640915 14054175 20620581 26896386
42383 26896386 23525502 12789961 6787789 9729951 13403681 12157032 10942331 14144998
42375 14144998 16810143 13465936 7654238 5765836 7517936 8891717 9072730 8447147
42367 8447147 5132779 -86932 -649734 6787838 14854632 14668560 8508667 4907579
42359 4907579 4525580 745423 -7053903 -11170952 -7795620 -2402427 -103263 1544667
42351 1544667 6112428 11132860 12366278 10845436 10633106 12131572 12124748 9340775 6332066
42342 6332066 5877532 8034205 11253012 14742970 18475791 21180356 20029668 14005047
42334 14005047 6912831 4420666 7552947 11704476 12803000 11188921 8195877 3219796
42326 3219796 -2872928 -5409033 -1252144 6093056 10588300 10562463 8194575 5368813
42318 5368813 4186929 7984657 16344596 22032518 19019562 11247006 6972225 6594286
42310 6594286 3768257 -2403559 -5029688 -802529 4087501 2972305 -1830205 -2627442
42302 -2627442 3467573 11001522 11999086 4661336 -3513169 -3283966 4649477 9747781
42294 9747781 6147805 1140594 3638345 10490478 12727329 10005498 8070741 5895090
42286 5895090 -1703480 -10230226 -8294937 4594344 16267699 20083992 21391700 22704134
42278 22704134 17345233 4152282 -5751318 -5729391 -4689931 -11414673 -19340133 -18400299
42270 -18400299 -11850122 -8463656 -6505577 520164 8589312 8330428 1619836 -1104610
42262 -1104610 2000359 3131835 56206 -719948 3162697 5822953 4034454 1928717
42254 1928717 2620662 4422236 7334346 14108480 22511019 25575954 22587596 21174934
42246 21174934 24762642 26252596 19214188 8363648 3038205 5264868 9846288 12546859
42238 12546859 12850189 10831393 6130588 -83395 -4585953 -3854152 3404024 14046036
42230 14046036 21657244 22633004 20456668 20648738 22263922 18987987 9278398 906399
42222 906399 3084318 16107521 29988402 32589156 20291319 2482890 -6391098 -1733450
42214 -1733450 6693582 8007155 3819968 3272200 8404592 12572246 12046055 10689620
42206 10689620 12164971 14837626 16328156 17109541 17684052 17122865 15537774 13526065
42198 13526065 9374513 2136945 -3460317 -2069571 2849889 2646891 -3297637 -6995631
42190 -6995631 -5744590 -6405135 -12342517 -16250960 -11869240 -4245266 -1322491 -2299719
42182 -2299719 -1722705 593526 1265319 492303 358132 -458638 -3732713 -6595213 -5399780
42173 -5399780 -1633319 1561758 5094534 10022971 11751494 5603252 -4148689 -8341705
42165 -8341705 -5058813 -1146558 -2294324 -7587755 -13152973 -15225672 -10401725 568985
42157 568985 9183191 6163394 -6478180 -16113288 -14150782 -5019463 1485761 1868222
42149 1868222 -172263 -653092 801465 2271333 1724941 -1535739 -5873662 -8141431
42141 -8141431 -6357776 -1080436 5906538 12855635 17617818 17942857 14062279 10087112
42133 10087112 10361861 13675396 13349418 5475942 -4382540 -6738419 -519357 5461145
42125 5461145 5568307 5374917 10957534 16301406 11162747 -1553254 -8148515 -4457989
42117 -4457989 -1558506 -7278011 -13708673 -10135178 1421939 12128522 19468497 24742053
42109 24742053 24630158 16789279 9160418 11653366 20865494 24500449 19727628 15450579
42101 15450579 16093602 15341959 8976332 2777141 2291460 3602092 774197 -3953628
42093 -3953628 -4052923 1437251 7786521 11516749 12532303 11310479 8427008 5944797
42085 5944797 5606259 5683523 2360811 -4958169 -11307692 -10808329 -3977288 1503596 -178760
42076 -178760 -4554156 -2319306 6695434 12074554 8397100 4260257 8885417 16616777
42068 16616777 14901674 3778377 -4031658 -1733057 3735789 3962116 -464508 -4535009
42060 -4535009 -6151891 -6017351 -6033266 -8925143 -13885424 -13876832 -5002130 3686535 684601
42051 684601 -8912475 -8810610 2730117 8855572 1236294 -5793922 1451797 13920553
42043 13920553 15536495 8958853 8306984 14001518 13683787 5389477 1580798 8141113
42035 8141113 14699069 10838781 536831 -5320220 -2992899 2500374 4645497 986721
42027 986721 -5108188 -7171097 -3072817 1638182 1656080 -142342 1349554 3419083 -45349
42018 -45349 -6590895 -7452111 -1121717 4887284 6021507 5069514 4130185 2011436 867913
42009 867913 5352741 12846323 14267976 7546635 978114 235885 1589259 1210664 1072272
42000 1072272 1660722 -636109 -4203680 -1324431 7733642 11447651 4923480 -1243625
41992 -1243625 992845 3035188 -4380399 -13261048 -11852021 -6192611 -10140471 -20460735
41984 -20460735 -21384763 -11053365 -3662190 -4932620 -4762964 2370932 8022864 6789772
41976 6789772 6219228 11905453 17118409 15704480 12052442 9539218 2573344 -9455450
41968 -9455450 -13689446 -2467494 11038185 10851369 2114474 74292 2990683 -3926409
41960 -3926409 -20532875 -28547866 -19106798 -5477588 -2378911 -7563010 -11176318 -10597389
41952 -10597389 -7644464 -1823983 4630601 3900316 -5942974 -13787983 -8894054 4644405
41944 4644405 15577121 21374823 26181283 28134797 21289264 8819282 2436695 6955362
41936 6955362 14810246 18025344 17117196 15320296 12114343 7055802 3843970 5388256
41928 5388256 8690350 8758623 4791004 -262174 -3087959 -787044 7575811 17185440
41920 17185440 19364784 11183041 91355 -4545523 -1450588 4217862 8323164 8974791
41912 8974791 4492104 -3534718 -7971705 -3734328 4280882 7881079 8132205 12226272
41904 12226272 18458687 15777834 1845902 -9569147 -6782568 2812474 3769069 -5114662
41896 -5114662 -10793905 -5956165 2436118 5728037 4631379 3980281 4148980 2673679
41888 2673679 -567174 -4160714 -7536482 -9190672 -6083378 1863077 9756888 13304785
41880 13304785 13585817 13645066 13469559 11233521 6616335 286158 -6731427 -10943790 -8026447
41871 -8026447 407538 6714959 7835087 10064899 17565065 22790045 17494530 8281156
41863 8281156 9343706 21279091 29564289 25723387 18046913 16909531 20211440 20273133
41855 20273133 16705557 14159980 13012495 10483779 7492522 7170667 8914192 10043223
41847 10043223 11260721 14712052 18417429 18203204 13964823 9102001 5043308 1242558
41839 1242558 -518415 2926830 10770304 17834745 19785324 16128312 9096325 2452363
41831 2452363 -126871 1222010 1836567 -1420457 -5306256 -4735304 -83591 3725457
41823 3725457 3590272 383502 -2982363 -2670880 3419324 10657256 10126823 916219 -5635743
41814 -5635743 -680881 9108964 12287422 10614161 13945222 20776088 19009863 6812552
41806 6812552 -2483557 -718912 3397202 -430194 -8929403 -13724091 -15140628 -18126945
41798 -18126945 -21691471 -21620148 -18353422 -14228122 -7901023 1291805 8895661 12672332
41790 12672332 18469407 30154704 39098788 33749426 16342809 552836 -5045244 -2462595
41782 -2462595 3580705 9135337 8955662 1678757 -3773544 2340243 14664971 17433906
41774 17433906 6581312 -4221298 -3230429 4524728 7848032 5318893 2639890 839693
41766 839693 -3665944 -10072744 -12115778 -6148241 4242093 11965157 12659552 8206718
41758 8206718 5430506 9483654 17584088 22021415 20118063 17042502 16832385 15572663
41750 15572663 7798401 -3688898 -9807445 -6199668 2060681 7182838 6933985 5070522
41742 5070522 5544977 8237683 10344496 10172152 7684913 2157216 -7049403 -16285745
41734 -16285745 -18759774 -13421225 -8539937 -11045957 -15841298 -12900478 -2504051 5655835
41726 5655835 7901674 10456111 15627870 15323378 4673026 -6973428 -7567544 812038
41718 812038 5724183 1825060 -3787270 -2433247 6793832 17889074 22695248 16135676
41710 16135676 2303171 -5963466 489808 15783664 25548260 23681955 16236199 9457168
41702 9457168 2227837 -7355577 -15261880 -16226235 -11115039 -5387340 -2463175 -1456193
41694 -1456193 374049 4875355 10865953 13685750 9581266 1720607 -1544066 3586325
41686 3586325 11669318 15610173 15565383 16630184 20368639 23375267 23184618 20984467 18287509
41677 18287509 14985200 11624054 10041597 10235345 9590994 6947819 4595975 4068862
41669 4068862 2894823 -1034363 -4042053 -279158 9535210 17468865 17494056 11476260
41661 11476260 4762153 -105333 -2838556 -2640203 -105382 765613 -2932703 -7915869
41653 -7915869 -8488919 -4393495 -339016 1545265 3561060 6587536 7937304 6378934
41645 6378934 4067293 1751161 -2226273 -5422598 -381654 14133302 26098835 22400719
41637 22400719 6300293 -5100954 -1642936 8657187 12017536 6524552 1626063 2791655
41629 2791655 3910066 -2731562 -13902814 -18452546 -11959483 -2451855 734399 -1458277
41621 -1458277 -2038523 558941 2559999 4350204 10787967 20773165 25423955 20530826
41613 20530826 13082191 10222896 9000794 3986933 -1384011 -124245 5859541 8400506
41605 8400506 6129305 5199628 7381366 7152584 2222913 -2046476 -1927561 -1272624 -3920809
41596 -3920809 -6562760 -4268559 1441795 5035752 4501784 2429444 1908174 4600876
41588 4600876 10796670 18586369 24662503 27708932 28936096 28356458 24016434 16486886
41580 16486886 10040872 6922862 4493736 982682 -393785 2734687 6003874 3763895
41572 3763895 -2354919 -6254853 -6983528 -9033250 -13202028 -13686309 -6333685 4909115
41564 4909115 12285165 11896440 5589015 -1490132 -3538928 2069070 10810410 13637356
41556 13637356 6757691 -3145517 -6532929 -1946664 4441773 8637183 12720747 18202182
41548 18202182 21147387 17649963 10587504 6177107 5427160 3873082 -429064 -3580072
41540 -3580072 -1782345 3712077 9811717 15902883 21829743 24882639 23123331 19718444
41532 19718444 19210064 20276434 17180517 8859106 1454555 -425137 -617058 -5677598
41524 -5677598 -14774421 -19967208 -16361113 -7971217 -2309929 -2367102 -5939986 -9855319
41516 -9855319 -11255342 -6946383 2901159 10516000 6955866 -4317423 -7499246 5596169
41508 5596169 21797497 22428283 9028390 772423 6449087 13268131 8324828 -2404799
41500 -2404799 -5796866 -1483566 1936279 3071169 6843392 11388881 8800585 -1841058
41492 -1841058 -12617766 -17363259 -15335609 -6626463 6077960 13519708 9007571 -32110
41484 -32110 -1445982 2702106 671028 -6701275 -5806724 5071966 9738110 -33226
41476 -33226 -10298720 -7439894 853787 554260 -6009931 -7814549 -5070718 -5121482 -6037876
41467 -6037876 -802663 7379772 9908395 9026743 13430304 20432322 18869099 8951826
41459 8951826 2911922 4790517 5539231 1128114 -132434 6238140 11365949 6881668
41451 6881668 -2953992 -9947677 -12743612 -12137737 -5524101 5958929 13072067 9649306
41443 9649306 1542053 -2938726 -4613650 -7508573 -8293696 -1775715 7477480 9423506
41435 9423506 2697609 -4436249 -6289712 -4601453 -1578349 3335660 8169816 7567242
41427 7567242 651649 -5777057 -5764561 -1935500 -763167 -3198468 -4837892 -4025861 -4161534
41418 -4161534 -6539773 -6008356 1883097 12323338 15837170 11152594 7079736 9722357
41410 9722357 14361193 14077252 10237513 8177838 7569478 5050256 2860943 5687683
41402 5687683 10714472 10557561 5889041 5071386 9869695 11773216 5725658 -2258562
41394 -2258562 -5810455 -7297191 -10067955 -10060665 -3315135 4171161 2914584 -6778425 -15198480
41385 -15198480 -15045135 -7458197 1714662 7054394 6815530 4299519 3668079 3164517 -2073282
41376 -2073282 -8733317 -5741258 8594079 19232673 13559560 282986 -2751697 5552918
41368 5552918 9786748 2471979 -6355013 -6526230 -1613380 347691 -306599 1063996
41360 1063996 3510204 2744464 -424409 -853619 3174818 7991253 9766564 8263494
41352 8263494 5791378 4812010 6186710 8298049 8536272 6484102 4406715 3762482 2874485
41343 2874485 -460947 -5240322 -8044889 -7495724 -6255750 -7477203 -10134155 -10116638 -6390860
41334 -6390860 -2864362 -1684430 1618065 11014862 20839916 21759649 15208096 12090401
41326 12090401 15370525 15395145 7710994 3224113 10798106 20620161 18775280 10421785
41318 10421785 11465348 21057331 21333063 6061551 -8590874 -8005819 1491023 5664937
41310 5664937 2193848 -2422199 -5667351 -8112860 -7346055 -3125666 -2507349 -9817085
41302 -9817085 -16817033 -13291585 -3276445 242467 -5642213 -11066652 -9075707 -3347954
41294 -3347954 945371 4240299 7534970 8206518 4798627 223232 -3135827 -6593752
41286 -6593752 -10484207 -10989002 -5136737 4438047 12668025 17161857 17991147 15675345
41278 15675345 12027456 10145476 10765085 10827367 7852989 3160846 -1410679 -6560449
41270 -6560449 -11994559 -13422169 -8248698 -1927529 -2177333 -7390505 -8016934 -1143288
41262 -1143288 4019525 105816 -5497747 126505 16494994 29273776 28828468 20243548
41254 20243548 12457458 6503111 340653 -2122898 4184099 15142223 20606159 17096916
41246 17096916 9980013 3405869 -4124323 -12977657 -18755664 -18508057 -14627355 -9338851
41238 -9338851 -991652 10053224 17187629 15229837 9298285 9592142 17764037 23944608
41230 23944608 18928262 5796974 -3296940 -881432 7833836 11756488 6952357 -127789
41222 -127789 -2196278 772908 5187909 10330382 16219248 19384529 17619265 15584890
41214 15584890 17591253 17844595 8372170 -4935996 -7215678 3055820 10939201 8832316
41206 8832316 8028304 17332702 25011154 16946429 2068602 1375948 16520093 27743747
41198 27743747 23037403 12489531 10017115 15223916 19729524 20500408 19326073 16137424
41190 16137424 9515132 84965 -9962685 -17325062 -17234543 -8386000 1662395 3212040
41182 3212040 -2865226 -7049442 -6094856 -5801259 -6916702 -530776 16409782 31871711
41174 31871711 33582898 24828049 16794951 12756612 9573968 8401608 12656508 19186993
41166 19186993 21985383 21963200 23256618 22900514 15325395 5219549 3450735 9616148
41158 9616148 11150648 2726684 -5419931 -3761983 2662287 4022684 683102 -269191
41150 -269191 2709921 5793352 8143036 11464373 13709899 11291530 6121620 2958160
41142 2958160 843510 -4944054 -12593552 -13928489 -6731747 991149 2582007 1746309
41134 1746309 5288739 12433823 17129563 17099333 14724013 11578511 7910816 5800301
41126 5800301 7003913 8512595 5914770 938139 -139683 3805732 6498188 3555678
41118 3555678 -1237783 -1753221 2600923 7763899 10246826 8650085 3400094 -1879371
41110 -1879371 -1829728 4373523 10722494 11495535 8080226 5449857 4772838 3765164 2178166
41101 2178166 2134582 3778619 4493786 2241546 -2593586 -7225522 -6639617 2540786 15080590
41092 15080590 18841421 9212075 -2455643 -2370373 7340480 13364291 11993468 12885430
41084 12885430 20537214 24995004 17371018 4316746 -1634820 1102192 5040323 6714115
41076 6714115 7918291 7299053 1462104 -5802096 -5277270 4384535 12975100 11764749
41068 11764749 3978888 -1865403 -3856706 -6190999 -9442931 -7674928 3566173 20043430
41060 20043430 31884832 32817035 25244203 16892541 13561855 14970715 16582593 15026014
41052 15026014 12138163 13500991 21817069 31711234 33368852 23097770 8894357 3296269
41044 3296269 11026406 24950258 33233637 29171594 15740026 2832718 -1107364 3333223
41036 3333223 8594218 10556641 12814834 17953198 20603703 15679113 8431870 7082892
41028 7082892 8899762 5156927 -1304593 2655196 18935293 32022650 30937001 24458415
41020 24458415 24848844 27813196 21781918 9144877 2992698 5975990 7107347 141596
41012 141596 -7624258 -7912016 -2562222 2235352 5067084 7726364 9519268 7767712
41004 7767712 2091632 -4158490 -6482704 -4001552 -2018375 -6224637 -12778451 -10550218
40996 -10550218 2111640 10588871 2818363 -11494635 -12549215 2315713 16648570
40989 16648570 19115636 15071527 11909025 7956265 2166781 1752086 10868350 21042348
40981 21042348 22432858 17962947 17312008 21945357 24746842 21349113 14522592 9351481
40973 9351481 9400446 15161875 21860247 21903882 13605321 4009178 -332785 -601320 -40193
40964 -40193 2623251 8422605 12863358 12467850 11548279 14967090 18957171 17589722 14092053
40955 14092053 15954995 21589785 22290478 16363230 10898471 9349274 7964279 6299337
40947 6299337 10430071 21312583 29360052 26980032 19442911 16234569 16825489 12880418
40939 12880418 2042815 -8016179 -9479636 -2837481 5598251 10596189 10888609 8185202
40931 8185202 5558375 5299542 6306125 4459251 -1961225 -7431185 -3426645 10224307
40923 10224307 21572120 18820187 4860483 -5975074 -5216259 2337964 9108533 13917429
40915 13917429 16880328 14205120 5677457 251765 4577439 10998902 7789840 -2038279
40907 -2038279 -4427749 4108921 11603146 9556728 4161048 3567718 5199275 3249535
40899 3249535 -31287 664913 3541799 3091786 -492465 -2893463 -3252664 -3087951 -714569
40890 -714569 5989558 13445010 15939405 13695894 10983344 8218956 3160921 -1645540
40882 -1645540 -1026711 3072509 2470241 -4745131 -10458441 -8540202 -3496654 -2413576
40874 -2413576 -4197732 -3077714 894597 1758032 -2689230 -6895656 -4746385 2571485
40866 2571485 7982190 6835345 2373641 2077522 8492591 15472546 15675991 10298165
40858 10298165 7289713 9959632 12545251 9259121 2807025 -113824 1870850 4783552
40850 4783552 5942095 5442195 2894042 -1550447 -3936658 -712356 3631795 217111
40842 217111 -10858164 -17818437 -12040150 381724 7517374 7143709 6131393 7435422
40834 7435422 6623881 1805703 -1186908 3045012 11602750 17419032 17630455 14487778
40826 14487778 10863624 8159818 6565098 4679889 923856 -2546134 -468003 7676622
40818 7676622 13708945 9703966 -882154 -6611352 -2197779 6299690 10961295 10803016
40810 10803016 8951857 6671143 4344610 4363640 7917652 11088369 9105671 3451467
40802 3451467 38105 754695 1747015 654834 480197 4242496 10251872 15797180 21851270
40793 21851270 29984217 36972543 37118309 29402490 18843261 11031424 7962949 8207862
40785 8207862 8126117 4291377 -1675457 -2609146 4880114 12629820 9708017 -1812921
40777 -1812921 -9106081 -7890739 -8214799 -15973673 -20841239 -12942832 -1443539 -1673400
40769 -1673400 -9578521 -6464686 11347463 25417436 22310302 11780333 9403548 14563011
40761 14563011 17204520 16264121 17813365 20913670 18861799 12005479 7303114 5957451
40753 5957451 2575593 -2902120 -3201266 3781601 9724658 7300936 -61383 -4140682
40745 -4140682 -2442696 1234604 2860630 1368587 -1366293 -1404696 3710953 10748787
40737 10748787 13249981 9690257 5836987 7223649 12548527 16533559 16221349 12159959
40729 12159959 6227182 1159010 314539 4888286 11711190 15490686 13305055 6836687
40721 6836687 1153511 1202938 7961414 17606649 25173348 28405080 27313707 22248199
40713 22248199 15065775 10216604 10640456 13325508 12863097 8942712 6095176 6118233 5629887
40704 5629887 2342658 -630170 988437 6900995 12566166 13554225 9059479 2894000
40696 2894000 571569 3140217 5137290 1733786 -4072709 -5996786 -4250674 -4360866
40688 -4360866 -6841813 -5575819 2035901 10295888 13222132 11373278 8009908 4192536
40680 4192536 601683 -1227637 -2263722 -4957060 -6447902 116071 13496180 21040301
40672 21040301 13651366 -1687886 -10892075 -9478150 -3813225 -287241 -561185 -4130069
40664 -4130069 -8161465 -7083662 929257 9172946 10366814 6823126 6016282 8876300
40656 8876300 10418774 9877831 11014669 12616942 8138121 -3151030 -12684998 -13367184
40648 -13367184 -7443023 -742594 4973149 10406204 14469307 15730146 15061109 13937410
40640 13937410 12533615 11317201 11816625 14204841 16506703 16995019 14791219 8387604
40632 8387604 -2202614 -11459339 -11769832 -2989653 5686118 5936118 -1085507 -8436626
40624 -8436626 -11709614 -10632314 -5754090 2269848 10967092 16272266 14861526 6796689
40616 6796689 -2525615 -4643326 3401792 13087000 12540908 1638190 -7279436 -6068212
40608 -6068212 -1064170 -2021581 -7652585 -9824325 -7484781 -7012331 -10212729 -11327568
40600 -11327568 -7234239 -2491920 -1329963 -1460099 124152 983449 -1834665 -4846830
40592 -4846830 -2279614 4727574 8831107 6112553 168899 -3728787 -4027005 -1470245
40584 -1470245 3119848 7288952 7021493 1902661 -2318537 -392593 4429996 3402729
40576 3402729 -6306714 -16990562 -18915018 -10977883 -834899 3974421 2619310 -799246
40568 -799246 -2988789 -3758161 -3339349 34699 7712290 16510068 20188820 16446495 10015641
40559 10015641 6802159 7309880 8612061 10259659 13804338 17853405 18832555 16678760
40551 16678760 14583371 12370524 5932672 -4403357 -10595045 -6445066 3123769 7177603
40543 7177603 1495045 -7718916 -11827170 -8012561 248203 8064219 13216068 15790148
40535 15790148 14805146 8047743 -2278960 -6916316 1170696 15255917 19933130 9986045
40527 9986045 -2582100 -3951387 5440157 14870565 17335663 13506802 6611186 355541
40519 355541 -1105341 2543665 5751186 4374965 1784890 2597524 4678346 4051402 3520762
40510 3520762 8084281 14762211 16016005 11582485 7832839 6412306 3184430 -1384432
40502 -1384432 -1007611 4934755 7881728 2029567 -7228016 -10685537 -5837204 2723860
40494 2723860 8550552 7256469 205600 -4707590 -1370344 5305081 5098845 -2607869
40486 -2607869 -8119050 -6644101 -4278438 -5545446 -5254191 1275969 8676194 9596093
40478 9596093 5505089 2180660 453403 -1048335 518536 7472017 14620303 15556309
40470 15556309 12874361 13555497 16530268 14387787 7273633 5350803 14378467 26444270
40462 26444270 30032911 24617153 19640278 20824610 22983415 17958344 6171544 -3459962
40454 -3459962 -4532700 53871 3968732 5962668 8514966 11221545 11511423 10720038
40446 10720038 13038873 17988762 19767560 15223048 7534320 1391582 -552104 3108424
40438 3108424 10516994 14196113 8519614 -158881 254352 10201390 17522282 16023693
40430 16023693 13142981 14707768 15160268 10956073 11144010 22882022 36192619 36683087
40422 36683087 26772651 20559262 22130961 22822973 17669724 11161171 6891102 3568361
40414 3568361 2234582 6650373 14794717 19190698 17331186 13990858 12722896 12885687
40406 12885687 14758935 18906611 20712399 15101869 7082483 7310336 15582250 19323938
40398 19323938 11801334 1901736 1029600 8757269 16902115 20892716 21606596 21286179
40390 21286179 22314709 25877543 29017148 27828044 25345943 29719692 41841285 51952758
40382 51952758 52630612 48494514 48138746 52419737 56339159 57630252 57559104 56578210 54346847
40373 54346847 51761688 49378446 46316249 42991393 41242352 39919734 35717197 30984639
40365 30984639 33861907 45754196 55340888 52279983 42061922 38971880 46974749 55925720
40357 55925720 56022341 48189273 39112522 32918330 30634630 32765217 38147338 42425572
40349 42425572 41413524 36072438 31872459 32229071 34138780 32480861 27875032 26390628
40341 26390628 30231931 33604598 31732162 29257465 33236963 41407681 45866437 46290175
40333 46290175 49368838 55239043 55857518 49227832 43540730 42548629 38721096 28283491
40325 28283491 21716724 28801680 42063794 46902440 41626200 35418893 31939624 28094947
40317 28094947 25318665 27980655 31801940 27474441 16357220 9891415 12318016 16712229
40309 16712229 19721217 26019756 34198433 33109085 19861865 8355634 10148611 18088728
40301 18088728 20060771 18694888 23488042 30857613 28302404 15743997 7082064 9325667
40293 9325667 13795000 11527598 5638271 2939217 2731868 709238 -2337499 -2032582
40285 -2032582 3302967 12258502 22423083 29353847 27781249 17999331 7687258 3783060
40277 3783060 5653873 9037712 12505081 16466554 20114616 23620016 29338869 36349825
40269 36349825 38107930 31025710 21497278 18192587 20736630 22625798 21926366 21130054
40261 21130054 19132005 12850679 5950134 5874035 11005260 10617644 762778 -8567276
40253 -8567276 -6662235 4489708 14479353 16404823 10844066 3602714 2689143 11443644
40245 11443644 21803798 21546885 11360201 5893612 13040587 22167763 20613163 12154422
40237 12154422 8295373 9050538 5591077 -2575727 -6753920 -3860837 425494 3377114
40229 3377114 8557880 16332488 21623690 23012502 24557580 26844974 25685633 21534413
40221 21534413 20232413 21702482 18293939 8595543 2648667 7066732 13639925 10488414
40213 10488414 -1583563 -11189196 -10323303 -81006 13343786 22413248 21735749 13744324
40205 13744324 8137644 10630172 15189096 12539396 3520902 -1855947 2716395 13147065
40197 13147065 20781091 20773419 14490576 6845634 2304694 2389343 6487676 13845952 22603660
40188 22603660 27937976 25509823 17662826 12061279 12422417 14262544 11769483 5364530
40180 5364530 82875 -683191 2427720 6378327 8023969 6458034 3863060 2686429
40172 2686429 2826087 3689358 6688546 11857422 14783547 12417344 9240844 10815165
40164 10815165 13989768 12241167 8225815 9703021 13787224 8890267 -5183404 -13296198
40156 -13296198 -7046085 2305151 1401528 -6060284 -7998166 -2634831 2727818 5106546
40148 5106546 6942799 7986163 5941070 2781174 2733726 6109740 10566323 15012610
40140 15012610 17718661 15515785 9457273 5472194 5284171 4166944 1867641 5539314
40132 5539314 15492936 19900317 13270891 8430144 17378339 30522826 30049994 16124991
40124 16124991 3863135 55589 -883479 -1924354 -662257 672004 -2591521 -7129680
40116 -7129680 -7100513 -6837063 -13197770 -18992375 -11452415 4843676 12448202 8636019
40108 8636019 8827323 19522472 27462783 21975206 10493168 3950020 2142933 1915377
40100 1915377 5791271 13416053 16516507 11185018 4946171 4427254 6182363 5985534
40092 5985534 6304554 8056616 5948391 -1258287 -6482786 -6352738 -6168570 -7184671 -2108116
40083 -2108116 9366021 14357285 5749210 -5373461 -6642609 -1664652 640484 1880183
40075 1880183 6765314 10692447 8280249 5171346 8159677 12182445 10218336 7283076
40067 7283076 10463386 13501548 6910045 -3529880 -4675297 2878863 7845927 8148522
40059 8148522 11056212 15911546 13472722 2577379 -7215440 -10199251 -8851386 -4231278
40051 -4231278 4526838 11505527 8716683 311314 -1177595 6192901 11624854 9472212
40043 9472212 5691613 4458710 2249312 -1310562 -234409 5302105 5697739 -2895589
40035 -2895589 -11057523 -9828946 -2208174 4805081 10154708 14421372 14229035 7953824
40027 7953824 455831 -3647472 -5543669 -6662620 -4212982 2844286 9331122 10006058
40019 10006058 5323991 -1668589 -8249951 -9868025 -2762605 8276549 12768341 8594321
40011 8594321 4869762 7242660 10167980 9237543 10643917 19658444 28264587 24915001
40003 24915001 11371836 -94711 -2828514 -198566 3298545 6431864 7800987 5805709
39995 5805709 2382746 1203899 2191657 2089911 -388363 -3786028 -6714210 -7734315
39987 -7734315 -4577685 2336579 7665735 6909285 2710794 815678 1099519 -2260203
39979 -2260203 -11468224 -20342082 -20735971 -12021991 -2738463 -2326000 -10957603 -18917968
39971 -18917968 -17756052 -9926381 -3867452 -2129250 -579558 2180406 3109991 3123011
39963 3123011 7743110 16236317 19394208 13290685 6597587 7562991 11668969 10412826
39955 10412826 5522593 4845686 9002852 12084195 12436585 13035017 13035354 8436899 728747
39946 728747 -3430999 -1269076 4347475 11365123 19211093 23706771 19800359 10411861
39938 10411861 4981980 7587529 13110753 16349189 17702664 17852439 14332167 7227797
39930 7227797 2161035 2944539 5686161 4635302 359330 -2466120 -2810904 -3735791 -5798262
39921 -5798262 -5038379 359166 4521949 -635620 -13767296 -22148128 -15459079 677978
39913 677978 10689198 8108059 1604044 650079 3731266 5319244 6047415 8134961
39905 8134961 7363701 -613769 -10126440 -11574432 -5032704 1792567 6648284 12953801
39897 12953801 18281380 14850337 3260296 -5318685 -3964463 2296030 6542353 8402929
39889 8402929 9106819 7655463 6385759 11149390 20492280 23303141 13733196 927042
39881 927042 -2942752 2296949 8481926 11254138 11020984 7537271 1872282 -222029
39873 -222029 5218305 13188956 15377310 10259187 2404806 -4159098 -6381605 -1213394
39865 -1213394 8737783 13370020 6728924 -3829422 -8135883 -7912498 -11227325 -16872119
39857 -16872119 -16425803 -9508928 -3872853 -673816 6343333 14893799 12243180 -4461648
39849 -4461648 -18951963 -16267646 -2506802 6275950 6939956 8765890 14998764 18552180
39841 18552180 16024567 13690498 15972182 17645375 13274431 7384910 7906181 13323584
39833 13323584 14195131 6859679 -1481970 -3216134 226791 3295513 5815477 11192474
39825 11192474 17449242 17936365 12277849 9322924 14994503 22599062 21093169 10040377
39817 10040377 286680 505317 8000198 13233798 10139312 1642184 -3180805 1666358
39809 1666358 11527737 15586178 10585570 5048671 5986972 7782635 1832873 -7985102
39801 -7985102 -10031384 -2658098 4316227 5807634 6943706 10060207 8948080 1673866
39793 1673866 -2513134 2593979 8643068 5373409 -2918241 -4970037 -1198257 -2038386
39785 -2038386 -9677065 -13929496 -7747776 3539956 11414831 14043364 13370452 9852810
39777 9852810 5002715 3558682 7560448 11675255 9515014 2570038 -1838010 -609194
39769 -609194 1642999 -151234 -4551765 -6293326 -3753112 -303607 1502835 3182531
39761 3182531 5947268 6815047 3045994 -2160784 -3769112 -3204626 -5949903 -11081622
39753 -11081622 -11234730 -5011175 -861188 -4030337 -7631109 -3463818 4895809 7989377
39745 7989377 4627210 1687738 3204914 7611928 12624752 14978605 9123874 -4710765
39737 -4710765 -14880696 -11300845 -888236 2009822 -2039299 460609 11878323 18426711
39729 18426711 13272259 7752447 11368906 15870073 10689953 1558267 24244 3784163
39721 3784163 1905660 -6524848 -12790649 -13430979 -12083215 -9884224 -6229699 -5899444
39713 -5899444 -12739437 -18778527 -13057609 188437 6368661 3311367 3752952 12731040
39705 12731040 18475129 11928414 1091154 -2746662 -1354289 -2316225 -4945584 -4216982
39697 -4216982 -2103472 -4436185 -10247989 -12642406 -7439347 4809668 20715858 32190485
39689 32190485 29040684 11250824 -6734454 -12103424 -8734821 -7779861 -9733652 -7310124
39681 -7310124 -1149872 1133777 -182817 3170745 12054610 17454607 15540156 12699580
39673 12699580 12300206 8837456 194816 -6072360 -5067303 -2339693 -2360280 -141740
39665 -141740 6987432 10090273 2513441 -6060703 -3007053 6537761 7451690 -870831
39657 -870831 -4021449 3895033 12458839 13683497 13285637 16885132 18446812 12004692
39649 12004692 4671888 6781059 15766138 21169463 21428936 23824918 28926915 27120779
39641 27120779 13881415 -734790 -3664686 5590990 16861033 23268344 26526043 28929015
39633 28929015 27297391 18744004 8126977 3680819 5932834 6962623 2269006 -2668810
39625 -2668810 -1840223 716298 -2957593 -10819512 -11914860 -2084576 9674851 13469595
39617 13469595 9865348 4699081 -571664 -6555463 -8837471 -1923596 10753521 18547446
39609 18547446 16708733 11654443 10647977 11599803 7779616 -564657 -5690882 -3933080
39601 -3933080 -1585375 -4957678 -8991444 -3566429 9656238 16526294 10435816 3151209
39593 3151209 6895715 13921774 7538715 -10673020 -21196435 -15308659 -6637160 -7993724
39585 -7993724 -12412749 -7703349 3120905 9309384 10752082 14514722 19656543 20142049
39577 20142049 18493564 21950618 27679962 26297971 18895502 16103852 20169878 22496287
39569 22496287 20229943 20198951 23227471 19903083 7799444 -1246269 1253480 8084047
39561 8084047 10117567 10638125 15628959 20025296 15746560 6328044 1795201 3824813
39553 3824813 6577146 8215916 11197454 13786479 11178987 4323087 -42264 2249283
39545 2249283 9514197 17241208 20221164 15682941 8767924 9309429 17971197 22849511
39537 22849511 16706477 8746061 9249166 11570157 3548497 -10009446 -13509530 -6143694
39529 -6143694 -2674984 -7664623 -7748108 4711391 17237202 16045733 6159314 1848752
39521 1848752 6565524 13137210 16739562 17146398 13134535 4624024 -2547709 -2374605
39513 -2374605 2811165 6345574 7306802 9846485 14536486 17372469 16679535 14845305
39505 14845305 13080686 9683608 4300512 -44385 -330951 3181651 7353947 8777870
39497 8777870 6909077 5319268 7883814 13160588 15811759 14666592 14782954 18801360
39489 18801360 21004113 14579321 1611726 -9009258 -11826241 -9024107 -6107647 -6853303
39481 -6853303 -10916552 -13523092 -9539946 -382461 5965304 4521288 -702332 -3394906
39473 -3394906 -3017697 -1757609 1450629 7405769 11395727 9141991 4851865 5109442
39465 5109442 7429330 4573310 -1121896 1010900 12995194 23651674 24945350 22620090
39457 22620090 24415489 26571231 20401655 6414846 -6554914 -12696699 -12366801 -7049119
39449 -7049119 1166115 6889372 5743878 1146232 517093 4762922 7482181 5055989
39441 5055989 1679374 2889088 8844967 15597168 19089476 16881908 9975991 3978912
39433 3978912 4241883 8655027 9744744 5356616 2059034 5255468 11090516 12366259
39425 12366259 8294657 3285046 -874957 -5824460 -11025183 -12917213 -9932273 -4407468
39417 -4407468 563693 3023870 1771905 -1979005 -3182508 2358484 11743275 17560006
39409 17560006 16898080 13514388 10991108 8929384 6767067 5684842 4843719 1379633
39401 1379633 -3397691 -3781884 1147437 4781539 4115336 6333561 16880620 27520322
39393 27520322 26610230 17084225 12111066 14394928 13374021 5086904 649337 7949180
39385 7949180 16838337 13316109 574370 -6221250 -2092072 2817186 -401227 -9098876
39377 -9098876 -16647787 -20740299 -20763936 -14881203 -4572957 3574247 5485636 4911511
39369 4911511 6905130 9942594 9459461 6131541 4826297 6564755 7237716 4915481
39361 4915481 3573909 7298943 13844887 16861308 13512804 7490393 4115396 4160975
39353 4160975 4088159 1823241 -276885 520608 2969703 4717260 7563039 14847265 23850515
39344 23850515 26817738 21475254 14737782 12703864 12839955 10909795 9542982 12303194
39336 12303194 13846984 5930402 -8245095 -15637276 -10054924 1713238 11536329 18056795
39328 18056795 20897411 17381766 9902191 6723888 9277274 8351759 514186 -2151920
39320 -2151920 10210651 26804974 29722410 19809500 13068859 14584910 13892334 7173355
39312 7173355 5556853 14982561 23583986 18869964 5763448 -2634963 -2990370 -351002
39304 -351002 3194978 7608503 8497150 2474470 -4819383 -5769071 -2812402 -4133442 -9770208
39295 -9770208 -11391270 -4922146 4996114 12691530 16052020 13852111 5946561 -3230204
39287 -3230204 -7385752 -5270025 -767350 2485844 2289465 -3049867 -10806369 -12601712
39279 -12601712 -4786768 3162548 -120073 -10444464 -12378000 -633349 13603728 18874505
39271 18874505 15454690 8991243 2756140 -9044 3917712 10251480 8644059 -2490173
39263 -2490173 -10619489 -5225985 7570338 13734446 9284712 2300947 811024 5344484
39255 5344484 11192741 12860262 7989556 204967 -4138884 -3548924 -1642773 978117
39247 978117 8124881 18753445 24553468 21553822 16166478 13946355 10919174 3698663
39239 3698663 -593023 4982723 13659214 14220844 8509670 6589919 8314630 4658924
39231 4658924 -3527124 -3908374 7355389 18499277 20261416 18033368 18919523 18842081
39223 18842081 12211018 4508692 3568054 5223268 194120 -8690452 -9010586 2235847
39215 2235847 14092572 17866138 17117218 17682014 17551401 13300372 9401880 12764858
39207 12764858 21452954 26456685 23434843 16415205 10518857 7067453 5974203 6924374
39199 6924374 7104506 3479463 -1162141 -522721 4501048 4348535 -5426734 -15447628
39191 -15447628 -14359399 -4316454 3523460 5360482 7057449 11458908 13516826 9537292
39183 9537292 2666477 -3162860 -7177882 -7626881 -1904035 6149474 7418648 288843
39175 288843 -5555580 -2849031 3771503 7619780 10609287 16187928 19634148 15499487
39167 15499487 8807583 8047797 11439920 11338581 8701912 10774093 16304853 16552823
39159 16552823 11550067 11680881 19874885 25321685 20567107 12976731 11455084 12308414
39151 12308414 8410045 4130233 8736482 19149716 21920195 12436124 1637823 1091537
39143 1091537 9367524 16804110 17851753 14479437 11155189 10553847 12342088 13231565
39135 13231565 9602719 2540444 -985716 5163555 18489648 29175136 29859633 22257601
39127 22257601 13180844 6296881 616413 -3877488 -3632979 2872855 9826244 9022130
39119 9022130 390725 -6489151 -3632975 5458482 10657386 8510008 5898374 9165695
39111 9165695 14261806 12285607 2818395 -4238562 -1460764 6599963 10194933 6978949
39103 6978949 3012236 3037550 5099532 5141961 2651395 361158 863745 4105232 6566623
39094 6566623 4051364 -2187966 -4300972 2946122 13956009 19021427 17435406 16479590
39086 16479590 18344563 17645830 13390664 12756598 18261134 21015842 13980878 3980393
39078 3980393 2103412 8298814 14270161 16652151 17944426 17922793 13866005 7912129
39070 7912129 5667848 7843994 10010491 9761006 8106113 5489258 2560292 2724410
39062 2724410 7556952 12294744 12594336 12391153 16966708 21491295 16294298 2081301
39054 2081301 -9725742 -11387455 -5015819 4348637 12557974 14578977 8963752 3315205
39046 3315205 5321892 10099117 8112971 3513644 9415387 24487370 31254309 21799718
39038 21799718 8567023 3254988 1545098 -2295589 -2026253 6943266 14703962 12125182
39030 12125182 7377442 11882649 19948149 19366710 14144452 17832424 29071572 33261637
39022 33261637 27187373 22816973 24798462 22651626 10804977 210349 1770342 10880276
39014 10880276 17284011 19880055 22284587 22216352 16081111 9030280 9949417 17991552
39006 17991552 22463045 16492987 4837853 -2986802 -3108604 891157 4291520 7078195
38998 7078195 12494238 20140258 23512349 17479270 6221703 -1057707 -1722487 -1509635
38990 -1509635 -4359296 -6896389 -5522832 -2815796 -2394068 -2187699 1672152 7452949
38982 7452949 10277387 10400327 12956501 19056699 22443377 17308365 6269419 -2035547
38974 -2035547 -2051320 3736407 8428694 7934648 3960729 102232 -3342441 -8247291 -12711964
38965 -12711964 -10614497 -189065 10212431 10247447 676430 -7120925 -5320697 2347952
38957 2347952 8587748 11894739 13411520 10732804 2768162 -2925181 2569569 15305257
38949 15305257 21263052 15300041 7818659 8633740 13731045 14734531 12946815 14437526
38941 14437526 17288379 14872698 8664258 6489097 8868151 8052710 1806813 -2033207
38933 -2033207 2307339 10225201 13754113 9990875 475159 -10358243 -14240626 -5305599
38925 -5305599 9621671 15874075 10015872 4651587 9118460 15889417 14263277 7739657
38917 7739657 6583590 10426379 11231470 9332883 12917931 22429136 28264809 25815041
38909 25815041 21689660 21553151 21332378 15489578 6651318 1365541 1266076 3483950 6193456
38900 6193456 9205663 11560024 12404044 12633063 12822062 11356846 7493094 4622808 7019963
38891 7019963 13645478 18263776 16513716 10676357 6219125 5544161 7373055 10869650
38883 10869650 16322882 20996966 19086026 9580905 811547 1736907 10312484 16369756
38875 16369756 15404226 12808066 13581800 15042237 12803181 8046698 4904150 5024876
38867 5024876 8059885 13363469 18361208 19734366 18962935 21618835 28217861 31653292
38859 31653292 27573839 21144693 18588253 18030802 14651905 9433894 6168693 4451551
38851 4451551 2470911 2666760 7697697 14235610 17389115 18221925 20845297 25189551
38843 25189551 27966126 27001266 20262875 6775717 -6150500 -5119807 11502826 26483612
38835 26483612 25257262 16273323 16437933 24003894 23342996 12436253 5948055 10249431
38827 10249431 14416599 10814125 7771108 14111590 24371028 27782635 22246724 12834374
38819 12834374 4970910 3855813 11660383 21207184 21827506 14825805 12375100 17769702
38811 17769702 19938426 13269767 8845887 16760741 29395774 33116998 26876868 18687169
38803 18687169 12561144 9510531 12777120 20721905 22525149 12850623 3295560 6629480
38795 6629480 16849127 19184374 13842943 13347353 19489754 20573923 12487583 6049209
38787 6049209 9143449 15438045 16848267 15846543 18474990 24051422 28870653 33136564
38779 33136564 37205124 36438768 27396916 16293706 14128502 23136152 32954406 32315613
38771 32315613 22359536 15334102 19246606 27081622 26161676 17018012 14560777 26937757
38763 26937757 41933349 42630509 30426261 21687107 24576180 31099150 32474748 30760595
38755 30760595 31529134 34404671 36262677 37245044 38471195 38585111 36832675 35536593
38747 35536593 36000325 35735401 32800105 29167020 27143435 26538138 28029727 34479617
38739 34479617 44903435 51453139 47585046 36754275 28397762 27060443 29624886 31665839
38731 31665839 31945631 30895316 28614719 25384856 22196888 20413625 21747633 27379796
38723 27379796 35577579 41758823 43180075 42270181 42775217 43943943 42064286 37249620
38715 37249620 34255496 35127794 35219136 30083393 23733606 24948649 35269214 45633593
38707 45633593 47351788 42496923 39447145 40998152 42611510 41678067 41852845 46026677
38699 46026677 50648145 51040547 48426674 47245034 48393599 49777499 51335455 54495454
38691 54495454 57920237 58763405 57603118 57513982 58638536 58367071 56719584 56628195 58747197
38682 58747197 61148355 64399091 70767685 77165440 76089171 67073368 60385558 63759191
38674 63759191 71038236 71190574 64578818 61460854 65756013 70024555 68806249 68158888
38666 68158888 76096582 89143652 95905900 92334243 86669588 88252891 96760915 105240578
38658 105240578 110087804 113965942 120276892 129085169 139525395 152942714 170929013
38651 170929013 191730683 211897555 231636535 254790002 280735201 298696342 295158264
38644 295158264 268420033 232517095 204397314 189534866 182342586 176959407 171982179
38637 171982179 166144119 157062718 146881137 142834928 147377552 152110403 147344048 135165275
38629 135165275 127109881 130140861 140630600 151508990 159145808 162578369 162133119 160996382
38621 160996382 163274710 168229814 170660730 168887545 167703817 171028741 176551137 180997918
38613 180997918 185891715 193399110 200313006 201925731 199964835 201116231 207868724 215276154
38605 215276154 217618318 215346255 214301951 219187651 228198583 234433945 233857478 231008040
38597 231008040 233576959 241575981 246876457 244906517 241117266 242591250 248705007 254838733
38589 254838733 260452243 267360056 273576555 275642053 275061986 276186306 279085049 280327199
38581 280327199 279474195 278989489 279099179 278938736 281413624 289677172 299193932 301275317
38573 301275317 295829442 292984307 299240615 308625985 311388497 306260771 300060302 298996659
38565 298996659 304004436 311634387 316394101 314556444 308046909 302624993 301160457 301524522
38557 301524522 301667306 302457754 303868341 302967190 298450410 293104286 288692242 282521531
38549 282521531 273335645 267287958 272316168 286886508 298673649 296028433 279602878
38542 279602878 262239126 257256581 265772797 275749042 275224365 265658289 258866305 261146871
38534 261146871 265589759 262057020 250001482 237640485 231483451 230672847 230293005 227213113
38526 227213113 222982688 221861964 224718736 225557319 218114472 206111264 200905177 206371974
38518 206371974 212538796 209171214 199925979 195958392 199662753 203427502 202785296 201495865
38510 201495865 202326368 201207685 194535595 186480328 184084588 187926379 191603451 189372427
38502 189372427 181940246 175272586 174601911 178843533 181152347 176536663 168075394 163023666
38494 163023666 163649720 165469722 164023858 159144281 152700349 147191499 146727591 152816143
38486 152816143 157687849 150044296 131965711 121706995 131507238 149260375 153363357
38479 153363357 141966819 134063281 141337266 153470132 156664998 153249839 152499757 151939028
38471 151939028 141705127 123012836 108136659 102301999 98649124 93594769 94412024 105265602
38463 105265602 116392042 116794223 111041221 112851880 124898710 135181393 133799138 124714154
38455 124714154 118159712 117576179 118003613 114181022 106790232 101335509 101933402 106032483
38447 106032483 106533166 100621860 94165776 94052971 98583300 100780453 99858163 102051531
38439 102051531 108612300 110713600 101458164 87847979 84069529 94506461 109010807
38432 109010807 115010972 109984643 101266034 96940878 98434756 100485390 97607968 90903594
38424 90903594 87206022 90223684 95005484 94655605 90619481 90785853 97238422 102422233
38416 102422233 100499634 96467340 98126297 103183052 102384802 94303535 88154743 89783089
38408 89783089 93074017 90229106 83764876 81030018 81426799 77988819 69969486 64723627
38400 64723627 66034482 68742139 67732439 65244827 65403542 67329167 68045702 67354133
38392 67354133 65437711 60325688 52700099 48842120 52990404 60341093 63835300 64700685
38384 64700685 69021727 76004099 78046388 72700364 66627933 65494029 66468597 63963234
38376 63963234 57758222 51804114 48505084 47648457 48677847 50989908 53017629 52796374
38368 52796374 48976486 41426583 32644189 28124328 32124741 42158098 50321184 51300322
38360 51300322 47187746 43814081 44525529 48347940 52192664 53739538 53277011 53039118
38352 53039118 53925384 53746647 50252446 44580301 39425317 35194640 30939947 27853065
38344 27853065 28193427 31310533 34322951 36480553 39376661 42983396 44912260 43750793
38336 43750793 40370941 36397697 33884643 34824716 37606582 36285245 28010740 18819366
38328 18819366 16172612 17872516 15803405 9638311 8141263 15791147 26503035 33009848
38320 33009848 34690389 33124524 27729122 20129076 15930626 17124954 18520704 16510694
38312 16510694 15613590 20782577 28271247 30364793 25787659 19969522 17646852 19641487
38304 19641487 24206246 27603061 26153251 20996344 17470750 17099111 15081020 9317750
38296 9317750 6028887 10792825 19077122 22437621 20471009 19723755 23308593 28295538
38288 28295538 31789416 33458329 32906779 29768565 25944012 23889461 23618626 23967770
38280 23967770 24388803 23259498 18717599 14109443 16579779 25461703 28922505 19378081
38272 19378081 5886124 2019487 6841058 9068345 6356553 7337090 14931988 20713957
38264 20713957 18696675 13677333 11666790 11379147 10081726 9756829 11807411 12254827
38256 12254827 8302164 4822473 8291697 17267888 24052135 24064573 19468421 14508572
38248 14508572 10842335 8033872 6580570 8183551 11677967 10644147 96513 -13692755
38240 -13692755 -17024258 -6554739 3982371 1866440 -6743348 -7066504 1894995 8143900
38232 8143900 6663337 3895906 2658817 -1711497 -7583185 -5410880 4528269 8310284
38224 8310284 489632 -4919190 3222412 13716189 10696560 -211561 -1030556 9888216
38216 9888216 16918327 12843585 7586997 9166461 11706046 7884010 1160863 -1114024
38208 -1114024 1670138 5418232 7651799 7584035 5571543 5434584 11136209 18593421 18083786
38199 18083786 8418695 1007681 4396066 11764640 10990760 1935852 -4425486 -1310523
38191 -1310523 7088910 12981993 12470655 6079258 -1964106 -4483198 2909077 15382121
38183 15382121 22797606 21428324 17267988 15954050 14576894 7448147 -3848322 -11818161
38175 -11818161 -13357746 -13184753 -15669928 -17629912 -12622353 -506973 10938478 14305941
38167 14305941 9910235 3594795 -900021 -4769985 -9469155 -12239804 -8951338 -591654
38159 -591654 6260210 6850909 4020628 4234491 8977510 12974282 11021077 3804502 -3863641
38150 -3863641 -7841252 -6161656 1335366 11720023 18859563 18328082 12674531 8995315
38142 8995315 10619963 13598232 12433236 7109353 2568564 2248164 4144174 3748824
38134 3748824 -139669 -3948064 -4321102 -3183338 -5138691 -9784661 -10575453 -3808861
38126 -3808861 4947704 8007409 6595212 8278269 13751480 13869771 3133361 -10094676
38118 -10094676 -12538316 -1856918 12045392 19621739 19816435 16291538 12066592 10124110
38110 10124110 14114649 23874381 32281814 30898980 18986127 4234203 -5732027 -9880254
38102 -9880254 -10944725 -9429720 -3959458 3599676 7786681 5799905 1090714 -1285544
38094 -1285544 -336047 2209525 5910268 10155907 10791307 3999344 -6224514 -10347062
38086 -10347062 -5280540 934123 -112094 -6027235 -7924247 -2700964 4969020 11502421
38078 11502421 18373565 25919124 29547390 26059310 19427374 15303083 12569617 6444833
38070 6444833 -970120 -648449 10277865 21811185 22779118 14872814 8379885 6905144
38062 6905144 4985925 488096 -879705 2841911 3274336 -5790809 -16145967 -15057612
38054 -15057612 -3794466 3775489 235098 -7231230 -8801717 -3463567 4039605 10011068
38046 10011068 11737344 6821935 -2905180 -10812361 -12077537 -7797961 -1484082 3675691
38038 3675691 3315722 -5210932 -15807910 -17129626 -7485736 1097126 -654422 -6056369
38030 -6056369 -3307889 6751209 13033588 10220684 2820360 -4180607 -9132818 -9545774
38022 -9545774 -3721421 3247847 3955146 -11775 393498 7751620 14564647 15812024
38014 15812024 16271693 21139255 26862883 26704957 20138096 11950705 6151844 4335201
38006 4335201 5685767 5405164 -1870885 -13533140 -19302774 -14441583 -7101363 -6851432
37998 -6851432 -10964999 -9326438 383270 10149693 12917806 9414548 3845409 -1022408
37990 -1022408 -3632649 -3425374 -2107496 -1968715 -2876745 -3733340 -5547334 -9078634 -10817222
37981 -10817222 -6436879 2041504 7639954 7390279 5233608 5478371 8126097 11519932
37973 11519932 14818870 16554864 15314497 13211025 14003748 16349060 14193950 6087120
37965 6087120 -1377304 -2550556 130162 1801351 2496749 3574847 1845851 -5680453
37957 -5680453 -14284353 -16276159 -11887992 -8338819 -8609160 -8520634 -5705640 -3990685 -6260657
37948 -6260657 -9462626 -10469706 -11485949 -14958436 -17451578 -14329328 -8198918 -6817551
37940 -6817551 -12710578 -19555160 -19980198 -13699674 -6433736 -3021423 -3529980 -5300503
37932 -5300503 -6836709 -8530082 -9932183 -8317456 -1941672 6076633 10085849 8723930
37924 8723930 6410083 6423683 5715089 88633 -7493860 -8870390 -1829811 5033743 1921135
37915 1921135 -9671870 -18016737 -15072167 -5647617 -121857 -774723 -409057 5328687
37907 5328687 10304036 6588724 -3303668 -9089851 -6387951 -1269408 -216081 -1683524
37899 -1683524 -804069 2213385 2925423 -393916 -4653662 -6076911 -3858704 -264816
37891 -264816 1329321 -610815 -3812834 -4646306 -3194605 -3526138 -7753060 -12449681 -12700776
37882 -12700776 -7521014 22326 5497502 4917143 -2497231 -11391619 -13578814 -6527357
37874 -6527357 4394072 13204806 18213230 18344376 11487107 501048 -5805643 -3439882
37866 -3439882 764253 -92205 -2526240 -525227 2786288 1474814 -554529 4559341
37858 4559341 13350342 15028005 9717562 8496969 13807590 14481674 4825289 -5202484
37850 -5202484 -6219779 -3850999 -7606365 -14892606 -16578409 -11791536 -6998712 -4968729
37842 -4968729 -3879553 -3860622 -5790308 -6153986 -1076717 6144911 8418915 4569284 46003
37833 46003 -671191 2184350 5369396 4291935 -3415973 -12034662 -10697438 2508172
37825 2508172 15421714 17634657 14740386 17599079 24043570 23920782 18151791 17892489
37817 17892489 25111160 28806868 23107137 15209756 10838516 5336921 -3841052 -8418078
37809 -8418078 -2813086 3886944 863061 -7258355 -8423173 -2800699 -1192325 -6578937
37801 -6578937 -10792648 -9793256 -9223981 -11859474 -11691657 -6111017 -3310007 -9350673 -16072440
37792 -16072440 -11957378 128957 6879165 3824846 -578952 -813395 -2978542 -12772623
37784 -12772623 -23374564 -22743649 -8755816 9106169 20351847 20644854 11446057 -1212441
37776 -1212441 -8798873 -6902192 -50941 3875611 3193696 2518434 4883986 8543230
37768 8543230 10561411 8891228 2318260 -6425491 -9496656 -2653932 6332331 5947150
37760 5947150 -3010785 -8577563 -5113852 480181 1824325 1290461 1367857 -913247 -5075019
37751 -5075019 -3744966 4243077 8058916 1792422 -3212182 4847434 18122945 20730839
37743 20730839 14076873 13468667 21787656 24211396 11747880 -5124199 -11651301 -6070646
37735 -6070646 3628205 10592537 11726833 7781312 5485581 12135355 24145621 28745874
37727 28745874 21243324 12562558 14157982 22570427 25506535 18146455 7285613 2618444
37719 2618444 8219438 19350724 24772479 16587262 676032 -7602276 -1065624 11482482
37711 11482482 18243180 18369354 17777734 17658093 14854157 9878910 6756456 6058812 4104944
37702 4104944 -1157791 -7669444 -12212458 -12887696 -9620269 -4423347 197292 4185836
37694 4185836 8561964 10605608 5637171 -4081360 -8346409 -1577730 8821129 12436959
37686 12436959 9685228 8644910 11282765 11195258 4757617 -3020541 -5637420 -2759479
37678 -2759479 1374123 3258809 1849861 -1774673 -4152829 -1107324 7591408 15892234
37670 15892234 16251842 7870363 -952831 -625125 9233630 18960647 19442238 11309103
37662 11309103 2165057 -2074385 -156551 6423094 13314238 14222232 7956539 2230435
37654 2230435 3783291 7470674 3884055 -4441160 -5907521 884006 3771799 -3673049
37646 -3673049 -12515762 -14321021 -14303479 -19783727 -26256721 -25845283 -21270382 -19846805 -19985146
37637 -19985146 -15340248 -7556082 -3443866 -3058207 -1349493 1556115 2405415 4063777
37629 4063777 11401495 19857140 19367691 9159374 -1279882 -5090731 -2681137 4193127
37621 4193127 12438031 14183033 5399078 -3854130 -976507 8850245 9266615 -262671
37613 -262671 -2142448 10511183 21478259 16848462 5931221 4231479 9656075 10830287
37605 10830287 8223691 9842952 12803388 7241868 -3832402 -5926555 4028521 11434728
37597 11434728 5617294 -4819281 -5596211 3319267 10305064 9641490 7347082 9869323
37589 9869323 14195936 12655951 4304486 -3183859 -3674093 -459038 -95426 -1093132 4202403
37580 4202403 15717129 21968338 15474784 5200971 5343530 15321227 20646374 13506148
37572 13506148 2650330 -544672 2647795 3552961 1007739 2010677 8258668 10715738
37564 10715738 1685135 -12755424 -18228562 -8749298 7029312 16750779 17043873 13395965
37556 13395965 11496231 12568450 15119918 17099392 16660173 13778966 10909796 9950964
37548 9950964 9697809 8579391 7899462 9021151 9550073 6897832 3863205 5082097 8978414
37539 8978414 9661341 6737436 6131134 9849928 12143217 8549056 2137252 -2667484
37531 -2667484 -6173992 -9276055 -9375398 -5545902 -2335141 -2746284 -2362625 3205837 9555864
37522 9555864 9704179 5768263 5983898 11438426 14429062 10890780 6597794 8129547
37514 8129547 13729091 17123661 16541763 15766747 17892992 21271464 21530865 16022201 6253344
37505 6253344 -3186685 -7785877 -5557160 2451355 12645915 20206303 21825218 17684869
37497 17684869 9888563 149575 -8720921 -11233702 -4425066 5617010 8688993 3425069
37489 3425069 -1062096 990484 3637956 -637654 -8953193 -12616808 -8772675 -782371
37481 -782371 8667641 17461131 20622901 15155918 6382133 2043253 1812858 -102446
37473 -102446 -4130474 -5551084 -4115138 -4082893 -4616908 282256 10656707 18454974 19011348
37464 19011348 16086906 12467090 4628387 -8084613 -16920523 -13396755 -654848 10841612
37456 10841612 15313568 14547099 12510348 12063897 14158663 15888792 11699830 179044
37448 179044 -12604827 -19322883 -18297938 -12217080 -4031734 2963787 5261114 3100721
37440 3100721 913695 1043090 1369821 1730502 6211859 14265234 16470700 6794957 -6180287
37431 -6180287 -9202082 -1916996 5114577 7636778 11791718 20128843 24376225 16863709
37423 16863709 1898106 -9327055 -10735590 -4810108 1842618 3138695 -2769684 -11385072
37415 -11385072 -15798327 -14140082 -10237065 -6660199 -2188254 2415291 2376151 -3398364
37407 -3398364 -7720775 -3514932 6423124 13073622 12126284 6356881 -677504 -7512849
37399 -7512849 -12099926 -12106227 -9014972 -7487364 -9044644 -9787464 -6026909 619059 5463179
37390 5463179 5930970 3080932 -16180 65547 5031276 12361936 16191981 12850965 4955598
37381 4955598 -1761091 -5088110 -7692555 -11890378 -15560075 -14699478 -8576338 -441948
37373 -441948 6248811 10213985 10923612 7584669 1506248 -2305940 826754 9283518
37365 9283518 15720994 14868602 9110111 4958223 5278208 6705314 4254704 -2948727
37357 -2948727 -10629802 -13499951 -10607425 -6442493 -5797759 -8016865 -8572145 -6249440
37349 -6249440 -4873664 -6070728 -4776055 3531078 14195865 18065295 13664211 8224447
37341 8224447 6287460 4332091 -972739 -6060449 -6395696 -3560066 -1167137 1483078
37333 1483078 5421302 6029160 -658812 -7881002 -3883276 11255021 23135400 20505948
37325 20505948 8089157 -2049423 -5295187 -4738838 -1861741 4748734 12430863 13715263
37317 13715263 5188858 -6846645 -12573697 -9174213 -2962823 -1003132 -2533861 -1026796
37309 -1026796 5408395 9765293 5607682 -2576555 -4646344 821189 5130684 3572206
37301 3572206 2301900 6849350 11722406 8630848 -562936 -7080913 -7346059 -3724765
37293 -3724765 3025849 12063955 15340376 4074457 -15905628 -26372779 -18848997 -5431887
37285 -5431887 -1656759 -6686567 -8578146 -3273383 1741695 924670 -1626402 125326
37277 125326 5430795 9222927 9369827 7630466 5122192 811697 -4610356 -6336959
37269 -6336959 -218259 10488753 16953787 14965479 9652427 7192067 6053784 1790620
37261 1790620 -3314615 -3777572 -2502087 -8137439 -18536775 -18145397 833871 23332939
37253 23332939 27955326 14293778 2764461 7805053 21613423 27584091 21637897 14003654
37245 14003654 13767519 18431933 19597263 14712756 9602514 9731478 12704752 12395756
37237 12395756 8476942 7099466 11949033 19602146 25310200 28324317 28652871 23628844
37229 23628844 12448639 685673 -4775922 -3400022 257925 3065031 4575162 4374570
37221 4374570 2776125 2237866 3879970 4785479 2987150 2148563 5786555 9526121 5931642
37212 5931642 -4065100 -11204452 -9224069 -348704 10072663 18247481 21423398 19313108
37204 19313108 16864577 19512085 24648837 23810185 14633735 4753676 2099189 6710536
37196 6710536 13616813 18303793 17927722 12956030 9259708 12630491 19642168 20555791
37188 20555791 13180980 6274613 6245407 8913434 9314525 11072969 18324926 24981343
37180 24981343 21438025 8524153 -3752820 -9381815 -10651439 -10766832 -9872678 -8511325
37172 -8511325 -8354858 -8490397 -6159936 -1832761 1235458 2989971 7189973 14797771
37164 14797771 21127932 21536018 16879195 11780920 9951755 12203032 16335109 17609808
37156 17609808 11942905 839842 -8353617 -9490895 -4609570 -1878134 -6004073 -12514623
37148 -12514623 -13450510 -7582116 -1631939 -1011236 -3627250 -5091750 -5297813 -5404445 -2938750
37139 -2938750 3207564 6422191 -21804 -10584655 -12696252 -4431192 3898616 7117037
37131 7117037 11470639 19421481 21876745 13864720 5620643 6948469 11076009 7215677
37123 7215677 161633 1662225 8668891 8130240 1145043 3701767 20789786 36420031
37115 36420031 35465865 22399332 11563617 9392337 12950805 17173648 17076405 10270964
37107 10270964 2687819 4375749 14813911 20830939 14963676 7032133 9566247 19552395
37099 19552395 24392435 20305215 14102267 9772756 4219514 -3515556 -8170123 -6140069
37091 -6140069 -1166828 1041719 127845 320148 4345912 10148962 13267240 11674145
37083 11674145 7866105 5856360 6991953 10013451 13845677 17642410 19182920 16831121
37075 16831121 12486545 8836665 4759675 -1721081 -7173277 -6081839 -388315 1801809
37067 1801809 -1650630 -3794109 154617 6326440 10057594 12019117 12443937 7905547
37059 7905547 -466595 -3992029 1168464 6440883 4039006 261480 5078847 14302171
37051 14302171 14738107 4723405 -3090204 -463216 5705629 4679008 -4031589 -11938007
37043 -11938007 -12085636 -5291868 1260984 463740 -7560370 -15066915 -15218089 -8922737
37035 -8922737 -1199132 5069470 8045799 4934789 -2736033 -6486437 -1208902 5629078
37027 5629078 3760290 -3907245 -5029169 3827426 13023953 14485262 10329873 5032748
37019 5032748 -1140260 -7083566 -7593638 -274786 9685011 15350992 14486148 8585282
37011 8585282 788416 -3755115 -1311659 4737121 7140827 5027192 4633310 8385358
37003 8385358 10570304 6751826 549858 -2736337 -3211206 -3246458 -2845297 -2126814 -3471877
36994 -3471877 -7306504 -10034247 -9340566 -7230490 -5187197 -1272087 5010042 9835279
36986 9835279 10099367 7012983 2641872 -2116806 -4579236 -1571158 4315512 6574484
36978 6574484 4910670 5571266 9219367 8391824 1456331 -1812605 4113005 9633208
36970 9633208 4587431 -5006183 -6198165 1632818 8958792 12492548 16404152 19922605
36962 19922605 16740006 6688201 -3152075 -9514214 -15153506 -19719036 -18576550 -11983858
36954 -11983858 -5924861 -2167539 3392780 10718518 13458940 9768516 6378040 7951361
36946 7951361 10393344 9190326 7141445 8702749 12642776 15353124 16481907 16757430
36938 16757430 14818781 10476677 6802383 5069144 2276315 -2038195 -1595586 8128097
36930 8128097 20836761 25316537 18691476 8185601 895923 -2335135 -2763079 457244
36922 457244 7315711 13345145 13117766 6961154 1009065 -699024 -1496621 -6139689 -11040560
36913 -11040560 -6369171 9809744 25170829 26310167 14812041 3962295 1829077
36906 1829077 4806931 6918932 7274418 6854134 5349867 4154181 6544450 11899942
36898 11899942 14942374 13350909 10751625 9436295 6192799 -610897 -5559426 -3239208
36890 -3239208 3357449 6867822 5052236 1413690 -1253964 -3332946 -5756773 -8093182
36882 -8093182 -8003742 -1743120 10892722 21072077 17230173 958854 -10435058 -3993989
36874 -3993989 12090562 19988299 15685720 10666537 12746124 16922555 16521813 12869955
36866 12869955 9925484 7351794 3584360 -249498 -3586984 -8066788 -11831927 -7922817
36858 -7922817 6168997 21927906 29056345 27976695 26309445 25244384 18038093 3209802
36850 3209802 -9087840 -8995697 -204148 5198582 2999664 814538 4721004 9066175
36842 9066175 4914048 -5446625 -9984587 -2959344 7580900 11357563 9278742 10093902
36834 10093902 17087150 24466340 26264027 22899637 17770374 12404613 7621908 5830682
36826 5830682 8599767 13414551 15452559 11929035 3475480 -6886203 -14062595 -12535115
36818 -12535115 -1989112 8887448 8939172 -2887831 -14978299 -16263335 -9113526 -4421592
36810 -4421592 -6003656 -7002588 -2574604 2078582 1111426 -1581391 626249 4314765
36802 4314765 532410 -9143434 -12241697 -3670422 5897985 5427526 -1117025 -2327558
36794 -2327558 3845579 9476243 9354994 5886179 2796429 1467733 3126776 7938613
36786 7938613 11650178 9256306 2788440 -53483 3923264 9639473 11301420 8798366
36778 8798366 4927788 900291 -2931363 -5382327 -5886814 -5192537 -3202720 1163400
36770 1163400 6724218 9693482 8334515 5382599 4105011 4357507 4410059 4369425 5288925
36761 5288925 6324588 5552082 3511946 3577588 7423708 11235734 9027197 952977 -4281327
36752 -4281327 867779 11649007 14989612 5894061 -5770154 -8073055 -1323170 5124492
36744 5124492 5730500 2448077 -1006456 -1937566 2126612 10637179 17807375 18712537 15716836
36735 15716836 13564918 11449086 6790047 3033633 4573462 6882978 2555160 -4467030
36727 -4467030 -3223182 5139634 6219493 -5760164 -17754918 -16277654 -5482184 819243
36719 819243 -2992444 -11734689 -17725846 -15331947 -3946334 7792958 7831211 -3635464
36711 -3635464 -11914733 -6866504 4499581 10939942 12572994 14919206 17173023 17252746
36703 17252746 19942535 27929064 32229544 24485358 12069689 7091056 6696103 109636
36695 109636 -9826388 -10399532 -2323700 -147389 -7850286 -12651702 -7568396 -2467837
36687 -2467837 -5577336 -10142429 -8885335 -7694590 -13774302 -21547368 -22104116 -17547406
36679 -17547406 -14176277 -9226754 2846078 16353668 19849406 13356076 8300462 10473413
36671 10473413 13387033 9932184 1884916 -4855151 -7768071 -7268841 -3725545 1408695
36663 1408695 4219145 1464062 -5368639 -10976651 -11643765 -8898090 -6702874 -5439973
36655 -5439973 -1565254 5271484 8759154 4160016 -2898358 -2537294 5340767 10434962
36647 10434962 6416781 -1080628 -3080089 2212450 10043929 14952318 13788678 8000381
36639 8000381 4458981 8660970 16392012 18574987 14327043 10372521 7091319 -2692435
36631 -2692435 -17318884 -22261733 -10734563 3532917 5077325 -1517610 -1410242 6634973
36623 6634973 10951106 7443601 4385812 7021618 10359801 9269590 5462775 2033327
36615 2033327 -806242 -2689000 -2586557 -2213515 -3749529 -4397359 165710 7378048 9763995
36606 9763995 5042473 -2218841 -7960708 -10573900 -7150930 3491250 14349473 15550031
36598 15550031 6940381 -2093210 -5134074 -3146249 2380754 10679304 16193531 12872479
36590 12872479 5294505 4201407 8955682 7155366 -4172422 -10632101 -1450392 13590519
36582 13590519 18449747 12658932 7559846 7792952 8501039 6638118 3629711 -907303
36574 -907303 -7734811 -11671732 -6723208 2512586 4109448 -4889723 -13808989 -12884349
36566 -12884349 -5495271 -1773247 -5072962 -9724612 -9822953 -5734264 -1761152 -251866
36558 -251866 158561 1025199 1129115 -1119022 -3756744 -3077369 786219 3826337 4203208
36549 4203208 3945663 3365768 -882850 -9016696 -14447512 -11870779 -5499928 -3590288
36541 -3590288 -6810996 -7947204 -2865296 3561016 4037809 -1854767 -6974475 -4605201
36533 -4605201 3370825 7053760 -810134 -15068231 -22754464 -18496847 -10806504 -10281441
36525 -10281441 -16189308 -19438369 -15377850 -7740602 -1458504 2482902 4741697 5090849
36517 5090849 3763041 2392455 2260553 2999890 3241255 1578672 -2268530 -5985650 -5610547
36508 -5610547 368767 8708521 14184965 13544021 6782410 -2565896 -7931252 -4669521
36500 -4669521 3645359 8038540 5491407 2827701 6312027 12757093 15537816 14327207
36492 14327207 12973083 12120424 10754138 11413828 16266602 20730370 19208313 15410658
36484 15410658 18164106 27273936 32431869 27465837 17674700 11031366 9376748 10470524
36476 10470524 11575420 8413624 -2152392 -14899647 -18715506 -10803530 -2139833 -3502757
36468 -3502757 -11664280 -15634875 -11982387 -6580393 -3680442 -925431 4395738 9971751
36460 9971751 11348550 7297267 1066554 -2446557 -874704 3321048 5544707 4594782
36452 4594782 3660695 5201362 7809884 9553623 10718698 10733802 6562448 -1493339 -5934041
36443 -5934041 -96942 11596641 17991976 15812050 13118073 16262412 20190314 16528782
36435 16528782 6416353 -1410456 -3094361 -2853170 -3371072 -823689 6556088 11432463
36427 11432463 6117612 -4881893 -9509322 -4983580 -984377 -3538862 -5136160 2405859
36419 2405859 12609393 11875341 -911078 -12639734 -13728319 -8185947 -4244656 -3788640
36411 -3788640 -4727837 -6310846 -7102448 -3414597 5271373 13883266 18864098 22576026
36403 22576026 26268349 25035875 16525920 8795244 10133036 14771154 9921630 -3395424
36395 -3395424 -8386238 4814334 24258546 30812073 21248764 9012196 5473516 8612722
36387 8612722 10327372 8005682 5527527 6057973 7575616 5797471 88802 -4662629
36379 -4662629 -2733861 5939947 14862493 17061333 11559194 3578965 -917683 -508664
36371 -508664 1236869 228292 -3114725 -4095758 38018 5501881 6195403 1862999 -1705728
36362 -1705728 -1276539 -445145 -2617425 -4137728 157516 6790075 5993589 -4626672
36354 -4626672 -14808412 -13529801 -2200287 8318185 11298800 9709018 8909963 9215484
36346 9215484 7841324 4708438 2794506 3535741 4600490 2970285 -1022936 -3862594
36338 -3862594 -3115639 -702608 -726906 -3890423 -5720308 -1904169 5531476 9518820 5632387
36329 5632387 -2970021 -8373501 -4542691 7991926 21543495 25594219 15374738 -2009734
36321 -2009734 -12470496 -8192384 5303393 16385191 18957764 14920531 8472499 2571894
36313 2571894 -344397 689505 2828112 2300066 823146 4702944 14964694 22593466
36305 22593466 18432054 5834333 -2097362 1726257 10608960 14357988 12521788 12288527
36297 12288527 15850694 17151340 12713152 8936111 13295081 22153182 24292869 15921932
36289 15921932 5435523 1630444 3211303 3456490 313587 -3280969 -5964492 -8813980
36281 -8813980 -10551422 -7567094 177545 7472303 9767814 7731871 4353116 384993
36273 384993 -4906315 -10272767 -12680452 -10997581 -7628833 -5707575 -5471415 -4424223
36265 -4424223 -1143276 2238100 2532321 -170607 -2571177 -2516749 -849555 1731050 6525465
36256 6525465 13385526 18100361 16634506 10633616 5390920 3153586 1893831 419352
36248 419352 897044 5287294 12106448 17914730 19829993 15772351 4973442 -9675262
36240 -9675262 -21365912 -23919349 -16954608 -5971937 2490288 5630024 5180316 4454658
36232 4454658 4999664 6076783 6605248 6289263 4822574 1795492 -1683866 -2928576 -742538
36223 -742538 2591609 3950980 3224349 3183472 6036791 10889702 13883398 10751282 1102736
36214 1102736 -9297292 -12913630 -8241755 -1034801 2892198 2815790 185632 -4509558
36206 -4509558 -8932113 -7717520 993855 11009350 14969688 13221223 11099680 10296779
36198 10296779 8728040 6759553 7032822 9004450 9728491 9514151 10955222 12899801
36190 12899801 11569757 7479710 4815070 3734112 149780 -5796035 -8133379 -4365759
36182 -4365759 -158967 -1447820 -6566084 -9264412 -6031912 1511585 8168243 8234433
36174 8234433 950484 -6682967 -6948304 -1245338 2331136 848380 -810301 438325
36166 438325 1534209 600571 726402 3067220 3360931 -710770 -5112483 -6172639 -5360588
36157 -5360588 -3905442 91003 4928518 3630040 -5138779 -11911819 -9201268 -2696860
36149 -2696860 -1731421 -4554369 -2394477 5924744 12962653 14071427 11242244 6780111
36141 6780111 915423 -4750075 -8110818 -10557645 -14459640 -17549484 -15387289 -8511219
36133 -8511219 -1893037 1571895 1971570 -1427358 -8895455 -16029599 -16606483 -9754738
36125 -9754738 -241511 7281449 10575918 9005970 5413914 6004494 12440565 16791484
36117 16791484 11353233 1217527 -1315367 5823384 11542401 7592977 -761495 -3632608
36109 -3632608 323546 4406674 3889080 941095 365159 3216194 5833969 5357405 4621690
36100 4621690 8270699 14327373 15370617 10184697 7398632 12763584 19506782 18494863
36092 18494863 12437271 11241524 17114955 23370093 25199535 22528451 14789837 2848253
36084 2848253 -5649881 -3454648 4360814 6068272 413085 -3169459 -1480048 -1633410
36076 -1633410 -5801300 -5643784 2261983 7908689 3041880 -5338528 -6222140 -1305118
36068 -1305118 86684 -2712196 -1621063 6100629 13731627 15841007 15412180 17691082
36060 17691082 22123145 24039955 22038553 19644007 18681393 14531670 2805627 -10239714
36052 -10239714 -11717409 191558 10869691 8565185 1107535 2909108 12335142 16481691
36044 16481691 14257078 17107571 26506211 29134966 19135616 8035531 5332968 5294461
36036 5294461 2251378 3383152 14044824 23868443 21575624 12765945 8644840 6812176
36028 6812176 -1302975 -12076252 -15204196 -11550967 -9199524 -6690029 2795519 14147214
36020 14147214 15337607 8543692 8075231 16117411 18627844 9095408 -904320 -1035388
36012 -1035388 3537723 4998061 5939601 10184788 12535771 8319837 3867929 6942814
36004 6942814 13950665 16486400 14441480 13215277 13452226 13093950 14810522 21224653
35996 21224653 26045759 20325194 6303176 -4224711 -4962916 -66001 5691222 12313097
35988 12313097 18156595 17090100 7238132 -3122580 -3979045 4990554 15559636 20929263
35980 20929263 20039413 13772711 2992148 -8040406 -11524459 -4318536 5558107 6137047
35972 6137047 -3943785 -13257973 -12543792 -6463633 -5072806 -8007768 -5820515 4017538
35964 4017538 12353629 12424007 9703543 11910274 16388656 15550336 10335617 8964795 13649556
35955 13649556 17404880 15283024 11350837 11764012 16534983 21200258 22201863 17890701
35947 17890701 8650621 -695118 -2980697 2441066 6665347 2431018 -4653270 -3079793
35939 -3079793 7381192 13674339 6977447 -5227762 -10037470 -6834571 -6420309 -14130684
35931 -14130684 -21973168 -19913143 -8927257 1605668 5959108 6296964 6140389 5121822
35923 5121822 1929193 -1564575 -2763335 -3275229 -7062127 -12894909 -12934789 -2658757
35915 -2658757 10100758 11989106 1261247 -7706284 -1512075 14711857 23545620 17608379
35907 17608379 7645000 6394953 12173374 14156440 8698483 2504777 1228872 2755920
35899 2755920 3130435 2499134 1823312 -1179747 -7929588 -13862080 -12893594 -6122500 -1014196
35890 -1014196 -1421605 -3102641 -853852 4191445 7369935 7145817 5057169 1544973
35882 1544973 -3414666 -6852082 -5246077 -561350 1079442 -2325280 -6283619 -6840916
35874 -6840916 -5117550 -3200215 -866797 959507 -963434 -6107723 -8193735 -4014222
35866 -4014222 777873 299442 -1992896 725571 7064256 9651136 6301425 1127256
35858 1127256 -3347171 -7014738 -6908580 -60491 8907856 11779970 8268132 5126681
35850 5126681 4456953 2734298 1372264 6695528 17286489 22948683 20000125 16395753
35842 16395753 16953409 15064493 5874636 -3054949 -2953700 2813023 5313821 2941761
35834 2941761 -207094 -2098412 -1308738 5264079 15436665 19451438 12796379 4460357
35826 4460357 4182452 8820818 10320315 9308173 10205833 10258472 5397874 842808 3535098
35817 3535098 9458981 10873223 10556319 15435513 21476533 19908274 14054785 13773455
35809 13773455 16598394 12257437 4194415 6919991 20412151 27088802 19146766 9975359
35801 9975359 10735914 13105182 5785690 -6458450 -12219604 -10816885 -8888447 -8200567
35793 -8200567 -6877836 -5702936 -4859104 -1095824 5216087 7881708 5703988 6216544
35785 6216544 11805789 12669507 2715586 -7641853 -5780787 4374728 9906827 8355537
35777 8355537 6865000 6984109 3865380 -1349282 -706468 8409024 19559557 26129434
35769 26129434 26567966 21387879 12134075 3152389 -1530986 -2490422 -1655856 2327432
35761 2327432 9900047 15238422 12432083 5089900 2747984 8590526 16621511 20034405
35753 20034405 17218916 10843701 5768413 6200706 10679024 12198551 7129157 420191
35745 420191 -2293476 -2936244 -5549418 -7337308 -2485899 7996808 16793341 18294927
35737 18294927 11344196 -1730256 -13503955 -14652776 -5815131 -415014 -7361229 -16958157
35729 -16958157 -14212308 -886724 7758515 5031552 -886476 -1543370 2700453 8338291
35721 8338291 12794114 12272882 5053645 -3013795 -5127793 -4152400 -6723524 -9236906
35713 -9236906 -2260745 12122532 21300445 21198351 19978066 20688232 15934451 4798572
35705 4798572 -591663 6174735 13847679 10589743 2118942 1581826 9526123 15347676
35697 15347676 13333036 7048807 1030322 -3562241 -6915646 -9777524 -12554986 -12523078
35689 -12523078 -6670928 652998 486517 -6981249 -10386118 -4054884 2738437 403536
35681 403536 -6693886 -9563738 -9316161 -11802285 -14832334 -12418853 -6305752 -1940361
35673 -1940361 2035839 8721092 12520034 6967912 -941445 1067036 9898300 10285151
35665 10285151 -495956 -7105742 272967 11438300 12614203 5444121 549729 1195133
35657 1195133 3102159 4450401 6645877 8496648 7490665 4953160 3760003 2649150
35649 2649150 -1686076 -8186660 -12168625 -11722231 -9021245 -5812355 -1833004 2088488
35641 2088488 3264000 928452 -1690000 -1002132 2126635 2880325 -1697876 -8381283
35633 -8381283 -10747320 -6538161 -131428 3128211 2697032 1237147 -1348 -1096234
35625 -1096234 -925778 1342338 3558543 3319635 2203520 3100513 4559849 2645888 -2507444
35616 -2507444 -7301603 -10878943 -14451978 -15204724 -8965828 49706 1173539 -7826921
35608 -7826921 -16498339 -16943856 -14331028 -15407524 -15475077 -7040617 5052161 9403777
35600 9403777 5644697 3625301 6091086 5463083 -264661 -1942849 4820427 10062454
35592 10062454 4435090 -5297306 -5965749 3036675 11242358 13444584 13207283 11943104
35584 11943104 6451233 -1391811 -3609099 1490154 5472375 3341126 2043960 8366553
35576 8366553 15929011 13766340 3258453 -3823611 -2408655 881183 295424 -1480808
35568 -1480808 -1476341 -3152535 -9049143 -13206363 -8383433 2547223 9695998 9496848 8252555
35559 8252555 11619372 16548991 16756814 12399103 10005108 13474401 18517694 17367046
35551 17367046 7479125 -6051123 -15898325 -17948839 -11519906 1511044 14609242 17501984
35543 17501984 6049167 -9130700 -11408658 1684636 13733537 9790535 -4348347
35536 -4348347 -10416518 -1345974 12266604 18299482 16069864 10821652 4160959 -4054484
35528 -4054484 -9988573 -9352287 -4692343 -3039003 -6472000 -9845286 -8358767 -3086052
35520 -3086052 2401312 7159200 11945233 15372336 14258924 7886085 -25751 -4342999
35512 -4342999 -2978011 1763987 5741164 6707227 5782717 5377271 5905820 5234159 1568445
35503 1568445 -4153264 -9579861 -13484265 -15349455 -13564126 -7113799 718627 3971378
35495 3971378 1221213 -1862573 92842 4950475 6923440 5437055 5301819 8847392
35487 8847392 12873590 13802673 11409663 6826699 1228545 -2754270 -2821603 -951647 -752807
35478 -752807 -612055 3949521 10018749 8162339 -2371247 -8438220 -482493 12250581
35470 12250581 13814938 3855466 -3203452 1040323 9932295 13566432 9654107 1180066
35462 1180066 -7833059 -11819077 -6660471 3976847 11295380 11693482 8335953 2852597
35454 2852597 -5573712 -12010321 -7727395 5527075 13540317 8110401 -1394047 -1854251
35446 -1854251 6525150 14799418 18973148 19530708 13965098 1207355 -10095808 -8829197
35438 -8829197 4018841 16610644 20619927 16501429 7169086 -3891254 -9607687 -4819165
35430 -4819165 4568731 7192563 2029009 -294500 6732431 17433045 23633963 23564353
35422 23564353 18578555 10096617 3418933 5690849 15174884 20398143 15086901 6422710
35414 6422710 3095661 3174988 812091 -2509427 -2178995 -172637 -1122882 -2647651 862607
35405 862607 7214518 8460495 2979998 -2954396 -5230495 -5350610 -3894259 835342
35397 835342 6106923 4886046 -4030437 -12295892 -11963039 -4378712 3684344 8231351
35389 8231351 9468498 9121628 9521119 12400963 16191788 17036387 13772511 8647658 2266404
35380 2266404 -7411270 -18879797 -24810918 -19827442 -7565024 3079031 6216974 1661999
35372 1661999 -6716633 -12695438 -12004241 -8370382 -11123349 -22885678 -34037302 -34220627
35364 -34220627 -24970073 -15165452 -8570015 -3634600 -1843889 -6026379 -11294512 -8465831
35356 -8465831 1563306 6959255 2391963 -2028776 4611995 18221263 26252008 24367704
35348 24367704 17998772 11061654 2598455 -6149747 -10094182 -7599023 -3170218 -640408
35340 -640408 1488748 5611445 9875116 10262486 5691760 -871815 -5318114 -5836356 -4389061
35331 -4389061 -4210873 -4916380 -2324794 4613901 10019305 8685492 4534535 4930847 8230108
35322 8230108 5288965 -5897696 -15893618 -17513074 -15850218 -19221222 -26319471 -28788834
35314 -28788834 -22402024 -9893788 3711671 13115730 13812650 7129860 1032750 214410
35306 214410 -614105 -6744618 -11657432 -5359639 8052074 13419015 6345074 17149
35298 17149 5650530 16492120 18470462 9139302 -2182827 -8184991 -9327120 -8453982
35290 -8453982 -6849238 -5068723 -3006242 -97159 1567298 -2517903 -11947251 -18388045
35282 -18388045 -15584888 -8617100 -6027655 -6095079 -538749 9239336 11117585 561184
35274 561184 -10605321 -10296502 -2807833 -577950 -4914772 -5669894 1412050 7775504
35266 7775504 5045739 -3515588 -9238241 -9609236 -7889082 -5472160 -1464998 1950444
35258 1950444 726533 -3891330 -5496409 -1897242 855045 -2848354 -9763291 -12692657
35250 -12692657 -10959830 -10468077 -14106434 -17533967 -15753180 -9732557 -4307541 -2212602
35242 -2212602 -2539967 -3604097 -5187359 -8169176 -12908983 -18107266 -21462048 -21759887
35234 -21759887 -19605370 -15730278 -10368504 -5442815 -4690199 -8900583 -13422673 -13928119
35226 -13928119 -12266750 -12169771 -11837472 -7132807 -273239 2577513 1794821 3172892 5614707
35217 5614707 1132133 -9167362 -11429758 514644 12200358 8027478 -4647109 -5941306
35209 -5941306 6445172 14436464 7691199 -1937586 -138564 8985250 11456375 4298383
35201 4298383 -2619243 -1598593 5064811 11175243 13645926 12788635 10027072 6650799
35193 6650799 3343255 887574 1165023 5265362 10382198 11897000 9543986 7916706
35185 7916706 9548707 11589057 11268942 10192839 10296633 9871449 7416207 5623394 7003696
35176 7003696 8649657 6499401 2754917 3491669 9272532 13117881 8965057 -1100912
35168 -1100912 -9455716 -11073977 -8066683 -6500552 -8958874 -11276604 -8280471 -1425163
35160 -1425163 3055753 3156661 2940526 4454120 4304120 1285384 594964 5156421 8820328
35151 8820328 5251711 -1280859 -2267677 1499108 2150014 -1379917 -1894692 3211473 7597772
35142 7597772 6964899 5419384 6810819 7390081 2480970 -4945645 -7493500 -1655016
35134 -1655016 10204855 22102794 26380750 19005619 6422707 1502333 8402962 16891783
35126 16891783 16240192 8643700 2915579 1227344 406714 1364879 7003049 13107709
35118 13107709 11775018 3876404 -1440007 -747640 -674184 -6087183 -12870448 -16156508
35110 -16156508 -17660992 -19821344 -19502279 -13611867 -6053122 -3088634 -5000751 -7077565
35102 -7077565 -5859159 -511379 8371393 17261359 20855491 18949598 17816213 20018995
35094 20018995 18210279 6070078 -9044428 -13297847 -4239613 7189471 11815802 10917850
35086 10917850 9378735 8617587 8487709 9284979 9431852 6746769 3465048 4248446 8264803
35077 8264803 9725677 7286115 5524969 5534286 2348243 -5483524 -12307197 -15058804 -17711326
35068 -17711326 -21387021 -19703314 -10845279 -4839345 -9458816 -16670433 -13784362 -2017386
35060 -2017386 7306908 10147710 11292107 12053618 9193239 4525742 3095415 2293929
35052 2293929 -4592894 -13684512 -13044392 -2569630 2369273 -7232499 -20429708 -21823772
35044 -21823772 -11066702 521948 4757309 868161 -7706615 -13724366 -10056832 33889
35036 33889 3479215 -4692331 -11895266 -5658096 6550092 7253204 -5582700 -16280984
35028 -16280984 -14065635 -5467182 -1524767 -3215864 -4928212 -4980854 -6060039 -8634311
35020 -8634311 -9546010 -6648217 -1520605 3038862 6557652 10330138 13145336 10188279
35012 10188279 -327128 -10833942 -10687751 -124231 8340081 5720166 -2519578 -6357831
35004 -6357831 -5728863 -7386959 -11532500 -11062271 -3496310 4615817 6526106 2496846
34996 2496846 -2972994 -6069653 -4840692 119548 5278326 7911801 9910678 13998662
34988 13998662 17297201 14034582 4658249 -3267576 -4313225 -626125 2901943 4269316
34980 4269316 3721124 1854898 491857 2078143 6221576 9444618 9948586 10252783 13517824
34971 13517824 18907788 21885526 18467882 9218792 -321458 -4235370 -2387002 -533604
34963 -533604 -3184032 -8652687 -12608383 -13211382 -10549495 -5154178 -498633 -2391895
34955 -2391895 -10920386 -17063216 -13184808 -3411678 2587139 2500601 961825 -146571
34947 -146571 -2313976 -3647150 -753141 3571234 3432994 32533 -133811 3421152 5297517
34938 5297517 5085639 7056279 8506001 1149916 -12800297 -19043243 -11633569 -3018079
34930 -3018079 -5435284 -12773266 -11421360 -1420781 5058882 2401064 -2531772 -2787358
34922 -2787358 -733677 -2667070 -8828161 -11916413 -5724338 5307456 8590247 -810263
34914 -810263 -11115830 -8757148 949540 730257 -10973145 -15196884 -1134755 16048669
34906 16048669 17123484 5817820 -163181 3806167 6628054 1118546 -8095681 -14395293
34898 -14395293 -14944883 -8251243 3355334 10578980 6704950 -1679406 -3342510 1196367
34890 1196367 2920486 717661 1434685 5351058 6150389 5763954 13813619 28863841
34882 28863841 35205617 24788885 9504890 3698554 5621137 5567415 2987945 4209756
34874 4209756 8904492 10208882 6665835 5068172 10559487 19444435 23312259 18183136
34866 18183136 9149049 5431582 9145121 11257770 3553311 -7962629 -10014036 -1566876
34858 -1566876 4765189 3028404 2818447 11447575 19834325 17173356 9655647 10342350
34850 10342350 16774710 14996105 3983190 -1060900 6702252 13483758 5873527 -7411981
34842 -7411981 -6845949 10520341 27148257 27843167 16274762 6091994 3696854 5472292
34834 5472292 7329404 9516791 12004681 11316065 5220201 -2497788 -5568455 -2492832
34826 -2492832 2589268 5795546 7538666 10372441 14844372 18140300 16229169 8317130
34818 8317130 185477 596770 11230560 22221411 22248064 12046510 2671479 690505
34810 690505 1639488 -290409 -3142847 -2133510 1623630 3021276 673816 -2327639
34802 -2327639 -3423592 -1921264 2782868 9495576 12907609 8204296 -1560453 -7104962
34794 -7104962 -3483813 3997332 6302721 1422202 -3329551 77527 10243620 16250141
34786 16250141 9220268 -6972811 -19423787 -20383961 -13729113 -6662557 -724373 5448437
34778 5448437 9763480 9306923 6584759 6757196 9747321 10865718 8488797 4977790
34770 4977790 189412 -8749516 -19420081 -22932467 -14972442 -2972578 2612561 751244
34762 751244 -1259512 1290096 6100338 9387494 10658559 11227549 11805527 12865650 14800734
34753 14800734 16721803 17212782 16795031 17192442 17554219 14539655 7813807 2380758 2612631
34744 2612631 6269896 7843568 5968001 3408801 1255924 -1291362 -1731899 3987717
34736 3987717 12431480 13136073 3320390 -4899181 -87771 11217923 13674526 6578841
34728 6578841 4517668 13133443 18960979 10694083 -2030674 -2930414 6225310 9184786
34720 9184786 -304298 -11587269 -14651415 -11709332 -8559565 -5739654 -3031835 -3396673
34712 -3396673 -6749595 -7571119 -4424547 -4408037 -11458496 -17319518 -12746430 -2389208
34704 -2389208 1220685 -4513723 -10231751 -9155669 -4115694 174033 2551249 1531881
34696 1531881 -4811184 -11766719 -9412525 3619733 14973066 13523134 3705908 -2206876
34688 -2206876 -1165622 141070 -1046731 455184 7264237 13783464 14276834 9922728
34680 9922728 4340817 -1788453 -7284189 -7552302 -1459146 3131696 -1676829 -11464163
34672 -11464163 -14146127 -6509499 2411470 5655768 6482381 8128587 5451935 -4633250
34664 -4633250 -12252741 -6329782 6751069 10228482 2532878 497869 12444884 23323384
34656 23323384 17051957 1443944 -3677615 4343067 10020004 5001062 -2028568 -1994403
34648 -1994403 2627280 6172817 7451448 4842814 -4047797 -12919638 -9627679 4941595
34640 4941595 13703573 7515881 -796723 2116667 7891571 1383048 -12705638 -17306472
34632 -17306472 -10977157 -8052746 -12794881 -13775299 -5987269 748415 548062 1091191
34624 1091191 7099971 9718811 1602155 -10150302 -15394158 -14319558 -11029126 -4777651
34616 -4777651 3399675 6075935 1302351 -926005 5785584 12286903 8750125 1684647
34608 1684647 3089628 10934452 14296627 11064105 6512658 630353 -8192135 -12358908
34600 -12358908 -4148575 8216045 10108045 3442038 2819727 10126186 11687076 2404708
34592 2404708 -5848710 -4540326 -299736 -443237 -2116999 -2597632 -5807068 -11081647
34584 -11081647 -9422800 807757 7849394 4940583 1288135 4823299 7946590 2914850
34576 2914850 -1688210 4721730 14578352 13750150 5888397 6824523 18385131 25890276
34568 25890276 21466059 13163032 8654315 5145660 404912 967232 12066407 27697050
34560 27697050 36944247 34820651 23278207 7411558 -5597460 -9054924 -2657460 6783030
34552 6783030 12404096 12547026 9137454 5193344 4243037 7485703 10817994 9113417
34544 9113417 3703088 604538 1075730 48594 -4342703 -5766754 2075232 16046992
34536 16046992 26001898 24926872 15111985 5996517 6221852 15230201 22534562 18115899
34528 18115899 3406599 -11085412 -18107353 -19101751 -17878387 -15033860 -10725998 -7881706
34520 -7881706 -9075033 -12795370 -15165248 -13607136 -8105801 -1516799 926885 -4128867
34512 -4128867 -13445918 -19985495 -20900950 -18838515 -15130326 -7713085 1861055 5907436
34504 5907436 511805 -6626302 -5170985 3230472 6851726 753975 -5950133 -3394792
34496 -3394792 4813333 7776411 4647773 6219173 16990532 25070783 17882722 2106034
34488 2106034 -3356477 6738584 17359618 15686603 8052250 6599809 9322355 5447844
34480 5447844 -5232835 -11858879 -9665251 -5275600 -4023703 -3107810 253997 3717545
34472 3717545 5991352 9207107 11769589 7648230 -2977307 -10715076 -9576636 -4925416
34464 -4925416 -3592300 -3739294 -806402 3614108 6015834 7863362 10769129 10517067
34456 10517067 3955745 -3176586 -3773836 -278619 589635 -433723 1509392 4352260
34448 4352260 2822726 546783 5453448 13627363 12113107 631296 -4132208 7173931
34440 7173931 20899109 19400549 5953504 -1890411 2283052 8674442 9493878 8459348
34432 8459348 9590843 8396768 755594 -7166130 -5834207 4318011 13382561 14560667
34424 14560667 10378396 6296121 3821577 2246592 2844781 7181178 12986506 15713596
34416 15713596 14116593 11057628 8516428 5395024 1587435 367018 3586551 7367315
34408 7367315 6806803 3296983 2154605 3379869 682598 -8273956 -16056429 -14319959
34400 -14319959 -5301156 828171 -828968 -4544360 -3110263 1923651 2621273 -4375302
34392 -4375302 -13129553 -15770772 -11943041 -8013458 -7608138 -6990310 -1991630 3936996
34384 3936996 3449702 -3903214 -10230825 -10053925 -7178143 -7492788 -9535038 -7635016 -1803025
34375 -1803025 1926771 836698 -737196 1276773 4331728 3159724 -2747633 -8311399
34367 -8311399 -8307973 -2303333 4586467 5453250 -1783154 -10994928 -13548605 -7930290 -723946
34358 -723946 2618144 3934489 7457755 12999060 17245882 18469118 16432606 10864935
34350 10864935 4085240 1883034 6470802 10895505 6489797 -5325793 -14861527 -17157445
34342 -17157445 -16216244 -15513843 -11988709 -3145496 5917239 8017696 3346993 -1308954
34334 -1308954 -1385955 982817 764223 -4025914 -10181491 -12641104 -10587062 -9005381 -11585881
34325 -11585881 -13732361 -7696316 5637658 16396395 18381397 15247630 11593936 5908429
34317 5908429 -2276294 -5650020 2100130 15113347 21249147 16642024 7183687 -1460466
34309 -1460466 -6994351 -6297807 1705334 9268288 6382628 -4076409 -7962793 -221398
34301 -221398 6399264 -737493 -15938569 -23239594 -16943122 -5036424 4519949 11289866
34293 11289866 16355958 17488392 13319321 7209845 3972325 5405241 10247099 15468783
34285 15468783 16436951 9417961 -3303945 -12956261 -12103157 -2557036 6713137 9384796
34277 9384796 7207125 5218026 4509627 2610978 -307767 -14695 5346930 10783095
34269 10783095 9855513 3149867 -2101248 -631073 5476101 10074153 9144514 3722267
34261 3722267 -955228 419118 7083596 10781424 4448472 -7552749 -12784128 -5920710
34253 -5920710 4387739 6989716 2133107 -825659 3282195 9996198 12460445 9353290
34245 9353290 4769135 3277889 5900327 9059757 7577124 555213 -6423196 -7369024
34237 -7369024 -3348733 -794842 -2887820 -6534426 -8342270 -9067184 -9986220 -9009834 -4327557
34228 -4327557 656535 731696 -3537359 -6100094 -3734783 92776 1160589 436365 1454033
34219 1454033 4800461 8614484 12234825 15131737 13676322 4368395 -8880152 -15504800
34211 -15504800 -9096332 5046021 15248925 14676632 6243593 -1364625 -1504464 4332675
34203 4332675 7710131 3318360 -2545428 1277571 14843556 24977425 22459172 13805490
34195 13805490 9900269 10212345 7596992 3327956 5217747 12382572 14358082 7230998
34187 7230998 -431388 -1233145 1640925 3419414 6379003 12612937 16432043 12588672
34179 12588672 6276183 5981125 10208108 10239253 4075421 -987586 354750 4852610
34171 4852610 6624246 4151352 -23878 -2548169 -1162189 3702128 8873807 12042825
34163 12042825 14345801 17102206 18337402 16179655 13259830 12788240 11972774 5233723
34155 5233723 -6222233 -13755608 -11449172 -2657285 4671625 5808691 2026822 -1052704
34147 -1052704 1912355 9466422 12583008 5234362 -5698448 -8158151 -2432940 -1672289
34139 -1672289 -11626172 -19622462 -11663032 6407000 15544433 8697889 -1750840 -2965554
34131 -2965554 2312758 3830588 -27585 -2266988 351261 3599321 4348673 5407238
34123 5407238 9486489 14085021 15860521 15624427 14836342 11006152 2074853 -7135620
34115 -7135620 -9180252 -3890485 2077835 5207809 7592650 8728383 3375139 -8517283
34107 -8517283 -17480805 -16339235 -10501805 -9489640 -13043019 -13700330 -9477081 -4645641
34099 -4645641 268904 9158235 20328153 25388117 20898462 13212447 8600571 5983186
34091 5983186 3066698 2083395 4236011 5064672 1521073 -1767328 251677 4372561
34083 4372561 4643074 2087116 925138 -1035772 -8378114 -16279920 -13865468 -799852
34075 -799852 9817660 8863283 2258678 -617148 -782938 -3862852 -7206268 -3506511
34067 -3506511 5226948 7995523 444979 -8475803 -8904090 -2710012 635353 -3462887
$$ [...]
##END NTUPLES=NMR SPECTRUM
##END=
