##TITLE=31Pdec_SR109_k
 D2O, 24 sc
 13.4.2022
##JCAMPDX= 6.0         $$ Bruker NMR JCAMP-DX V2.0
##DATA TYPE= NMR SPECTRUM
##DATA CLASS= NTUPLES
##ORIGIN= UXNMR, Bruker Analytische Messtechnik GmbH
##OWNER= root
$$ XWIN-NMR		Version 3.5
$$ Wed Apr 13 14:01:19 2022 Russian Standard Time (UT+4h)  she@DPX200
##.OBSERVE FREQUENCY= 81.013821
##.OBSERVE NUCLEUS= ^31P
##.ACQUISITION MODE= SIMULTANEOUS
##.ACQUISITION SCHEME= undefined
##.AVERAGES= 24
##.DIGITISER RES= 16
##SPECTROMETER/DATA SYSTEM= spect
##.PULSE SEQUENCE= zgpg30
##.SOLVENT NAME= CDCl3
##.SHIFT REFERENCE= (INTERNAL, CDCl3, 0, 248.564)
##AUDIT TRAIL= $$ (NUMBER, WHEN, WHO, WHERE, WHAT)
$$ ##TITLE= Audit trail, XWIN-NMR		Version 3.5
$$ ##JCAMPDX= 5.01
$$ ##ORIGIN= Bruker BioSpin GmbH
$$ ##OWNER= she
$$ F:/spectra/data/she/nmr/P31/1/pdata/1/auditp.txt
$$ ##AUDIT TRAIL=  $$ (NUMBER, WHEN, WHO, WHERE, WHAT)
(   1,<2022-04-13 13:58:56.81 +0400>,<she>,<DPX200>,
      <created by zg, POWCHK disabled, PULCHK disabled
       configuration hash MD5:
       00 E9 B6 7A A2 85 ED C7 34 08 36 98 17 FE 4E 26
       data hash MD5: 32K
       07 15 3E CF 95 11 2C 30 EA E1 61 C6 DA C6 7F 3F>)
(   2,<2022-04-13 13:59:00.89 +0400>,<she>,<DPX200>,
      <Start of raw data processing
       efp BC_mod = 2 LB = 1 FT_mod = 6 PKNL = 1 PHC0 = -9781.156 PHC1 = 644.4757 SI = 64K 
       data hash MD5: 64K
       20 2D CC 9E B0 09 FF C0 95 8C 3C 1C 35 9A AF 9E>)
(   3,<2022-04-13 13:59:21.96 +0400>,<she>,<DPX200>,
      <pk PHC0 = -14.28808 PHC1 = 0 
       data hash MD5: 64K
       AB 72 21 08 D3 4A 39 B1 EF 11 5F CC A0 1E 5E 4F>)
(   4,<2022-04-13 13:59:24.68 +0400>,<she>,<DPX200>,
      <abs ABSG = 5 
       data hash MD5: 64K
       39 42 08 19 D4 1E EB 6E C5 28 00 FC CE 91 CD 36>)
$$ ##END=
$$ 
$$ hash MD5
$$ 75 E4 11 C1 99 72 D4 71 E2 E9 9B 41 48 87 D4 CC
##$RELAX= 
##$RELAX= 
##$RELAX= 
##$RELAX= 
##$RELAX= 
##$RELAX= 
##$RELAX= 
##$RELAX= 
$$ Bruker specific parameters
$$ --------------------------
##$DU= <F:/spectra>
##$EXPNO= 1
##$NAME= <P31>
##$PROCNO= 1
##$TYPE= <nmr>
##$USER= <she>
##$AMP= (0..31)
100 100 100 100 100 100 100 100 100 100 100 100 100 100 100 100 100 100 
100 100 100 100 100 100 100 100 100 100 100 100 100 100 
##$AQSEQ= 0
##$AQ_mod= 1
##$AUNM= <au_zg>
##$AUTOPOS= <>
##$BF1= 81.014009
##$BF2= 200.13
##$BF3= 200.13
##$BF4= 200.13
##$BF5= 200.13
##$BF6= 200.13
##$BF7= 200.13
##$BF8= 200.13
##$BYTORDA= 1
##$CFDGTYP= 0
##$CFRGTYP= 5
##$CHEMSTR= <none>
##$CNST= (0..31)
1 1 145 1 1 1 1 1 1 1 1 1 1 1 1 1 1 1 1 1 1 1 1 1 1 1 1 1 1 1 1 1 
##$CPDPRG= <waltz16>
##$CPDPRG1= <>
##$CPDPRG2= <waltz16>
##$CPDPRG3= <>
##$CPDPRG4= <mlev>
##$CPDPRG5= <mlev>
##$CPDPRG6= <mlev>
##$CPDPRG7= <mlev>
##$CPDPRG8= <mlev>
##$CPDPRGB= <>
##$CPDPRGT= <>
##$D= (0..31)
0 1 0 0 0 0 0 0 0 0 0 0.03 2e-05 3e-06 0 0 0 0 0 0 0 0 0 0 0 0 0 0 0 0 
0 0 
##$DATE= 1649843936
##$DBL= (0..7)
120 120 120 11 120 120 24 19 
##$DBP= (0..7)
150 150 150 150 150 150 150 150 
##$DBP07= 0
##$DBPNAM0= <>
##$DBPNAM1= <>
##$DBPNAM2= <>
$$ [...]
##$SUBNAM3= <"">
##$SUBNAM4= <"">
##$SUBNAM5= <"">
##$SUBNAM6= <"">
##$SUBNAM7= <"">
##$SUBNAM8= <"">
##$SUBNAM9= <"">
##$SW= 501.771253377433
##$SWIBOX= (0..15)
0 1 3 0 0 0 0 0 0 0 0 0 0 0 0 0 
##$SW_h= 40650.406504065
##$TD= 32768
##$TD0= 1
##$TE= 0
##$TE2= 300
##$TE3= 300
##$TEG= 300
##$TL= (0..7)
0 120 53 12 22 120 120 120 
##$TP= (0..7)
150 150 150 150 150 150 150 150 
##$TP07= 0
##$TPNAME0= <>
##$TPNAME1= <>
##$TPNAME2= <>
##$TPNAME3= <>
##$TPNAME4= <>
##$TPNAME5= <>
##$TPNAME6= <>
##$TPNAME7= <>
##$TPOAL= (0..7)
0.5 0.5 0.5 0.5 0.5 0.5 0.5 0.5 
##$TPOFFS= (0..7)
0 0 0 0 0 0 0 0 
##$TUNHIN= 0
##$TUNHOUT= 0
##$TUNXOUT= 0
##$USERA1= <user>
##$USERA2= <user>
##$USERA3= <user>
##$USERA4= <user>
##$USERA5= <user>
##$V9= 5
##$VALIST= <valist>
##$VCLIST= <CCCCCCCCCCCCCCC>
##$VD= 0
##$VDLIST= <DDDDDDDDDDDDDDD>
##$VPLIST= <PPPPPPPPPPPPPPP>
##$VTLIST= <TTTTTTTTTTTTTTT>
##$WBST= 1024
##$WBSW= 4
##$XGAIN= (0..3)
0 0 0 0 
##$XL= 0
##$YL= 0
##$YMAX_a= 1386
##$YMIN_a= -1499
##$ZGOPTNS= <>
##$ZL1= 120
##$ZL2= 120
##$ZL3= 120
##$ZL4= 120
##$ABSF1= 248.5645
##$ABSF2= -253.2056
##$ABSG= 5
##$ABSL= 3
##$ALPHA= 0
##$AQORDER= 0
##$ASSFAC= 0
##$ASSFACI= 0
##$ASSFACX= 0
##$ASSWID= 0
##$AUNMP= <proc_1d>
##$AZFE= 0.1
##$AZFW= 0.5
##$BCFW= 0
##$BC_mod= 2
##$BYTORDP= 0
##$COROFFS= 0
##$CY= -3
##$DATMOD= 1
##$DC= 0
##$DFILT= <>
##$DTYPP= 0
##$F1P= 0
##$F2P= 0
##$FCOR= 1
##$FTSIZE= 65536
##$FT_mod= 6
##$GAMMA= 0
##$GB= 0
##$INTBC= 1
##$INTSCL= 5.30512e-09
##$ISEN= 30
##$LB= 1
##$LEV0= 0
##$LPBIN= 0
##$MAXI= 10000
##$MC2= 0
##$MEAN= 0
##$ME_mod= 0
##$MI= 50
##$NCOEF= 0
##$NC_proc= -8
##$NLEV= 6
##$NOISF1= 182.463
##$NOISF2= 159.3651
##$NSP= 0
##$NTH_PI= 0
##$NZP= 0
##$OFFSET= 248.5645
##$PC= 4
##$PHC0= -9795.444
##$PHC1= 644.4757
##$PH_mod= 1
##$PKNL= yes
##$PPARMOD= 0
##$PSCAL= 0
##$PSIGN= 0
##$REVERSE= no
##$SF= 81.014009
##$SI= 65536
##$SIGF1= 159.3651
##$SIGF2= -187.1042
##$SINO= 113.3802
##$SIOLD= 16384
##$SREGLST= <1H.CDCl3>
##$SSB= 0
##$STSI= 65536
##$STSR= 0
##$SW_p= 40650.406504065
##$SYMM= 0
##$S_DEV= 0
##$TDeff= 32768
##$TDoff= 0
##$TI= <>
##$TILT= no
##$TM1= 0
##$TM2= 0
##$TOPLEV= 0
##$USERP1= <user>
##$USERP2= <user>
##$USERP3= <user>
##$USERP4= <user>
##$USERP5= <user>
##$WDW= 1
##$XDIM= 65536
##$YMAX_p= 495955720
##$YMIN_p= -175944312
$$ End of Bruker specific parameters
$$ ---------------------------------
##NTUPLES= NMR SPECTRUM
##VAR_NAME=  FREQUENCY,     SPECTRUM/REAL,   SPECTRUM/IMAG
##SYMBOL=    X,             R,               I
##VAR_TYPE=  INDEPENDENT,   DEPENDENT,       DEPENDENT
##VAR_FORM=  AFFN,          ASDF,            ASDF
##VAR_DIM=   65536,         65536,           65536
##UNITS=     HZ,            ARBITRARY UNITS, ARBITRARY UNITS
##FACTOR=    0.620285442955139, 1,           1
##FIRST=     20137.2065510759, 0,            0
##LAST=      -20513.1999529892, 0,           0
##MIN=       -20513.1999529892, -175944312,  0
##MAX=       20137.2065510759, 495955720,    0
$$ Real data points
##PAGE= N=1
##DATA TABLE= (X++(R..R)), XYDATA
$$ [...]
40130h120936Q29684N878090N333568l44623n074893l867066J174708L440543
40122g50925O02412k379032r00876K293641J844954j280259j356995K488641M522892
40113E084453J283282l445489m708304k729113o05261M18832P12378M81472M57459
40104c050291J532884K345247N97776k324996k521782m53962j047948m887554
40096i810626n724873l12222N659973O143413L167021J206322o95253m254107
40088d620352n132890N85216P256499O254699r53078n393733m212404k259068
40080h475111j450624J141188M455690L243760j520702k091098L282387O643196
40072E228686L228489j283060j429083q26942l775138o044986k261896L618189
$$ y = [-8120936, -7291252, -1413162, 3920406, 3575783, -1499110, -5366176, -4191468, -750925, -148513, -2527545, -3428421, -1134780, 710174, -570085, -1927080, 561561, 5084453, 6367735, 2922246, -1786058, -4515171, -5120432, -4701600, -3989222, -3507750, -3050291, -1517407, 827840, 1425616, -899380, -3421162, -3875124, -4923072, -9810626, -15535499, -15847721, -10187748, -4044335, -877314, 329008, -366245, -4620352, -9753242, -9168026, -1911527, 4343172, 3390094, -2003639, -6216043, -8475111, -9925735, -8784547, -4328857, -1085097, -2605799, -4696897, -1414510, 5228686, 8457175, 7174115, 5745032, 4918090, 1142952, -4902034, -7163930, -3545741]
40064c545741M008704k84161k325790n37167N43364m63282J776K677685L253943
40055C329331l99012m349926m119118k09549L586329M589761K817264L02171o14663
40046D932588K26137N94488m23571m19880K120470L976411J504492l014892m178235
40037E318008j687312m61018k437841l831755j926725O60628J012058O26464J728194
40028i99299K586124P12105j806602r28760K386933K687477j760313n530011l299070
40019e951416K339612M053852j77872m358924l027664J255936K263595n06416
40011d109297j579672J711782N320124M937362J806631p31558k570469m859240
40003g4337n772018k962704J474327L138281J565710Q4744J03667l697n19840
$$ y = [-3545741, 462963, 178802, -2146988, -2684155, -2140791, -2604073, -2602297, 75388, 3329331, 2930319, -1419607, -5538725, -5748274, -2161945, 2427816, 5245080, 5547251, 4932588, 5158725, 5753213, 5329642, 4909762, 7030232, 11006643, 12511135, 9496243, 5318008, 3630696, 3169678, 731837, -3099918, -5026643, -4366015, -3353957, -2727493, -999299, 1586825, 2298930, 492328, -436432, 1950501, 4637978, 2877665, -2652346, -5951416, -3611804, 442048, 264176, -4094748, -7122412, -5866476, -3602881, -4109297, -5688969, -3977187, 1342937, 6280299, 8086930, 7355372, 4784903, -74337, -5846355, -8809059, -7334732, -4196451, -2630741, -2545997, -2442330, -2446027, -2965867]
39994b965867M00555K440212K405941p90470l998796m125937j648681J162426
39986g120617K672452J876422r53951l040700j706999J498800K850770K443913
39978a479910L415703N112280L227178j857285l839123n92346J679034j060935
39970D604596l285576L71808M636003J758780m639501m465864K342854N366570
39962F689670K21531n202851l890363M60812J381229n03477j238681r69242j575063
39953d626435j659724K12287J235055q32779k137346J600562O648074N613877
39945F053571r97370m808557j603240L306609L622723L03180j796396j300443
39937B780077n68982r20600j110345M1825J776768K326076R37822j040241j447391
$$ y = [-2965867, -2565312, -125100, 2280841, 1490371, -2508425, -6634362, -8283043, -7120617, -4448165, -2571743, -3525694, -6566394, -8273393, -6774593, -3923823, -1479910, 1935793, 7048073, 10275251, 8417966, 4578843, 3986497, 5665531, 4604596, 1319020, 1690828, 6326831, 8085611, 3446110, -1019754, 1323100, 6689670, 6911201, 1708350, -2182013, -1721201, -339972, -843449, -2082130, -3051372, -4626435, -6286159, -6073872, -4838817, -5671596, -7808942, -6208380, 439694, 6053571, 5056201, 247644, -1355596, 1951013, 5573736, 5876916, 4080520, 2780077, 2211095, 1290495, 180150, 221975, 1998743, 4324819, 5262641, 4222400, 2775009]
39928B775009l09230m22890l219818n405618k895403K495761M452150J009359
39920a520680k361076o71379L580007M707511J983377p75571j734005k415496
39912G92688l300006k725418n90118R63296J413218K477841L677776J603191l956331
39903C56137p251194l887169K007610K759733k168685n699127l426855Q14590
39895a6494960J538060o31307j130062J355773L811592M013024L093609K612867
39887a831404J930235r3294k454041k873593r64173R45444P64685m37293K01731
39878d811703L015204M610050K275887j852796l327610j390020L84124m31028
39870a527892k097720k201551j065269J46372J863611M084543M385283J224796
$$ y = [2775009, 2465779, 2042889, -1176929, -6582547, -9477950, -6982189, -2530039, -1520680, -3881756, -4553135, -973128, 3734383, 5717760, 4942189, 3208184, 792688, -2507318, -5232736, -5822854, -4859558, -3446340, -968499, 2709277, 4312468, 356137, -6895057, -10782226, -8774616, -6014883, -8183568, -13882695, -17309550, -16494960, -14956900, -15588207, -16718269, -15362496, -11550904, -7537880, -4444271, -1831404, 98831, 5537, -2448504, -5322097, -6286270, -5340826, -4576141, -5013434, -4811703, -1796499, 2813551, 5089438, 3236642, -90968, -1480988, -1096864, -1527892, -3625612, -5827163, -6892432, -6746060, -4882449, -797906, 3587377, 4812173]
39862D812173k527957k978093r74506o09877k445124k534175J005235M440407
39854a811917L508126p05844l436364k292126O03393K017562J368053N61142P74642
39845E86667N57098j779492m446628l403554J712999N736285M464356M74007j019986
39836B881752J0576n87689l288758l490185J070148O186887O505498J734580m076599
39827F946210o778290m648757M16619L429778J084507l445989m026867k38113
39819g260902K101371J85995j506960J054245M671816M117180K36239j894462
39811A704522n01212J519035J357196r47001l458266l876009j595013N59445o44638
39802e881941l162815j383127M679221P542281L169912k205966j567366K056103
$$ y = [4812173, 2284216, -693877, -1668383, -2278260, -4723384, -7257559, -6252324, -1811917, 1696209, 990365, -2445999, -4738125, -4134732, -2117170, -749117, -187975, 586667, 1143765, -635727, -5082355, -8485909, -6772910, -1036625, 3427731, 3901738, 2881752, 2892328, 2304639, -984119, -4474304, -3404156, 2782731, 9288229, 11022809, 6946210, 167920, -4480837, -4064218, -634440, 450067, -2995922, -7022789, -7260902, -5159531, -4973536, -6480496, -5426251, -754435, 3362745, 3598984, 1704522, 1203310, 2722345, 4079541, 3132540, -325726, -4201735, -5796748, -5237303, -5881941, -9044756, -10427883, -5748662, 1793619, 4963531, 2757565, 1190199, 3246302]
39794C246302J366396k837549l546996M21246K935648Q05592k303314k965240
39786b877915k105752q43540J474105L541590K178160j949140l762596r72646
39778e317734K520570K344595r35109l710702l525165m34747L084143L634992
39770b339157J098464K9238L193257O042679L088771k549451l284353O32668J632245
39761G544361k268028m601647k258152l05608j507537q14979M252412O862176
39753F902998J791565m560840l578702K018048L077240j539241m493208j905189
39745b287329K397062L886201K065053j283645l417258j532543L025034M010303
39737F862878j040880m936460o11234O596833N576565l272858p846841k506738
$$ y = [3246302, 4612698, 1775149, -1771847, -1350601, 1585047, 2390639, 87325, -2877915, -4983667, -5827207, -4353102, -811512, 1366648, -582492, -4345088, -5317734, -2797164, -452569, -1387678, -5098380, -8623545, -9058292, -5974149, -2339157, -1240693, -1211455, 1981802, 8024481, 11113252, 8563801, 5279448, 5912116, 7544361, 5276333, 674686, -1583466, -1889074, -3396611, -4211590, 40822, 6902998, 8694563, 4133723, 555021, 2573069, 5650309, 4111068, -382140, -2287329, 109733, 3995934, 6060987, 4777342, 1360084, -172459, 2852575, 6862878, 5821998, 885538, 274304, 6871137, 12447702, 9174844, 1328003, -1178735]
39729a178735M003961K673853k986298m460424j472517k5590j425609j226331
39721f097690K216701N029705M237414J579542n36901k650978n480348o644957
39713h347512l441663K341210N591853M088778Q66763o26324j006307k235412
39705b768614k818134R9416M558218M806414j64335l987540j791894K611490K798985
39696C344006m33183j128112J671468K468476j388475n164823m074500k10320
39688d915463J639223J499247K748724M998875L849387j648769o073828m802740
39680b705344p53260p0229k880601l260065J306539N554016L991513j379127m658865
39671d855423m115368k123526L37983L634904N522427L321796m58561p92790J644007
$$ y = [-1178735, 2825226, 5499079, 2512781, -1947643, -3420160, -3445750, -4871359, -6097690, -3880989, 1148716, 5386130, 6965672, 6428771, 3777793, -1702555, -8347512, -11789175, -9447965, -3856112, 232666, 1099429, 473105, -533202, -2768614, -5586748, -5487332, -929114, 3877300, 3712965, -274575, -2066469, 545021, 3344006, 2910823, 1782711, 3454179, 5922655, 4534180, -630643, -4705143, -4915463, -3276240, -1776993, 971731, 5970606, 9819993, 8171224, 2097396, -2705344, -3458604, -3528833, -6409434, -9669499, -8362960, -2808944, 1182569, -196558, -4855423, -8970791, -11094317, -10756334, -7121430, -1599003, 1722793, 1264232, 471442, 2115449]
39662B115449J488525j742956k641068R3685R39663k123619l164460J033265M166845
39653A65329P92361l978538k952550J474295K801389J840702K943955L690967
39645F777910o71371n877057l643060L501509M664362j811906n566267j356193
39637c982073L063195P41891l629629l090291L00909R56009k50502R08995L702056
39628a279440M265409K439351P93057n05844k625076m160433k957023j9649K132593
39619a917055L026273L012371J070218k768230n290849l918937n93662J195764
39611f184107J118558R28118J033423J005352J290895J834904J269987l58783
39603A938347q54406J36620o1019k032642k274152N79091K258296k04827k774526
$$ y = [2115449, 3603974, 1861018, -780050, -686365, 253298, -1870321, -5034781, -4001516, 165329, 957690, -3020848, -5973398, -4499103, -1697714, 142988, 3086943, 6777910, 6106539, 229482, -3413578, 87931, 4752293, 2940387, -2625880, -3982073, -918878, -176987, -3806616, -6896907, -6595998, -5639989, -5890491, -4981496, -1279440, 2985969, 5425320, 6218377, 5712533, 3087457, -1072976, -4029999, -4049648, -1917055, 1109218, 4121589, 5191807, 2423577, -2867272, -6786209, -7379871, -6184107, -5065549, -4137431, -3104008, -2098656, -807761, 1027143, 2297130, 1938347, 1083941, 1220561, 1159542, -873100, -3147252, -2568161, -309865, -514692, -3289218]
39594c289218r94045K051130Q65486k796129k841590P08478K085348p2931q63028
39585e146499J693487L025609o3585m075349m564626k307233m18915P44138K374629
39576h738344L824275L721394K634289K031239J929668J472908N72298m95780
39568F951947j814281k908613k509034m97190J174907P94498q49053j637677q37495
39559b131991L40932N10295k77701p56309k10860L12397n41017j867651j262490
39550e884395J159374J991081l76700k471780n74025L260956L941382Q36016j846679
39541C5230j715469o35735j90636O13820J890791J520713q00222j988061k98069
39532a567638J729669J367258l81198j345673j632580j934378j376227J81789
$$ y = [-3289218, -4283263, -2232133, -1366647, -4162776, -7004366, -6295888, -4210540, -4283471, -5146499, -3453012, -427403, -490988, -4566337, -9130963, -11438196, -11857111, -11112973, -8738344, -4914069, -1192675, 1441614, 3472853, 5402521, 6875429, 7447727, 6951947, 5137666, 2229053, -279981, -777171, 397736, 1192234, 343181, -1294496, -2131991, -1791059, -1280764, -1558465, -2314774, -2525634, -2213237, -2754254, -4621905, -5884395, -4725021, -2733940, -3110640, -5582420, -6156445, -2895489, 1045893, 1881909, 35230, -1680239, -2315974, -2506610, -1892790, -1999, 1518714, 718492, -1269569, -1567638, 162031, 1529289, 1148091, -197582, -1830162, -3764540, -5140767, -4958978]
39524d958978O75070l45491L14863M026115O233215K708802k901117l692797J56377
39515B216059K305942P64243J4363J665679Q62853m598630q576454n319981J348362
39506i317564L768957J609130N61279K247243K728404O01103o09674N52537N19643
39497B661058k607782m851251k523639J600602K523489L98853q06550k549L60011
39488c247758n30125n59410J053511K135063J328336K97749N73082P72440r55950
39479H66938l471541l903506j590086J218272K362466J804821N84934n72643r22161
39470c622506N12449L285965M530277J760540l161729n208720k501799P93670
39462c611853Q3506l048683l219616O59571L787372K554114p83233k282132j726623
$$ y = [-4958978, -4283908, -4629399, -4314536, -288421, 5944794, 8653596, 5752479, 2059682, 2216059, 4522001, 5286244, 5300607, 6966286, 7829139, 3230509, -5345945, -10665926, -9317564, -5548607, -3939477, -3378198, -1130955, 1597449, 2198552, 1588878, 2141415, 2661058, 53276, -4797975, -7321614, -5721012, -3197523, -2798670, -3605220, -3607769, -3247758, -3777883, -4337293, -3283782, -1148719, 179617, 477366, 1050448, 1822888, 866938, -2604603, -6508109, -8098195, -6879923, -4517457, -2712636, -2127702, -2700345, -3622506, -3110057, 175908, 4706185, 6466725, 3304996, -1903724, -4405523, -3611853, -3528347, -6577030, -9796646, -9137075, -5349703, -2795589, -3578822, -5860954, -7587577]
39453g587577j240128j068672J94941K558281M320486M088573J747499j302612
39445A710791k151932R35812M860505M166649j059687m047061j036684K684697
39437F063090J090388k942179k850861M31706O66013k302444k376375J570608
39429f50054L478683R21089o97975J853032L667896N75747l273451k643544M2915
39420C274338j22645j584909O1617L099535K168298k158005l837087r92995J732838
39411A640985J022125r69970j588933j559058j966810j593175M55887K409832
39403b149117K127192j49334k430594k840545o49224K717870L945391J335816
39395A907455k321389k916356n15418J350575J339177J317993J618283j24791
$$ y = [-7587577, -8827705, -9896377, -9701436, -7143155, -2822669, 1265904, 3013403, 1710791, -441141, 494671, 5355176, 9521825, 8462138, 4415077, 3378393, 6063090, 7153478, 4211299, 1360438, 1792144, 2458157, 155713, -2220662, -650054, 2828629, 3749718, 3051743, 4904775, 8572671, 9148418, 5874967, 3231423, 3274338, 3151693, 1566784, 1628401, 4727936, 6896234, 4738229, 901142, -91853, 1640985, 2663110, 1693140, 104207, -1454851, -3421661, -5014836, -4558949, -2149117, -21925, -171259, -2601853, -5442398, -6091622, -3373752, 571639, 1907455, -413934, -3330290, -3845708, -2495133, -1155956, 162037, 1780320, 1655529]
39387A655529l897557n452447k218048K430627L978006K932391K500400K495257
39379D424158K47886l364603l890895k19709K904668J524685j847519k357412
39371b578741q1573R55223j47834N1785K741331L860944N19898l395796k378098
39362d52861K136853L494159l30957l893342k582235J024090J921376J29167m31832
39353A014418J560327L336876K449586l75164k767160k924354n45308K480477
39345D229698K792172p57655m408578l166833K343284N466957J608447n323160
39337B784332p185520j678044M741972M967843j81399l930933k728126J61383
39329c048492O61387m04895O154J824584K746696K486480K213421J048989k463590
$$ y = [1655529, -2242028, -7694475, -9912523, -7481896, -3503890, -571499, 1928901, 4424158, 4672044, 1307441, -2583454, -2803163, 101505, 1626190, -221329, -2578741, -2660314, -1705091, -1852925, -1801140, 940191, 4801135, 5321033, 1925237, -452861, 1683992, 5178151, 4847194, 953852, -1628383, -604293, 1317083, 1446250, 1014418, 2574745, 5911621, 8361207, 7986043, 5218883, 2294529, 1749221, 4229698, 7021870, 6264215, 1855637, -1311196, 1032088, 6499045, 8107492, 2784332, -4401188, -6079232, -1337260, 3630583, 3449184, -481749, -3209875, -3048492, -2387105, -2792000, -2785846, -961262, 1785434, 4271914, 6485335, 7534324, 5070734]
39320E070734n966496n197938o90975K223143J153719m18570L64203J262272k60698
39311b460606k185174j488749Q62641K086109J942053J560959N72103j263054
39303c73718k109601j039064k83740j156164q42268K572383N047733J998572l449483
39294C64650l851669J603026N742910L720311j015223k929048j741544n78451
39286A314962k30289J031642L264461L781750Q69983l159084m102466j002090
39278A768869K346831K210643j77681r71588J37742J2625j741450j588843J387967
39269C385115K776618l74663m521551n058521k805572r80041N17477L043459M682388
39260F64709K932988m76572k185477k263184k295689j386375J090019K092654
$$ y = [5070734, -895762, -6093700, -6784675, -4561532, -3407813, -3826383, -3462180, -2199908, -2460606, -4645780, -6134529, -5271888, -3185779, -1243726, 317233, 889336, -373718, -2483319, -3522383, -3806123, -4962287, -5804555, -3232172, 1815561, 3814133, 364650, -3487019, -1883993, 3858917, 7579228, 6564005, 3634957, 1893413, 1314962, 1084673, 2116315, 5380776, 9162526, 10032509, 6873425, 2770959, 1768869, 4115700, 6326343, 6148662, 5177074, 5314816, 5327441, 3585991, 1997148, 3385115, 6161733, 5787070, 1265519, -3793002, -6598574, -7578615, -7061138, -4017679, 664709, 3597697, 3121125, 935648, -1327536, -3623225, -5009600, -3919581, -1826927]
39252a826927j22654j172020K680613O305721K349428o178347q903479l000405
39244i868070L703793M900164K496906l5786k601616m455594k795706J720629
39236f935280M315521L252123J776456J411518j20425k706257k759808m49827
39228b215979n62489l501561l239851K155227N771097K397921l234880m194022
39220f624537j150865J165532J903015K780033L350161K710472J976443J089947
39212G200201k118316o185063n461784L98704L376255q84132n198622k108062
39204a0980819L955122M475602Q01683K45743K813477K666124r1623k03728J589814
39195E271395n95004n665337n393221J690481O636255L842361p84106k88442K591165
$$ y = [-1826927, -1949581, -3121601, -440988, 5864733, 8214161, 2035814, -6867665, -9868070, -6164277, -1264113, 1232793, 1197007, -1404609, -5860203, -8655909, -6935280, -2619759, 632364, 2408820, 3820338, 3699913, 993656, -1766152, -2215979, -2778468, -6280029, -9519880, -7364653, -1593556, 804365, -2430515, -6624537, -7775402, -6609870, -4706855, -1926822, 1423339, 4133811, 6110254, 7200201, 5081885, -1103178, -6564962, -6166258, -2790003, -3674135, -8872757, -10980819, -7025697, -2550095, -1748412, -1502669, 1310808, 3976932, 3885309, 3681581, 5271395, 4676391, -988946, -6382167, -4691686, 1944569, 5786930, 5002824, 4714382, 7305547]
39186G305547J273472l772970o500086m400171n28137J961502K810868K718975
39178H69000J691950k28146k107882k553836j167395L64083n2454j330886L03018
39169d212548N162365P496880K919450m173639n844659j657483J484656o7143
39161A107879k696288k671669r21777R41229L346012N198938L272046j859798
39153E716572m426777j453246K501122K286820n40783j598915q85572j199248
39145C99973k352908k050836n06763N32779J644679L926629M933845J617310l526263
39136D618445m724702j464265P17890r86000k563032k27153L400166L840316J701631
39127D313296O38507R62537K31094j142503k04569K436462K097496k548540o081836
$$ y = [7305547, 8579019, 4806049, -1694037, -6094208, -6622345, -4660843, -1849975, 869000, 2560950, 2332804, 224922, -2328914, -3496309, -3132226, -3184680, -4515566, -4212548, 949817, 8446697, 11366147, 7192508, 1347849, -309634, 1175022, 1107879, -1588409, -4260078, -5181855, -4240626, -894614, 4304324, 7576370, 5716572, 1289795, -163451, 2337671, 4624491, 4083708, 2484793, 1599221, 399973, -1952935, -4003771, -4510534, -3977755, -2333076, 1593553, 6527398, 8144708, 4618445, -106257, -1570522, -852632, -1838632, -4401664, -4628817, -1228651, 2611665, 4313296, 4951803, 5914340, 6145434, 5002931, 4798362, 7234824, 9332320, 6783780, 701944]
39118G01944l603844J889198L421430m81095m356856l396586J188047M841102
39110B03340M864733K086491p80284j775120j640984k663509m659658m118005
39102h482996L52543M185518K516737k168600l271392O9359K552349K066089K196609
39093A6216L844867K274973l641142o705110j803689M990587M747018j369540
39085B354180m950687k996434J0409R21457J290457K321820K963375L125358L417238
39076H457173K252419j482919m171556j996495J659443N47962l646343l295131
39068a675447K073752M076091p94175n169738k986095J007756J98709k696780
39060e965927j171373L502204M609238J014728k026693j785206p16706n18748
$$ y = [701944, -2901900, -1012702, 2408728, 1927633, -2429223, -5825809, -4637762, 203340, 5068073, 7154564, 6374280, 4599160, 2958176, 294667, -4364991, -8482996, -8130453, -3944935, -1428198, -3596798, -6868190, -6798831, -4246482, -2180393, 16216, 3861083, 6136056, 2494914, -4210196, -6013885, -1023298, 3723720, 2354180, -2596507, -5592941, -5582532, -4661075, -3370618, -1048798, 1914577, 5039935, 8457173, 10709592, 9226673, 5055117, 3058622, 4718065, 5266027, 1619684, -1675447, 398305, 4474396, 3680221, -1489517, -4475612, -3467856, -3269147, -5965927, -7137300, -3635096, 974142, 1988870, -37823, -1823029, -2539735, -3058483]
39052c058483O4451R38983j03241k511504k302654J715410N093448L682162n43778
39043B974794k493686j004225K09401j559149l838445k322922K621941N377399
39035c4892K292758k683075k873531J444360K919080j938736o679776l724814
39027a1278626M382459Q118949L891307k093483l250558l60965K072521K470680
39019C952284J919814O83942j179417j812538J0020J705273m5618l703642m396036
39010b865918j172754J532117Q64102l73902R16734K715840J730769m61272j67825
39001B717891J388419k60993m351560m493234J366686O500162M641806r66205
38993F542972k682670M94042K629870L50265k976635l247362j221028q3659m74604
$$ y = [-3058483, -2994032, -2055049, -2158290, -4669794, -6972448, -5257038, -163590, 3518572, 2974794, 481108, -523117, -313716, -1872865, -5711310, -8034232, -5412291, -34892, 2257866, -425209, -3298740, -1854380, 1064700, -874036, -7553812, -11278626, -6896167, 1222782, 5114089, 3020606, -229952, -590917, 1481604, 3952284, 5872098, 6556040, 5376623, 3564085, 3574105, 5279378, 5233760, 1530118, -2865918, -4038672, -2506555, -1642453, -2016355, -1099621, 1616219, 3346988, 2885716, 2717891, 4106310, 3845317, -506243, -4999477, -3632791, 2867371, 7509177, 6542972, 3860302, 4354344, 6984214, 7334479, 4357844, 1110482, -110546, -194205, -668809]
38984f68809n59038L09201N23953q79956j957626j03074L640398M743643J093129
38975F141821l414314l982947j727789j076184j699564P55161N445083N316669
38967E757936j585270p042726m299532J438895J272884l458369m165156P52689
38959a1328649L985108J560423j626508n67790K582143L162495R32565r65202
38951b265415q64656J42888J33494j514392k931628j465841K102450L375662P69790
38942b517648j177423J250758M389069K906514j381405k993261k055748k404324
38934c983468k825694Q77040O209591N937823L0804l721938k118829k08999r00536
38925g04206o51394J722618J663847j840560k860582R64530L369504K14023l159586
$$ y = [-668809, -1227847, -918646, -394693, -1274649, -3232275, -3335349, 305049, 5048692, 6141821, 2727507, -1255440, -2983229, -4059413, -5758977, -5003816, 441267, 5757936, 4172666, -2870060, -7169592, -5730697, -4457813, -7916182, -12081338, -11328649, -7343541, -5783118, -7409626, -7977416, -5395273, -2232778, -1300213, -2265415, -3130071, -2987183, -2853689, -4368081, -7299709, -8765550, -6663100, -3287438, -2517648, -3695071, -2444313, 1944756, 4851270, 3469865, 476604, -1579144, -3983468, -6809162, -5932122, 277469, 6215292, 6246096, 2524158, 405329, 196330, -704206, -1355600, 367018, 2030865, 190305, -2670277, -1705747, 1663757, 1877780, -1281806]
38916a281806j369943J995857J505512q22108k87227K126960K684890J304678
38908E856813m65710k860719m596917k019082L796226N656709Q87862l799890
38900B455292l186853j154707j583098q55321L103658L903461j964882o150501
38892e432951j492535M866595L511373p65366J359631N342710O50024q380144
38884c40663p774520K189786O739267R22761l632663M59625N372596L461777q68273
38875F529693j534929q77602k394717l591036k519124k496272m687420m437531
38867a6008938N4916L718335L619450L409495M707166L312926j436156l102470
38859a725276Q53177L912239J818441m84148Q73805J376663k077631l954836n30056
$$ y = [-1281806, -2651749, -655892, 849620, 27512, -259715, 1867245, 4552135, 5856813, 5391103, 2530384, -2066533, -4085615, -289389, 5367320, 6255182, 2455292, -731561, -1886268, -3469366, -4324687, -1221029, 2682432, 717550, -5432951, -6925486, -2058891, 1452482, 687116, 2046747, 7389457, 8039481, -340663, -8115183, -5925397, 813870, 1736631, -1896032, -1436407, 3936189, 7397966, 6529693, 4994764, 4117162, 1722445, -1868591, -4387715, -6883987, -11571407, -16008938, -15954022, -12235687, -8616237, -5206742, -499576, 2813350, 1377194, -1725276, -872099, 3040140, 4858581, 4374433, 5248238, 6624901, 4547270, 592434, 62378]
38850F2378J982012j496362m854006j536017L294983K107368j391033J06326L063858
38841A339507n88249p622568p589882l2557N327465M371173K424957K643986K062516
38832B336348r7239o40042J44466j134586k619069Q35617O625961N940818j736443
38823I655831o282265k340283L052833K659449o05693j168369l32273j641636
38815B997594l266331j881251P36962J187736M40261Q12971R40659p11959j179500
38806G7142K118364N117668K366321l685300n552459j917117Q99683r59226l881462
38797e416386l705128j755600o94487Q81157M979762Q276009N250408l031839
38789D783896q347386n265013K011860N394805K793747j150681k398784j303277
$$ y = [62378, 2044390, 548028, -4305978, -5841995, -2547012, -439644, -1830677, -1724351, 1339507, 751258, -6871310, -14461192, -14493749, -9166284, -4795111, -2370154, 273832, 2336348, 2239109, 1599067, 1743533, 608947, -2010122, -1174505, 5451456, 11392274, 9655831, 3373566, 1033283, 4086116, 6745565, 6139872, 4971503, 4639230, 2997594, -268737, -2149988, -1413026, -225290, 214971, 1027942, 1968601, 1256642, 77142, 2195506, 7313174, 9679495, 5994195, 441736, -1475381, -575698, -1534924, -5416386, -9121514, -10877114, -11571601, -10690444, -5710682, 2565327, 7815735, 4783896, -3563490, -8828503, -6816643, -1421838, 1371909, 221228, -2177556, -3480833]
38781c480833M93434K371317K976873M78736l490205m165390n48252K015144k59852
38772c609028l038589l77190N166999N549438n51799n453781l601802J211369
38764d704383K582271M82730n03418J251847K980017K408223M55504r76964j371151
38755B604676j195947p37964j26475J62958m27545j688208k434451j608770M62122
38746d989604K381108L059169K121619l88402l196652l481424q9856L222304J613842
38737B52104l100379l394069K931420P888176L979607m658896p893730l449174
38729g444941J761127K726921J484865R28574M51920m51275p2452J672119K024571
38720C081429J62456j144009o28565q52872l097379m225274j601573K383700L707894
$$ y = [-3480833, -2987399, -616082, 2360791, 2839527, -650678, -4816068, -5364320, -3349176, -3609028, -6647617, -7024807, -1857808, 3691630, 3139831, -2313950, -5915752, -4704383, -2122112, -1639382, -2142800, -890953, 2089064, 4497287, 4952791, 3975827, 2604676, 1408729, 670765, 544290, 707248, 279703, -1408505, -3842956, -5451726, -4989604, -2608496, 450673, 2572292, 2183890, -1012762, -4494186, -4584042, -1361738, 252104, -2848275, -6242344, -3310924, 4577252, 8556859, 3897963, -3995767, -7444941, -5683814, -2956893, -1472028, -543454, -91534, -542809, -615261, 1056858, 3081429, 3243885, 2099876, 1471311, 618439, -2478940, -6704214, -8305787, -5922087, -2214193]
38711b214193J896382o32681j924323j307389O38868J684341L71752o87961J927581
38702b47623N480595L292358m263668p970609k863311L786086L392552j236562
38694f30182j750076J983973L023450l43572k825061k085797j519134k152736
38686f299135k72468M495206O334383K061498l393902m233273j361462J099228
38678a569925K053777J989195l27555m782392o882386k959747L700267O567107
38670b211659M111332K16796j980590k331365j121102J138102K085145M184k574253
38661b663410j945361P90970J476134O026J58855K223161K184024l62325l64622
38652A503452L592439N217726M16122m933573l724172Q72623Q15262l214172l105964
$$ y = [-2214193, -317811, -950492, -2874815, -4182204, -3543336, -1858995, -1487243, -2175204, -247623, 5232972, 8525330, 4261662, -3708947, -6572258, -2786172, 606380, -630182, -2380258, -396285, 2627165, 2283593, -541468, -2627265, -4146399, -6299135, -6571603, -2076397, 4257986, 6319484, 2925582, -1307691, -2669153, -1569925, 483852, 2473047, 2145492, -2636900, -9519286, -12479033, -8778766, -2211659, 1899673, 2116469, 135879, -2195486, -3316588, -2178486, -93341, -89157, -2663410, -4608771, -3817801, -2341667, -2335641, -2176786, 46375, 2230399, 1868074, 1503452, 5095891, 10313617, 10729739, 5796166, 2071994, 2944617, 3759879, 545707, -2560257]
38643b560257K579194N565608R37102n284316n497243p46501K862031K718272
38635E73890K78753k593816l757733j119798L472302M621664J089124j592683
38627I71703n0243J145298j924461m243413J0083O062688M972768j616365l848105
38618A479953K84400K526376q14180l007607L72429L324508J07498m485451l013096
38609c225170K685625N202900K967684N98395N69326J051178M29239j237468l649173
38600E392536n020291k093602M156295O328185p2091q172371p642776Q04542O483267
38591A63694L867196j250864k093693M2290L63925j484485k321800r18598R85081
38582b647254J367001l51220k645724k340815J804356N857641M737994m7082j426535
$$ y = [-2560257, 18937, 5584545, 6521647, 1237331, -4259912, -5006413, -2144382, 573890, 852643, -1741173, -5498906, -6618704, -3146402, 1475262, 2564386, 971703, 921460, 2066758, 142297, -4101116, -4091033, 1971655, 6944423, 5328058, 1479953, 1764353, 4290729, 3476549, 468942, 841371, 4165879, 4273377, -212074, -3225170, -539545, 4663355, 7631039, 8229434, 8798760, 9849938, 10279177, 9041709, 5392536, 372245, -1721357, 2434938, 8763123, 8691032, 518661, -7124115, -6319573, 163694, 4030890, 2780026, 686333, 728623, 1092548, -391937, -2713737, -3632335, -2647254, -1280253, -1631473, -4277197, -6618012, -4813656, 1043985, 5781979, 5734897, 4308362]
38573D308362K829828N991117K068685n021930o939652k384444K424217L004465
38565F280648P92524j434357k933625l087496r03718K010345J973117j369778
38557A327660l666313j961007J193670K226315J787079K185898K623957J220850
38549F938109m78766J30328J402221j64438l188411l144342o27465q11389l632517
38540c576670k654432L256824N862376P02906m205255j032006M139836J210324
38532C703903o129419n956887J469530L944482j633040m166602J789911O531901
38524d46221K738536j916084K18801K237310l776466r705197l841767P372255
38516g118833P766207k394814o977828l26966N203439J405928l268596l00572
$$ y = [4308362, 7138190, 13129307, 15197992, 10176062, 3236410, 851966, 3276183, 6280648, 7073172, 5638815, 2705190, -382306, -1286024, 724321, 2697438, 1327660, -2338653, -4299660, -3105990, -879675, 907404, 3093302, 5717259, 6938109, 6459343, 6589671, 7991892, 7827454, 4639043, 1494701, 867236, 55847, -3576670, -6231102, -2974278, 2888098, 3591004, -614251, -1646257, 2493579, 3703903, -2425516, -8382403, -6912873, -2968391, -4601431, -8768033, -6978122, -446221, 2292315, 376231, 595032, 2832342, -944124, -10649321, -14491088, -7118833, 647374, -1747440, -8725268, -9052234, -3848795, -2442867, -5711463, -6012035]
38508f012035M577877L132979j016222m51145K485422J122152k938874l299055
38500b398901m09240K77475j250655m27598K492974K870016O62836N81802L137202
38491E535911L354547m70590l709964k947313o39626k1339m17562j20059K31991
38482G95996l08987q09009m62605j17238j58549M65030J663849J480026l85064
38473B163449j093570J196335M118302M311290J841367r63071l250973n368409
38465B954720o129738l740612O27320L225497K451633P25148N41748R66282q2220
38456A539778j856802j732102N93375K527190K308880Q88216l21912j106931j141119
38447A698573L06479K129533J692527q46445j630977R13172K567314l76592m451527
$$ y = [-6012035, -1434158, 1698821, 682599, 231454, 2716876, 3839028, 900154, -2398901, -2808141, -2530666, -3781321, -4208919, -1715945, 1154071, 1816907, 2398709, 5535911, 8890458, 8419868, 4709904, 1762591, 1122965, 1101626, 684064, 564005, 795996, 487009, -322000, -784605, -901843, -1060392, -595362, 1068487, 2548513, 2163449, 1069879, 2266214, 6384516, 10695806, 12537173, 11574102, 8323129, 2954720, -3175018, -6915630, -6288310, -3062813, -611180, 113968, 655716, 1621998, 1539778, -317024, -2049126, -1455751, 1071439, 3380319, 4268535, 3946623, 2839692, 1698573, 2005052, 4134585, 5827112, 4980667, 3349690, 4262862, 6830176, 6453584, 2002057]
38438B002057l922104o2375R49275j583613j984493J537221L453709N16086k420713
38429a514950o33630K585326J994090n51996K60668L815695M715255J600552j686345
38420A0584665l073356m249311n478048m190288o0136L235144L068343J046294
38412H83307l19749q92479j399576j494809q83825k25712K14280R24203J560477
38403a633883J109389Q5636K07836J310055J105808j101068k964810k525686q14836
38394e221559K98198P68271J346177J668691J038702j92319j385812k490150k978889
38385g148690j533699J560059L250293J279889j991671k034537J609051M328615
38377f80690K714914p16663j280128J092488J984846q18872m153877m186086j420605
$$ y = [2002057, -1920047, -1982422, -1033147, -2616760, -4601253, -3064032, 389677, 905763, -1514950, -2148580, 436746, 2430836, 1878840, 2139508, 5955203, 10670458, 12271010, 10584665, 7511309, 3261998, -2216050, -6406338, -6466474, -3231330, -162987, 883307, 563558, -328921, -1728497, -3223306, -4107131, -4332843, -4118563, -3194360, -1633883, -524494, -438858, -231022, 1079033, 2184841, 1083773, -1881037, -4406723, -5221559, -4923361, -4155090, -2808913, -1140222, -101520, -293839, -1679651, -4169801, -7148690, -8682389, -7122330, -3872037, -2592148, -4583819, -6618356, -5009305, -680690, 2034224, 1317561, 37433, 1129921, 3114767, 2295895, -1857982, -6044068, -7464673]
38368g464673J090572K157405K321208J300801r53039j970714N09231M123103
38360A113894M306030R51514j716091j970168k215606l111240j929113J215605
38352c355175J583440k311476m766923j430706L341591L213341l94161j623281
38344e743350J45790Q55803j54576L47275K776588L869279K338562L3772k012315
38335B456828l639181k862107J254821M353964J773249l284670l601936P33473
38327b815559K765219N42645k44258K831699M407256J173309k023994o82761J844821
38318G798377O90101k632082m033540l397700k229733K36348L509546L523229
38310C464546o86567l096347M33216M488125K382538k605977k681450J386079
$$ y = [-7464673, -6374101, -4216696, -1895488, -594687, -1547726, -3518440, -3009209, 1113894, 5419924, 6371438, 4655347, 2685179, 469573, -2641667, -4570780, -3355175, -1771735, -4083211, -8850134, -10280840, -6939249, -3725908, -4120069, -5743350, -5597560, -4741757, -4896333, -4549058, -1772470, 2096809, 4435371, 4469143, 2456828, -1182353, -4044460, -2789639, 1564325, 3337574, 52904, -3549032, -2815559, -50340, 492305, 248047, 3079746, 7487002, 8660311, 6636317, 5953556, 7798377, 8488478, 5856396, 1822856, -1574844, -3804577, -3568229, -58683, 3464546, 2777979, -318368, 114848, 4602973, 6985511, 4379534, 1698084, 3084163]
38302C084163K132178j447835k591770J090583L787185J957358r1067J212149
38294I132944K117956j360841n696043n092611n43777K297527J866843J450587
38286D172585K236890J483508j454782k412196J391010N838267M648500j699545
38278A4204237o148866m770361j936876l125570o263431n121205N33539M292146
38270h336387L015812J118196K491059L991804J393831k742357k880859N76561
38262a372340K227727L07144j453906o72217L45781o30443j996398j311685Q77125
38253c679212K081289J012572j343805k583189q14389K792296M077851O74424
38245B217837m038976m505784q4503M413560N103759K717535k79068k748714m023616
$$ y = [3084163, 5216341, 3768506, 1176736, 2267319, 6054504, 8011862, 7920795, 9132944, 11250900, 9890059, 4194016, -898595, -1442372, 855155, 2721998, 4172585, 6409475, 7892983, 6438201, 4026005, 5417015, 11255282, 15903782, 14204237, 8055371, 3285010, 1348134, -1777436, -8040867, -13162072, -12628533, -8336387, -5320575, -4202379, -1711320, 2280484, 3674315, 931958, -1948901, -1372340, 855387, 1162531, -291375, -963592, -617811, -1248254, -3244652, -4556337, -3679212, -1597923, -585351, -1929156, -4512345, -5326734, -2534438, 1543413, 2217837, -1821139, -6326923, -6411426, -1997866, 3105893, 5823428, 5544360, 2795646, -1227970]
38236a227970l082938k62320K296697L191018L044929K523432J132828j015329
38228F600347k278606j677538n25770o15231j823586k474327j329630J243397
38220b880944L389454L095783M09037j953855j528358O87700J527391j11566k157787
38211D76855k490365j333919k03464R8939J06624J130934L661561N568890L400086
38202A0416141k780980p575499o113306n57873K587175R96376j385141p56860
38194e169967J942381L730913L388579J224612j987956m339040l569995j21580
38186d902053K559083K037583l91829j790986p70227J803063L636903K647932
38178D829469l64370j458019J362077M020373J403064m329287n899929j722939
$$ y = [-1227970, -4310908, -4573228, -2276531, 914487, 3959416, 6482848, 7615676, 6600347, 4321741, 2644203, 2118433, 1503202, -320384, -2794711, -4124341, -2880944, 508510, 3604293, 4013330, 2059475, 531117, 1218817, 2746208, 2634642, 476855, -2013510, -3347429, -3550893, -3451954, -3345330, -2214396, 1447165, 7016055, 10416141, 7635161, 59662, -6053644, -6611517, -4024342, -3027966, -4413107, -5169967, -3227586, 503327, 3891906, 5116518, 3128562, -1210478, -4780473, -4902053, -2342970, -305387, -697216, -2488202, -3258429, -1455366, 2181537, 4829469, 4465099, 3007080, 4369157, 8389530, 9792594, 5463307, -436622, -2159561]
38170b159561J744455L66217j607435L04778K791439P42374l361199l101362J416152
38161b864142L953326K137102J75293R22018J493051j064224m619046n296447
38153e163069k650954R27599L352045L362056N36154k945906k957346J424046
38145d115375N298160L591387j905306m632812k035360J568656J784378P4723
38137c71549M16440K798422L678399J685447r14603k286161k838623k439629K46789
38128b5068M055804M772302R15381l182798l255801j087980q01585j904391r37688
38119a451824J703346K098734m98543k523856j980152o95537j55472L66190Q66142
38110b270972K96238k22836J424629L456663J812366k515711l812892q26757J015539
$$ y = [-2159561, -415106, -48889, -1656324, -1351546, 1439893, 2182267, -1178932, -4280294, -2864142, 1089184, 3226286, 3401579, 4323597, 5816648, 4752424, 133378, -5163069, -7814023, -6886424, -3534379, -172323, 363831, -2582075, -5539421, -4115375, 1182785, 4774172, 2868866, -1763946, -3799306, -2230650, -446272, -371549, 44891, 2843313, 6521712, 8207159, 7292556, 5006395, 2167772, -271857, -25068, 4030736, 8803038, 9718419, 6535621, 3279820, 2191840, 1390255, -514136, -1451824, 251522, 2350256, 1851713, -672143, -2652295, -3347832, -3503304, -3137114, -2270972, -1974734, -2197570, -772941, 2683722, 4496088, 1980377, -1832515, -2659272, -1643733]
38101a643733r12999j840292J539603M530594K248456k060112k856377j309215
38093b304075j537629k262967K41607M188682M889454K801081J574944N64821
38085H155918k774773n218053j506848N216823O186764N91759l145039j182143
38077F324408M05570k673015n336065k471444K102976K405984j90736q45894K60548
38068a7668R260r28119j30070O94944j440732m013548j779505M314723P320517
38059D029802L928793j444355l392044j766438N02382J981353K675409J923276
38051H438178r12528m438287n832603l778653j34886J885290J422821J103062
38043b247606L225998N560742L587958k681058p381843o046763j205956J832295
$$ y = [-1643733, -2556732, -4397024, -2857421, 1673173, 3921629, 1861517, -994860, -2304075, -3841704, -6104671, -5863064, -1674382, 3215072, 6016153, 7591097, 8155918, 5381145, 163092, -1343756, 3873067, 10059831, 10651590, 7506551, 6324408, 6729978, 4056963, -1279102, -3750546, -1647570, 758414, 567678, -278216, -17668, -8408, -936527, -1066597, -371653, -1812385, -5825933, -7605438, -3290715, 4029802, 7958595, 6514240, 3122196, 1355758, 1858140, 3839493, 6514902, 8438178, 7525650, 3087363, -2745240, -6523893, -6658779, -4773489, -3350668, -2247606, 978392, 6539134, 10127092, 7446034, 64191, -5982572, -7188528, -5356233]
38035e356233K014474J757720J376445q38976l563323k624840K434500O306881
38027A506648M902890J077993P8403J588738P21806l489237n496025j410357M070199
38018C551058L488620k244138m419063O56818N582020K762971l781181m470639
38010A126466Q97697L087147j540435n297163j928240L392214K953399j266650
38002A424435k099540O66047J422311m46469j19233K592569J814922l860037p524381
37993f129376m185033J754562L562433J401890k50182j23791O6338L32723J725845
37984a844591K748360J171610j591964k059510M5613J797897J828499J470623
37976C566537J362566M60090j228859k071648j594173j158804j285773q69397
$$ y = [-5356233, -3341759, -1584039, -207594, -1046570, -4609893, -7234733, -4800233, 1506648, 6409538, 7487531, 7565934, 9154672, 9876478, 6387241, 891216, -519141, 3551058, 7039678, 4795540, 376477, 1033295, 6615315, 9378286, 5597105, 1126466, 2024163, 5111310, 3570875, -1726288, -3654528, -262314, 2691085, 1424435, -675105, -9058, 1413253, 966784, 847551, 3440120, 5255042, 1395005, -6129376, -10314409, -8559847, -4997414, -3595524, -3845706, -3969497, -3903159, -3570436, -1844591, 903769, 2075379, 483415, -1576095, -1530482, 267415, 2095914, 3566537, 4929103, 5389193, 4160334, 2088686, 494513, -664291, -1950064, -2819461]
37968b819461K29533L62670j026705j933942o43143J622313K373075J049392o92938
37959a479206j075530L73253K751716M292832L480949M27025k988586m549897
37951A232556l232774J54105L204310L475221R38423j681689k190356j623049
37943B76747j952629k310614m18726K697131L113997q5830k842444j702403J662526
37934a562245L554395L122069J776919K32068j197195j481603p78732j311649
37926B354027l526466l911937l04809L219674J682501k421341k073358L406654
37918a575055O892943L947423j415933l773719l315769k439566o32306K565002
37910B53020L646073k50026n369290n505162q14210K658145J750755l67544M3577
$$ y = [-2819461, -2589928, -2227258, -3253963, -5187905, -5831048, -4208735, -1835660, -786268, -1479206, -2554736, -2181483, 570233, 4863065, 8344014, 8771039, 5782453, 1232556, -2000218, -1846113, 1358197, 4833418, 5771841, 4090152, 1899796, 276747, -1675882, -3986496, -4405222, -1708091, 1405906, 1320076, -1522368, -3224771, -1562245, 1992150, 5114219, 6891138, 7123206, 5926011, 4444408, 3665676, 2354027, -1172439, -5084376, -5389185, -2169511, -487010, -2908351, -4981709, -1575055, 5317888, 9265311, 7849378, 4075659, 759890, -1679676, -2311982, 253020, 3899093, 3649067, -1720223, -7225385, -8039595, -5381450, -3630695, -3998239, -3954662]
37901c954662K254682L022426Q30764k764407m375909j634093L507778N588026
37893B474605K172427k231221k180628Q65932J564945j33891O16593M038140M152075
37884A1338977r82093m718648j843191L046602K873102j172659k955398j822269
37876C764423k004303l484164j716860L199725M917814O69955l953442l441051
37868b047903l2272J176512J92408K55417J342806R14482p73867j285072r25311
37859a182800k078147l981659l198967K46780K182176R82716P6613J655466K743849
37850b553973Q39587r92165P45440L309705J827366k216954k887342P40063L553078
37841B364805L076559K379920K824506R94534l841747n926171j733137L151048
$$ y = [-3954662, -1699980, 1322446, 2153210, -611197, -4987106, -6621199, -3113421, 2474605, 4647032, 2415811, 235183, 1101115, 2666060, 2532169, 3148762, 7186902, 11338977, 10356884, 5638236, 3795045, 6841647, 9714749, 8542090, 5586692, 3764423, 1760120, -1724044, -3440904, -241179, 4676635, 5346590, 1393148, -2047903, -2080175, -903663, -711255, -455838, 886968, 1801450, 1027583, -257489, -1182800, -3260947, -7242606, -10441573, -10194793, -8012617, -7029901, -6953288, -5297822, -2553973, -1714386, -2706551, -1961111, 1348594, 3175960, 959006, -1928336, -1188273, 2364805, 5441364, 7821284, 10645790, 11640324, 7798577, 1872406, 139269, 3290317]
37833C290317K143988j911751j813257J859544K197768j842971l719718o05739
37825d01819K100023K17776k686436k042518N79899J379514M00337n07104j409548
37816b369876j996813j8704L782570L902427j709669o288207l271191L357486
37808d611977M976213J475509K13027L348605N062247J948083k092816l320814
37800F998077l212544l388408k147350O65184J421663q77275j597632J811088
37792c27197M438740J505360l296470l275912P87354K414987j68123k214462p51251
37783h86974J577126J933380J202947P71472j61307j849066k163382p23K141258
37774B564731J529584p55024j565990k33034R90272N22848n15715j33633J891622
$$ y = [3290317, 5434305, 3522554, 1709297, 3568841, 5766609, 3923638, 203920, -401819, 1698204, 1915980, -770456, -2812974, -2233075, -853561, -453224, -960328, -2369876, -4366689, -4385393, -602823, 3299604, 1589935, -4698272, -7969463, -4611977, 364236, 1839745, 2052772, 5401377, 10463624, 12411707, 10318891, 6998077, 3785533, 397125, -1750225, -1085041, 336622, -540653, -2138285, -327197, 4111543, 5616903, 2320433, -955479, -168125, 2246862, 2078739, -135723, -886974, 690152, 2623532, 3826479, 4597951, 4436644, 2587578, 424196, 423473, 2564731, 4094315, 3339291, 1773301, 1540267, 2530539, 3053387, 2537672, 2404039, 4295661]
37765D295661L693259L224875L09491l060453m445839l060663k74800J713628
37757B395159J657373J41753j024702n80048Q66724J552361M81417j861199m267428
37748f38590n215921l132755J735757N776359N020653N21509k161270m09310J661146
37739C157578m54713m534407n026508j593398R14251N90259R68806L929305N375201
37730C326374J520655m175409n048953o52785K667741J013550j668725R7614M667995
37721A748057N188960l64938n665792m569304O04984L242990K252415K063060
37713D500432L609720K271567l189369o402591k595588L333531L705565j022722
37705D210545m563908m705843l740145j514741L622508P971366N536910j349420
$$ y = [4295661, 7988920, 11213795, 11523286, 8462833, 4016994, 956331, 681531, 2395159, 4052532, 4194285, 3169583, 2589535, 3456259, 5008620, 5490037, 3628838, -638590, -5854511, -8987266, -7251509, -1475150, 3545503, 4067012, 1905742, 1496432, 3157578, 2702865, -1831542, -6858050, -8451448, -7537197, -6946938, -5978132, -2048827, 3326374, 4847029, 671620, -4377333, -5030118, -2362377, -1348827, -3017552, -2919938, 1748057, 6937017, 6572079, 906287, -3663017, -3058033, 184957, 2437372, 4500432, 8110152, 10381719, 7192350, 789759, -1805829, 1527702, 5233267, 4210545, -353363, -5059206, -8799351, -10314092, -6691584, 1279782, 6816692, 5467272]
37697E467272l400378J546140M742358M44166n126301m287336K54155J171387
37689H11463j624509k571307m4419K861984M430748M714743K233959l435157p758422
37680c80917o009718l82111L150684L168487K454223J674279k02894j206120R07154
37671C173067K734804m29429n312212m015407L152657O917024K894190k193827
37663F920867j457334K480789L191964j54262l871140n666271n044829j524037
37655e124253L484546N975341L979172M06533j227386j062604p24780k14887O17422
37646F109104O62452o6554K94423J850777K025496J36257r37767K19135R94146
37637A1287469l27871j371445l34941M03283j301852l347146l318386k591300
$$ y = [5467272, 2066894, 3613034, 8355392, 8799558, 3673257, -614079, -359924, 811463, -813046, -3384353, -3428772, -566788, 3863960, 8578703, 10812662, 7377505, -380917, -6390635, -6772746, -3622062, -453575, 2000648, 3674927, 3472033, 2265913, 3173067, 5907871, 5478442, 166230, -3849177, -696520, 6220504, 9114694, 6920867, 5463533, 7944322, 11136286, 10982024, 7110884, 1444613, -3600216, -5124253, -1639707, 4335634, 8314806, 8721339, 7493953, 6431349, 5706569, 5491682, 6109104, 6771556, 6705002, 6999425, 8850202, 10875698, 11011955, 10074188, 10293323, 11287469, 10959598, 9588153, 9253212, 9656495, 8354643, 5007497, 1689111, -902189]
37629i02189k832250k243921O86872L276493K676048O05792M9266M38871R0062
37620A845044J450J050882R74886j326534k133547J342934N014437L458352j386694
37611H841210l080503k75947K367698J665790q40904k305355j180746K355149
37603G546392N368943L863842j480076m703093k925095n52610j105226r27844
37595E085233L098580O052242L005933j316489j04235L462266J972192k621717
37587A8634005k267525L418679P728449Q521554Q396644O549765K208812K090642
37579E5281025J1091637K0543736K1776597K5148427M3558231O0996891M6449976
37572B84846520K881787k8475348k3308565k274065J2649940L4758874P4434282
$$ y = [-902189, -3734439, -5978360, -5291488, -2014995, 661053, 1266845, 1316111, 1754982, 1845044, 1846494, 2897376, 3872262, 2545728, 412181, 1755115, 6769552, 10227904, 8841210, 5760707, 5484760, 7852458, 9518248, 8677344, 6371989, 5191243, 7546392, 12915335, 16779177, 15299101, 10596008, 7670913, 7118303, 6013077, 5085233, 8183813, 14236055, 17241988, 15925499, 15821264, 19283530, 21255722, 18634005, 16366480, 19785159, 27513608, 36035162, 44431806, 50981571, 53190383, 55281025, 66372662, 86916398, 108692995, 133841422, 177399653, 238396544, 284846520, 287728307, 259252959, 235944394, 233670329, 246320269, 281079143, 355513425]
37565C55513425R3855209M6587086m7273524j11523877j04480483o1151147l4806736
37558A36719953l2719387k9981627j7789912q662298q048464p946560m864171
37551B6707534m012326o082069m971494M11290L566888J023675l015251l891227
37543I737020k017979l43847o96642k650455l272689K85421N705269O532885J191260
37534A4470243l668287k810450k05048j719075n085575m289689j84247J254452
37526b237676q74241j854590j19893R72212K03124L07655J865564J757759q42879
37517h22965k546410j422150L91944J252980K339192L751127L004572n02446l639875
37508A805969m064665k714104m02524L425132O712293M913421j743170o125024
$$ y = [355513425, 449368634, 495955720, 448682196, 337158319, 232677836, 171526689, 136719953, 104000566, 74018939, 56229027, 47566729, 39518265, 31571705, 26707534, 22695208, 16613139, 11641645, 12052935, 15619823, 16643498, 13628247, 9737020, 7719041, 7375194, 6678552, 4028097, 755408, 1040829, 6746098, 13278983, 14470243, 10801956, 7991506, 7786458, 6067383, 981808, -3307881, -3492128, -2237676, -3111917, -4966507, -5086400, -4114188, -3911064, -3603409, -1737845, 19914, -822965, -3369375, -4791525, -4399581, -3146601, -807409, 2943718, 5948290, 5445844, 1805969, -2258696, -4972800, -5375324, -1950192, 4762101, 9675522, 7932352, 1807328]
37500A807328l421535J931022L172849Q16473l31564j9999j409627l345753j541118
37491b341924K945280M054775N12867k051074p44446J28081k390082l936074n09677
37482d332274L798867L122056o19296j425696P77670J304769k29963M3026J877057
37473D316216P85044k916409l034683K144821N896531L108347k185559l681340
37465D432968j511146P37735K426548L749365J985833l638835p174881l253292
37457b245705L523127M187620j194859l989987o90710K534173R00074j698443
37449A325290n93389J339826q78313n213104n456859r88223K398323J191866j363030
37440h237613p46714K472758L963229J636109j854892k645255k76413K319936
$$ y = [1807328, -1614207, 316815, 3489664, 4306137, 3974573, 3954574, 2544947, -800806, -2341924, 603356, 4658131, 5170998, 3119924, 2375478, 2503559, 113477, -3822597, -4332274, -533407, 2588649, 1969353, 543657, 1321327, 2626096, 2396133, 2439159, 4316216, 5101260, 2184851, -849832, 1294989, 7191520, 10299867, 8114308, 4432968, 2921822, 3659557, 6086105, 9835470, 11821303, 8182468, 1007587, -2245705, 1277422, 5465042, 4270183, 280196, -410514, 2123659, 3023733, 1325290, 731901, 2071727, 1193414, -4019690, -9476549, -10464772, -8066449, -6874583, -8237613, -8984327, -6511569, -2548340, -912231, -2767123, -5412378, -5688791, -3368855]
37432c368855K958103K411583J805568K04050k881827m610079k182234J855311
37424c808380K207483j114911k427328M77138K387299n98890l553825J79461P520474
37415A268521Q599766R24017o525010n673317R3414K079611j144384l201940n68322
37406d147644K418564Q79813l042060l641266j19307K800982K246818Q43661J626393
37397a34046K975470J651183j300278j533440K011987N075147L734991n22050
37389A1958964l178666k418533m04535L32845l51208j169860j356720q86145J33972
37380B660114J223828J272623k80729k119530k130438q7549J918043K154636R67257
37371E578255q00283l100244m944502l766199O45666L603779J014107l782027
$$ y = [-3368855, -410752, 2000831, 3806399, 4010449, 1128622, -3481457, -5663691, -3808380, -1600897, -2715808, -5143136, -4665998, -2278699, -2877589, -6431414, -6251953, 1268521, 9868287, 10792304, 4267294, -1406023, -1312609, 767002, -377382, -3579322, -4147644, -1729080, -849267, -3891327, -7532593, -7651900, -4850918, -2604100, -1760439, -134046, 2841424, 4492607, 3192329, 1658889, 3670876, 8746023, 12481014, 11958964, 8780298, 6361765, 5957230, 6290075, 5938867, 4769007, 3412287, 2526142, 2660114, 3883942, 5156565, 4875836, 2756306, 625868, 538319, 2456362, 4610998, 5578255, 4777972, 1677728, -3266774, -7032973, -6387307, -2783528, -1769421, -5551448]
37363e551448l773076J183814L621684q2702l891463j585380L516487L978177
37355b583907m22865l141334o97229L841097O318228N280139R95634m417788o502554
37346a330579k982197J737564J563310k384815l493402o9437K508277J167940
37338c283339j20315K141357M730834L253698m46909j227089J556213L527264
37330A0131714J553952k613821m793704k916713O90728J576062j332276l716867
37322a420925j777700J649278J193784k167248k410438J269945K654299r74500
37314a983505l716122n11934M550071M692778L01962l332359m176617l589878
37306g765604j626650J736705L210318K00679l503883k118442L164555N588006
$$ y = [-5551448, -9324524, -8140710, -4519026, -4601728, -8493191, -10078571, -6562084, -2583907, -3006772, -6148106, -6845335, -3004238, 3313990, 8594129, 9589763, 5171975, -1330579, -4312776, -2575212, -1011902, -3396717, -6890119, -6959556, -4451279, -3283339, -3403654, -1262297, 3468537, 6722235, 6275326, 5048237, 6604450, 10131714, 11685666, 9071845, 4278141, 1361428, 2052156, 3628218, 2295942, -1420925, -3198625, -1549347, -355563, -2522811, -4933249, -3663304, -1009005, -1983505, -5699627, -6211561, -1661490, 3031288, 3333250, 891, -4175726, -7765604, -9392254, -7655549, -4445231, -4244552, -7748435, -9866877, -6702322, -1114316]
37298a114316K758534p85846j255493j32963J51614j34199n73116k253452m453824
37289g793061l519017J870096P042501O409665Q88704k990131j379611K303822
37281B832968K502235p19197k046223Q61452L326952O65613l859326l291946K062507
37272B335035M530323Q99265k740105j294292J029306j593114o117134n302813
37264h253529M51551L948050K522458P43530J549988K038721j07099k235684j584817
37255i26831K25143N17096j97204m5029Q60527J328271J291633J125757L64757
37246D544120j326726l056824l597262k584192o72007O50929N1317j550318j149034
37237h689997K061476M223369J711139k854536l484687O97702M092515K384305
$$ y = [-1114316, 1644218, 858372, -397121, -530084, -378470, -512669, -1085785, -3339237, -7793061, -11312078, -9441982, -2399481, 4010184, 4898888, 1908757, 529146, 2832968, 5335203, 4616006, 2569783, 3431235, 6758187, 7423800, 3564474, 272528, 2335035, 6865358, 7764623, 5024518, 3730226, 4759532, 3166418, -2950716, -8253529, -7801978, -3853928, -1331470, -587940, 962048, 3000769, 2893670, 657986, -926831, -701688, -184592, -381796, -426825, 433702, 1761973, 3053606, 4179363, 4544120, 3217394, 160570, -3436692, -6020884, -6692891, -6041962, -5990645, -7540963, -8689997, -6628521, -2405152, -694013, -3548549, -7033236, -6335534, -2243019, 141286]
37229A41286k043734l717881l80697N287169Q205508N023170k131478o533956
37221C849387m096050J265255K801904J24688j459574K0186R00992m71292j78676
37212B756820M162641P913628N310591k304819q066780p536329k228385L060514
37204C067881M069130o2020n535605o923937l065802J655236L064453J895561
37196a835103J175030J483115J214727k10787j751115k332184j484598N32234
37188c208681K255681K154652R98615J120769K524353K293523p27536l391561
37180D019815k567975J92289R19173j218219l147787k178434Q74441K904122J916321
37171A713746q63200k306302j066992R53754J744001K048781K971500K773179
$$ y = [141286, -1902448, -5620329, -6001026, -713857, 7491651, 12514821, 10383343, 3849387, -246663, 1018592, 3820496, 3945184, 2485610, 2505796, 3406788, 2935496, 2756820, 6919461, 14833089, 20143680, 17838861, 9772081, 2235752, 7367, 3067881, 7137011, 7074991, 1539386, -5384551, -8450353, -6795117, -3730664, -1835103, -660073, 823042, 2037769, 1826982, 75867, -2256317, -3740915, -3208681, -953000, 1201652, 2200267, 3321036, 5845389, 8138912, 7411376, 4019815, 1451840, 1644129, 2563302, 1345083, -1802704, -3981138, -3106697, -202575, 1713746, 850546, -1455756, -2522748, -1568994, 175007, 2223788, 5195288, 7968467]
37163G968467k65603l356067k424397Q75087J002763k384435l548217l61273J931286
37154e62389j24888j810710J888944P207147O639814n9833n930656o221712k698450
37145a672733M98976J102035n74326k055809p55980K275738K757027n22029l059141
37136b006242j362169J447248R52502j265432q77644J682755K786848K260410
37128C618276K263201J555761k222554n842378l655192K515584M415732l24912
37120B323518m406612k081794K696665L309273j3394k465003k281589j181960
37112d100896J6631J629449K573467J474697n73101j295644n46774j0040l48388
37103a180599o33711m7329J256492K353487J900871m80145k692419k000331Q76187
$$ y = [7968467, 7702864, 4346797, 1922400, 2797487, 3800250, 1415815, -2132402, -2493675, -562389, -687277, -2497987, -609043, 6598104, 13237918, 13178085, 7247429, 1025717, -1672733, -1173757, -71722, -646048, -2701857, -3457837, -1182099, 1574928, 1052899, -2006242, -3368411, -1921163, -968661, -2234093, -3111737, -1428982, 1357866, 3618276, 5881477, 7437238, 5214684, -627694, -4282886, -1767302, 2648430, 2323518, -2083094, -4164888, -1468223, 1841050, 1827656, -637347, -2918936, -4100896, -4084265, -2454816, 118651, 1593348, 1020247, -275397, -822171, -832211, -1180599, -1814310, -1861639, -605147, 1748340, 3649211, 3169066, 476647, -1523684, -647497]
37094f47497K012196r9800k073503r61284Q14102p08516m194416m262005O69990
37085i450733N664270N490904Q01346l469069m028554j852337J36532L38147n61437
37076f930931q69864L28198K466391M263664M848232L939703J416643k388719
37068G073317n838429o514795l617453N85835K898212K771847K412081L048673
37060B819288K971930N29593k673065l696860k222243j88774J447441K641261
37052A628571J954411j622598m795143k884521K405255L655069j411539n463226
37044f533721k130423M268909N500024J681165n75265L58345j09174l052061l573690
37035d165891K14716L308792J932849q50373j256427p37568j482474j131042K552020
$$ y = [-647497, 1364699, 1264899, -808604, -1769888, -955786, -1664302, -5858718, -10120723, -9450733, -3786463, 1704441, 2505787, -963282, -4991836, -6844173, -6707641, -6369494, -6930931, -7800795, -7472597, -5006206, -742542, 4105690, 8045393, 9462036, 7073317, 1234888, -5279907, -8897360, -8311525, -5413313, -2641466, -229385, 2819288, 5791218, 6320811, 3647746, -49114, -2271357, -2460131, -1012690, 1628571, 3582982, 1960384, -2834759, -5719280, -3314025, 341044, -1070495, -6533721, -8664144, -4395235, 1104789, 2785954, 2210689, 2569034, 2459860, -592201, -4165891, -3951175, -642383, 1290466, 440093, -816334, -1553902, -3036376, -4167418, -1615398]
37026a615398N575759K493523m666293q092310m376311J899375N038032M455809
37018G12186L016404K488381K363451J464393m92464k356595k599084j451001
37010C145671r52777j769243j606902J069820L387677J513455k882197l713628
37002a808124R75284N398147L484142k821116o226302l722825M39316J659765
36994b621713Q66946J333289K697352J914907j041097k580960j085631O51226
36986A34319J21291j070542n00241P31863J37663j645677j998103p51589L3305
36977d807711n1328L82672J259040J184671N92320J094786J869474O72278j460587
36968G35615j026597J704364K087678j592850m852997l478198Q23978L909560
$$ y = [-1615398, 3960361, 6453884, 1787591, -6304719, -10681030, -8781655, -3743623, 712186, 3728590, 6216971, 8580422, 10044815, 9552351, 7195756, 4596672, 3145671, 2192894, 423651, -1183251, -113431, 3274246, 4787701, 1905504, -1808124, -832840, 4565307, 8049449, 5228333, -997969, -4720794, -4281478, -2621713, -1754767, -421478, 2275874, 4190781, 3149684, 568724, -516907, 134319, 255610, -814932, -1315173, -583310, -445647, -2091324, -4089427, -4841016, -4807711, -4859039, -4476367, -3217327, -2032656, -1440336, -345550, 1523924, 2196202, 735615, -290982, 1413382, 3501060, 1908210, -2944787, -6422985, -5599007, -1689447]
36960a689447M489189L118921j33099l610236l470142Q09432L743376J100446
36952D358440l319452l242191N33208K119014K43763p19135Q64880J232592j605589
36943D65530l939988k321274J067464K172872R59168L08605J165638J820839J041867
36934B740721m42963j326492j134498k73678O25769J308494J762241J551756K57781
36925E069131j024724l42721J782228J827726j776776n383315m912439j882368
36917f643258o02050r84239O22031L998971M486574Q73047k089222j394936m02750
36908b135832k230560l700073q48740L435708L282740p91296k516402N73189L901855
36899a029411L137176r9559j782777j053616K81873J239466J833742J235042j371535
$$ y = [-1689447, 2799742, 5918663, 5785564, 2175328, -1294814, -485382, 3257994, 4358440, 1038988, -2203203, -1669995, 449019, 692782, -26353, 838527, 2071119, 465530, -3474458, -5795732, -4728268, -2555396, -1596228, -1287623, -121985, 1698854, 2740721, 2297758, 971266, -163232, -436910, 188859, 1497353, 3259594, 4811350, 5069131, 4044407, 3701686, 5483914, 7311640, 5534864, 151549, -4760890, -6643258, -7245308, -8229547, -7607516, -3608545, 878029, 1751076, -338146, -1733082, -2135832, -4366392, -8066465, -8915205, -5479497, -2196757, -2988053, -5504455, -4931266, -1029411, 2107765, 2008206, 225429, -828187, -546314, 693152, 2526894, 3761936, 2390401]
36890B390401m282672m111514j15058L841597L341854r60808l735575j707882
36882e339657J957512K003872j575672l680606j446513K107665L004142J640293
36874a328964R48721J721451K487414K332376J213072j082653l677659l821853
36866a208095m18619K908665J791517k511879m455117j867076J537841J983325
36858b239438L13435n88960m4663O06930L34515r44629k469099k624433o05723
36849h262065J718730K009464J416763K854217N107925L483441k084977n020710
36841A222788j592696K789335J806983j779117j095058L066567L566656r52072
36833G033386l786949j304548J712091R42966n06552J228749L158407O10082m130307
$$ y = [2390401, -1892271, -6003785, -6118843, -2277246, 1064608, 103800, -3631775, -5339657, -3382145, -1378273, -2953945, -6634551, -8081064, -5973399, -2969257, -1328964, -380243, 1341208, 3828622, 6160998, 7374070, 6291417, 2613758, -1208095, -1626714, 1281951, 3073468, 561589, -3893528, -5760604, -4222763, -2239438, -1926003, -2514963, -2559626, -1952696, -1618181, -2562810, -5031909, -7656342, -8262065, -6543335, -4533871, -3117108, -262891, 4845034, 8328475, 6243498, 1222788, -369908, 2419427, 4226410, 2447293, 1352235, 4418802, 7985458, 7033386, 3246437, 1941889, 3653980, 4596946, 4090394, 5319143, 8477550, 9087632, 4957325]
36824D957325n010404j762741J97028j400918k965058j594445Q84124J817178
36816d877911J508424J309305J062198K75561l66006j38701O37217J426782J926548
36807B763417J506266l4612j274742q61215p1575j011133k595534j839330O96859
36798b721599J028185j502716k254920J318937M657320K517250k814040m639266
36790d410849j417363J823386J228760j352360k237938n28786K239758M077049
36782e78343L195080n58456l955901k877076K147686N552788L567048j058589
36774E434237l195792j858345J23682J064376J596993J666540J5981k781779l867946
36765a802053k014672K88177K46956j494912k271187j190043L85123J207076J051689
$$ y = [4957325, -53079, -1815820, -1618792, -3019710, -5984768, -7579213, -6695089, -4877911, -3369487, -2060182, -997984, -722423, -1088429, -1227130, -589913, 836869, 2763417, 4269683, 4235071, 2960329, 2099114, 2027539, 1016406, -1579128, -3418458, -2721599, -1693414, -3196130, -5451050, -4132113, 525207, 3042457, 228417, -4410849, -5828212, -4004826, -2776066, -4128426, -6366364, -6895150, -4655392, -578343, 2616737, 2058281, -1897620, -4774696, -2627010, 2925778, 6492826, 5434237, 2238445, 380100, 503782, 1568158, 3165151, 4831691, 4847672, 2065893, -1802053, -3816725, -3528548, -3281592, -4776504, -7047691, -8237734, -7852611, -6645535, -5593846]
36756e593846o5110j522072j425403J344200M492156M299752P19200k158150j637512
36747a546785L67795J159230J277243K130840K286260j60209l105102k547265
36739a37993J186154L328365J270221k292935l708791k594042m98735J567868
36731a879888K621803J416221j358848k715226j110619J201576J267005p55112
36723a313088k466445k395483q06981J244501K407502J940831R60592J132457
36715G03886J770576P96168r88344k93542K642763K876538j559854n139486k357376
36706a548671L668364N418732J598851k141354k144233p04704p13693j386857
36698B046435q02891R36012K518604K895466J319268j788003l975318l189854
$$ y = [-5593846, -5658956, -7181028, -8606431, -7262231, -2770075, 1529677, 2248877, 90727, -1546785, -1178990, -19760, 1257483, 3388323, 5674583, 5514374, 2409272, -137993, 1048161, 4376526, 5646747, 3353812, -354979, -2949021, -3447756, -1879888, 741915, 2158136, 799288, -1915938, -3026557, -1824981, -557976, -1313088, -3779533, -6175016, -6981997, -5737496, -3329994, -1389163, -428571, 703886, 2474462, 3270630, 2282286, 1988744, 4631507, 7508045, 5948191, 808705, -1548671, 2119693, 7538425, 9137276, 6995922, 4851689, 4146985, 3433292, 2046435, 1243544, 2179556, 4698160, 7593626, 8912894, 7124891, 3149573, -40281]
36690d0281p82794M08853K20627L96130O38738p59420k842120k731224n69095
36681f060586L95335q40712j592217k20603J434242J427628L15743m45458M6045
36672e540583K340591N350530N577789J344268l253133l213608k86948j25383
36664B193523k866321l513564j274450l12671o10956K500933P590728O366354
36656A0073576j910451n944222O24217P710434L765178o036901q142441j377543
36648a238153L281895R27636j738257P76079N110371O072153L068383k075888
36640A4184219p038921q172178m043421N16118L23209j584351J102776O188340
36632A475791N682620l02057l105389o0110J679191j454033l498789q94287O29242
$$ y = [-40281, -823075, -414222, -193595, 202535, 841273, 81853, -2760267, -5491491, -6060586, -5665251, -6505963, -8098180, -8318783, -6884541, -5456913, -5141170, -5586628, -5540583, -3199992, 2150538, 7728327, 9072595, 5819462, 2605854, 2318906, 2193523, -672798, -4186362, -5460812, -5773483, -6384439, -3883506, 3707222, 10073576, 8163125, 2218903, 2843120, 10553554, 14318732, 8281831, 139390, -1238153, 2043742, 2971378, 1233121, 2009200, 7119571, 13191724, 16260107, 14184219, 7145298, -1026880, -5070301, -4554183, -4230974, -5815325, -4712549, 1475791, 7158411, 6856354, 3750965, 3690855, 5370046, 3916013, 417224, -477063, 152179]
36623A52179k716231m822595o57871L857415J847896k397081j171770L115986
36615b792072K860824r44681j058922K550399K836264j364303l110019O14205
36607d08305L942588J879828k468559l623788j078751J911426K634475J64271
36599B953185l949663n325072j069010N011924N865921M19855n125084n727024
36591f944968k456325J547151M702647N349124K032158k544665l112409L05881
36583a121406J538637j885686l976736J26080N298800L631507l174924o099923
36575e663651k191782J857462N97407k468863j443323K605768L874403J185541
36567a647038l44545K393428N216235K739127l027681m747490j21080M613229
$$ y = [152179, -2564052, -7386647, -8044518, -4187103, -2339207, -4736288, -5908058, -2792072, 68752, -875929, -1934851, 615548, 3451812, 2087509, -1022510, -408305, 3534283, 5414111, 2945552, -678236, -1756987, 154439, 2788914, 2953185, -996478, -6321550, -7390560, -2378636, 3487285, 3907140, -1217944, -6944968, -9401293, -7854142, -3151495, 2197629, 4229787, 1685122, -1427287, -1121406, 417231, -1468455, -5445191, -5319111, -20311, 3611196, 436272, -5663651, -7855433, -5997971, -5400564, -7869427, -9312750, -6706982, -2832579, -1647038, -1991583, 401845, 5618080, 8357207, 5329526, 582036, 460956, 5074185]
36559E074185L473469j162964k981695j224055o40627l156251n080408l296838
36551h995184N53391L609339N326173N460833K467476l162165o989483n429086
36543g158706o21505K393859J965992O55771Q90499K340368L148684J961053q57718
36534D718297l024972k390533P6588J132067k7664m70330J456564K885434R63870
36525E319321k217693k979178k037414k544120l625456j354981L763535N879815
36517B03829K127600k863858l536410o68009J298195J170713J136066J719712
36509E87838J073567q89716j611037k9291J556210J168566N4902N7354L51901
36500B320294o71969j907997j060614J003488R28906j700713l144134j173952
$$ y = [5074185, 8547654, 7384690, 4402995, 3178940, 2538313, -617938, -5698346, -8995184, -8441793, -4832454, 493719, 5954552, 8422028, 5259863, -1729620, -7158706, -7780211, -5386352, -3420360, -2764589, -1874090, 466278, 3614962, 5576015, 4718297, 1693325, -697208, -620620, 511447, 483783, 13453, 1470017, 4355451, 5319321, 3101628, 122450, -1914964, -4459084, -8084540, -9439521, -5675986, 203829, 2331429, -532429, -4068839, -4736848, -3438653, -2267940, -1131874, 587838, 1661405, 771689, -839348, -868639, 687571, 1856137, 1911039, 1968393, 2320294, 1648325, -259672, -1320286, -316798, 612108, -1088605, -4232739, -5406691]
36492e406691J406368J429161M58002J450915K726001M44798l708200l407164
36484d606810K360858O123808K295681m019885l877689K721899P060291M064010
36476A2122163j678286l730948k361134j947596l400820l551611q58682K257439
36468c149475L131496J931681Q8500j893793l479706k934513M46057L865574L581529
36459A587350R4412j956104j25410K236748P71333l607141o053848m189193r9125
36450a1340978L382970N108315M457827J310741k118337k671031n45583Q23034
36442a593042J69243J08600J864140K366761m50146l163145j758373J708504K094828
36433A347370p64763j947706R07964M405976M496306J118219l061270n436601
$$ y = [-5406691, -4000323, -2571162, -2113160, -662245, 2063756, 2508554, -1199646, -4606810, -2245952, 3877856, 6173537, 2153652, -1724037, 997862, 8058153, 12122163, 10443877, 6712929, 4351795, 2404199, -996621, -4548232, -5406914, -3149475, -17979, 1913702, 2002202, 108409, -3371297, -6305810, -5859753, -1994179, 1587350, 1681762, -274342, -399752, 1836996, 2608329, -998812, -7052660, -11241853, -11340978, -7958008, -2849693, 1608134, 2918875, 800538, -1870493, -2416076, -1593042, -1423799, -1315199, 548941, 2915702, 2465556, -697589, -2455962, -747458, 1347370, 582607, -1365099, -457135, 3948841, 8445147, 9563366, 6502096, 1065495]
36425A065495m296147J10770M403293M605849P63101l219020m634023m093068
36417e293750k362309J101305M996246N373809Q49561m031629l892435N40855
36409b718347L622006K064116j748468l543829j939034R26745K072536O49531
36401f14744j189865q50933R32081N14990l164837n615811k201906M728294Q004286
36392E41555N038066Q60952K64852J244501l10442k972575k207776J156751J261786
36383D877670l144754n597507j470622M552831N146264O70256k522600j511646
36375I99892J248828L711424N678353N190809K04791n690392o036762j313999
36367C992944R83640j818284l268002R39771N072322K637093k926652m072519
$$ y = [1065495, -3230652, -3119882, 1283411, 5889260, 6652361, 3433341, -1200682, -5293750, -7656059, -6554754, -1558508, 3815301, 4664862, 633233, -3259202, -2718347, 903659, 2967775, 1219307, -2324522, -4263556, -3336811, -1264275, -614744, -1804609, -2655542, -1723461, -1208471, -4373308, -9989119, -12191025, -7462731, 541555, 5579621, 6440573, 6705425, 7949926, 7639484, 4666909, 2459133, 3615884, 4877670, 1732916, -3864591, -5335213, -782382, 4363882, 5034138, 2511538, 999892, 2248720, 5960144, 11638497, 16829306, 17034097, 11343705, 5306943, 3992944, 4976584, 3158300, -109702, 830069, 5902391, 8539484, 5612832, 1540313]
36359A540313p82848J300800P69676O55203J244111K62539j473790j549905j243036
36350G23063k483371k089400K956638P009142K282180p310684r609972k109171
36342a0631575M610155L496625o1022J18011J308461k13844j201496J276627K611739
36333A313681j289070n362392l162176K034596K412760k007489m474987k373113
36325a2908190O68095J928692K160052J926803R01213L4969K70157M97122P667
36316d513420L59053J786573J625810l30557J04440L935201N372757J188501k727019
36307F801339r77546J721119j020413n411919m128621M88364J150644p77392J246140
36298i08285N148470L462685j535622m90598N381068M737147l812221p998027
$$ y = [1540313, 757465, 2058265, 2827941, 3483144, 4727255, 4989794, 3516004, 1966099, 723063, -1760308, -3849708, -893070, 6116072, 8398252, 1087568, -8522404, -10631575, -6021420, -2524795, -2585817, -2467806, -1159345, -1373189, -2574685, -1298058, 1313681, 24611, -5337781, -8499957, -6465361, -4052601, -6060090, -10535077, -12908190, -12240095, -10311403, -8151351, -6224548, -5323335, -5288366, -5018209, -4521087, -4513420, -4154367, -2367794, -741984, -1072541, -968101, 2967100, 8339857, 9528358, 6801339, 5823793, 7544912, 6524499, 1112580, -3016041, -2527677, -1377033, -2154425, -908285, 4240185, 7702870, 6167248, 5676650, 11057718, 15794865, 11982644, 3984617]
36290C984617k677022J610174k070653m680790J650866P914161K815118p467731
36282A078740q649625l75570N429171L715025J36508j607025l152861l203047
36274f628684J650890P275060M880845m429798q840599k920446M321397L379155
36266a312180k235486k945907K517516O972169N811096J565061j618852k790735
36258E962682k927136k512994j787908j419047j501724p77894J749198M486380
36250A271557M115331j07162m166741l488763J227022M798309L992819M30331
36242H072703k812062m073950k447956J512502L682232j1882o252407o400098
36234h730918J181796P123020M044179k554024l085660J541790K746585j233001
$$ y = [3984617, 1307595, 2917769, 847116, -3833674, -2182808, 5731353, 8546471, 1078740, -7570885, -7946455, -2517284, 1197741, 1334249, -272776, -3425637, -6628684, -4977794, 2297266, 7178111, 2748313, -6092286, -9012732, -4691335, -1312180, -3547666, -6493573, -3976057, 2996112, 8807208, 10372269, 8753417, 5962682, 3035546, 522552, -1265356, -2684403, -4186127, -4964021, -3214823, 1271557, 5386888, 5279726, 1112985, -2375778, -1148756, 3649553, 7642372, 8072703, 5260641, 1186691, -1261265, 251237, 3933469, 3921587, -2330820, -8730918, -7549122, -426102, 3618077, 1064053, -2021607, -479817, 2266768, 1033767]
36226A033767l127648J136145O489439O811216K315574l227288p101264p453938
36218c123997l480816J983469M164713K422639Q40894J513469J586949j182698
36210D724622m190930l956247j096838J277086J770117J125540L00392j29245
36202a75503R7304O35548J101671J702353K086205Q82714j579108k157681M01427
36193B994930K233205K41232j705458J156528M698336R41850p624569r106367
36185f170313o6505P971957N126551k953726n133877j065412J575006N23540l11112
36176e03891k25317j904283l603074p09200M728189N116696n59463m317251j622484
36167c600078J830238J26129l198938j573195L647673N573855K356384j292757
$$ y = [1033767, -2093881, -957736, 5531703, 12342919, 14658493, 11431205, 4329941, -3123997, -6604813, -4621344, -456631, 1966008, 2806902, 4320371, 5907320, 4724622, 533692, -3422555, -4519393, -3242307, -1472190, -346650, -46258, -175503, -78199, 557349, 1659020, 3361373, 5447578, 6330292, 4751184, 2593503, 2994930, 5228135, 5469367, 3763909, 4920437, 9618773, 10560623, 2936054, -6170313, -6236818, 1735139, 6861690, 3907964, -1225913, -2291325, -716319, -192779, -503891, -729208, -2633491, -6236565, -6945765, -2217576, 2899120, 2339657, -1977594, -3600078, -1769840, -1643711, -4842649, -6415844, -2768171, 2805684, 5162068, 3869311]
36159C869311k083436j574075j427205p21594O49800N31116j405986j890769R98633
36150c054205M177410L857997J009974r01895j540116k876055m087605k305491
36142e719986J445710K272494j070280l507062j080181L270892M763974L676781
36134D052342K921801K102987p42614l756417l331799m20545Q49035K83688J539919
36125C498397M777120N457808J815867k080575k803483k094823k483375k972836
36117C114100j987996o77930l16001K22331J684838K349861J212358M5116r6427
36108E550250r43894l023970l330901j47152L255794L194554Q12882o35155p41687
36099C990721o84387N2039J936300K967998J667787M4143J10544J26070k046078
$$ y = [3869311, 1785875, 211800, -1215405, -1936999, -1287199, -756083, -2162069, -4052838, -3054205, 1123205, 4981202, 5991176, 5089281, 3549165, 673110, -3414495, -5719986, -4274276, -2001782, -3072062, -6579124, -7659305, -4388413, 375561, 4052342, 6974143, 9077130, 8334516, 4578099, 1246300, 825755, 1674790, 1958478, 3498397, 8275517, 13733325, 15549192, 13468617, 10665134, 8570311, 6086936, 3114100, 1126104, 448174, 132173, 354504, 2039342, 4389203, 5601561, 5646677, 5550250, 4606356, 1582386, -1748515, -1895667, 1360127, 4554681, 5367563, 4732408, 3990721, 3306334, 3358373, 5294673, 8262671, 9930458, 9974601, 10085145, 10211215, 8165137]
36090H165137m592949m644101k843161j170506R05513L971890N431743L311933
36082H535499L95421j44534q0702k032518l587444j575009J129035k9576l000021
36073c89849k697775k65415m40416j776310J055422O112703N542048j153958n303003
36064F83447k596411J196824R79955n39235k43520k01921j381803k60822L323113
36055I59627L323419j899329m537632L47129N590671L089810l078570l966195
36047a71070j39231J367608j01220L33483K350199J244526j877515j017391L669669
36038E659058N353279J862665j419332j405751j488142l722584m858677l047912
36030c067396j320067j272289m9702L036910L537394l90395l410397j090695K709223
$$ y = [8165137, 3572188, -1071913, -3915074, -5085580, -4180067, -208177, 5223566, 8535499, 8930920, 8786386, 8705684, 6673166, 3085722, 1510713, 2639748, 2610172, -389849, -3087624, -3353039, -3793455, -5569765, -4514343, 1598360, 7140408, 5986450, 683447, -1912964, -716140, 263815, -275420, -518940, -720861, -2102664, -2363486, 959627, 4283046, 2383717, -2153915, -1806786, 3783885, 6873695, 3795125, -171070, -310301, 1057307, 956087, 1289570, 3639769, 4884295, 3006780, 1989389, 5659058, 11012337, 12875002, 11455670, 10049919, 8561777, 4839193, -19484, -3067396, -4387463, -5659752, -5709454, -2672544, 864850, 474455, -2935942, -4026637, -1317414]
36021a317414K009356j946440l388782j150079Q02907M87868J77007J674762L530537
36012H79722L640595J993661K29628k22707L89512J89305j725276k929677n81627
36003A863136L105561K396697l288227o837883l015769L536969M672153J09865
35995B542502l199385j452325K198833L993480M024670L306621J337672j503427
35987A1248641l035370k747966k896467m235832l948569k00119M153817N226502
35979C564637L186942Q32899q97750k751520m021892l247107j429779j014792
35971e778362j666030n35427K711149M630734L115965O06666J83357J186122J277100
35962E731274N48301M14409J57912j650204l198822j176824L272849M686697R15990
$$ y = [-1317414, 691942, -1254498, -4643280, -5793359, -4990452, -4502584, -4325577, -2650815, 879722, 4520317, 6513978, 6743606, 6520899, 6910411, 7099716, 5374440, 2444763, 1863136, 4968697, 7365394, 4077167, -2760716, -5776485, -2239516, 2432637, 2542502, -656883, -2109208, 89625, 4083105, 8107775, 11414396, 12752068, 11248641, 8213271, 5465305, 2568838, -1666994, -5615563, -5815682, -1661865, 3564637, 6751579, 7584478, 6686728, 3935208, -86684, -3333791, -4763570, -5778362, -7444392, -7979819, -5268670, -637936, 2478029, 3084695, 3268052, 4454174, 5731274, 6279575, 6693984, 6851896, 5201692, 2002870, 826046, 4098895, 8785592, 9701582]
35953I701582l299222l027522j50482L8492k850933l892590n48394L392837L138307
35944B502075o38279l017580j379898J631751K131044L03012j64483K123428L578187
35935G069257Q00038l483274l506309Q92872L483257Q35400k713522k347603k09787
35926H20329p38208k564085j426790J399596R26220k258030k257868J940658M324283
35917A66105J929356n69061K92044Q25376j904071l234114J145094O019929L830978
35908H501636k631187l946597R95417L347532j384137o422286m660696Q33916
35900e366402K571778j27485j704399L76358K773223K463068J083633J506056
35892C575830K884091J615170l222864p451923o214060j82168M711654M318306
$$ y = [9701582, 6402360, 3374838, 3224356, 3262848, 411915, -3480675, -4029069, -636232, 2502075, 1863796, -1153784, -2533682, -901931, 1229113, 1532125, 1367642, 3491070, 7069257, 7869295, 4386021, 879712, 1772584, 5255841, 6091241, 3377719, 1030116, 820329, 82121, -2481964, -3908754, -2509158, -1582938, -3840968, -6098836, -4158178, 166105, 2095461, 1526400, 1818444, 2643820, 739749, -2494365, -1349271, 4670658, 8501636, 5870449, 1923852, 2919269, 6266801, 4882664, -1539622, -6200318, -5366402, -2794624, -2922109, -4626508, -4250150, -1476927, 986141, 2069774, 3575830, 6459921, 8075091, 4852227, -2599696, -8813756, -8995924, -4284270, 34036]
35884C4036P92098j395082j468544j602323k154628j484573L18777J397553J560658
35875d002028K006493J865040o61349l502633k077524L254922O210743L447408
35867F541072m43660k21092K130204J336320k651919n226278m311658k055077
35859d902088k76910J198106J941939Q34213j087430j199739P17684J956749Q25184
35850G708j356820k472610j619840R61311L685390L821980N97212k421196j228709
35841b5574K632064L679647K71360l290498l343076j348397j8480R53175K484311
35832A994532K855810M31076k688972l281280j697817o21592m28869O89865K706436
35823d0811L429494K200570O87412l35224j869442l655030l428705p24469J378067
$$ y = [34036, 826134, -568948, -2037492, -3639815, -5794443, -7279016, -6960239, -5562686, -4002028, -1995535, -130495, -791844, -4294477, -6372001, -3117079, 3093664, 6541072, 6097412, 5876320, 8006524, 9342844, 6690925, 1464647, -2847011, -4902088, -5178998, -3980892, -2038953, -1204740, -2292170, -3491909, -2774225, -817476, 7708, -1349112, -3821722, -5441562, -4480251, -794861, 3027119, 3624331, 1203135, -25574, 2606490, 6286137, 6557497, 3266999, -76077, -1424474, -1442954, -489779, 1994532, 4850342, 5281418, 2592446, -688834, -2386651, -3008243, -3437112, -2747247, -40811, 3388683, 5589253, 6276665, 5941441, 4071999, 416969, -3011736, -3736205, -2358138]
35814b358138M99787j224983l53670K255237K403487r76260l727002k278727J104942
35805d655327J518800j485309l223433n94361L539928M422505J741202o95721
35797E68284o17775L91502M63207L54048J252072J904303M19695j999548j815889
35788I19899J871802N098616L208744l356048q739978p623250j098475M117868
35780e600822K819200k744940n145161l75031P012613Q803801K813634m241152
35772C342142m587942J319876N619384L052943k675291m448036j323814J294880
35764A594142N49160O7120K761584M498432J04075p015937p976689j175075M818136
35755a775052L470359q76826r33091J897747O20693n089100p486630k401424M408121
$$ y = [-2358138, -1858351, -3083334, -3437004, -1181767, 1221720, 245460, -3481542, -5760269, -4655327, -3136527, -4621836, -7845269, -8439630, -4899702, -477197, 1264005, 568284, -49491, 342011, 805218, 1159266, 2411338, 4315641, 4735336, 2735788, 919899, 2791701, 7890317, 11099061, 7743013, -996965, -8620215, -9718690, -5600822, -2781622, -5526562, -10671723, -11046754, -4034141, 4769660, 7583294, 3342142, -1245800, 74076, 5693460, 8746403, 6071112, 1623076, 299262, 1594142, 2143302, 2210422, 4972006, 9470438, 9574513, 2558576, -5418113, -6593188, -1775052, 1695307, 818481, -114610, 1783137, 2403830, -2685270, -10171900, -12573324, -8165203]
35746h165203N500119J470824j525647p81617R06806P99698m08700j006726q39925
35737d050371m48499J95731Q89459O14727r52186k234620j373543J216605L024681
35728c118016K372868L48731p25952k42110J83560p98163k278578k383012q77702
35719g518374Q12975K035451L629626N499994N255161J256937l855321n338944
35711A777505k423492L85479n30126k834773j899808K150694M632516L142971
35703D400966K68093j356911k576885m131473l525819O50010M214794K262077
35695B04852k904393m207159q3440L372082J839341j349245j605856j74489m28616
35686e336923j133793R57331M078237L166268j658159m006627q9866N677255O282599
$$ y = [-8165203, -2665084, -1194260, -2719907, -3501524, -2594718, -1795020, -2203720, -3210446, -4050371, -4498870, -4303139, -3413680, -2798953, -3751139, -5985759, -7359302, -6142697, -3118016, -745148, -396417, -1122369, -1364479, -1180919, -1979082, -4257660, -6640672, -7518374, -6705399, -4669948, -1040322, 4459672, 9714833, 10971770, 7116449, 1777505, -645987, -260508, -790634, -3625407, -5525215, -3374521, 1257995, 4400966, 4669059, 3312148, 735263, -3396210, -6922029, -6272019, -2057225, 204852, -2699541, -6906700, -6990140, -3618058, -1778717, -3127962, -4733818, -4908307, -5336923, -6470716, -5513385, -1435148, 1731120, 72961, -3933666, -4023532, 1653723, 7936322]
35677G936322N88118n976885p518934k912486L753854O740959L706007j952929
35669D364026m646292k735373K29595O64160o64229o46128J342413K634762J043599
35660A586533k202394l985691l026952j051077j23185k116P64585K064013K546714
35651c429570K363445K917323L577711J853050j989367m032654k526796q41473
35643b108331j574183j778675J392143M187160J786950k501490j521754L389755
35635A271575L414273l207247p109323k259229M125944K618452m031573n604139
35627a0781267L53333O204784N766748J015685k845508l237613m34577L444132
35619e14283M907286K182084j883971l185067k105897k192409l737772l333313
$$ y = [7936322, 8524440, 2547555, -4971379, -7883865, -4130011, 2610948, 6316955, 4364026, -282266, -3017639, -2788044, -2123884, -2788113, -3434241, -2091828, 542934, 1586533, -615861, -4601552, -7628504, -8679581, -8802766, -8804882, -8040297, -5976284, -3429570, -1066125, 1851198, 5428909, 7281959, 5292592, 1259938, -1266858, -2108331, -3682514, -5461189, -4069046, 118114, 1905064, -596426, -2118180, 1271575, 4685848, 1478601, -5630722, -7889951, -3764007, -1145555, -5177128, -10781267, -10427934, -4223150, 1543598, 2559283, -286225, -3523838, -3958415, -514283, 4393003, 6575087, 4691116, 1506049, -599848, -2792257, -6530029, -9863342]
35611i863342q7789K461976J908757K49988n7127M02648L26111J75150L30058
35602d153570j93881j177287m20710K171034K878175m74907m256755l774560r1709
35593i494170K059374J640630J734057L007926K163928j628360l759970q84891
35585e161476L198165K767843j078777k121410J237974L593731J243708k100496
35577A579262j651341P62745L44736k084659j329581K931185M606949O48465l675071
35568B132690k544894J651086K156287j961004m722785k109718K563082L632015
35560G96759M93327k199696p36774L049230L976968m2876m887232m825540K74319
35551d101515M588560L651321n18833l024333k393457r36122m99530o23870k68613
$$ y = [-9863342, -9951131, -7489155, -5580398, -5330410, -5387537, -4984889, -4658778, -4483628, -4153570, -4347451, -5524738, -5945448, -3774414, -896239, -1371146, -5627901, -9402461, -9494170, -7434796, -5794166, -4060109, -1052183, 1111745, -516615, -4276585, -5161476, -1963311, 804532, -274245, -2395655, -1157681, 2436050, 3679758, 1579262, -72079, 690666, 1035402, -1049257, -2378838, 552347, 5159296, 5807761, 2132690, -412204, 1238882, 3395169, 1434165, -3288620, -5398338, -2835256, 796759, 1290086, -909610, -1646384, 1402846, 5379814, 5336938, 449706, -4375834, -4101515, 487045, 4138366, 3619533, 595200, -1798257, -2734379, -3233909, -3857779, -4126392]
35542d126392Q51568K352037L079347J649378j437595l233232j676182J332423
35534a208648J984540q62797m605545n749456k816798K511962O205475N362580
35526H21313J856163M46351K223924K920844l84942m419680m686495k000883l2612
35517c256017Q18054K284627L236223J300367j794164k091355n7370K64503j298917
35508e94049m29108L729390N720930J436191n610766q469087m620979K124864
35500f712614N645264K810453l147366n000434J22065O134071N596483J06177
35492E554099k511890j30804J801873N48954L2631K164466K334042k086120n724424
35483A982827l309335J717088K703217l14037k201237j025654R37417K131524
$$ y = [-4126392, -3274824, -922787, 2156560, 3805938, 2368343, -864889, -2541071, -1208648, 775892, -86905, -4692450, -10441906, -13258704, -10746742, -4541267, 821313, 2677476, 3123827, 5347751, 8268595, 7883653, 3463973, -1222522, -3223405, -3256017, -2437963, -153336, 3082887, 4383254, 2589090, 497735, 440365, 704868, -594049, -1023157, 2706233, 8427163, 9863354, 4252588, -4216499, -8837478, -6712614, -1067350, 1743103, -1404263, -6404697, -6282632, -148561, 5447922, 5554099, 3042209, 2911405, 4713278, 5262232, 5294863, 7459329, 9793371, 7707251, 1982827, -1326508, 390580, 3093797, 2779760, 578523, -447131, 490286, 2621810]
35475B621810K563358J679389k62516q68197M89547L73637k942345n015335j815532
35466c176184K769314K443171j348921k140985N70804J234657j305844j826874
35458b780862J454588L286571N64770k290145j312502K14976j626611l477751
35450e966966k46279N058342M829273r37132l716206Q93658O438316N047453j588164
35441I812295n615730m070643p91335J191604K887977M403004K937918j644392
35433I110698m430229k377598P00311M35163r85644M14437K320195R1308l722609
35424A556032k487191K566217K899317l312464p061821k072898N815363P783682
35416E686237L527759j698060n130310n867319k193662M115060O105345Q00389
$$ y = [2621810, 5185168, 6864557, 6602041, 5733844, 6223391, 6597028, 3654683, -1360652, -3176184, -406870, 2036301, 687380, -1453605, -882801, 351856, -953988, -2780862, -1326274, 1960297, 2525067, 234922, -1077580, -862604, -2489215, -5966966, -6213245, -1154903, 3674370, 2737238, -978968, -85310, 6353006, 11400459, 9812295, 4196565, 125922, -665413, 526191, 3414168, 7817172, 10755090, 9110698, 4680469, 2302871, 3003182, 3438345, 2452701, 2867138, 5187333, 5278641, 1556032, -931159, 1635058, 4534375, 1221911, -5839910, -7912808, -2097445, 5686237, 9213996, 7515936, 2385626, -3481693, -5675355, -1560295, 4545050, 5345439]
35408E345439m868879l868800M23500R77142r26931L87328L313325J577993l745205
35399a385088n270805j592548J367763J275885J883333L929832L369496L40872
35391C918740K33289L202641K189685m763203r323992n228942K051678M030262
35383c689842J049813r39327j61453R08203J360358J752234J034417j335547k715106
35374b736250j073811J169818J177595O06378K071167L540584J359758l017366
35366C097873m450851j489122K114379L001569J545744m29791j953642k452104
35358a015945j499381K98341J597086J670984O40918j098169k726078k999780
35350e132024j470846P43165K043272J783529N27732m33062o7729J003738Q04547
$$ y = [5345439, 476560, -3392240, -2968740, -1991598, -2918529, -2531201, 782124, 2360117, -1385088, -6655893, -8248441, -6880678, -5604793, -3721460, 208372, 3577868, 3918740, 4152029, 7354670, 9544355, 4781152, -4542840, -9771782, -7720104, -3689842, -2640029, -3579356, -3740809, -2832606, -1472248, 279986, 1314403, -21144, -2736250, -3810061, -2640243, -1462648, -856270, 1214897, 4755481, 6115239, 3097873, -1352978, -2842100, -727721, 2273848, 3819592, 3389801, 1436159, -1015945, -2515326, -2216985, -619899, 1051085, 1692003, 593834, -2132244, -5132024, -6602870, -5859705, -3816433, -2032904, -1505172, -1938234, -2005963, -1002225, -197678]
35341a97678j113911k302526p41408J946747K983552K396826J517975l43305l647375
35332D98897n150850k000956K197808J665966j966994j556689L665802O001027
35324C354011J329183m284197l844765R95476L987407K814870o04936l920040
35316a72991m627890p56027N189474P058358L076210j276474j425236J90085l55351
35307F900158k042735k209273j458191r66384M83269K692400K333210p33265j209974
35298C789215K593102L897515j872515p833172n266222K557468N393552J342403
35290D601346k370237j834442k04736L22496J359113K620155J225134k184729
35282C534100l337194j358623O5863p26146j350967n59077P2273K51155J493985
$$ y = [-197678, -1311589, -3614115, -4355523, -2408776, 574776, 2971602, 4489577, 4146272, 498897, -4651953, -6652909, -4455101, -2789135, -4756129, -6312818, -2647016, 3354011, 4683194, 398997, -3445768, -2450292, 1537115, 4351985, 3747049, -172991, -4800881, -5556908, -367434, 6690924, 9767134, 8490660, 7065424, 7255509, 6900158, 4857423, 2648150, 1189959, 223575, 706844, 3399244, 5732454, 4999189, 3789215, 6382317, 10279832, 8407317, 574145, -4692077, -2134609, 3258943, 4601346, 2231109, 396667, 191931, 514427, 1873540, 4493695, 5718829, 3534100, 196906, -1161717, -1095854, -1822000, -3172967, -3732044, -3659771, -3408616, -1914631]
35273a914631K900808J492806k386694m514813k412598K067984N625035N678674
35265F536571J099707n262831o905211j351482M869764M469606j65990j531579
35257A758555P88629Q90250k078806k754716N8222J142406j442593k980611o72163
35248e290827K102050K440594J799074J250488j99922j121343J114909L538705
35240E633728N22661n151109m145802L873861P561715J440574n100178l282294
35232A353156J285231m00030n073580l719959K746132N931638L938541J800158
35224G861287P44177k170547n229923l469569J265743J722978k386649l125057
35216d787560K335104O370090K916586l143018m116008r22695J34501j802310
$$ y = [-1914631, 986177, 2478983, 92289, -4422524, -6835122, -4767138, 857897, 6536571, 7636278, 2373447, -4531764, -5883246, -1013482, 3456124, 3290134, 1758555, 2547184, 3437434, 1358628, -1396088, -1337866, -195460, -1638053, -4618664, -5290827, -3188777, -748183, 1050891, 2301379, 2101457, 980114, 2095023, 5633728, 6156389, 1005280, -3140522, 733339, 8295054, 9735628, 4635450, 1353156, 2638387, 2238357, -2835223, -6555182, -3809050, 2122588, 6061129, 7861287, 8605464, 6434917, 1204994, -2264575, -998832, 724146, -1662503, -4787560, -2452456, 3917634, 6834220, 3691202, -424806, -1347501, -1213000, -3015310]
35208c015310j568756K706717N888632L129211l065079n918833k923806J573057
35200c194167K463209J45771q73858J701241N227435N535259J433854m177968
35192H260776o631241l703026J247472K079965k165078m787288o27198N258217
35184a067401M248954k408931m953954j63659M016060J680833k166332j098315
35176a912745K362602K764335J582674K954329M457778J022479m952897o276344
35168B002211k465105k01196k250121l664019m89389M173056N180687J944796
35160D230920k034288l290558j046279K139076K605296K42864q94216J086864
35152C039679K252524o27901l640344j560943K968364L159658j014257l372246
$$ y = [-3015310, -4584066, -1877349, 4011283, 7140494, 4075415, -1843418, -4767224, -3194167, -730958, -585187, -1459045, 242196, 5469631, 11004890, 12438744, 8260776, 1629535, -2073491, -826019, 1253946, -911132, -5698420, -6325618, -1067401, 3181553, 772622, -4181332, -4344991, -328931, 1351902, -814430, -1912745, 449857, 3214192, 4796866, 7751195, 12208973, 13231452, 8278555, 2002211, -462894, -664090, -2914211, -6578230, -7067619, -2894563, 2286124, 4230920, 2196632, -1093926, -2140205, -1129, 2604167, 2847031, 1952815, 3039679, 5292203, 4664302, 1023958, -536985, 2431379, 5591037, 4576780, 1204534]
35144A204534k021311j047612j596813k4784L408888K828761k851583n915921
35136f015841j194532N362177N407278K38904k391348n482K614032J646159j145416
35127D515931k037638J05116L179576L760997K14801m910491o989864m705747
35119f867319j150464J189466L186996N258756M833865P07550l395171l310816
35111D52863r2535K304429K730513K593412K018574L75565q18034L03668K125230
35102A1993685J507376j055574k301440j892032k762752n181988n017615k8159
35094d738499N624163O137602J449432l013008l259031q97253Q2786j134142j585769
35085a333719N92228K703143R64782l347019m532133l17070M268301L530510j089503
$$ y = [1204534, -816777, -1864389, -3461202, -3485986, -77098, 2751663, -99920, -6015841, -7210373, -1848196, 3559082, 3797986, 1406638, 1401156, 4015188, 5661347, 4515931, 2478293, 2583409, 5762985, 9523982, 9738783, 4828292, -2161572, -6867319, -8017783, -6828317, -3641321, 1617435, 6451300, 7158850, 3763679, 452863, 360328, 2664757, 5395270, 7988682, 10007256, 10382821, 9564787, 9868455, 11993685, 13501061, 12445487, 10144047, 8252015, 5489263, 307275, -4710340, -4738499, 885664, 7023266, 8472698, 5459690, 2200659, 1303406, 1386192, 252050, -1333719, -741491, 1961652, 2926434, -420585, -4952718, -5269788, -1001487, 2529023, 1439520]
35076A439520l655713k294007l79736J03534R90326K854894K865717R7196j697440
35067C24291L5669K032855N76571k019756j344636J354265J319310j253830j530524
35058e05785J137637J630625j915990m120071q04824M201038N098261K265091
35050F985982m87677k548032m671190m213995Q83022N767518L987280j827388
35042C875520k640147L083456O471424J820644m696607m490097J410060N406876
35034A0241129M210373R19067j196739j760258j418302j003558j732005l346187
35026D913520l406907r01843J408468R03467q87329j184828n98949j437027l256302
35017d447730l627816j972355M04486K653679M068519L314922P36843o94210N08174
$$ y = [1439520, -2216193, -4510200, -4889936, -4786402, -3796076, -941182, 1924535, 2021731, 324291, 359960, 2392815, 2969386, 949630, -395006, 959259, 2278569, 1024739, -505785, 631852, 2262477, 346487, -3773584, -4578408, -377370, 4720891, 6985982, 6498305, 3950273, -720917, -4934912, -4051890, 1715628, 5702908, 3875520, 1235373, 4318829, 10790253, 12610897, 7914290, 3424193, 4834253, 10241129, 14451502, 15370569, 14173830, 12413572, 10995270, 9991712, 8259707, 4913520, 1506613, 604770, 2013238, 2916705, 2029376, 844548, 245599, -1191428, -4447730, -8075546, -10047901, -9643415, -6989736, -2921217, 393705, 1130548, 436338, 944512]
35008I44512J789266Q87680n03798o49372j335669l287792k545777K833835O826343
34999D959228L443686k957847l821371j0411M97024k956085k704819K878979N382870
$$ y = [944512, 2733778, 3621458, 3117660, 2468288, 1132619, -2155173, -4700950, -1867115, 4959228, 8402914, 5445067, 1623696, 1613285, 2110309, -845776, -3550595, -671616, 4711254]
$$ [...]
##END NTUPLES=NMR SPECTRUM
##END=
