##TITLE=31Pdec_SR109
 D2O, 24 sc
 17.3.2022
##JCAMPDX= 6.0         $$ Bruker NMR JCAMP-DX V2.0
##DATA TYPE= NMR SPECTRUM
##DATA CLASS= NTUPLES
##ORIGIN= UXNMR, Bruker Analytische Messtechnik GmbH
##OWNER= root
$$ XWIN-NMR		Version 3.5
$$ Thu Mar 17 13:05:35 2022 Russian Standard Time (UT+4h)  she@DPX200
##.OBSERVE FREQUENCY= 81.013821
##.OBSERVE NUCLEUS= ^31P
##.ACQUISITION MODE= SIMULTANEOUS
##.ACQUISITION SCHEME= undefined
##.AVERAGES= 24
##.DIGITISER RES= 16
##SPECTROMETER/DATA SYSTEM= spect
##.PULSE SEQUENCE= zgpg30
##.SOLVENT NAME= CDCl3
##.SHIFT REFERENCE= (INTERNAL, CDCl3, 0, 248.564)
##AUDIT TRAIL= $$ (NUMBER, WHEN, WHO, WHERE, WHAT)
$$ ##TITLE= Audit trail, XWIN-NMR		Version 3.5
$$ ##JCAMPDX= 5.01
$$ ##ORIGIN= Bruker BioSpin GmbH
$$ ##OWNER= she
$$ F:/spectra/data/she/nmr/P31/1/pdata/1/auditp.txt
$$ ##AUDIT TRAIL=  $$ (NUMBER, WHEN, WHO, WHERE, WHAT)
(   1,<2022-03-17 13:04:30.01 +0400>,<she>,<DPX200>,
      <created by zg, POWCHK disabled, PULCHK disabled
       configuration hash MD5:
       00 E9 B6 7A A2 85 ED C7 34 08 36 98 17 FE 4E 26
       data hash MD5: 32K
       48 16 B2 84 F4 DD F2 59 81 0C 9E 63 8E A7 B7 4D>)
(   2,<2022-03-17 13:04:32.71 +0400>,<she>,<DPX200>,
      <Start of raw data processing
       efp BC_mod = 2 LB = 1 FT_mod = 6 PKNL = 1 PHC0 = -9093.485 PHC1 = -87.52437 SI = 64K 
       data hash MD5: 64K
       2D 5E 34 FB 59 5E A7 60 9D 40 96 77 3C 13 41 76>)
(   3,<2022-03-17 13:04:55.51 +0400>,<she>,<DPX200>,
      <pk PHC0 = -29.30315 PHC1 = 0 
       data hash MD5: 64K
       1E 6B E7 FC 0D 87 FD F3 B7 1A 59 C1 3B 0B 46 A5>)
$$ ##END=
$$ 
$$ hash MD5
$$ 54 6D 30 8A B8 97 C3 1F 3A C9 B6 17 35 6B 34 F2
##$RELAX= 
##$RELAX= 
##$RELAX= 
##$RELAX= 
##$RELAX= 
##$RELAX= 
##$RELAX= 
##$RELAX= 
$$ Bruker specific parameters
$$ --------------------------
##$DU= <F:/spectra>
##$EXPNO= 1
##$NAME= <P31>
##$PROCNO= 1
##$TYPE= <nmr>
##$USER= <she>
##$AMP= (0..31)
100 100 100 100 100 100 100 100 100 100 100 100 100 100 100 100 100 100 
100 100 100 100 100 100 100 100 100 100 100 100 100 100 
##$AQSEQ= 0
##$AQ_mod= 1
##$AUNM= <au_zg>
##$AUTOPOS= <>
##$BF1= 81.014009
##$BF2= 200.13
##$BF3= 200.13
##$BF4= 200.13
##$BF5= 200.13
##$BF6= 200.13
##$BF7= 200.13
##$BF8= 200.13
##$BYTORDA= 1
##$CFDGTYP= 0
##$CFRGTYP= 5
##$CHEMSTR= <none>
##$CNST= (0..31)
1 1 145 1 1 1 1 1 1 1 1 1 1 1 1 1 1 1 1 1 1 1 1 1 1 1 1 1 1 1 1 1 
##$CPDPRG= <waltz16>
##$CPDPRG1= <>
##$CPDPRG2= <waltz16>
##$CPDPRG3= <>
##$CPDPRG4= <mlev>
##$CPDPRG5= <mlev>
##$CPDPRG6= <mlev>
##$CPDPRG7= <mlev>
##$CPDPRG8= <mlev>
##$CPDPRGB= <>
##$CPDPRGT= <>
##$D= (0..31)
0 1 0 0 0 0 0 0 0 0 0 0.03 2e-05 3e-06 0 0 0 0 0 0 0 0 0 0 0 0 0 0 0 0 
0 0 
##$DATE= 1647507869
##$DBL= (0..7)
120 120 120 11 120 120 24 19 
##$DBP= (0..7)
150 150 150 150 150 150 150 150 
##$DBP07= 0
##$DBPNAM0= <>
##$DBPNAM1= <>
##$DBPNAM2= <>
##$DBPNAM3= <>
##$DBPNAM4= <>
##$DBPNAM5= <>
##$DBPNAM6= <>
##$DBPNAM7= <>
##$DBPOAL= (0..7)
0.5 0.5 0.5 0.5 0.5 0.5 0.5 0.5 
##$DBPOFFS= (0..7)
0 0 0 0 0 0 0 0 
$$ [...]
##$SUBNAM2= <"">
##$SUBNAM3= <"">
##$SUBNAM4= <"">
##$SUBNAM5= <"">
##$SUBNAM6= <"">
##$SUBNAM7= <"">
##$SUBNAM8= <"">
##$SUBNAM9= <"">
##$SW= 501.771253377433
##$SWIBOX= (0..15)
0 1 3 0 0 0 0 0 0 0 0 0 0 0 0 0 
##$SW_h= 40650.406504065
##$TD= 32768
##$TD0= 1
##$TE= 0
##$TE2= 300
##$TE3= 300
##$TEG= 300
##$TL= (0..7)
0 120 53 12 22 120 120 120 
##$TP= (0..7)
150 150 150 150 150 150 150 150 
##$TP07= 0
##$TPNAME0= <>
##$TPNAME1= <>
##$TPNAME2= <>
##$TPNAME3= <>
##$TPNAME4= <>
##$TPNAME5= <>
##$TPNAME6= <>
##$TPNAME7= <>
##$TPOAL= (0..7)
0.5 0.5 0.5 0.5 0.5 0.5 0.5 0.5 
##$TPOFFS= (0..7)
0 0 0 0 0 0 0 0 
##$TUNHIN= 0
##$TUNHOUT= 0
##$TUNXOUT= 0
##$USERA1= <user>
##$USERA2= <user>
##$USERA3= <user>
##$USERA4= <user>
##$USERA5= <user>
##$V9= 5
##$VALIST= <valist>
##$VCLIST= <CCCCCCCCCCCCCCC>
##$VD= 0
##$VDLIST= <DDDDDDDDDDDDDDD>
##$VPLIST= <PPPPPPPPPPPPPPP>
##$VTLIST= <TTTTTTTTTTTTTTT>
##$WBST= 1024
##$WBSW= 4
##$XGAIN= (0..3)
0 0 0 0 
##$XL= 0
##$YL= 0
##$YMAX_a= 1603
##$YMIN_a= -1606
##$ZGOPTNS= <>
##$ZL1= 120
##$ZL2= 120
##$ZL3= 120
##$ZL4= 120
##$ABSF1= 0
##$ABSF2= 0
##$ABSG= 0
##$ABSL= 0
##$ALPHA= 0
##$AQORDER= 0
##$ASSFAC= 0
##$ASSFACI= 0
##$ASSFACX= 0
##$ASSWID= 0
##$AUNMP= <proc_1d>
##$AZFE= 0.1
##$AZFW= 0.5
##$BCFW= 0
##$BC_mod= 2
##$BYTORDP= 0
##$COROFFS= 0
##$CY= -3
##$DATMOD= 1
##$DC= 0
##$DFILT= <>
##$DTYPP= 0
##$F1P= 0
##$F2P= 0
##$FCOR= 1
##$FTSIZE= 65536
##$FT_mod= 6
##$GAMMA= 0
##$GB= 0
##$INTBC= 1
##$INTSCL= 5.30512e-09
##$ISEN= 30
##$LB= 1
##$LEV0= 0
##$LPBIN= 0
##$MAXI= 10000
##$MC2= 0
##$MEAN= 0
##$ME_mod= 0
##$MI= 50
##$NCOEF= 0
##$NC_proc= -8
##$NLEV= 6
##$NOISF1= 182.463
##$NOISF2= 159.3651
##$NSP= 0
##$NTH_PI= 0
##$NZP= 0
##$OFFSET= 248.5645
##$PC= 4
##$PHC0= -9122.788
##$PHC1= -87.52437
##$PH_mod= 1
##$PKNL= yes
##$PPARMOD= 0
##$PSCAL= 0
##$PSIGN= 0
##$REVERSE= no
##$SF= 81.014009
##$SI= 65536
##$SIGF1= 159.3651
##$SIGF2= -187.1042
##$SINO= 113.3802
##$SIOLD= 16384
##$SREGLST= <1H.CDCl3>
##$SSB= 0
##$STSI= 65536
##$STSR= 0
##$SW_p= 40650.406504065
##$SYMM= 0
##$S_DEV= 0
##$TDeff= 32768
##$TDoff= 0
##$TI= <>
##$TILT= no
##$TM1= 0
##$TM2= 0
##$TOPLEV= 0
##$USERP1= <user>
##$USERP2= <user>
##$USERP3= <user>
##$USERP4= <user>
##$USERP5= <user>
##$WDW= 1
##$XDIM= 65536
##$YMAX_p= 481210824
##$YMIN_p= -114842439
$$ End of Bruker specific parameters
$$ ---------------------------------
##NTUPLES= NMR SPECTRUM
##VAR_NAME=  FREQUENCY,     SPECTRUM/REAL,   SPECTRUM/IMAG
##SYMBOL=    X,             R,               I
##VAR_TYPE=  INDEPENDENT,   DEPENDENT,       DEPENDENT
##VAR_FORM=  AFFN,          ASDF,            ASDF
##VAR_DIM=   65536,         65536,           65536
##UNITS=     HZ,            ARBITRARY UNITS, ARBITRARY UNITS
##FACTOR=    0.620285442955139, 1,           1
##FIRST=     20137.2065510759, 0,            0
##LAST=      -20513.1999529892, 0,           0
##MIN=       -20513.1999529892, -114842439,  0
##MAX=       20137.2065510759, 481210824,    0
$$ Real data points
##PAGE= N=1
##DATA TABLE= (X++(R..R)), XYDATA
$$ [...]
42584 2127297 2124898 2552572 -1885205 -7530256 -7354789 -2810447 -1327790 -4265472 -5810103
42575 -5810103 -3143491 43962 732611 676773 1928009 3276710 2693460 -38603 -3730382
42566 -3730382 -6323193 -5711680 -2580691 -761067 -1839802 -2020669 1727272 5503497
42558 5503497 3928432 -746016 -1542059 2585312 5923507 5483564 4216927 4024211 2527183
42549 2527183 -1152153 -3421373 -1685325 1936203 4467328 5308247 4176895 753849
42541 753849 -2016460 230817 5821855 7166336 1603463 -3604479 -1678449 3441221
42533 3441221 3263259 -2504561 -6215199 -3714328 1154912 3791281 4697942 6069197
42525 6069197 6874324 4654687 308016 -1951349 528210 5655393 8951877 8313893
42517 8313893 5418973 2545387 -392720 -4484658 -8752065 -10501853 -8580048 -4653312
42509 -4653312 -1368443 -560496 -2589464 -5574590 -6035933 -2717466 789643 87480 -3668639
42500 -3668639 -4796602 -815739 4318092 5727873 3173269 -303975 -2373928 -2301181
42492 -2301181 -195481 2858809 5543726 7994132 10779032 12109311 9363319 4156384
42484 4156384 1847993 4035488 5509751 1707589 -4300194 -6253826 -3663673 -1790289
42476 -1790289 -3685418 -6523712 -6220191 -2546851 1266853 2195935 52791 -2620119
42468 -2620119 -3314058 -2515562 -2739475 -4105098 -3214987 1700767 6822211 7066240 3128404
42459 3128404 651169 2569556 5868263 6790386 5858350 5543141 5452515 3202704 -622283
42450 -622283 -1933959 1244893 5338308 5743458 3030658 1514811 2655431 3959442
42442 3959442 4589711 7027241 11101435 11521460 5436755 -1826747 -3850910 -2336190
42434 -2336190 -2860146 -4601112 -2609807 1189523 -797087 -8335274 -11129459 -4115894
42426 -4115894 4030684 3608202 -2621094 -5984138 -5497951 -6058245 -7396884 -4585896 2037833
42417 2037833 6410911 6264233 5220283 4634755 1073988 -5830394 -9934860 -6827095
42409 -6827095 -585215 1793157 -609864 -3060425 -2476176 -678066 -974727 -4019148
42401 -4019148 -7321630 -7980235 -5937992 -4378043 -5987069 -9191919 -9750454 -6133153
42393 -6133153 -1503456 188543 -1443102 -3497113 -3291128 -838432 1619595 2107587
42385 2107587 949324 -63371 -516249 -2042009 -5325112 -7968765 -7062508 -2980942
42377 -2980942 1152029 3264675 3939761 4502480 5050105 4563085 2225552 -1245293 -3419196
42368 -3419196 -2249359 1264029 3762734 3372904 1376003 -389829 -1774010 -3145373
42360 -3145373 -4172962 -4878455 -5779743 -6076001 -4293678 -1717386 -1850334 -4869832 -6319363
42351 -6319363 -3549018 508652 2869846 5383065 9827980 12188564 7532918 -1825325
42343 -1825325 -8664757 -9859589 -8011973 -5684404 -3422302 -2518943 -4271594 -6674013
42335 -6674013 -6520389 -4371364 -3071671 -2454471 -568890 948522 -1372951 -6065863
42327 -6065863 -7745114 -5209673 -2670740 -2318460 -1643038 720968 2383352 2144103 2148611
42318 2148611 3231739 3118120 1062371 -546314 -836335 -1810311 -3567134 -3412137 -1405224
42309 -1405224 -1256757 -3676969 -4578415 -2326440 -850361 -2583200 -4334291 -3777554 -4005555
42300 -4005555 -7184981 -9355435 -6781787 -2611838 -1700996 -3050358 -3034319 -2365799 -3876645
42291 -3876645 -6301502 -6136394 -3615259 -1724165 -1228144 -1228990 -2379984 -5040794 -6673920
42282 -6673920 -5526254 -4183973 -4987288 -5248867 -2186831 1078925 686877 -382227 2656659
42273 2656659 6652479 4495501 -2630887 -6271773 -4102303 -2819955 -5785916 -7119942
42265 -7119942 -2202277 3887844 4054308 -479062 -3370299 -2629665 -1233096 -947191 -838471
42256 -838471 -681924 -1471539 -2797734 -2820081 -928397 1388225 2066556 -75578 -4362334
42247 -4362334 -7840360 -7242209 -2496001 2792811 4944480 3053819 -1624516 -6753451
42239 -6753451 -8967923 -5775762 1111333 6543791 7454784 5716583 4425105 3726072
42231 3726072 2019365 -743675 -2993031 -3514857 -2066995 795436 3578396 4975627
42223 4975627 5716553 7303749 8463387 5854645 -384767 -5181863 -4982221 -2489329
42215 -2489329 -1732577 -1374961 2421932 8159095 9613598 4787503 -772976 -1694635 113079
42206 113079 -751028 -4839773 -7267008 -4854995 -250947 2054669 1147314 -698136 -2010679
42197 -2010679 -3083453 -3442244 -1310671 3245987 6761499 5908470 1610161 -2104924
42189 -2104924 -2677252 -833933 1416177 2563613 1704654 -909323 -3173336 -2885521 -543022
42180 -543022 1381018 2135573 3508312 6369177 8717873 8438861 6156823 3971267 2913923
42171 2913923 3000633 4187871 5580105 5024645 1489442 -2857318 -4653778 -2986613 327411
42162 327411 3466837 5998679 7777936 7999446 5812476 1420307 -3373956 -5804226
42154 -5804226 -4452959 -1365353 -315356 -1968474 -2581167 662227 4745246 4182395
42146 4182395 -1413947 -6514639 -7049185 -5483132 -6625072 -10499944 -12225500 -8653614
42138 -8653614 -2634261 562067 -143457 -583494 2605278 6693062 5924361 -478930 -6482346
42129 -6482346 -6907458 -4149909 -4270692 -8360482 -11965396 -12413547 -11711835 -11106110 -8014900
42120 -8014900 -1623268 2795570 177690 -6123611 -8001616 -3695153 473718 113388
42112 113388 -1337234 617232 3891224 3462560 -477391 -3210613 -3117597 -3534828 -6526567
42103 -6526567 -9195277 -8040175 -3957739 -670319 -101324 -1433307 -3382089 -5048188
42095 -5048188 -5017997 -2016509 2794069 5706329 4113869 -47475 -1876927 915592
42087 915592 5101787 5811258 2467132 -1188175 -2699792 -3514807 -4919110 -4722402 -978240
42078 -978240 3299682 3149588 -1435887 -5572926 -6487417 -6547837 -8401674 -10713688 -10606333
42069 -10606333 -7758413 -4203713 -1803226 -1117164 -1080203 801870 5666248 10225624
42061 10225624 9486002 3436936 -2412334 -4520204 -5252892 -7063087 -7413051 -3771193
42053 -3771193 189876 -712831 -4282613 -3182626 3919065 9538626 7612864 1684676
42045 1684676 -333965 3462374 7400994 5899859 -307473 -5936727 -7172432 -4663496
42037 -4663496 -1249901 1345293 2506227 1106286 -3352898 -8305609 -9960452 -8142341
42029 -8142341 -6131407 -4942884 -1869964 3499513 6527963 4201327 316707 -365842
42021 -365842 660035 -625282 -3465781 -4911485 -6448283 -10550612 -12928980 -7113437
42013 -7113437 3691424 8716372 4926253 873567 2462791 4441636 1162842 -3116514
42005 -3116514 -2241363 480074 -2000085 -7707543 -8049509 -1238930 5368955 6425499
41997 6425499 4477975 3467043 2940566 1201921 -773691 -1456215 -1505077 -2085771 -2822243
41988 -2822243 -3065306 -3183602 -3437377 -3457924 -3628860 -4957531 -6834411 -7054002 -4996794
41979 -4996794 -2770922 -2120257 -2117596 -1233312 62935 467822 331314 983342 2090554
41970 2090554 1682145 -808378 -3107293 -2819985 -714104 286166 -715042 -1327604 304290
41961 304290 2409162 2401308 1287877 2167065 4924574 6184365 5051792 4805489 7031918
41952 7031918 8034217 4388250 -912478 -2111979 1040753 3024530 364219 -4077645
41944 -4077645 -5364250 -2154741 2953226 6697008 7672291 6801056 5978829 5721221 4480140
41935 4480140 1160635 -2522999 -3752294 -2129510 67723 643752 -1067261 -4738443
41927 -4738443 -8905681 -10651432 -7804110 -1845160 3124371 4622689 3547852 1818149
41919 1818149 201502 -1108134 -1590202 -1030274 -36391 688881 903743 528710 -334231
41910 -334231 -996133 -703456 267228 780032 252493 -628887 -694245 374273 1331508 303992
41900 303992 -2702483 -4736407 -3207584 -91135 6959 -3345473 -5073276 -2017293 1968486
41891 1968486 1675308 -1882769 -4014516 -4115749 -5467106 -8319104 -8995924 -6383774 -3930139
41882 -3930139 -3669778 -2998690 419581 4525571 6146873 5189493 3192092 625568 -2009638
41873 -2009638 -3158181 -2749070 -3169175 -5167531 -5485355 -1702194 2921200 3225065 -716558
41864 -716558 -4141727 -4519739 -3942249 -4459995 -4904163 -3694802 -1829677 -1101413 -1281202
41855 -1281202 -1151175 -1128227 -2629690 -5166383 -6251694 -4831299 -3046057 -3211617 -4279920
41846 -4279920 -3400286 -580932 823592 -989773 -3411385 -3118330 -515184 1757227
41838 1757227 2941389 3966351 4475609 3377011 1747865 1845488 3394377 4114622 3819158
41829 3819158 4398892 5608742 4932382 2395440 1245201 2399026 2490904 -467883 -3640214
41820 -3640214 -4207679 -3613788 -3703887 -2494122 2122583 7643017 10349219 10761713 11149190
41811 11149190 10237392 5803903 618590 -266531 2595082 3859095 2060364 1412295
41803 1412295 4189975 7431513 8915069 10352743 11878215 9290809 1166450 -6027474
41795 -6027474 -5341652 1083396 5142928 3608973 694230 692886 3114126 5490081 6771754
41786 6771754 6832980 5742933 4595033 4685461 5324192 4771586 3495603 3685023 5151308
41777 5151308 4944401 2053957 -736370 -1156897 -314201 742125 3660855 8664766 11029014
41768 11029014 6551050 -1140822 -4103171 -677507 2770424 1626703 -945891 -335721
41760 -335721 2082955 2056242 -448420 -2218964 -2930623 -5085352 -8353849 -9064199 -6163587
41751 -6163587 -3220772 -2698890 -2003335 2074441 7616511 9459187 5742011 18461
41743 18461 -2971683 -1938385 607308 1569048 468489 -607813 -347691 -429557 -2860716
41734 -2860716 -5987281 -5970109 -2472791 216293 -1076169 -4456790 -6468336 -6644879 -6137699
41725 -6137699 -4537314 -1463962 638462 -744278 -3621669 -3676752 -783392 723672
41717 723672 -1066200 -2446775 447452 6137902 10133646 10582399 9065030 7153906
41709 7153906 4823769 1932428 -841573 -2820031 -3811671 -3687971 -2556809 -1389773
41701 -1389773 -1286175 -1795789 -1171766 969256 2419213 1328869 -303855 1528543 7011480
41692 7011480 11184907 10389706 7651308 8235444 11374030 11215593 6172248 1830528 2271300
41683 2271300 3706496 1067437 -3170843 -2668775 2457906 5520452 3322869 192406
41675 192406 519383 2592041 2445961 -198254 -2760442 -3645247 -2711421 -385397 1418692
41666 1418692 -57515 -4492602 -7524047 -6211298 -3297099 -3323459 -6469249 -9222852
41658 -9222852 -9577729 -8393445 -6669615 -4535467 -2355731 -336359 2087162 4076704
41650 4076704 2202464 -5104080 -13048456 -14684850 -9630461 -4518469 -4284077 -7151198
41642 -7151198 -9336750 -10256814 -10692053 -9723699 -6986419 -5286646 -7257075 -11021262 -12599261
41633 -12599261 -11440037 -10205128 -9934961 -9068996 -7118915 -5724529 -5472774 -4867756 -3385669
41624 -3385669 -2541534 -2704296 -1909043 362073 1224527 -1133063 -3582565 -2163342 1639296
41615 1639296 2744450 -74889 -2850989 -2894549 -2268852 -3174592 -3859567 -2068617 395368
41606 395368 254445 -1856615 -2504620 -1272180 -1495397 -4695775 -7787346 -7304989 -3813486
41597 -3813486 -348929 1520825 2039639 1086283 -1866173 -5674081 -7230488 -4135662
41589 -4135662 2596326 8746944 10171027 6569742 2033703 1018207 3658354 6010078
41581 6010078 5038004 2030894 470412 1733679 3914613 4276508 2158226 -240766
41573 -240766 -4510 2802680 4130572 456681 -5976851 -9232841 -7529196 -5545566
41565 -5545566 -7072021 -9093100 -6821286 -1752301 276495 -2213102 -4930696 -5199959
41557 -5199959 -5313800 -6976429 -7508872 -4629994 -993249 -176014 -1164917 -1018796 -704578
41548 -704578 -3303925 -7356072 -7313915 -1547444 4615777 5862409 3429155 2130944 3586538
41539 3586538 5594943 6604867 7198472 7344031 5519403 1718257 -1031911 -49373 3183651
41530 3183651 4415089 1670953 -2551947 -4484370 -3293674 -1237550 -366696 -458086 -399249
41521 -399249 -335483 -1370050 -3577016 -5421902 -5321834 -3081388 361163 3894402 6613852
41512 6613852 7875017 7524224 5874994 3298960 303915 -1822629 -1317114 2251277
41504 2251277 6783622 9086925 7654076 3827221 547417 227103 3081871 6664173
41496 6664173 7601323 5017979 1991572 2255992 5506967 7611827 5854699 2131129
41488 2131129 -133427 -488434 -961210 -2124037 -2154866 -10410 2574445 3291388 2257434
41479 2257434 1752273 3592195 7552314 11802246 13954800 12104329 6293441 -427104
41471 -427104 -3508426 -1046589 3508353 4335534 -165699 -5131890 -5170830 -1279060 914470
41462 914470 -646848 -1870657 487018 3156554 1090208 -4663298 -8063932 -5996826
41454 -5996826 -919902 4028809 8093042 10394312 8919248 4187153 512366 1046181
41446 1046181 4006196 5997087 6551029 6910164 6760958 5296611 3792924 3908848 4520956
41437 4520956 3270434 530896 -981686 -81572 1937562 3749390 4936229 4919986 3396859
41428 3396859 1587385 907571 842657 161019 -660489 -559087 -230075 -513048 122612
41419 122612 2738934 3853234 -824726 -8659884 -11518247 -6246483 1261337 4481948
41411 4481948 3959983 3817552 5075700 6230524 6991367 7444069 6198288 3139470 1416394
41402 1416394 2747518 3410302 -406333 -5468638 -5252930 246338 4265068 2950332
41394 2950332 -348010 -1629028 -1703064 -2700499 -3642787 -2863086 -1728416 -2462228 -4192306
41385 -4192306 -4272131 -2293148 -86582 1416757 2901606 4719549 6307414 7363069
41377 7363069 7973228 7795674 6532948 4917898 3850232 2906566 1190140 -702890 -1419755
41368 -1419755 -1543929 -3321445 -6823596 -8479076 -5327196 499272 3839098 2656506
41360 2656506 -270899 -2059023 -3352002 -5748614 -8019985 -7687568 -5221542 -3607181
41352 -3607181 -3855212 -3842160 -2180222 -592016 -1282947 -4006399 -6872432 -8282463 -7178480
41343 -7178480 -3463421 672501 1939624 -223820 -2993306 -4347135 -5307626 -6699664
41335 -6699664 -6998892 -5661934 -5130813 -6347688 -5683313 -551819 4857618 4606616 -271320
41326 -271320 -3567421 -3026053 -1857782 -1965999 -2001290 -2241039 -4820913 -8083781 -7301402
41317 -7301402 -2888938 -1302553 -4982561 -7897168 -4916076 449883 2340671 1000374
41309 1000374 -490804 -2782346 -7006518 -9158579 -5260384 474278 415840 -4710770
41301 -4710770 -6500747 -1488095 4210501 4397971 532722 -2501610 -3027318 -1933506
41293 -1933506 425622 3369572 4668576 2991200 -122153 -2411304 -3357167 -3551488
41285 -3551488 -3630393 -4539794 -6602330 -7800166 -5625554 -1215503 1336208 564783 -726330
41276 -726330 -429175 -29056 -798766 -944318 649103 1123516 -2274870 -7019033 -7920288
41267 -7920288 -3784832 1665392 4660330 4337855 1541447 -2487453 -6254687 -8895231
41259 -8895231 -10682167 -11188290 -8206588 -1025214 6087865 6941619 522067 -7338458
41251 -7338458 -10165708 -6997419 -1867006 1039761 832858 -190394 765733 3805188
41243 3805188 5794196 3960336 -269421 -2735662 -1967861 -964637 -2541310 -4996563
41235 -4996563 -4563235 -1070997 1517935 530691 -1773129 -1417914 1801148 4106664 2880254
41226 2880254 20864 -842555 810793 2019026 528401 -2270492 -3179585 -932946
41218 -932946 2720312 5100318 4876048 2426205 -1113269 -4525816 -6507953 -5938151 -2973288
41209 -2973288 340130 1559393 238043 -2021516 -4048530 -6120250 -7729709 -6387433
41201 -6387433 -948330 4990883 5921161 718054 -6273166 -10538172 -11190646 -9285020
41193 -9285020 -5816874 -2949608 -3894916 -8639464 -11985407 -9204422 -2457394 1749014
41185 1749014 945062 -930887 182745 3281599 4895141 4217678 3273417 3173624 2481284
41176 2481284 -551328 -5242878 -8355852 -6722124 -531600 5868381 7422526 3334507
41168 3334507 -1986513 -3587947 -1069707 1635120 1038146 -2294807 -4833402 -4026909
41160 -4026909 -943160 818725 -1028925 -4642672 -5715677 -2405476 2316320 4302862
41152 4302862 3329555 2618052 3522193 3388913 -68421 -4673896 -6550301 -5658584 -5593102
41143 -5593102 -7969712 -9896813 -7984357 -2770155 2093300 3650819 1663571 -1855247
41135 -1855247 -4151170 -3928255 -2802369 -3322097 -5046572 -4494751 -31396 5289916 7476023
41126 7476023 6427404 5034379 4941938 5463539 5650917 5231307 4151989 2935394 2623419
41117 2623419 2925167 1917793 -692522 -2042803 -220228 2316418 2490044 1510336 2113233
41108 2113233 2995218 951237 -2774741 -3852788 -2074375 -1300021 -2086468 -874366 2269386
41099 2269386 2055526 -3082151 -7019166 -5075938 -1363172 -1839846 -4834800 -4556538 -686872
41090 -686872 1911416 1272941 190284 587481 1014011 -179377 -2917894 -6453956 -9314256
41081 -9314256 -9059780 -5114326 -608113 1667335 3369058 6946782 9794628 6935654
41073 6935654 -1183905 -8377363 -10308906 -8299968 -5453495 -2989806 -921523 1044136
41065 1044136 3619979 6176023 5599594 355391 -5412025 -6160509 -2477183 583404
41057 583404 1897927 4863012 9257895 9520585 3622676 -2450158 -2689841 1323078 4485909
41048 4485909 5474784 5898892 5896596 4999878 4571347 5231138 4382918 451143 -2827874
41039 -2827874 -1013853 3826904 5384703 1779060 -2745669 -4704413 -5316844 -6616293
41031 -6616293 -7645068 -6504320 -3633522 -1221039 -865399 -2803067 -5831523 -7185048
41023 -7185048 -4423684 1173321 4714069 3016778 -1219442 -2650398 -174857 2014519
41015 2014519 851441 -994846 706758 4958908 6684511 4263930 1567407 1276128
41007 1276128 828004 -1850899 -2794993 2622350 11224545 15000127 11952236 8169259
40999 8169259 8547829 11011118 11350223 8584513 3479444 -3311170 -9020723 -9329365 -4275092
40990 -4275092 459130 1168627 727674 2240173 3075792 194708 -2951518 -1168811 3720247
40981 3720247 5561052 3647149 2976503 5170819 5942028 2722379 -1062879 -1394021 1198284
40972 1198284 3857067 5025459 4168747 1313856 -1520996 -1534979 846901 2145202 1024975
40963 1024975 -10577 779636 1842635 1995220 2677881 4265858 3964264 402600 -3058666
40954 -3058666 -3083312 -1383287 -1004353 -326102 4204862 10876878 13790139 11255979 8003503
40945 8003503 7698550 7862719 4804702 76188 -1529163 1323553 5090348 6097493
40937 6097493 4096842 1052076 -1394412 -2565981 -2399961 -1457016 -651203 -382178 -339306
40928 -339306 -419125 -1166628 -2725183 -3851672 -2935736 -178945 1988771 1345747 -1522822
40919 -1522822 -3922582 -4510930 -4908172 -6819347 -8594154 -6922471 -2078873 1277168
40911 1277168 87549 -2808718 -3062905 -1439379 -2014104 -4691296 -4618567 -7784 4541680
40902 4541680 4993203 3512653 3595309 3883615 1847847 148613 2923044 7569993 7206845
40893 7206845 1152936 -3848505 -3873861 -2646169 -4066031 -6362510 -6986865 -7479971 -9069763
40884 -9069763 -8322949 -2355261 5201631 8520219 7105368 4362823 1541319 -1649988
40876 -1649988 -2800264 791309 6414444 8222290 5091987 1450838 382636 593969
40868 593969 462441 554349 1271419 1679346 1307754 84447 -3124091 -8224184 -10837476
40859 -10837476 -6263471 3304860 10200493 10458880 7026309 3513258 264222 -2099056
40851 -2099056 -1130245 2727644 4902632 3197428 977283 845719 49030 -3858483 -7464317
40842 -7464317 -6672604 -3672608 -3165666 -4529453 -3698126 -804275 415589 -118502 1288829
40833 1288829 4653786 5135634 1036922 -2687932 -1726437 1478229 2408035 1469569 2034482
40824 2034482 3995380 4077712 1814556 714025 2719383 5102244 4562468 1822949 -25067
40815 -25067 84405 1099492 3053153 6970639 11204601 11385207 6205285 696128 467988
40806 467988 4014642 4552249 -620318 -6707245 -8589023 -7417411 -7243717 -8195728 -7182583
40797 -7182583 -4001958 -2198798 -3370854 -4509985 -2707604 449997 1645574 1022580
40789 1022580 1589195 4161057 6106542 5800141 5443173 7390001 9549695 7533017 1171874
40780 1171874 -4167203 -4064174 -637017 358447 -3210829 -7713279 -8599796 -5510822 -2117279
40771 -2117279 -1919119 -4673964 -6846656 -5810152 -3242691 -2871106 -4760466 -4482529 609544
40762 609544 7127125 10328296 10423449 10413092 9891930 6281794 1286990 -114048 1962161
40753 1962161 1222607 -4829677 -9613900 -6609730 636229 3228962 -933540 -5582818
40745 -5582818 -5755857 -3424216 -2633316 -3701872 -4455528 -4219402 -3960918 -3781261 -2506626
40736 -2506626 231015 2905487 3896095 3918315 5257581 7886477 8121534 3489820 -2338224
40727 -2338224 -3299375 387258 1985158 -1777177 -5603524 -4017493 -186509 -867371
40719 -867371 -5591500 -7453014 -3664881 1143287 2649997 1860211 861160 -877834 -3333484
40710 -3333484 -3846368 -1670609 -769349 -4087407 -7964134 -6761536 -1391639 1364589
40702 1364589 -2203223 -8354144 -10949753 -7771037 -1065559 5323975 8010872 5562454
40694 5562454 -51603 -4603027 -5763040 -5452525 -6848503 -9847462 -11157206 -8751553
40686 -8751553 -4592113 -2319373 -3284877 -5623028 -6582601 -4976659 -1728442 1121950
40678 1121950 1928453 619052 -1342803 -2336332 -1931988 -816965 289149 1251391 2130805
40669 2130805 2488507 1351801 -1613634 -4598998 -4384917 -214210 3576564 1407901
40661 1407901 -6340115 -12626114 -11815857 -5937928 -784574 1419950 2122614 1714850 -490404
40652 -490404 -2535260 -1167655 2696315 4436175 2541211 582682 1045982 1514118 -925347
40643 -925347 -5141827 -8022107 -7963785 -4615964 1484967 7337578 9188772 7587780 6812256
40634 6812256 7676209 5987570 664762 -2522973 453939 5088871 5491623 3267412
40626 3267412 2851935 2548179 -1962239 -8236961 -9572155 -5398994 -1220231 940106
40618 940106 3830308 6767498 4754541 -2462478 -8072274 -7509866 -3694666 -666254
40610 -666254 1691397 3907944 4008700 1570695 -559785 -1487594 -3970363 -8160130 -9411751
40601 -9411751 -5855870 -2482660 -3402752 -5342987 -3792766 -827504 -1093975 -3747864
40593 -3747864 -4379798 -2437100 -1112259 -1560604 -2268653 -2921183 -4418412 -5984400 -6003172
40584 -6003172 -4688221 -2841884 317028 4924924 8190105 7815043 5591116 4125737
40576 4125737 2534170 -625042 -2861026 -1097485 2598805 3783524 2471562 1952080
40568 1952080 2226418 383450 -3181756 -4746729 -3525623 -2566177 -3086481 -3106133 -2166063
40559 -2166063 -2212680 -3084958 -2336287 -529716 -1417499 -5408241 -8065430 -7016610 -5390377
40550 -5390377 -6158473 -7814646 -8138214 -7616654 -6435285 -2780854 2601400 4751803 1375126
40541 1375126 -2632578 -1868931 1872296 3167841 1058848 -1474819 -3464656 -5733212
40533 -5733212 -6480908 -3120237 1950475 3184126 55240 -1919507 260056 2337824
40525 2337824 -849040 -7855860 -12483696 -11175191 -6152496 -2341557 -2919225 -7136939
40517 -7136939 -11281658 -12086887 -9566052 -6125601 -3514155 -1958162 -1600421 -2625827
40509 -2625827 -4011369 -4249150 -3392333 -2396566 -776049 2375474 5240982 4750195 1793584
40500 1793584 926787 3278270 3999055 -348710 -5780979 -6396239 -2941671 -989985 -2355719
40491 -2355719 -3574988 -2387757 -630518 -159374 -360018 -643616 -1440640 -1759654 321256
40482 321256 3684139 4700216 2809646 1138344 303388 -2850901 -7786701 -7776425 276653
40473 276653 8805393 8781838 2193952 -1719294 -39853 1845284 648057 -740097 -358995
40464 -358995 -635673 -2552139 -3087582 -1206330 -269497 -1450862 -808412 3326967 5932733
40455 5932733 3012352 -1541636 -2305046 -881111 -1808985 -3896250 -3007558 -871532 -3009117
40446 -3009117 -8707887 -11142382 -8294936 -6003921 -7697690 -8213475 -2216151 6492063
40438 6492063 9406488 4153261 -3819180 -8631536 -8829382 -5833963 -1668733 1444499
40430 1444499 2365352 2772406 5392395 9675217 11271186 7157677 -172878 -5306684
40422 -5306684 -5861770 -4096998 -3127829 -3942782 -6504084 -10792269 -14735876 -13706041 -5678242
40413 -5678242 4251740 8472884 5857710 2232972 1695121 2215536 1216478 263149 1136421
40404 1136421 1873314 820208 612246 3196109 4393782 -515598 -8092255 -10301415
40396 -10301415 -5959870 -2020642 -3159066 -6544882 -8328173 -9045418 -9811005 -8469689
40388 -8469689 -3468136 1915766 2937965 -1000238 -6598950 -10602508 -11542060 -9582384
40380 -9582384 -6583922 -4726574 -3807315 -1719676 1638719 3565940 2791489 1613303
40372 1613303 2154340 3246553 3021782 2073350 1802042 1765998 985346 170789 479709
40363 479709 1328918 1214324 -233962 -1981394 -2243382 652013 5948309 9187758 6520620
40354 6520620 543489 -2266182 -739626 -500259 -4203926 -6174467 -1097072 6950548
40346 6950548 10048259 7581122 5364223 5686404 5129695 2038166 -385550 179936 1621228
40337 1621228 1653998 1502970 2920111 4622475 4251345 1986576 100704 -26811 958996
40328 958996 1533280 688613 -1385862 -3647757 -5321077 -6241706 -5980668 -4001072 -1423258
40319 -1423258 -778299 -2517531 -3685879 -2098136 191593 379716 26635 2926470 8663859
40310 8663859 12217202 10314281 5013191 443847 -1285502 -470668 1269670 1749601
40302 1749601 -1995 -2219021 -2406189 -797322 178346 -418906 -1209432 -1085444 -133342
40293 -133342 1792867 4738216 7090837 7219852 6436372 7109298 8022595 5496532 -415537
40284 -415537 -5003625 -5331241 -3503933 -1906096 466057 4206239 6038858 3073560
40276 3073560 -2104491 -4591040 -3782376 -3094529 -4073688 -4474526 -2217484 1610386 4145722
40267 4145722 3385114 -406523 -4427060 -5221576 -2671423 -1199628 -4670403 -10779457
40259 -10779457 -13332401 -10002773 -4808271 -2306958 -2503345 -3115630 -3936227 -5895832
40251 -5895832 -7424762 -5527253 -727997 2365095 964111 -1935260 -1798952 1023782
40243 1023782 2264410 468937 -833186 1509758 6010707 9438849 11181429 12076181
40235 12076181 11015267 6160592 -1186763 -6993562 -8738864 -6966024 -3053397 1866381
40227 1866381 5861965 6947218 5455664 3471491 1663693 -965079 -4099011 -5809820
40219 -5809820 -5868270 -6351062 -7854962 -8159095 -6305935 -4945650 -6020316 -6585839 -2411075
40210 -2411075 5344912 10534047 9435943 5139988 3336403 5346875 7175123 5416458
40202 5416458 2275232 2792849 7448585 10483950 7389964 1462976 -584580 1983020
40194 1983020 3548792 1182548 -1045524 1221204 5929440 7924833 5995490 2980575
40186 2980575 685582 -1617001 -4192248 -5432595 -3907324 -315319 2679568 2070523
40178 2070523 -2903628 -8945897 -10944637 -7159742 -783636 4402600 7707126 9735823
40170 9735823 9950533 8488642 7794212 9102928 9168307 4243150 -3677348 -8336891 -6703852
40161 -6703852 -1643739 2830378 5503797 6547973 5570462 2878650 577202 496257 1936471
40152 1936471 2665832 1575183 -438685 -1847615 -2169055 -2236781 -2904343 -3815408 -4029699
40143 -4029699 -3539434 -2992986 -2090806 -9081 2401234 3012601 1659938 668045 1298054
40134 1298054 2322245 3242775 5666328 9604577 11920470 11116027 10046921 10438673 8616289
40125 8616289 1651266 -5552207 -5709312 16185 3306748 417427 -3869997 -4506610
40117 -4506610 -2137746 432567 1874443 829196 -3476237 -7206792 -4532018 3068842
40109 3068842 6285910 572100 -6628295 -6255855 -64748 3460942 1612932 -1117886
40101 -1117886 -1796719 -2044519 -2720872 -1887657 1161131 4590076 7236806 8994584 8128890
40092 8128890 3003327 -3159318 -4353784 85363 4211138 4051433 2670479 4039943
40084 4039943 6482968 6215318 4001121 3617676 5691485 7753612 9548720 13568128
40076 13568128 19719861 23541884 21628329 16296216 12744779 12851411 13527777 10776069
40068 10776069 4262876 -2032205 -3282480 1749983 9397949 14386994 14396752 11063790
40060 11063790 7124583 3869618 1373474 -346589 -1176011 -1010575 358348 2387518
40052 2387518 2728935 -877121 -6618555 -8910171 -5026858 365440 562672 -4214983
40044 -4214983 -7061066 -3749680 2286109 5815386 6634126 7604634 9007366 8856041 7198322
40035 7198322 5927258 4683789 818324 -5886436 -11515379 -12206839 -8079895 -2433083
40027 -2433083 1083445 387730 -3464907 -6151300 -4113715 531188 1879113 -1929729
40019 -1929729 -5975982 -5615777 -2996349 -3158760 -5946168 -6189559 -1503109 4172590 5751717
40010 5751717 2748450 -1485195 -3982157 -3958485 -1939390 976072 3354652 4231206 3858111
40001 3858111 3295384 3392631 4261117 5339336 5883696 5837832 6129929 7338099 8037825
39992 8037825 5649658 -312144 -6570227 -8692454 -5345038 606170 5204849 7238743
39984 7238743 9096058 14220760 23688615 34933126 43760178 47772575 47818357 46195772
39976 46195772 44148218 41807672 40028810 40653752 44179147 48222791 49667291 48023125
39968 48023125 45305219 42519983 37976089 30172107 21157509 15146202 13804197 14541069
39960 14541069 14075028 12228696 10847131 10003248 7642654 3450267 751739 2547217
39952 2547217 6782953 8150700 4641190 -216920 -2443819 -2347063 -2420384 -2841711 -1969806
39943 -1969806 -88669 555088 -745723 -2362915 -2974829 -2341926 329617 5487005 10437384
39934 10437384 11284697 8753325 8057999 10995860 12341193 7428603 -254117 -3475950
39926 -3475950 -867427 2726611 4144767 4967099 6588376 7127900 4896723 1522511
39918 1522511 -360475 -454364 -331512 -1010912 -1949280 -1532731 1534689 6196964 8768765
39909 8768765 6393410 718265 -3445509 -3093489 594814 4371939 5956012 5382043
39901 5382043 4566960 4994009 5327602 3108898 -518141 -1020803 2710283 5764086 4715775
39892 4715775 3297873 5512068 7461386 3341928 -3559260 -4789159 -359047 1319655
39884 1319655 -2296977 -3936657 455845 4757692 3498055 634312 1410934 3399721
39876 3399721 2639135 1601313 3256988 3655214 -714172 -3727364 2030545 11664068
39868 11664068 13653596 7072278 1912423 2544888 2379149 -2894509 -7700877 -6804090
39860 -6804090 -4034993 -4760260 -6688400 -5013323 -1703632 -2427247 -6852092 -8652088
39852 -8652088 -4617671 1361993 3888574 2039861 -1070476 -2391387 -1556883 -320247
39844 -320247 -45479 -229385 -91116 -654492 -3151129 -5684168 -4455955 762646 5101747
39835 5101747 4231190 -437155 -4003619 -4098910 -2770931 -3086716 -5438022 -7317572 -6276933
39826 -6276933 -3063510 -1261020 -3026800 -6054878 -6394387 -3604743 -920088 -580224
39818 -580224 -1533020 -2016987 -1832195 -1253495 10465 1684793 2592321 2391167 1993436
39809 1993436 1571541 81445 -2309306 -3352273 -1756348 403191 -48766 -3506362
39801 -3506362 -7254602 -8622448 -7602182 -6438942 -6939627 -8276858 -7983336 -5351901
39793 -5351901 -2605206 -1717546 -1641361 -603225 218065 -1862809 -6320622 -9011859 -7007533
39784 -7007533 -1833917 2551718 3560412 1721700 -106182 417794 2241948 2188112 -16662
39775 -16662 -672576 1904430 3932329 2494130 1577095 5920780 11689806 10965420 4531370
39766 4531370 1630514 5934399 10366585 8838266 5017837 4786109 7016431 7648666
39758 7648666 7164267 7625778 6930308 2792687 -1091656 190379 4315352 4826978 985423
39749 985423 -2232710 -2939694 -4126844 -6440008 -5982195 -1118636 4029083 5262166 3319801
39740 3319801 1182837 138781 674689 3782472 8579983 11088547 8250050 1901614
39732 1901614 -3378231 -5448820 -5833203 -6413310 -6736673 -5022102 -978061 3201867 5040313
39723 5040313 4655971 4447308 5632546 6402007 4510922 668255 -2100820 -2115744 -902062
39714 -902062 -1298370 -4152766 -7048453 -6847048 -3920534 -2359200 -4243580 -5746535 -2710718
39705 -2710718 1389846 -932722 -8974110 -12313759 -4957180 5391156 7664200 1892384
39697 1892384 -3403925 -4306332 -3947706 -3981469 -2289317 539028 396095 -2958166 -4595763
39688 -4595763 -2739998 -1832162 -4216238 -5057520 -115710 6449502 7585198 3449077
39680 3449077 443407 1799780 4312833 4240582 2126201 830701 1670834 3674016 5005666
39671 5005666 4307336 1591454 -1640661 -3528308 -3198369 -1063711 1628837 3468800
39663 3468800 3906066 3740801 3774650 3169106 516107 -3455212 -5962998 -5451232 -3302183
39654 -3302183 -1820563 -1983960 -3530253 -5493832 -6094107 -4016899 -650118 872200
39646 872200 -154749 -871887 736103 2535623 1511158 -1515834 -3329596 -3433595 -4289216
39637 -4289216 -6215598 -5556605 52965 6919846 8893533 5186634 1411761 1857369
39629 1857369 3756258 1981861 -2620012 -4027389 -286308 2891731 311589 -4830935
39621 -4830935 -5502187 -1027913 2276823 329362 -3681709 -4715292 -2441576 -211866
39613 -211866 -158254 -1773485 -3800865 -5227536 -4969677 -2345878 1843679 5324629 5814276
39604 5814276 3043223 -351050 -958287 1433387 3243534 1911126 -387202 -344582 734551
39595 734551 -1312018 -6348828 -8890391 -5390477 1039822 4949254 4588554 1787992
39587 1787992 -1368330 -3368766 -2955859 -553743 1250744 641743 -1004522 -1045171 1203355
39578 1203355 4207859 5764176 3973109 -1350059 -7106344 -8926438 -6175915 -2783142
39570 -2783142 -1760691 -1782986 -1214609 -2032418 -5967393 -9318801 -6545632 1636354 8170927
39561 8170927 7995874 2890046 -2307354 -4668015 -3587653 42196 3298609 2832215
39553 2832215 -888707 -3295058 -1739853 633522 -170984 -2376487 -831101 4650810
39545 4650810 7975781 5131888 -175557 -2142564 -1083976 -1759823 -4916221 -5719207
39537 -5719207 -1590122 3200925 3696716 1500607 1853131 5539521 8228209 7233424 4445419
39528 4445419 1992644 -741339 -4080477 -5706202 -4064057 -1668221 -2074254 -5034915
39520 -5034915 -7432775 -8010988 -8152103 -8127367 -5817322 -586679 3890498 3310158 -1308834
39511 -1308834 -4100997 -1796127 1738754 912366 -3341207 -4901609 -2062580 -555662
39503 -555662 -4448020 -9045837 -7886928 -3177142 -2465545 -6466303 -7891984 -3297746
39495 -3297746 1509793 1047154 -1505020 -593752 2016690 252131 -5965312 -9731270
39487 -9731270 -6515577 222540 3838798 1887265 -2358423 -3902180 -765529 4414732
39479 4414732 7433450 7250871 6458506 6680749 5904355 2135662 -2337395 -2996187 1358094
39470 1358094 7126798 9645061 7312947 2840638 1076994 4155141 8217979 7199006
39462 7199006 752568 -4552527 -3643228 778673 3120743 2892593 3813413 6902951 8786843
39453 8786843 6431501 435641 -5919534 -8616741 -5305776 1585418 5853255 4653676
39445 4653676 2639401 5317949 10501203 11359525 6692614 2442149 2927840 6167728
39437 6167728 8895470 10789239 11686072 9532518 4213927 -241625 -540947 1399801
39429 1399801 1692931 -80951 -1458141 -1188998 130720 2093627 4214441 4483369 1222179
39420 1222179 -3434050 -4499998 148648 6351769 7531065 1990437 -4861559 -6529398
39412 -6529398 -2942510 -128888 -2273388 -6619210 -7785420 -4783374 -993597 1290104
39404 1290104 2909799 4895235 6657562 7386083 6729577 4013663 -762597 -5209221
39396 -5209221 -6478578 -5000502 -3696677 -3595609 -3183830 -1978482 -1161035 -310714 2524872
39387 2524872 6464416 7541073 4548413 1269423 562027 -66367 -3859487 -8848665
39379 -8848665 -10195199 -6651315 -1435910 1965325 2103843 -878492 -5130598 -7555334
39371 -7555334 -6842197 -5006644 -3998632 -2740774 -133665 1362905 -900632 -4332215
39363 -4332215 -3637028 1531872 5929209 6128803 4146443 2446530 -246452 -5541793
39355 -5541793 -11122179 -13202416 -11461703 -8727048 -6938444 -5859356 -4846183 -3527212
39347 -3527212 -1259889 1976711 4485573 4530246 2815136 1518832 1237914 854012 114012
39338 114012 3200 470602 289342 -326473 381384 2264553 2616051 698678 -27399
39329 -27399 2935674 6182055 4618786 -577600 -2770687 955372 5614428 5040671 -416359
39320 -416359 -5300254 -6037485 -3962041 -2333180 -2540083 -3364909 -2951887 -1143017 449760
39311 449760 1072537 2378505 5619383 8289615 6510604 808109 -3587695 -3002770 858631
39302 858631 4080773 4526321 1751947 -3593361 -8579474 -9381228 -5874542 -2128602 -786556
39293 -786556 -250107 947993 1179358 -259498 -448604 2367293 5256187 5638849 5757655
39284 5757655 7774652 8747333 5899223 2781839 3671457 5334315 1882860 -4696752
39276 -4696752 -7057388 -4160155 -1994502 -2923276 -2843410 132908 2373815 1855605 946142
39267 946142 18656 -4098381 -10675652 -13658827 -11029696 -8283455 -8695979 -7560502 -1210622
39258 -1210622 5209029 5474352 2163807 1665055 3415309 1535844 -5107938 -11292395
39250 -11292395 -13037532 -11366873 -8815441 -6608146 -5404570 -5727738 -7519487 -10586542
39242 -10586542 -14124380 -15034093 -9895144 -451850 6349155 6295441 2651616 677401
39234 677401 1176397 2207286 3173813 3880355 3176780 1671584 1976827 3506218 1895728
39225 1895728 -3129560 -5171764 -1009201 3103117 966333 -3610414 -3712102 -902575
39217 -902575 -1231754 -3637879 -1902299 3898860 7138466 5091570 1462456 -924164
39209 -924164 -2239575 -1300039 2940187 6196313 3311174 -2517792 -3291925 1457044 4856772
39200 4856772 4905070 6226853 8787104 6196497 -1708248 -5770539 -1844824 2155857
39192 2155857 -407137 -4381394 -3200636 -748394 -3448990 -7664792 -5622328 702199
39184 702199 2307450 -2543499 -6630374 -5650140 -2872485 -1447588 29709 2734737
39176 2734737 4910027 5854865 7336609 9259244 8576769 4368378 -22949 -1772508
39168 -1772508 -2034901 -2850771 -3728885 -3322498 -2022833 -873128 244947 1547954 1953684
39159 1953684 505260 -1746850 -2890098 -2794480 -3264060 -5342141 -7423879 -6972037 -4067050
39150 -4067050 -2049550 -3535623 -6617323 -6996890 -3885751 -1397023 -3026248 -6829179
39142 -6829179 -7933897 -4631064 -43366 1797961 -54782 -3407974 -5657296 -5944969
39134 -5944969 -4831209 -2718134 64817 1630626 -503553 -5139647 -6724180 -2305036
39126 -2305036 2905409 1674012 -4574843 -7112203 -2497561 2645507 2006086 -1387503
39118 -1387503 -973817 3365747 6770453 7619596 8205809 8729972 6542419 1529566 -2546928
39109 -2546928 -3069343 -1449596 -148404 343306 670938 993693 1074811 673441 -353320
39100 -353320 -1386062 -1071873 864209 2882507 3981457 5214057 7104332 7512669 4711040
39091 4711040 891613 -609482 -326223 -1300955 -3560219 -4100646 -2463688 -1968500 -4018825
39082 -4018825 -5018716 -1536641 3973174 5691662 1862923 -2863838 -3027542 1148678
39074 1148678 4082951 1639455 -3680111 -5857307 -3209076 -578655 -2678100 -7812989
39066 -7812989 -10509414 -8418179 -3562714 1992921 7881389 12737481 13581284 9645124
39058 9645124 4425161 1921007 2218133 2617548 2128337 2521560 4732373 6430020 4872024
39049 4872024 1138971 -836458 429124 2280123 2585464 3011043 5153880 6487587
39041 6487587 4276559 1106154 1068861 2036748 -1483632 -8156767 -10477757 -7015705 -5243879
39032 -5243879 -8729685 -10671098 -6040125 -1198442 -2866824 -5320236 313888 9581183
39024 9581183 10425247 2712553 -1447100 2972894 7516757 5678371 2032416 1129382
39016 1129382 -1064229 -7591164 -12173380 -8959504 -3108383 -2800849 -6416833 -6519490
39008 -6519490 -2211988 1385419 2841412 4677058 5733655 2054965 -4800463 -8240100
39000 -8240100 -6332381 -4250413 -5717436 -8106908 -7965480 -6176485 -5238242 -5383972 -5528744
38991 -5528744 -5020207 -3085624 578043 3865354 4044056 2069215 1621891 3177880 3067854
38982 3067854 -232876 -3089414 -2231561 456189 1511365 1068567 1185564 1607696 902773
38973 902773 2361 696637 1596560 -361423 -4374118 -5611448 -1735900 3534645 5182087
38964 5182087 2905065 247977 -600933 -496270 -492404 -136007 771540 876839 -904039
38955 -904039 -3528272 -5110399 -5194280 -4526684 -3468359 -2162621 -1524805 -2100419 -2306484
38946 -2306484 -119248 3274619 4013342 762541 -2858725 -2752468 372497 2179740
38938 2179740 244116 -3561994 -5982348 -6043511 -5384735 -5616100 -5852937 -3494883 1883324
38929 1883324 6370727 5534890 278132 -3691205 -2776901 936260 3953357 5668399
38921 5668399 6282441 4137875 -1138904 -5531176 -5107520 -1942926 -1021218 -2423991 -1756731
38912 -1756731 1857676 3756738 1012885 -3133536 -4281849 -2354573 247744 2457420
38904 2457420 3999410 4205745 3963595 5778639 9075796 8720301 2032564 -5535572 -6561634
38895 -6561634 -1846336 876470 -1881526 -5049193 -3375495 871602 1973317 -711992
38887 -711992 -2589182 -1091937 1080454 848378 -446553 380827 2650375 2029241 -3116579
38878 -3116579 -8525754 -9134560 -5372195 -1727461 -392671 231131 1169580 1133048 -8915
38869 -8915 -100473 1035662 76391 -4205478 -7354418 -5025707 522713 4103514 5290623
38860 5290623 7137516 8846626 6083860 -1088044 -6639029 -6665616 -4043250 -2941499
38852 -2941499 -3370641 -3793084 -4867529 -7266134 -9049759 -8400737 -6322220 -4160460 -1575000
38843 -1575000 630166 -324419 -3889753 -4445668 570242 5028251 2517236 -3254688
38835 -3254688 -3763385 1163933 4014460 2509377 2332232 5511834 5794026 -206057 -5841352
38826 -5841352 -4718281 -1250152 -3154796 -8331795 -8143157 -1473535 3501611 1893256
38818 1893256 -1544978 -815988 3095686 5827029 6559601 7120016 7171864 4609808 -281644
38809 -281644 -4336799 -5155734 -3226820 -433895 1934305 3361522 3455356 2042090 -54967
38800 -54967 -993794 308365 2178800 1318161 -3023553 -7200185 -7125933 -3163086 894672
38791 894672 2855227 3458466 3020527 264546 -4315336 -7067190 -5567993 -2446260 -2202265
38782 -2202265 -5305857 -8032182 -7667348 -5284658 -3181211 -2057716 -1666438 -2093156 -2756995
38773 -2756995 -1744856 1574667 4036811 1515257 -5258897 -10252198 -9017399 -4080741
38765 -4080741 -1288875 -2214503 -3165946 -1375435 1190748 1315215 -811669 -2304168 -1388214
38756 -1388214 1287143 4148026 5911747 5871291 4258774 2219882 965815 1234108 3204391
38747 3204391 5749185 6332129 3774746 765701 733199 2402853 1489668 -1702209 -1797875
38738 -1797875 2245033 3341314 -3277928 -11122063 -10870157 -4147673 -728594 -3690001
38730 -3690001 -6276850 -4112198 -1561737 -2856240 -4636042 -2320578 1745488 2109795
38722 2109795 -1407851 -4264405 -3860985 -1405419 1148367 2329980 786862 -2910983
38714 -2910983 -5139426 -2852898 2281439 5570599 4452061 514000 -2502295 -1630924
38706 -1630924 2733700 6262090 4901779 496442 -790330 3193413 7597789 7781975
38698 7781975 5179798 2985158 528018 -3543575 -6316045 -4536289 -1076255 -1624623
38690 -1624623 -6179998 -9349846 -8435513 -5868961 -3830225 -1824160 -163206 -831143
38682 -831143 -3627735 -5608758 -5479760 -4758608 -3830676 -1130348 2498037 3076688 -672989
38673 -672989 -4619822 -5062274 -4131424 -6244779 -11338913 -14780995 -13015642 -6965212 -475442
38664 -475442 2855034 1852803 -1663936 -4477798 -4743752 -3074823 -1141335 -172267 -699618
38655 -699618 -2385911 -3779069 -3317432 -881752 2284188 4894063 6121112 5545494 3680669
38646 3680669 1721810 -195777 -3085018 -6330651 -7131428 -4833629 -3236484 -5376356
38638 -5376356 -8397101 -7663186 -3882792 -1249593 -191234 2129786 4875992 3810678
38630 3810678 -772845 -2995505 -152023 3485286 3959695 2882114 2554406 1722260 -91717
38621 -91717 391851 4237211 6283527 2391578 -3407365 -4608431 -1635166 390203 528807
38612 528807 2234180 6068785 8343776 6899424 3366019 -177834 -2594988 -2326973
38604 -2326973 1066160 4478143 4440053 2055240 711730 143852 -2155577 -4538709 -2419742
38595 -2419742 3566004 6803782 3984904 -329944 -1013301 733644 1159426 385406 791418
38586 791418 1834754 995998 -1348212 -1940227 505456 3340343 3438004 870110 -1505449
38577 -1505449 -1293953 1076711 3122814 3154956 1740850 193896 -987249 -1170385 1037612
38568 1037612 5197498 7379371 4374554 -1157754 -3356911 -851269 2028500 2057078
38560 2057078 880622 726799 677743 -388322 -875134 375808 895401 -2000288 -6618055
38551 -6618055 -9014248 -8221171 -6201321 -3831417 -368934 3452042 4997835 3086368
38543 3086368 -141536 -1285075 1168912 5331476 6840772 2595830 -5136827 -9840841
38535 -9840841 -7809302 -2702675 -895388 -3656253 -6760486 -6952380 -5390869 -4443592
38527 -4443592 -4143721 -3031070 -592303 2181934 3560749 2167662 -1445553 -4550889
38519 -4550889 -5234325 -5222699 -7367540 -10400609 -9334509 -2269459 5988370 9176800 6534560
38510 6534560 2313192 -152797 -1171439 -1997314 -2166882 -418294 3175605 6887227
38502 6887227 8578349 7054099 2986094 -1112513 -2509181 -539181 2765773 4566569
38494 4566569 3684407 1187726 -1110720 -2310712 -2587229 -2247258 -1255433 259473 1625318
38485 1625318 2144452 1648625 266701 -1752971 -3402725 -2853876 676582 5163160 7286608
38476 7286608 6085406 3927651 3341856 4114576 4442128 3834478 3349174 3307811 2351451
38467 2351451 -648460 -4391604 -5523347 -1657765 5471132 10168412 7560481 -956059
38459 -956059 -8272098 -8830017 -4258553 -257212 682219 647273 1162728 687245 -1504554
38450 -1504554 -2561055 -22484 3667662 3883745 63091 -3771306 -4434757 -2848753
38442 -2848753 -1734696 -2351286 -3968369 -4787742 -3078440 1079150 5175536 6833892
38434 6833892 6469517 5663327 4134197 1336508 -39756 3296777 8875161 9877243
38426 9877243 4644467 -312998 256011 2883339 1721938 -2065735 -3195193 -1553115
38418 -1553115 -1740888 -4469115 -5298360 -2462341 301531 192427 -951478 -1329808 -2307052
38409 -2307052 -4287578 -4363120 -1434073 526460 -1787147 -5405271 -5357920 -1943655 487159
38400 487159 124807 -1072955 -1559947 -1714228 -1683605 -983537 -27312 395490 560228 657977
38390 657977 -457343 -2949247 -4136927 -2024693 915725 1028652 -961455 -1802226 -1868977
38381 -1868977 -4396486 -8764541 -10033810 -6419205 -2281639 -1589213 -2671657 -2019524
38373 -2019524 437112 2764766 4548929 5747527 4567096 -60120 -5519813 -8111308
38365 -8111308 -7414881 -5540057 -3437105 -724619 1956908 3313728 3512273 3498289 2946000
38356 2946000 1282625 -171846 84083 560250 -1462403 -5069105 -5973747 -2382460 2380222
38347 2380222 4280539 3016554 664402 -1592333 -3337469 -3504172 -1657917 274578
38339 274578 -29168 -1919410 -2485295 -635583 1591182 2293826 2323499 3384216 4927465
38330 4927465 4783760 2492479 248677 146434 1742770 2994114 2639199 903647 -1299450
38321 -1299450 -2922014 -3254960 -2941425 -3849929 -6606942 -8904233 -8095722 -5153153 -3672939
38312 -3672939 -4550387 -4308723 -280551 4757039 5652965 1615597 -2636505 -2487849 1726611
38303 1726611 5896708 6708668 4332029 1347183 -260102 -971555 -2599688 -5505823
38295 -5505823 -7764139 -7411924 -4636563 -1217703 1127328 1110858 -1952916 -6751779 -9744726
38286 -9744726 -8361143 -4241924 -1567733 -2111951 -3517513 -2704506 526281 3893008
38278 3893008 5499428 5432282 4904439 4484877 3574001 1859272 691567 1628194 3549613
38269 3549613 3294138 233987 -1969194 -310297 2625037 1740763 -3207148 -6559732
38261 -6559732 -3659489 3568095 8923480 8451977 4063021 1439859 4289623 10186813
38253 10186813 13141700 10897582 7366754 6153493 4971663 280516 -5467203 -6923308
38245 -6923308 -4720987 -4572217 -7384852 -7465236 -2411819 2341337 2326239 773033 1801308
38236 1801308 2977357 934035 -660186 3390502 9405102 8524009 201531 -6086636
38228 -6086636 -3998166 1699707 2982969 -1052253 -5210754 -5955287 -4470002 -3603977
38220 -3603977 -4336213 -4916796 -2852531 1590816 4498762 2703726 -1709948 -3860746
38212 -3860746 -2490223 -883172 -1488319 -2904791 -2761933 -696202 2249186 4762574
38204 4762574 5394470 3795362 1793163 999496 113325 -2494452 -4739946 -3426231 24489
38195 24489 1356880 617531 1802708 4982444 5213444 1004319 -2654766 -2489908 -1687169
38186 -1687169 -2591023 -1131587 5873995 13164787 13457122 7870591 3436901 2816619 2873921
38177 2873921 1561724 -187311 -2407876 -5951521 -8868506 -8316991 -5597459 -4148552
38169 -4148552 -3302059 333801 5772062 8124381 6551522 5625220 7729949 9988712
38161 9988712 10164236 9770118 9457411 7177921 3308848 1664591 2416109 183820 -6685183
38152 -6685183 -11049480 -6870186 1057585 4278269 3584985 6406218 13203789 15611437
38144 15611437 9243696 264619 -3963797 -4215057 -5004073 -6101191 -4260990 -495574
38136 -495574 631185 -1452659 -1921306 2022389 6561363 6595074 2940067 1251237 4925475
38127 4925475 11641914 16613998 17112048 13622997 8458796 4029341 1448236 195697
38119 195697 -514705 -462506 527099 1039382 -460007 -2843601 -3371139 -1815318 -997105
38110 -997105 -2486686 -4506397 -5256760 -5319071 -5017120 -2697723 1653230 4253191 2619336
38101 2619336 69019 690971 2131680 -1040274 -7893957 -11318602 -8222687 -3543718
38093 -3543718 -2143866 -2154310 409662 4751011 7023052 6222313 4620599 4020548 4695648
38084 4695648 6701422 9345499 10267906 7713354 3384625 949074 1717594 3214939
38076 3214939 2142594 -1878294 -5463604 -4610612 535675 4850683 4004134 294604
38068 294604 -174457 4129812 8391116 8716530 6951816 6296982 6148126 4405564 1778009
38059 1778009 254325 -424876 -1342645 -1414638 645426 2994388 3067186 2255231 4266067
38050 4266067 9068000 12189031 10684204 6841750 4886824 6118178 8517071 9892124
38042 9892124 10143837 10427213 10600578 8589251 3443051 -1922468 -3567706 -1971990 -1455409
38033 -1455409 -3681343 -5576878 -4987571 -3869756 -3374819 -715628 4821856 7266826
38025 7266826 1409152 -8040205 -11433849 -7015482 -2124566 -1833102 -3152360 -1859600
38017 -1859600 1103629 2796298 3191477 3888118 5170229 6893003 9675466 13109538
38009 13109538 15132159 15020581 14830405 16117287 17203485 15485199 11069375 6737996
38001 6737996 5195009 6881467 9540183 10078233 8055920 6437148 7120980 7444756 4270273
37992 4270273 -110518 -654508 2710252 5337718 5781410 7323889 10369498 10037490 4594750
37983 4594750 184488 2308391 7419896 8698083 6621415 7428639 13015411 18781357
37975 18781357 21181370 21576505 21720286 20544704 17480185 15116766 15809006 17834539
37967 17834539 17526004 14364879 11932255 13581660 18226756 21282892 19942658 16620907
37959 16620907 15921803 18750180 21710293 22681881 24069464 28734593 35225448 39901869
37951 39901869 42349233 45639095 51797062 59891833 68719010 78846594 91228083 105380658
37943 105380658 119566409 131890435 141397779 149351467 159148486 173219326 189650491
37936 189650491 203281922 210651668 212720268 212318580 210402282 206125454 199748819 193466311
37928 193466311 188683502 183879142 176630030 166952355 156442873 144188213 126757835
37921 126757835 104146265 82933761 70093128 64973682 60910034 53899649 45814493
37914 45814493 39540983 35712631 34930133 38085356 42269588 41026824 32205484 22155924
37906 22155924 18293123 19975283 20598498 16776799 11253868 7625070 6255516 5825487
37898 5825487 5918006 7009947 9256900 11776924 12863953 11615873 9475725 8569532 8394012
37889 8394012 6724367 4240323 4510122 7806584 9236132 6040676 2633712 4019794
37881 4019794 7615138 7032928 1869633 -2021074 -1101774 2476941 5936827 9043018
37873 9043018 11439030 11417596 8866559 6160165 4999987 4897693 5072821 5259308 4834307
37864 4834307 3938772 4775985 8441374 11369081 9192029 3721813 1307476 3970546
37856 3970546 7120633 6988891 5272376 4686217 4756562 4531938 5196087 6961000 6892991
37847 6892991 3101316 -1572334 -3123731 -1638845 -310989 -845118 -2235496 -3036021
37839 -3036021 -3062718 -3416026 -5297959 -7839051 -7871528 -4218812 -1081262 -3180475 -8108807
37830 -8108807 -8766225 -3913060 -149315 -1427568 -3212907 -965417 1779413 -374864
37822 -374864 -5055131 -5502647 -829989 3767126 5533360 6450597 7459493 6528192 3316623
37813 3316623 681422 186661 165584 -537556 -581916 762230 1844927 1609142 1557111
37804 1557111 2943461 4200354 3160787 514962 -845911 379555 2013760 767163
37796 767163 -3683737 -7712888 -7766707 -4780891 -2621409 -2314008 -969989 2546135 4594031
37787 4594031 1972580 -3020706 -6122320 -7022287 -7819728 -7846686 -4730026 651574 4895281
37778 4895281 6978307 8019479 7147663 2858222 -1895118 -1946393 1863680 2703217 -1994716
37769 -1994716 -6074688 -3794078 1555952 2599088 -2046376 -7251389 -8735411 -6702231
37761 -6702231 -3510813 -1455207 -1951206 -3730951 -2733561 3160068 10159717 12481439
37753 12481439 9518394 5711110 3679660 1497488 -2400053 -5528855 -4924887 -1819031
37745 -1819031 102508 -109725 114321 2689228 6196088 7926585 6982704 4493149 1959058
37736 1959058 528249 1052021 3299535 5287522 4956102 2838526 1594020 2255320 2555278
37727 2555278 289360 -3064726 -4121534 -2333306 -696096 -1502797 -3389675 -3491464
37719 -3491464 -1191068 1338998 1647436 -763300 -4363664 -7166275 -8386187 -8672865
37711 -8672865 -8773111 -8442684 -7092297 -5012374 -3211041 -2225413 -1716255 -1181318 -709007
37702 -709007 -1038543 -2632133 -4156877 -2632640 3138270 9525070 11037384 6983059
37694 6983059 2321569 653722 -259952 -3637496 -7816252 -9027050 -7425275 -5988202
37686 -5988202 -5269606 -3904707 -2857645 -3959255 -5047153 -2213771 3107849 5135033
37678 5135033 2571856 552751 2215286 4225480 3127455 555842 -959690 -2089674
37670 -2089674 -2996667 -706171 5317231 9540193 7477759 2710919 1414413 3120765
37662 3120765 2806833 -276585 -2104769 -902340 1173231 2652677 3628340 2673820 -1366873
37653 -1366873 -4625270 -1397939 6732068 10757721 5700172 -2497864 -4760477 -249001
37645 -249001 3603360 874968 -5998399 -9298060 -4750193 3454241 7142749 3684656
37637 3684656 -1189180 -1379709 1870712 3365406 2054992 868240 289146 -1998711
37629 -1998711 -5279781 -5479843 -1714569 1944834 2638771 1993682 1892404 1738007 1526907
37620 1526907 2749826 4310102 2706900 -1235261 -1335907 4632351 9870003 7597269
37612 7597269 817799 -2464580 -413824 2200614 2411818 1668573 1014455 -418824 -1880926
37603 -1880926 -1080028 1355788 1823454 -644312 -2370637 -146877 4509189 7771226
37595 7771226 8066947 6760490 5659613 5131317 4368899 3169017 3066932 5368294 7837098
37586 7837098 5951338 -809120 -6556060 -5809848 -784089 1519862 -1941953 -8037045
37578 -8037045 -12852451 -15233511 -15300591 -13477319 -11373118 -10302972 -8824365 -5020166
37570 -5020166 -910250 -581771 -3878773 -6395201 -6237492 -5871406 -6100979 -3797828 1710034
37561 1710034 5309383 3270274 -497685 -138030 3515154 5269707 4095196 3417080
37553 3417080 4049882 2984175 -355771 -2354022 -1356333 -613721 -2539288 -4287803 -2532648
37544 -2532648 585520 493806 -2619151 -3938608 -930972 3706095 6440918 6902411 6384269
37535 6384269 5306007 3995678 3797689 5205160 6325851 5335163 3368592 2811844 3611813
37526 3611813 3721968 2708627 2288097 3272673 4498727 4993612 4704066 2951785 -771916
37517 -771916 -4005443 -3067479 986368 2228052 -1726165 -5143773 -1962386 5129617
37509 5129617 8433550 5907579 2416690 1277394 710507 -628408 -610675 1511211 2150363
37500 2150363 -1294041 -5562114 -5494012 -693544 4825093 8054130 9223181 9589183 9516837
37491 9516837 8661084 6713406 4087073 2034298 1034315 -683856 -4803797 -9011996
37483 -9011996 -8568242 -2919918 2452430 2698841 -800408 -3641360 -4122298 -2959786 -354622
37474 -354622 2851913 3483574 -105054 -4034680 -3407845 161154 583711 -3274593 -5809107
37465 -5809107 -3746157 -1537898 -4387944 -10056283 -12135633 -9140381 -5469255 -3954921
37457 -3954921 -2247705 2129919 7018720 8727260 7729936 7870198 10317105 11573853
37449 11573853 8574802 3260349 44737 209830 1155568 538108 -1253094 -2712653
37441 -2712653 -3064794 -2080344 26728 2023986 2729662 3008050 4775105 7686155 9124627
37432 9124627 8107423 6627334 6120953 5414660 3729277 2881686 4334353 6591764 7911278
37423 7911278 9060749 10616170 10222582 6310732 2429886 3344915 7802754 9774643
37415 9774643 6840313 2942121 2054204 3168433 3230164 1950558 1598748 3677196 7124237
37406 7124237 8850190 6094140 -142203 -4625496 -3469393 231958 -200550 -5754659
37398 -5754659 -9914809 -7539145 -1450774 2557760 3753876 5442886 8029300 7870605
37390 7870605 3096068 -3374584 -7820853 -9759791 -10255693 -8672109 -4033531 1337324
37382 1337324 2900273 -497043 -4702868 -5731916 -5014352 -6453928 -9776459 -10668360
37374 -10668360 -7437832 -3456027 -1866926 -1711579 -1134097 -703638 -1032852 -653976 683423
37365 683423 144923 -3098698 -4603151 -1193402 2719409 1376704 -2531414 -1552820 4454298
37356 4454298 7904427 5324588 1466401 -133387 -2621273 -8321672 -12918950 -12096900
37348 -12096900 -8484686 -6761696 -6244959 -3665363 220719 2230995 2463880 3354053
37340 3354053 4828997 4939483 3832906 2931426 1489145 -1991702 -5913994 -6911298 -4376228
37331 -4376228 -605398 2620346 4744846 5031016 3525999 2317386 3029791 4422091
37323 4422091 5106495 6558583 9979977 12262549 9457752 3104475 -1231292 -1132531 933382
37314 933382 2472443 3457545 4174636 4550534 5769182 8985092 12357668 12790266 10562733
37305 10562733 8773566 8302672 6958200 3637748 -270336 -3598899 -5890727 -5545256
37297 -5545256 -1694086 2319286 2214350 -246095 962885 6339410 8889832 4469613
37289 4469613 -1642148 -2441916 1159560 3077319 1018351 -2278727 -4622640 -6276085
37281 -6276085 -7059103 -5651125 -1979885 2265686 5316703 5811669 2865572 -2085712
37273 -2085712 -4789915 -2254067 3306485 6895642 6502413 4359829 3233595 3729399
37265 3729399 4781680 4696273 2084396 -2386006 -5664414 -5434638 -2795148 -149291 2249307
37256 2249307 5217310 7409218 6568998 3733842 2727181 4882151 7317446 7390853 6039501
37247 6039501 5414542 5796595 6495969 7542605 8652115 8619666 7855883 9467196 14986408
37238 14986408 20531681 20633501 15315880 9824204 7183732 4994286 1049731 -1868428
37230 -1868428 -217143 3815828 4472184 577891 -2668507 -1107923 2654678 3150449
37222 3150449 -580457 -4229078 -3974003 -597452 2351721 2956952 2753325 4397683 7761381
37213 7761381 9073677 5198544 -1533049 -4953951 -2266888 2649614 4544612 2947539
37205 2947539 624932 -1773248 -5636745 -9846089 -10622024 -6801021 -1880957 662335
37197 662335 1440233 2867171 5061787 6126075 5144315 2983677 830533 -674637 -1400794
37188 -1400794 -1795072 -2378551 -2598680 -1244862 1280630 2452281 563557 -2899113 -5067364
37179 -5067364 -4885765 -3187765 -695157 2130024 3742739 2191699 -2327248 -6924693
37171 -6924693 -8639352 -6932884 -3499398 -535468 575412 -162600 -1508307 -2151746
37163 -2151746 -1889106 -1075128 821465 4564791 8528755 8714067 3374890 -3531154 -6198024
37154 -6198024 -4005602 -1633548 -1679175 -1061638 2917619 6705942 5095892 -516611 -3789218
37145 -3789218 -2676929 -1346545 -2213682 -2094896 1282109 4502074 4061366 2141135 2149027
37136 2149027 2451117 187634 -1616351 2585317 11422580 16962018 15031706 9858920
37128 9858920 7391862 8619377 10798498 11300402 8908494 4717700 2659710 5750367
37120 5750367 11183360 12791201 8978632 4247401 2149921 1285665 -238927 -989749
37112 -989749 713454 3572862 5523986 6120558 5107306 2106340 -790667 -199867 2948602
37103 2948602 3426809 -352340 -3145201 -625615 4451407 7480984 8598324 9549479
37095 9549479 8619977 4300448 244627 374739 1925539 -135880 -3938827 -2985097 3323686
37086 3323686 8392671 8035175 5127347 3598781 3375789 3042362 2880898 3254943 3416571
37077 3416571 3289720 3496404 3124849 764133 -2076995 -2338511 -375781 553370 -46126
37068 -46126 406707 1486621 -1003521 -7465373 -11518998 -8296180 -1657913 1069988 -1343560
37059 -1343560 -4059103 -3878079 -2584071 -3018324 -5283852 -7316204 -7144311 -4288674 -270126
37050 -270126 2171254 1229826 -2500891 -6677363 -8649979 -6626376 -1020986 5156371
37042 5156371 8868954 10202270 11290003 12355949 11456118 8494317 6417331 7176194
37034 7176194 9199912 10309737 10480066 10057307 8066828 4596303 2342170 2995867 4102072
37025 4102072 2521779 -588843 -1587639 -162045 194229 -2465826 -5890938 -7166085
37017 -7166085 -6414741 -5605114 -5314643 -4454155 -2779142 -2038361 -3681370 -6057587 -5649426
37008 -5649426 -1858298 1273079 193269 -2731657 -2146457 2544174 6439798 6656444
37000 6656444 5888821 6498672 5870127 1500899 -3133632 -2923300 987357 3072824 2049751
36991 2049751 2029225 4903225 6991493 4873627 308691 -2651006 -2192020 1210654 5994918
36982 5994918 8975949 6887428 774690 -3941940 -4085339 -2535426 -2838347 -3294160 -447724
36973 -447724 3994333 4884085 1495877 -1435870 -1092608 -293593 -2259138 -5745780 -7826885
36964 -7826885 -8243360 -8096922 -6775420 -3449264 69267 1205373 308260 -442377 -708098
36955 -708098 -1317374 -815835 3341637 9977118 14371027 14065113 11003973 7077967 1683143
36946 1683143 -4428322 -7222996 -4770757 -1265032 -1540400 -3876105 -2728039 2736099
36938 2736099 7471296 7663863 4835723 2452573 1973666 2869265 3580786 2112220 -1535135
36929 -1535135 -3665467 -902393 4374519 6634922 5272009 5186701 8381093 10492441
36921 10492441 8147414 4459414 3430893 3507692 1529281 -544932 1530168 6940596
36913 6940596 10830758 11413157 10811797 9600506 6008119 840247 -1991132 -1040825 886451
36904 886451 1751708 2934784 5307139 6686070 5512238 3759541 3598091 3727114 1602213
36895 1602213 -2527965 -5928823 -6244858 -2737451 3282836 7952104 7431877 2909021
36887 2909021 314652 2668844 5587456 3732469 -901071 -1737329 2625131 6444405
36879 6444405 5045461 627709 -1647252 -72188 3002164 4674038 3750534 946911
36871 946911 -1804651 -3158643 -3937348 -5697425 -7839105 -8226564 -6775370 -5692869 -5538013
36862 -5538013 -4240629 -1396640 22704 -1221441 -1225865 3459667 9247958 9330649 3169509
36853 3169509 -2586862 -2843696 742073 4145355 6107763 6950368 6096531 3614250 1604039
36844 1604039 1369202 1278595 -159283 -1279122 -79509 1920498 1927194 650948 1397745
36835 1397745 4967638 8601484 9775155 8229478 4557349 -207542 -3668204 -3855850
36827 -3855850 -2207116 -1737524 -2018258 523893 6499497 11518078 12000253 9714013 8372045
36818 8372045 8792170 9999465 12161888 15147311 16679561 15830247 16383834 22073617 29418606
36809 29418606 30552663 23845473 16689668 15622978 18068514 17355007 12638328 9053954
36801 9053954 9265810 9916451 7467204 3467902 1543998 1873334 1939859 1463814 2892825
36792 2892825 6671905 9316013 7741947 3174235 -1068213 -3578934 -4390521 -2600475
36784 -2600475 2020179 6083230 5383135 1016679 -1140118 1776718 5959800 6772432
36776 6772432 4648744 2612491 1301424 26371 43060 2326755 3775401 553193
36768 553193 -5222332 -7018187 -2767860 2299650 3214884 1530731 1607756 3994666 5734718
36759 5734718 5298216 4090215 3842023 4778918 5929469 5782262 3410169 154737 -1006622
36750 -1006622 829214 2827915 2200208 113429 -526410 126981 -577364 -2879186 -3748308
36741 -3748308 -1669770 848131 1185684 523345 1561315 4068393 5457562 5010467 4570369
36732 4570369 4784750 3619242 150101 -2513209 -774014 4057663 6957191 5795407
36724 5795407 3586909 3124217 2812118 482016 -1620443 -23346 3273020 2655006 -2062369
36715 -2062369 -3987244 955127 7346021 7662523 2749432 -370027 925713 2416055
36707 2416055 937063 -1195646 -1313458 -983820 -2535925 -4530386 -4118111 -1779314 -454432
36698 -454432 -1088565 -1904521 -1711421 -1529641 -2534540 -3805684 -2901963 1199353 5715690
36689 5715690 5777333 164896 -5747723 -5823529 -1529468 -199906 -4061861 -6219270 -691430
36680 -691430 8310645 12061300 8811377 3785807 56125 -3783240 -7439961 -7556563
36672 -7556563 -4042883 -1764889 -3447868 -5831768 -5490808 -3821821 -3172581 -2426328 -244789
36663 -244789 1184720 117907 -258211 3485259 7981254 6446684 -1442298 -8422340
36655 -8422340 -9064184 -5637473 -3090277 -2394439 -1627307 -762422 -1744480 -4497115 -5915839
36646 -5915839 -3874579 -674450 -724739 -4745038 -8063383 -6231900 -1193922 824106
36638 824106 -2468045 -6585487 -6889057 -4657601 -3832852 -4418085 -3029007 1206694 5299284
36629 5299284 6950820 7068093 7180483 7275889 7173057 7621662 8720515 8937562 7017599
36620 7017599 3926124 2063536 3147737 7123354 12330237 16392566 17512490 15315251
36612 15315251 10784978 6083850 4100904 6223945 9732155 9349806 2954500 -5617470
36604 -5617470 -10681916 -10052072 -5417517 -50409 2257552 -705418 -5707164 -5568706
36596 -5568706 1747794 8770809 8041450 2936241 2551247 7726004 10047711 5144488
36588 5144488 -965361 -1380278 2564552 5439119 5562514 4347681 1913428 -2076984
36580 -2076984 -5775305 -7099199 -6435566 -4810158 -1853145 1795770 2867125 -522280
36572 -522280 -5403440 -7531364 -6508925 -4587768 -2443656 713384 4283440 6383413
36564 6383413 5861858 2434276 -3423856 -8959069 -10009907 -5923248 -1398878 -819961
36556 -819961 -2918797 -3735224 -2436113 -991479 -287178 -148258 -1449539 -4539370 -6964419
36547 -6964419 -6294210 -3966008 -2943291 -2941808 -1604450 905581 2467630 3199604 4972869
36538 4972869 7255372 7525811 5731815 4461634 4542284 4116978 2312036 290002 -1563475
36529 -1563475 -3929926 -5752347 -4866996 -2039565 -706675 -1917167 -3217975 -3427769
36521 -3427769 -4338842 -6061690 -5085505 77980 4992923 4947316 2036924 2232350 6486806
36512 6486806 9311103 6815271 2255370 1369702 4602775 6993796 5201761 1651586
36504 1651586 638051 2559289 4243979 3889085 2910999 2805735 2845888 1961038 881367
36495 881367 1042743 2667200 4830311 6192814 5343969 2239573 -529142 -415793 879805
36486 879805 -744290 -5049376 -6839950 -3820495 -336072 -391968 -1813582 -1386084 -894591
36477 -894591 -2590760 -3183087 629262 4160941 667078 -6677275 -8019579 -2116871
36469 -2116871 1234737 -3548929 -9229355 -7114118 356275 4652392 3616602 2012710
36461 2012710 2452175 2461669 247281 -1851891 -992406 1989854 3555793 1798726 -961268
36452 -961268 -522030 3740324 7060246 4967229 -383256 -2873714 -1018238 237511
36444 237511 -2815091 -7225027 -7685203 -3278934 2241423 4847561 3287494 -513307
36436 -513307 -2991091 -2334301 -547849 -492448 -1770693 -2316170 -2687458 -4534163 -5826016
36427 -5826016 -3102536 1715262 3050759 899141 1355614 6148388 9240206 7217034
36419 7217034 5396085 8536280 12554916 11924483 9065128 8775936 8592468 3509672 -3396446
36410 -3396446 -4586414 -413657 1650437 -199505 425953 6329106 11171710 9048650
36402 9048650 2633395 -2121534 -3769099 -3808378 -2144750 1248093 3362576 1331211
36394 1331211 -3074759 -5375829 -3617893 515943 4242436 5287498 2667582 -1905150
36386 -1905150 -4687407 -3924272 -2023212 -2018176 -3339486 -3284658 -1534360 -499607 -1349556
36377 -1349556 -2270879 -1528571 -353175 -1152955 -3669631 -4846910 -2965200 -257660 83275
36368 83275 -1502304 -1627876 862116 3192888 3218173 2836662 4408053 5895613 3156035
36359 3156035 -3451698 -8173377 -6343744 574835 7223127 9652960 7597705 3437534
36351 3437534 423937 728715 3525004 5237465 3001014 -1860084 -4721953 -2687231
36343 -2687231 1900851 4214217 3109985 2518744 5481446 9040444 8030560 2734368
36335 2734368 -1238563 -896747 575300 -315908 -2070278 -1539122 709471 1824828 1210129
36326 1210129 244455 -718836 -1691211 -934304 2830314 6955101 7078307 2520949 -3276617
36317 -3276617 -7123399 -8193596 -6626457 -3172425 21987 1071624 688849 690608 955580
36308 955580 258681 -1028676 -1904855 -3092701 -5114708 -5389519 -1321320 4626839 7458756
36299 7458756 6838999 6947690 9066808 9628135 6809778 3845399 3528117 4001181 2869747
36290 2869747 1577575 2311869 3557859 2334185 -994745 -3262140 -2773640 -721746
36282 -721746 847345 863231 -218841 -868526 -485973 -900546 -3854447 -7223542 -6872500
36273 -6872500 -2593439 1499584 3244483 4655969 6301638 4687705 -1264192 -5771646
36265 -5771646 -3196641 3592728 7045959 5044331 2039576 1512836 2711865 4520625
36257 4520625 7260037 9813074 9405398 5611887 1203703 -1910391 -4298761 -5859759
36249 -5859759 -4854448 -1596881 382038 -1022653 -3501093 -4106492 -3387175 -3326462 -3538612
36240 -3538612 -2418651 -346156 1242472 2644488 4620789 5389468 2590692 -1913894
36232 -1913894 -3189312 -213988 2008990 -504459 -4704395 -4789277 -458061 3059972
36224 3059972 2589349 620025 667699 2626637 4449420 5518745 5950257 4773552 1742733
36215 1742733 -411584 1275403 5391403 7173675 4386949 -270642 -3084837 -3406501
36207 -3406501 -3102653 -3845966 -5760192 -7248780 -5758419 -481565 5347631 7027944
36199 7027944 3922370 70580 -1545178 -2381636 -4290246 -5361534 -3056054 846907
36191 846907 2521066 2179143 3489668 6877147 7901045 3825465 -2004896 -4875361
36183 -4875361 -4962792 -5807086 -8354627 -9970938 -8800219 -5944124 -3085647 -763655 219976
36174 219976 -1606982 -5612794 -7801562 -4772580 1639761 5724679 3974562 -1609972
36166 -1609972 -6235253 -6763161 -3268852 1929124 5638712 5555290 2387227 -165897 947955
36157 947955 4489835 6265542 4366961 1542033 1308225 3081920 3314095 1156615 222353
36148 222353 3348973 8016721 9796932 8952288 9659942 12571026 12790749 7524662 1572054
36139 1572054 1038164 4305216 4464811 -372064 -4814769 -4804740 -3119398 -4139089 -7451861
36130 -7451861 -9613587 -9166875 -7016762 -4221276 -2039553 -2050362 -3778196 -4228963 -2037346
36121 -2037346 174741 -89395 -1334499 -1187690 -743597 -2223279 -4492764 -4888145 -3810471
36112 -3810471 -3403024 -3115047 -1054269 1269887 442220 -2823749 -4005557 -1694646 368933
36103 368933 -605204 -2446672 -1928678 589638 2399232 2025919 95532 -1668410 -1592197
36094 -1592197 206696 1332613 316157 -504650 1844650 5820353 7123023 5131959
36086 5131959 3278553 2983192 1959639 -753691 -2970996 -3838186 -5213528 -6837085
36078 -6837085 -5232669 6581 3722569 2236217 -1482776 -3175384 -3542726 -5056908
36070 -5056908 -6504853 -5591618 -3941994 -4470741 -6059591 -5751654 -4267676 -4254966 -4623273
36061 -4623273 -2131395 2081702 3185492 310471 -1687081 534453 4320412 5822724
36053 5822724 5487391 5951820 7109377 6546192 3875138 1680319 1702575 2103659 -17850
36044 -17850 -4173759 -6538204 -5004540 -2147190 -1396500 -2186292 -1854296 -744092 -1050018
36035 -1050018 -1343464 2034974 7274283 7238655 253573 -5386824 -2409531 5075230 7999584
36026 7999584 4994689 1953379 1856151 2262554 1573975 871155 -48047 -2031469 -2196039
36017 -2196039 3200446 11109362 13672258 9211204 4826133 6016508 9853012 11179444
36009 11179444 9841430 8284611 6930835 5661709 5611149 5904849 2884072 -3484714
36001 -3484714 -6660925 -1840976 6190660 8888834 5215581 1478820 1283328 1490233
35993 1490233 -1435282 -6045447 -8643985 -8261658 -7025907 -7008883 -7798717 -6888382 -2727493
35984 -2727493 2569547 5155831 4538722 4046394 4950661 3846377 -1124800 -5242998 -3360994
35975 -3360994 1524996 1971101 -2722123 -5652634 -3159953 267003 225056 -802463 941263
35966 941263 2999578 308496 -6378543 -10912713 -9577076 -4343904 1018786 4388936
35958 4388936 5190119 4213607 3558373 4171030 4057504 1651744 -329000 1702570 5791803
35949 5791803 6349485 2700795 307089 1942731 3325740 720129 -2353564 -839308
35941 -839308 3431821 4890085 3213214 2746534 4100929 3155914 -883503 -2934981 78469
35932 78469 4185801 4553897 2407022 1740538 2359189 926612 -2605893 -4322573 -2340421
35923 -2340421 128678 -932597 -5074954 -8024432 -6979066 -3948095 -3117163 -5386465
35915 -5386465 -7285422 -6195057 -4331534 -4765560 -5394153 -1599921 5278322 7733927
35907 7733927 2332865 -4894357 -6662950 -3789415 -2055150 -3104214 -3619819 -1695501
35899 -1695501 991555 2628533 2692175 567102 -3337767 -5711543 -3559698 1025729
35891 1025729 3104841 1573650 -231557 -279567 14639 -480231 -949582 -1184265 -1773208
35882 -1773208 -1316962 2229771 6763654 7322283 3464127 437339 986122 1164256 -2430249
35873 -2430249 -6119146 -4690063 -135219 800647 -3364723 -6374329 -2361334 6994892
35865 6994892 14502346 14670457 8201770 556854 -3300559 -2895359 -1003005 663570
35857 663570 2689619 5091068 5995732 4362308 1890077 927064 2113101 4725363 7231449
35848 7231449 7140084 3290873 -1047592 -1040684 2637134 3998748 862189 -1533396 599392
35839 599392 2790004 -111877 -4453103 -3241053 2160082 4232410 1761762 999303
35831 999303 3718992 3409307 -3292771 -9488565 -7731795 -898854 2766463 1352098
35823 1352098 -362749 153185 260923 -2141441 -5106476 -5719140 -3417667 309320 3118115
35814 3118115 2750918 -740274 -3699548 -2211624 2964587 6831760 5827158 1339660
35806 1339660 -2599095 -3404370 -1373820 1430308 3074819 3274735 3194956 3434101 3047409
35797 3047409 1490496 341196 1277304 2987117 2130445 -2589250 -8760033 -12497940
35789 -12497940 -11212666 -5098144 2182324 5127925 1374286 -5025646 -7757566 -5628217
35781 -5628217 -2991061 -2676087 -2185435 1470286 6446955 8380149 6085201 2242826
35773 2242826 -386619 -952227 387648 2749500 4020257 2257807 -1874947 -5268695
35765 -5268695 -5261536 -1848362 2594511 5180315 4839148 3502921 4004106 6022691 5660221
35756 5660221 568229 -5983216 -8430367 -5500989 -1112259 915844 538001 -319294
35748 -319294 -817639 -1462808 -2812966 -4843644 -6743605 -7031201 -4848874 -1347542 1169244
35739 1169244 1576860 524672 -1077215 -2898674 -4492724 -5075781 -4465727 -3571354 -3798191
35730 -3798191 -6170302 -10296266 -13613640 -12911731 -7928387 -2400572 -124849 -1113656
35722 -1113656 -3083878 -4920163 -6328951 -5984974 -3426703 -1464346 -2746520 -4722867
35714 -4722867 -2491420 3441384 7125157 5716312 3117780 3257355 4437456 3257253
35706 3257253 321246 -1350538 -879744 534789 2007468 2723858 1523812 -895855
35698 -895855 -1624322 349710 2064340 879063 -1746772 -3104482 -3027559 -2330629 -693315
35689 -693315 889160 -909212 -6399688 -9871528 -6647799 -315045 2299877 872783
35681 872783 322576 1653965 1028577 -2207142 -3594251 -1268701 396196 -2471565 -7411295
35672 -7411295 -9397413 -7112947 -2970014 495122 2042238 1500830 -150903 -1692102
35664 -1692102 -3137064 -4859721 -5705451 -4296493 -1614542 513924 2539718 5141178
35656 5141178 5241487 -621181 -8905673 -11145981 -5159165 1549022 2284919 -462493
35648 -462493 -1014695 223710 -1053041 -4931168 -7287786 -6565440 -5325444 -5263780 -4965975
35639 -4965975 -3012024 -2197 2950072 5090622 5161862 2180017 -2476798 -5805050
35631 -5805050 -6378587 -5111359 -2813631 848797 5291806 7856012 6245526 1538124
35623 1538124 -2284705 -1953059 2035862 5763920 5328074 402172 -5275954 -7080628
35615 -7080628 -3632323 1815456 4321205 2192972 -1205647 -1503711 1191159 2700441
35607 2700441 744713 -2267945 -3567056 -3888598 -4563110 -4012741 -1125140 488384 -3120918
35598 -3120918 -8867792 -9439110 -3554430 2238048 2965731 891145 133723 1156673 3075079
35589 3075079 6085649 8282600 5174364 -3283604 -9542819 -7316498 -29681 4784394
35581 4784394 6166540 8415356 11341512 9547814 2025317 -4419002 -4048983 361632
35573 361632 2320598 546987 -602479 1865709 5566400 6072453 2328187 -2318976
35565 -2318976 -4008009 -2306251 261770 1855258 2885862 3839608 3615003 1350539
35557 1350539 -1578022 -3059456 -2861896 -2309262 -2162378 -2262262 -2621357 -3473426 -4630329
35548 -4630329 -5749213 -6634702 -6570271 -4511308 -1080627 806676 -1112764 -5515223 -8799442
35539 -8799442 -8812208 -6243277 -3048726 -792664 -241556 -1417843 -3642568 -5607496 -5681416
35530 -5681416 -3291617 -835283 -2556744 -9264996 -15463287 -14970547 -8722486 -3200482
35522 -3200482 -1454655 -390160 2589913 5856292 8298778 11834888 15647655 13616707
35514 13616707 3012731 -8331784 -9967598 -1937144 5814940 5961391 428169 -4775915
35506 -4775915 -6143524 -3800879 -361342 685464 -1583669 -3952242 -3604734 -2737327
35498 -2737327 -4892413 -8373001 -8370719 -4951203 -3344263 -5780949 -8417685 -7831242 -5741979
35489 -5741979 -5172218 -5955071 -6368401 -5886033 -4179334 -470345 4013667 5831217 3745774
35480 3745774 752034 -328795 -476592 -1290532 -1086081 2280520 6458771 6484199 1553859
35471 1553859 -3246168 -2906546 1714656 5061506 2855296 -3771130 -9500416 -9670331
35463 -9670331 -4321413 1886348 3714966 -38586 -5329737 -6523532 -1955513 4409979
35455 4409979 7602182 7065329 5716515 4533295 1574592 -2992207 -5025430 -2186616
35447 -2186616 1745328 2012609 -102315 206137 3151488 3768144 -326816 -5187593 -6201946
35438 -6201946 -4115822 -3094447 -4667478 -5858730 -3058358 3317518 8484644 8105058
35430 8105058 3373002 -178264 515107 2552929 1653889 -2334806 -6751947 -10325376
35422 -10325376 -12738778 -12095365 -7021913 -477887 2465089 575531 -2858392 -4829672
35414 -4829672 -5063416 -4311186 -3364517 -3261687 -3683717 -2280008 1411529 3348783 421968
35405 421968 -3511124 -2384386 2666246 4895502 2462006 415486 1407447 1645237 -1502197
35396 -1502197 -4514033 -3938134 -2114815 -2672261 -4771164 -5755043 -5634061 -5133732 -2903246
35387 -2903246 1451075 4783085 4637363 3009832 2211842 340574 -4644179 -9212783
35379 -9212783 -7972932 -1710335 3168847 2786104 -734518 -3740191 -5142560 -5535299
35371 -5535299 -5290832 -4553002 -3470675 -2038337 -591330 131103 380602 1685389 4438406
35362 4438406 6510222 5808059 3042021 569252 -174969 1115002 4039479 6389176
35354 6389176 4689323 -1599828 -7731264 -8116085 -2634642 3339072 4749672 1374977
35346 1374977 -2783404 -3583737 -934487 793635 -2003198 -6635661 -6600971 -102559 7491350
35337 7491350 11113594 11801407 12390502 11688911 7456419 2261975 989000 3545295 4824753
35328 4824753 1794268 -3389337 -7401413 -9138149 -8639005 -6119199 -3195489 -2419150
35320 -2419150 -4243450 -6064421 -5147479 -1528667 2124451 2720138 -580632 -4806433
35312 -4806433 -5394628 -1523529 2122172 1069593 -2813192 -3853117 -453418 3079691
35304 3079691 2912712 488031 -510924 584728 1450265 804702 106449 972709 2476101
35295 2476101 2329287 450489 -403959 1403617 3501191 2939676 1323850 2807844 6944767
35286 6944767 8133841 4051794 159241 2236159 7878667 9965326 6368334 1347374
35278 1347374 -1480249 -2414175 -2041445 469352 4020574 4792567 1193316 -3202843 -3984834
35269 -3984834 -1310018 992124 345995 -2337605 -4503967 -4538984 -2916741 -1746228 -2867818
35260 -2867818 -5785523 -7850976 -6970129 -3797960 -944696 -436293 -2326524 -5354625
35252 -5354625 -8213457 -10073979 -10613356 -10294180 -10296437 -11031782 -10687443 -6926126 -819094
35243 -819094 2884955 1216048 -2927921 -4460550 -2372245 557252 2803137 4892615
35235 4892615 5914405 3906754 126469 -1666027 -1171235 -2162483 -5693493 -7693611
35227 -7693611 -5788964 -3592564 -4565910 -5783080 -2291486 5106713 10695572 10715429 6138536
35218 6138536 427681 -2642377 -920809 3748227 6976404 7294389 7205122 7475057 5223957
35209 5223957 431325 -1302536 2921184 7427967 6129417 1842599 811616 2187675
35201 2187675 901968 -2064042 -1157768 3243057 4516047 313112 -4307042 -5192968
35193 -5192968 -3696408 -1978354 -203375 464989 -1780786 -4855047 -4352367 -542548
35185 -542548 1933018 1764667 1941413 2489642 -376300 -6223408 -8975732 -6167844 -2755579
35176 -2755579 -2808061 -4149905 -4401388 -5269903 -6780002 -4207963 3982352 11135537 11024595
35167 11024595 6467610 3820843 3645063 2742148 1156220 696986 -197418 -3735505 -7412973
35158 -7412973 -7397331 -5203720 -5202873 -7201030 -7196440 -4207072 -852624 1762474 4241755
35149 4241755 4817456 920196 -5032389 -6940751 -3174434 1237936 1891850 338105
35141 338105 375589 2481136 4212914 3953264 2168287 99158 -1306394 -1636214 -1066483
35132 -1066483 -256273 -99571 -1221586 -3062529 -3911990 -3065415 -2164717 -2323765 -1103367
35123 -1103367 3899886 9045599 7630586 -23242 -5444670 -3715911 -197250 -1192225
35115 -1192225 -3895818 -2206126 2059879 1913414 -3135300 -6470339 -5156802 -3592018
35107 -3592018 -5103905 -6711515 -4856858 -1156467 583585 -397827 -1971260 -2035548 148410
35098 148410 3366376 4620196 2254090 -1078150 -1359398 1148923 2557523 1406962
35090 1406962 121712 154597 -69327 -1371108 -1990197 -980864 111266 475161 1649814
35081 1649814 4334220 6545149 6456325 4454575 1361358 -2513070 -5692938 -6178343 -4789493
35072 -4789493 -4496098 -5431116 -4448657 -980737 1091487 -282674 -1464685 1248419 5762486
35063 5762486 7596551 6281240 4613478 3725664 2510107 427475 -2082843 -4540021
35055 -4540021 -5512960 -3021565 1662093 3446474 -9166 -3867293 -2272360 3357891
35047 3357891 6653275 5002044 1047469 -3064435 -7358308 -10319701 -9188044 -4797245
35039 -4797245 -1184592 652106 3649422 7875889 8212303 1889190 -6016956 -8468917
35031 -8468917 -4792556 549182 4757638 7950141 9367654 7224531 2577873 -474450
35023 -474450 340027 2781971 3276355 1030340 -1859750 -3005624 -1557040 1550004 4222724
35014 4222724 4456867 1645125 -3041569 -7356402 -9236223 -8213856 -5972505 -4721105
35006 -4721105 -4606255 -3779339 -1597106 -182139 -1392831 -3675430 -4079193 -2499382 -1323689
34997 -1323689 -1171297 -8978 2802658 4567088 3160843 649331 607317 3209139 5561941
34988 5561941 6243395 6789821 8498007 10247288 10415538 9013361 6738970 3617866 192930
34979 192930 -1300680 814714 4632727 6005688 3215046 -1326428 -4323966 -4780112
34971 -4780112 -3348785 -581957 2679858 4741633 4836411 4509417 5328250 6193791 5291119
34962 5291119 3888812 4933257 7688564 7439627 2111314 -3967159 -5402274 -2494272
34954 -2494272 258890 722275 828547 2416442 4666011 5993855 5945839 4633866 2258100
34945 2258100 -302247 -1985866 -2899666 -3855610 -4762879 -4974678 -4731138 -4406426 -2980940
34936 -2980940 368969 3718314 4310650 2822738 2525413 4080768 4778567 3597572 3018654
34927 3018654 4188173 4204665 925655 -2645987 -2100347 2092045 4979555 2883970 -3189523
34918 -3189523 -9004973 -10837907 -8958666 -7668170 -9887313 -12240387 -9295243 -2455447
34910 -2455447 1068837 -653274 -1252014 2582896 4379840 -1445536 -9115174 -9980069
34902 -9980069 -6052479 -5146402 -6341655 -1908559 7415281 11275580 5713512 -817564
34894 -817564 -1159306 906998 -209105 -2291017 -1428138 -211376 -2401875 -5193697 -4218231
34885 -4218231 -1635407 -1859273 -3062493 -598171 3878753 4508295 1049762 -718367
34877 -718367 1813352 4939683 5116327 3121295 1112230 129795 988702 3590743 5240880
34868 5240880 3524919 646828 911383 4235145 6377057 5351596 3218838 1659025
34860 1659025 397506 99723 1986009 4177755 3401383 903190 1257732 4244607 3991932
34851 3991932 -1469840 -5905655 -3931125 954123 2314979 550126 924055 4484795
34843 4484795 6982366 5918394 3248540 869746 -1900158 -5301204 -7346820 -6656907
34835 -6656907 -4570606 -3101157 -2590987 -2307455 -1775254 -770547 676587 1833784 2110427
34826 2110427 2422805 4031464 5902312 5397928 2236578 -568036 -975185 -825379 -2488342
34817 -2488342 -4640203 -4315094 -2012360 -1242513 -2895987 -3566052 -762846 3175008 4485269
34808 4485269 3061665 1589263 1197731 844667 97268 -571478 -2056112 -5994361 -11137256
34799 -11137256 -13078954 -9035936 -1184756 5759648 8724665 7384889 3152476 -1575039
34791 -1575039 -4551314 -5213914 -4228824 -1601688 2670631 6071601 5065598 410358
34783 410358 -2515963 -893164 1526896 694960 -993470 1076970 5353524 5926808 1982548
34774 1982548 -756110 994452 3441343 2400221 -483051 -1758740 -2317905 -4905179
34766 -4905179 -8134405 -8115146 -5073803 -3405107 -4754049 -5570346 -3109146 13914 -110179
34757 -110179 -2917185 -4898133 -4988130 -4740783 -4101561 -1240016 2961659 4396484 1461313
34748 1461313 -2162166 -2794321 -1669629 -1637863 -2090140 -1206505 -611367 -2630043 -4665146
34739 -4665146 -2412521 1883824 1216433 -5180383 -9628741 -7296677 -2835097 -1849872
34731 -1849872 -2314474 11235 3303319 3700342 3248719 6095724 9674809 7929195 1919619
34722 1919619 -1094654 882849 2144337 -602671 -3497813 -3179779 -1889345 -1667516
34714 -1667516 -121335 3811086 5723842 2454539 -1726208 -1108637 2797853 4223577
34706 4223577 2312624 1653958 4685996 8555715 9501373 6621993 1414028 -3319429
34698 -3319429 -4477257 -1557489 1786478 1672410 -1305693 -4061596 -6462369 -10861105
34690 -10861105 -16479651 -18642960 -14906618 -8540219 -4154470 -2534953 -1771184 -1255850
34682 -1255850 -1910142 -3331254 -3142017 269046 5253121 7727401 4948877 -1082111
34674 -1082111 -4712034 -2549727 2101403 2882955 -1248102 -4046892 -80855 7639935
34666 7639935 11262449 8218762 3980115 4054963 6781388 6551211 2098405 -1833188 -1063627
34657 -1063627 2648381 4291955 2196221 -131369 1049522 4586338 5889981 3162612
34649 3162612 -186685 -719284 -256514 -2684924 -6699617 -6708533 -1904183 1087617 -2129972
34640 -2129972 -6508770 -5254337 -583624 311399 -2528002 -2193088 2873104 6044362
34632 6044362 3708871 480524 -336384 -2898184 -9847930 -14800765 -11173897 -2798656
34624 -2798656 2084921 2816846 4094784 5648088 3426544 -911457 -1027321 3788907
34616 3788907 7540105 6967645 4477249 1527927 -2938724 -6813056 -5809026 -1694613
34608 -1694613 -1431114 -5894505 -7616067 -2896736 1913432 635098 -3533022 -4300166
34600 -4300166 -1617202 843323 2372565 3848502 3977433 2025000 429637 247755
34592 247755 -1642846 -6242084 -8338350 -4318167 713773 180199 -3732279 -4379453 -1849105
34583 -1849105 -1691411 -4402715 -4686526 -1057294 1784320 1331094 859666 2415957 2386691
34574 2386691 -2611349 -9762794 -13235901 -10650817 -4292499 1639031 3382347 -209876
34566 -209876 -5980505 -8810712 -7109350 -4415575 -4552727 -7007147 -8415121 -7055494
34558 -7055494 -4153694 -1529033 296445 1514600 2029255 2158943 3466467 6662848
34550 6662848 8447767 3805885 -6107884 -11773776 -5908402 5682149 10146314 4124670
34542 4124670 -2917136 -3127232 -82851 -567040 -4083122 -6292950 -6827845 -7048893 -4938670
34533 -4938670 643800 4602053 2004192 -3267885 -3900013 -515727 502688 -1457441
34525 -1457441 -956529 2741539 3891593 510014 -2136671 -672280 1427481 1098116
34517 1098116 911112 3111673 4409300 1272443 -4146014 -7819621 -10007705 -13261069
34509 -13261069 -16772238 -16822097 -11881099 -4598788 757785 1654190 -875294 -3083109
34501 -3083109 -2298270 254569 1718113 1537903 942359 82508 -1181222 -1243370 755351
34492 755351 2117670 597424 -836731 1357475 4020096 1586890 -3729778 -4374545
34484 -4374545 -144674 631680 -5440545 -11149584 -10116810 -5835196 -4625019 -6575109
34476 -6575109 -8533782 -9954280 -10687061 -8523463 -3781437 -992185 -1631830 -1102856 2594389
34467 2594389 4241589 1116462 -374784 4532051 8815717 4004248 -5222498 -7964006
34459 -7964006 -4603992 -5142253 -11741471 -15586191 -12200583 -8046864 -8549428 -9903001
34451 -9903001 -7673659 -4899484 -5639829 -7089048 -4528651 408761 2420839 520297
34443 520297 -1831115 -2591476 -2681363 -2841542 -2664626 -2278168 -2287336 -2345466 -1697072 -756417
34433 -756417 -612654 -1180028 -956210 1181943 4162090 5001255 1915436 -2565175 -3551904
34424 -3551904 -183136 2433351 194924 -3735936 -3687745 -402839 244165 -3225017 -5705309
34415 -5705309 -3825691 -633027 313358 311196 1702939 3082459 2342626 1189319 2224929
34406 2224929 3801605 2288115 -1769216 -4168633 -3538242 -3185594 -5532294 -8101815
34398 -8101815 -7035095 -2492358 1808939 3535004 3733242 3581614 1651341 -3453164
34390 -3453164 -9060615 -10376200 -7004599 -4209373 -5647161 -7767101 -4852679 2184960
34382 2184960 6271416 3197337 -3667029 -8413601 -9132290 -8110457 -7918834 -8855605 -9119171
34373 -9119171 -6875585 -2920837 -689151 -2137757 -4701557 -4618206 -2175334 -734397
34365 -734397 -1568369 -3250551 -5369721 -8498566 -10617539 -8426761 -3011552 482343
34357 482343 -44107 -1629340 -2602396 -5308059 -9939969 -11457689 -6932412 -1244320 -384441
34348 -384441 -2724423 -2421164 1163858 3228075 1297930 -2179446 -4509682 -5174383 -3568477
34339 -3568477 1206105 7451882 11212967 10534311 7216144 4135633 2747416 2850736
34331 2850736 2828050 716478 -3154043 -5748501 -5371970 -4158858 -4098445 -3181641 873252
34322 873252 5584891 7160618 7011579 9095968 11813156 9131106 390534 -7428523
34314 -7428523 -9135817 -7313780 -6304992 -5566766 -2681915 1197628 3038604 2349450
34306 2349450 569765 -1592893 -3348566 -2843085 -5718 1811043 -25388 -3547545
34298 -3547545 -5035255 -3685963 -999642 1964328 3788561 1855179 -3943526 -8768995
34290 -8768995 -8136172 -4050213 -1875367 -2665147 -3108975 -1965524 -1480369 -2535893 -3315951
34281 -3315951 -3352667 -4301939 -5862923 -5573037 -3939403 -4929885 -9187530 -11419824 -7716229
34272 -7716229 -1516649 1418427 623878 -666948 -1795248 -4155964 -6032466 -3691465
34264 -3691465 2046901 5304365 2665358 -2662994 -5878096 -6273396 -5737761 -4792093 -3340630
34255 -3340630 -3267249 -6465930 -10778920 -11293247 -6315771 430371 4435186 5078688 4468668
34246 4468668 3597880 1774801 -1043605 -3584984 -4991112 -5507976 -5105979 -2941365 1053559
34237 1053559 5175685 7458454 7494124 6134041 4189839 2159882 416106 -1196055
34229 -1196055 -3153786 -4829071 -4440283 -1839750 -186176 -2625120 -7774864 -10992397
34221 -10992397 -10311484 -8556305 -8666628 -9427638 -7722871 -3385517 437478 1175693 -694602
34212 -694602 -2916370 -3803601 -3177453 -1834248 -413366 1208104 3101218 4219748 3341541
34203 3341541 1116361 -397662 -597739 -844399 -1487640 -867859 1294400 2263488 504755
34194 504755 -1057450 492755 2469437 147382 -5062495 -6452713 -1692864 3707211
34186 3707211 4639716 3122287 3487766 5180179 4958083 3300847 3271397 4351009 2775073
34177 2775073 -1840975 -4965413 -3363090 1007705 4634509 6392532 6130838 2928944
34169 2928944 -2386526 -5690131 -4034973 -243829 396543 -2577060 -4196038 -1050009
34161 -1050009 4242602 6920314 6088842 4696260 4653496 4489996 2421943 21707 944724
34152 944724 5824002 10123815 8878633 3173243 -466148 1897306 6504872 7128740
34144 7128740 3719714 2200728 5677767 9871021 9215312 4389412 670849 636644 2102624
34135 2102624 2733166 2929741 3273418 2304251 -1118818 -5194485 -7124801 -6675728 -5823908
34126 -5823908 -5456896 -4514082 -2541564 -1190994 -2179937 -4817524 -6759443 -6935270 -6638501
34117 -6638501 -7360250 -8359470 -7433429 -4105337 -859292 -316687 -1894380 -2557301 -697960
34108 -697960 2143338 3659745 3415980 2319271 645580 -2095701 -5673568 -8545470
34100 -8545470 -9014312 -6872048 -4022179 -3160692 -5106247 -7662711 -8153093 -6781012 -5929718
34091 -5929718 -6312536 -6077498 -4173944 -2002164 -601750 1008137 2861638 2385742 -1401914
34082 -1401914 -4643060 -3451523 -122122 -15378 -3269809 -4738590 -2345307 -169658
34074 -169658 -1665844 -4709204 -5986892 -6082701 -6831426 -7122294 -5386947 -3770345 -5433917
34065 -5433917 -9045544 -10138949 -7435931 -3977770 -1972874 -198160 2770315 5960010
34057 5960010 7903726 8693719 8866613 8277772 7319741 7314380 8185771 7529144 4043017
34048 4043017 618364 1352858 5604180 7708361 3866148 -2633747 -5253012 -2418392
34040 -2418392 818930 -170057 -3676524 -4847185 -2810418 -1378790 -3074887 -5787507
34032 -5787507 -6318644 -4672025 -3272014 -3612961 -5100858 -6074924 -5097553 -2454288 -840356
34023 -840356 -2816372 -7093353 -9599445 -8944038 -7942322 -8374985 -7653112 -3304965 2248729
34014 2248729 4881389 4449441 3588223 2781989 858892 -1023648 -650180 534696 -1125287
34005 -1125287 -5035148 -6250396 -3118754 -435382 -2712677 -8031391 -11307506 -10789486
33997 -10789486 -8425774 -5935890 -3577190 -1740046 -1143752 -1576732 -1946412 -1536546 -643250
33988 -643250 -367851 -1739533 -4118213 -4930867 -2670067 346212 590652 -1590570 -2559820
33979 -2559820 -1228682 -646520 -2638729 -4612285 -3797046 -1405826 4580 524230 1433668
33970 1433668 2230263 2193805 2840855 5479842 7886872 6890269 3345690 1250311 2336918
33961 2336918 4528923 5664017 5998274 6552275 7012335 6077822 3172519 -267334 -1393045
33952 -1393045 812352 3022351 1004114 -3889454 -5486544 -1816745 1178753 -1543238
33944 -1543238 -6071855 -5584414 -894761 1665099 722154 783238 3273982 4298090 2271860
33935 2271860 479858 66546 -2346282 -6957874 -7686066 -1423076 5492407 5704490 1170111
33926 1170111 -991326 571840 1219591 -1140426 -3891860 -5396154 -6888056 -8450951
33918 -8450951 -8277289 -6705007 -6529901 -8311179 -9268082 -7850585 -5748166 -4210792 -1933421
33909 -1933421 1761598 4677059 4631426 2444700 467226 -157994 248592 609774 -615641
33900 -615641 -3827821 -6487578 -5422906 -1656525 -69880 -3003536 -7095896 -8212141
33892 -8212141 -6627278 -5021927 -4080266 -3138745 -3092482 -5068309 -7280030 -6593755 -2859961
33883 -2859961 1155111 3809598 5729044 7092706 6830077 5082641 3850482 4245332
33875 4245332 5062872 4816856 3412446 1246346 -1484883 -3949962 -5021815 -5125471 -5843294
33866 -5843294 -6984451 -6276340 -3160937 -650888 -1533406 -4398516 -5511107 -3548808
33858 -3548808 -617509 633367 -680267 -3438904 -5205036 -4145611 -1577141 -1168147
33850 -1168147 -3989018 -6239820 -4442719 -1161448 -1991439 -7666680 -13067144 -14168378
33842 -14168378 -12104600 -9575678 -7128755 -4704774 -3516223 -4133109 -5187003 -5836237
33834 -5836237 -6972503 -8229847 -6939206 -2618352 607115 -584226 -3624262 -4289898
33826 -4289898 -3496641 -5028695 -8307477 -9119074 -6950584 -5588623 -5887657 -4228945 -114497
33817 -114497 963875 -4027683 -9601726 -9104987 -4216996 -1428026 -1765278 -550306 3469706
33808 3469706 5460729 2337315 -2332787 -3983201 -3343082 -3563944 -4103942 -1838454 2832593
33799 2832593 5242243 2667195 -1732337 -2982784 -582779 1445998 180896 -2855074
33791 -2855074 -4558091 -4372018 -3807478 -3205955 -1645629 105411 -458006 -3485547 -5184217
33782 -5184217 -2505267 2209132 3766893 544201 -3975286 -5781194 -4278073 -1576781
33774 -1576781 135447 -44237 -1592379 -3182129 -4116170 -4936742 -5798519 -5113978 -1583471
33765 -1583471 2888608 4503590 2129027 -1216357 -1965592 190171 2324166 959227
33757 959227 -5024031 -12656995 -16433813 -13533221 -7326199 -3687992 -4229735 -5721857
33749 -5721857 -5699744 -4938687 -3994983 -1724253 864421 -478465 -7148631 -13688225 -13840904
33740 -13840904 -8528660 -3824479 -2544293 -2277690 -1173999 -930629 -2920542 -5081018
33732 -5081018 -4697418 -2106230 153673 603599 -80272 -504870 -217757 -65400 -852326
33723 -852326 -1603325 -385213 2264968 2569239 -1606285 -6486761 -6156979 -185978 5795820
33714 5795820 7393838 5918222 4518645 3286258 616089 -2784973 -4202009 -2694051
33706 -2694051 -516255 -510549 -2914505 -4911890 -3417069 1299462 5332054 5594896 3813382
33697 3813382 4129190 7252784 9762074 9415856 7954429 7424380 6827404 4530328 1497516
33688 1497516 -432284 -1600119 -3155932 -4082911 -2539882 546203 2064257 863812
33680 863812 -1003008 -1410517 -595220 347 -142424 -304068 282134 1164452 615848
33671 615848 -2396583 -6021272 -6801453 -3914562 -401639 1053578 1565040 3338725 5524944
33662 5524944 5594341 3522167 1439030 -143202 -2401924 -4647128 -4143851 -229543 4223697
33653 4223697 6451411 6638862 6381084 6566320 7593925 9475470 10788120 9601475 6358714
33644 6358714 3820389 3341501 3422050 2823972 2523352 3125900 2907847 494655 -2525260
33635 -2525260 -3823988 -3568208 -3422121 -3822787 -4258873 -4860907 -5667276 -5525670 -3603961
33626 -3603961 -811230 1723506 3731732 3921472 115156 -5947537 -7514641 -1280903
33618 -1280903 5847954 4765647 -2489743 -4996211 864568 5888489 2202710 -4864022
33610 -4864022 -5388566 371275 3803234 1406550 -2136967 -3649887 -5673453 -9190321
33602 -9190321 -9709755 -4545557 1679168 3578698 2906211 4694567 8476943 9274487 6096523
33593 6096523 3411276 3546887 3187690 -251853 -3332152 -1572110 2969688 3801043 -672256
33584 -672256 -4249430 -1106236 6103256 9409739 5771552 700941 672162 4795460 6767685
33575 6767685 3714053 -456501 -955306 1862087 4198130 4282335 3648748 3996720 5075341
33566 5075341 5543791 4562554 2814784 2577104 5436217 8959841 7894875 921387 -5966252
33557 -5966252 -6183038 -1106320 2194637 966274 -332836 2347869 7017541 9552329
33549 9552329 9253146 8012404 6941143 6123820 5215830 2552647 -3421141 -10103676 -11648123
33540 -11648123 -6397128 57648 2144354 1112902 1156133 2461907 2712422 2478157 3853889
33531 3853889 5737103 5593945 4282068 4072901 3629230 499110 -3033439 -2903116 -885738
33522 -885738 -2189600 -5901851 -5807567 -1530778 -226288 -4524509 -7329119 -3208004 2648932
33513 2648932 2900865 -788361 -2058253 -535620 -621627 -2599343 -2427872 854458 3921607
33504 3921607 4794008 4356609 2937247 360555 -1315872 -43753 1910332 844631
33496 844631 -1836520 -1265281 2911041 5779646 4920328 3297011 2992150 1490515 -3159078
33487 -3159078 -7867640 -8527027 -5684821 -3180786 -2826615 -2889301 -1126865 2121630 3822069
33478 3822069 1414091 -3457971 -5891981 -3834461 -912414 -551281 -264033 3644669
33470 3644669 8287492 7538571 2081894 -1157617 -77420 -263240 -4795093 -8727460
33462 -8727460 -7299774 -2895761 512869 3486698 6486732 5255969 -2404211 -9913860
33454 -9913860 -9418977 -3012687 626812 -1480184 -4755213 -5772727 -5416642 -3871722
33446 -3871722 308389 5462125 7428995 5882442 4561355 4610340 3456636 1064282
33438 1064282 1033858 3801661 4827038 1960991 -999205 -858274 242800 -283008 -1093729
33429 -1093729 -1019298 -2481113 -6600770 -9495623 -8055096 -5166542 -4367919 -3727420 -794691
33420 -794691 746423 -3249162 -8309461 -6557453 430103 3082690 -1476756 -5483752
33412 -5483752 -3579285 -678403 -2175897 -4385693 -1579546 3461658 3994129 700115
33404 700115 132229 3407869 4790015 1909653 -383918 1509809 4391989 4449749 3153226
33395 3153226 2709583 708708 -5032959 -9948808 -7899857 -1382599 571856 -4613273
33387 -4613273 -8919839 -5328154 2171349 4739847 970334 -2602240 -1551743 1544152
33379 1544152 2572024 1459834 690336 1716436 4635190 8606691 10831139 7942513
33371 7942513 791023 -4675804 -4293541 -1450577 -2441397 -7438476 -10381726 -7748744
33363 -7748744 -2996820 -966602 -1695580 -2039878 -478476 2340659 5573301 7915524
33355 7915524 7194768 3182056 -620058 -1116380 -349935 -2573876 -7409056 -10079113 -8580155
33346 -8580155 -6177289 -5538507 -4725852 -1409705 2693556 4869260 5998914 8386071
33338 8386071 11060330 11240898 9250769 7957691 7841736 6573258 3690052 1975849
33330 1975849 3245392 5699575 6483412 4570759 588893 -3844563 -6312336 -5709928
33322 -5709928 -4313204 -4865807 -5806594 -3320183 1641342 3423290 284896 -2395538
33314 -2395538 -399052 3049257 3305007 1682358 1518424 1239857 -1994317 -5009036 -2699209
33305 -2699209 2402243 2929226 -1318016 -2887836 637574 2561028 -1053089 -4195799
33297 -4195799 -1150698 3605597 3096842 -245038 1053452 6667071 8957966 5111616
33289 5111616 319693 -1586104 -2840206 -5350061 -6695056 -5393166 -4113188 -4266927
33281 -4266927 -2951824 708127 1587627 -3584145 -8813974 -6232247 1721904 5288501
33273 5288501 2052444 384942 6006176 12716196 11617012 4191666 -496446 1059302
33265 1059302 3490510 2036732 -1293474 -2844182 -3067225 -3819838 -3873574 -1252857 2165971
$$ [...]
##END NTUPLES=NMR SPECTRUM
##END=
