##TITLE=31Pdec_SR104_5
 , 124 sc
 17.2.2022
##JCAMPDX= 6.0         $$ Bruker NMR JCAMP-DX V2.0
##DATA TYPE= NMR SPECTRUM
##DATA CLASS= NTUPLES
##ORIGIN= UXNMR, Bruker Analytische Messtechnik GmbH
##OWNER= root
$$ XWIN-NMR		Version 3.5
$$ Fri Feb 18 11:27:13 2022 Russian Standard Time (UT+4h)  she@DPX200
##.OBSERVE FREQUENCY= 81.013821
##.OBSERVE NUCLEUS= ^31P
##.ACQUISITION MODE= SIMULTANEOUS
##.ACQUISITION SCHEME= undefined
##.AVERAGES= 124
##.DIGITISER RES= 16
##SPECTROMETER/DATA SYSTEM= spect
##.PULSE SEQUENCE= zgpg30
##.SOLVENT NAME= CDCl3
##.SHIFT REFERENCE= (INTERNAL, CDCl3, 0, 248.564)
##AUDIT TRAIL= $$ (NUMBER, WHEN, WHO, WHERE, WHAT)
$$ ##TITLE= Audit trail, XWIN-NMR		Version 3.5
$$ ##JCAMPDX= 5.01
$$ ##ORIGIN= Bruker BioSpin GmbH
$$ ##OWNER= she
$$ F:/spectra/data/she/nmr/P31/1/pdata/1/auditp.txt
$$ ##AUDIT TRAIL=  $$ (NUMBER, WHEN, WHO, WHERE, WHAT)
(   1,<2022-02-18 11:26:10.03 +0400>,<she>,<DPX200>,
      <created by zg, POWCHK disabled, PULCHK disabled
       configuration hash MD5:
       00 E9 B6 7A A2 85 ED C7 34 08 36 98 17 FE 4E 26
       data hash MD5: 32K
       A2 38 76 20 03 67 F7 94 F2 3A EC AE 33 E6 89 2F>)
(   2,<2022-02-18 11:26:12.48 +0400>,<she>,<DPX200>,
      <Start of raw data processing
       efp BC_mod = 2 LB = 1 FT_mod = 6 PKNL = 1 PHC0 = -9175.758 PHC1 = 100.0745 SI = 64K 
       data hash MD5: 64K
       16 4F D2 D2 B7 08 B1 C2 9D 91 25 DC 6D F8 E2 F2>)
(   3,<2022-02-18 11:26:28.98 +0400>,<she>,<DPX200>,
      <pk PHC0 = -13.62468 PHC1 = 0 
       data hash MD5: 64K
       C4 E3 B7 42 C0 25 79 7E 84 24 D5 6C 9C 3F E6 A4>)
(   4,<2022-02-18 11:26:32.25 +0400>,<she>,<DPX200>,
      <abs ABSG = 5 
       data hash MD5: 64K
       9C 2D 94 87 E8 7C 74 5F FF 50 9E B6 00 FD 2E E3>)
$$ ##END=
$$ 
$$ hash MD5
$$ 68 70 BD 5D AE B4 8A 14 6E 37 60 FA B2 93 3C 7E
##$RELAX= 
##$RELAX= 
##$RELAX= 
##$RELAX= 
##$RELAX= 
##$RELAX= 
##$RELAX= 
##$RELAX= 
$$ Bruker specific parameters
$$ --------------------------
##$DU= <F:/spectra>
##$EXPNO= 1
##$NAME= <P31>
##$PROCNO= 1
##$TYPE= <nmr>
##$USER= <she>
##$AMP= (0..31)
100 100 100 100 100 100 100 100 100 100 100 100 100 100 100 100 100 100 
100 100 100 100 100 100 100 100 100 100 100 100 100 100 
##$AQSEQ= 0
##$AQ_mod= 1
##$AUNM= <au_zg>
##$AUTOPOS= <>
##$BF1= 81.014009
##$BF2= 200.13
##$BF3= 200.13
##$BF4= 200.13
##$BF5= 200.13
##$BF6= 200.13
##$BF7= 200.13
##$BF8= 200.13
##$BYTORDA= 1
##$CFDGTYP= 0
##$CFRGTYP= 5
##$CHEMSTR= <none>
##$CNST= (0..31)
1 1 145 1 1 1 1 1 1 1 1 1 1 1 1 1 1 1 1 1 1 1 1 1 1 1 1 1 1 1 1 1 
##$CPDPRG= <waltz16>
##$CPDPRG1= <>
##$CPDPRG2= <waltz16>
##$CPDPRG3= <>
##$CPDPRG4= <mlev>
##$CPDPRG5= <mlev>
##$CPDPRG6= <mlev>
##$CPDPRG7= <mlev>
##$CPDPRG8= <mlev>
##$CPDPRGB= <>
##$CPDPRGT= <>
##$D= (0..31)
0 1 0 0 0 0 0 0 0 0 0 0.03 2e-05 3e-06 0 0 0 0 0 0 0 0 0 0 0 0 0 0 0 0 
0 0 
##$DATE= 1645169169
##$DBL= (0..7)
120 120 120 11 120 120 24 19 
##$DBP= (0..7)
150 150 150 150 150 150 150 150 
##$DBP07= 0
##$DBPNAM0= <>
##$DBPNAM1= <>
##$DBPNAM2= <>
$$ [...]
##$SUBNAM3= <"">
##$SUBNAM4= <"">
##$SUBNAM5= <"">
##$SUBNAM6= <"">
##$SUBNAM7= <"">
##$SUBNAM8= <"">
##$SUBNAM9= <"">
##$SW= 501.771253377433
##$SWIBOX= (0..15)
0 1 3 0 0 0 0 0 0 0 0 0 0 0 0 0 
##$SW_h= 40650.406504065
##$TD= 32768
##$TD0= 1
##$TE= 0
##$TE2= 300
##$TE3= 300
##$TEG= 300
##$TL= (0..7)
0 120 53 12 22 120 120 120 
##$TP= (0..7)
150 150 150 150 150 150 150 150 
##$TP07= 0
##$TPNAME0= <>
##$TPNAME1= <>
##$TPNAME2= <>
##$TPNAME3= <>
##$TPNAME4= <>
##$TPNAME5= <>
##$TPNAME6= <>
##$TPNAME7= <>
##$TPOAL= (0..7)
0.5 0.5 0.5 0.5 0.5 0.5 0.5 0.5 
##$TPOFFS= (0..7)
0 0 0 0 0 0 0 0 
##$TUNHIN= 0
##$TUNHOUT= 0
##$TUNXOUT= 0
##$USERA1= <user>
##$USERA2= <user>
##$USERA3= <user>
##$USERA4= <user>
##$USERA5= <user>
##$V9= 5
##$VALIST= <valist>
##$VCLIST= <CCCCCCCCCCCCCCC>
##$VD= 0
##$VDLIST= <DDDDDDDDDDDDDDD>
##$VPLIST= <PPPPPPPPPPPPPPP>
##$VTLIST= <TTTTTTTTTTTTTTT>
##$WBST= 1024
##$WBSW= 4
##$XGAIN= (0..3)
0 0 0 0 
##$XL= 0
##$YL= 0
##$YMAX_a= 100327
##$YMIN_a= -174174
##$ZGOPTNS= <>
##$ZL1= 120
##$ZL2= 120
##$ZL3= 120
##$ZL4= 120
##$ABSF1= 248.5645
##$ABSF2= -253.2056
##$ABSG= 5
##$ABSL= 3
##$ALPHA= 0
##$AQORDER= 0
##$ASSFAC= 0
##$ASSFACI= 0
##$ASSFACX= 0
##$ASSWID= 0
##$AUNMP= <proc_1d>
##$AZFE= 0.1
##$AZFW= 0.5
##$BCFW= 0
##$BC_mod= 2
##$BYTORDP= 0
##$COROFFS= 0
##$CY= -3
##$DATMOD= 1
##$DC= 0
##$DFILT= <>
##$DTYPP= 0
##$F1P= 0
##$F2P= 0
##$FCOR= 1
##$FTSIZE= 65536
##$FT_mod= 6
##$GAMMA= 0
##$GB= 0
##$INTBC= 1
##$INTSCL= 5.30512e-09
##$ISEN= 30
##$LB= 1
##$LEV0= 0
##$LPBIN= 0
##$MAXI= 10000
##$MC2= 0
##$MEAN= 0
##$ME_mod= 0
##$MI= 50
##$NCOEF= 0
##$NC_proc= -4
##$NLEV= 6
##$NOISF1= 182.463
##$NOISF2= 159.3651
##$NSP= 0
##$NTH_PI= 0
##$NZP= 0
##$OFFSET= 248.5645
##$PC= 4
##$PHC0= -9189.383
##$PHC1= 100.0745
##$PH_mod= 1
##$PKNL= yes
##$PPARMOD= 0
##$PSCAL= 0
##$PSIGN= 0
##$REVERSE= no
##$SF= 81.014009
##$SI= 65536
##$SIGF1= 159.3651
##$SIGF2= -187.1042
##$SINO= 113.3802
##$SIOLD= 16384
##$SREGLST= <1H.CDCl3>
##$SSB= 0
##$STSI= 65536
##$STSR= 0
##$SW_p= 40650.406504065
##$SYMM= 0
##$S_DEV= 0
##$TDeff= 32768
##$TDoff= 0
##$TI= <>
##$TILT= no
##$TM1= 0
##$TM2= 0
##$TOPLEV= 0
##$USERP1= <user>
##$USERP2= <user>
##$USERP3= <user>
##$USERP4= <user>
##$USERP5= <user>
##$WDW= 1
##$XDIM= 65536
##$YMAX_p= 503048647
##$YMIN_p= -4676897
$$ End of Bruker specific parameters
$$ ---------------------------------
##NTUPLES= NMR SPECTRUM
##VAR_NAME=  FREQUENCY,     SPECTRUM/REAL,   SPECTRUM/IMAG
##SYMBOL=    X,             R,               I
##VAR_TYPE=  INDEPENDENT,   DEPENDENT,       DEPENDENT
##VAR_FORM=  AFFN,          ASDF,            ASDF
##VAR_DIM=   65536,         65536,           65536
##UNITS=     HZ,            ARBITRARY UNITS, ARBITRARY UNITS
##FACTOR=    0.620285442955139, 1,           1
##FIRST=     20137.2065510759, 0,            0
##LAST=      -20513.1999529892, 0,           0
##MIN=       -20513.1999529892, -4676897,    0
##MAX=       20137.2065510759, 503048647,    0
$$ Real data points
##PAGE= N=1
##DATA TABLE= (X++(R..R)), XYDATA
$$ [...]
$$ plain form
41838 -753034 -26910 1059920 1715376 1581528 1150425 1097614 1478824 1851120 1939154 1827057
41828 1827057 1608504 1207076 595154 -29796 -390204 -391026 -210758 -129619 -232398 -314700
41818 -314700 -173488 69899 106088 -139705 -433627 -564631 -507859 -280317 50695 200690
41808 200690 -111401 -700496 -1087845 -1242473 -1638332 -2361201 -2775916 -2521782 -2244491 -2661013
41798 -2661013 -3344435 -3280949 -2395566 -1605897 -1387456 -1227670 -705614 -221448 -222572 -424901
41788 -424901 -342341 -52520 96823 92043 31282 -283923 -943141 -1459024 -1351353 -951402
41778 -951402 -954810 -1342271 -1454682 -1075384 -698248 -654738 -698749 -643063 -719585 -1008353 -1126328
41767 -1126328 -855764 -528655 -374717 -37914 729762 1388275 1291066 712996 499744 898666
$$ packed form
41838g53034P26124J086830O55456j33848m31103n2811L81210L72296Q8034j12097
41828A827057k18553m01428o11922o24950l60408q22J80268Q1139j02779q2302
41818c14700J41212K43387L6189k45793k93922j31004N6772K27542L31012J49995
41808B00690l12091n89095l87349j54628l95859p22869m14715K54134K77291m16522
41798b661013o83422O3486Q85383P89669K18441J59786N22056M84166j124k02329
41788d24901Q2560K89821J49343m780o0761l15205o59218n15883J07671L99951
41778i51402l408l87461j12411L79298L77136M3510m4011N5686p6522k88768j17975
41767a126328K70564L27109J53938L36803P67676O58513r7209n78070k13252L98922
$$ plain form
41757 898666 1430202 1781268 2083287 2321658 2230135 1904252 1832206 2122759 2339979 2301392
41747 2301392 2349620 2554059 2398061 1715838 1218986 1467000 1941618 1899508 1627597 1965906
41737 1965906 2923889 3711772 3988147 4154857 4442351 4594959 4538815 4514177 4416155 3847128
41727 3847128 3006030 2652434 2911745 3006465 2550812 2186507 2395547 2606555 2234793 1794019
41717 1794019 2041897 2652340 2756010 2345149 2100701 2156447 2109889 2040061 2378819 2835317
41707 2835317 2616670 1834431 1541653 2090401 2568492 2314453 1921480 2096136 2481700
41698 2481700 2436998 2197005 2312982 2526548 2224582 1650985 1633850 2257638 2785814 2908670
41688 2908670 3115651 3625359 3826911 3241546 2412233 2271963 2944470 3648232 3660861 3031623
$$ packed form
41757H98666N31536L51066L02019K38371r1523l25883p2046K90553K17220l8587
41747B301392M8228K04439j55998o82223m96852K48014M74618m2110k71911L38309
41737A965906R57983P87883K76375J66710K87494J52608n6144k4638r8022n69027
41727C847128q41098l53596K59311R4720m55653l64305K09040K11008l71762m40774
41717A794019K47878O10443J03670m10861k44448N5746m6558o9828L38758M56498
41707B835317k18647p82239k92778N48748M78091k54039l92973J74656L85564
41698B481700m4702k39993J15977K13566l01966n73597j7135O23788N28176J22856
41688B908670K06981N09708K01552n85365q29313j40270O72507P03762J2629o29238
$$ plain form
41678 3031623 2363652 2113321 2169149 2102966 1808074 1709675 2173006 2915471 3379257 3569534
41668 3569534 4008199 4799293 5310211 5066670 4493922 4338962 4675813 4977496 5004807 5103046
41658 5103046 5597930 6322489 6870155 7040082 6933626 6837969 7095074 7873064 8974695
41649 8974695 10034355 10939680 11868101 12912673 13970840 15073948 16479233 18263626
41641 18263626 20175376 22145926 24594580 27854139 31632988 35567233 40037593 45755517
41633 45755517 52670269 60134525 68271465 78236692 90639576 104487975 118335177 131686232
41625 131686232 144257269 154396593 159653906 159069160 153822975 145409941 134326842 121087816
41617 121087816 107344696 94852568 83867088 73631334 64151482 56390174 50693269
$$ packed form
41678C031623o67971k50331N5828o6183k94892r8399M63331P42465M63786J90277
41668C569534M38665P91094N10918k43541n72748j54960L36851L01683K7311R8239
41658E103046M94884P24559N47666J69927j06456r5657K57105P77990J101631
41649H974695J059660R05325R28421J044572J058167J103108J405285J784393
41641A8263626J911750J970550K448654L259559L778849L934245M470360N717924
41633D5755517O914752P464256Q136940R965227J2402884J3848399J3847202J3351055
41625A31686232J2571037J0139324N257313n84746n246185q413034j1083099j3239026
41617A21087816j3743120j2492128j0985480j0235754r479852p761308n696905
$$ plain form
41610 50693269 46087406 41523715 37072066 33406014 30639659 28224855 25727599 23229285
41602 23229285 21051151 19406812 18280237 17421241 16495243 15379239 14251655 13305542
41594 13305542 12499340 11706205 10976372 10494125 10334507 10353010 10252150 9737418 8758490
41585 8758490 7649377 6860796 6497240 6312412 6183355 6254864 6485928 6481403 6116330 5951689
41575 5951689 6495853 7268687 7250961 6276632 5331500 5250166 5690318 5803085 5484492 5386872
41565 5386872 5842413 6340132 6200749 5426475 4670709 4489304 4770627 4922903 4599678
41556 4599678 4155000 4229865 4912420 5587236 5728478 5511900 5371161 5278383 4946882 4561263
41546 4561263 4674775 5301504 5701155 5349675 4673671 4448969 4790279 5139304 5041468 4539714
$$ packed form
41610E0693269m605863m563691m451649l666052k766355k414804k497256k498314
41602B3229285k178134j644339j126575q58996r25998j116004j127584r46113
41594A3305542q06202p93135p29833m82247j59618J8503j00860n14732r78928
41585H758490j109113p88581l63556j84828j29057P1509K31064m525l65073j64641
41575E951689N44164P72834j7726r74329r45132q1334M40152J12767l18593r7620
41565E386872M55541M97719j39383p74274p55766j81405K81323J52276l23225
41556D599678m44678P4865O82555O74816J41242k16578j40739r2778l31501l85619
41546D561263J13512O26729L99651l51480o76004k24702L41310L49025r7836n01754
$$ plain form
41536 4539714 3946526 3622185 3886858 4738344 5658447 6077092 6075115 6275287 6957556 7640674
41526 7640674 7709237 7165102 6555534 6386283 6808870 7674161 8632234 9301578 9590855 9809694
41516 9809694 10291182 10988785 11632242 12165890 12738328 13283371 13484191 13337532 13469977
41507 13469977 14540607 16382567 18075069 18982765 19470993 20386343 22023277 23919460
41499 23919460 25577020 26939490 28014696 28464761 27996407 26981589 26224416 26047857 25934136
41490 25934136 25180426 23662885 21824082 20121426 18682204 17398592 16173773 15040962
41482 15040962 14089631 13312736 12593607 11869845 11181922 10461959 9455510 8079885 6722974
41473 6722974 5882153 5573041 5408965 5193668 5031186 4860283 4383937 3621025 3068845
$$ packed form
41536D539714n93188l24341K64673Q51486R20103M18645j977K00172O82269O83118
41526G640674O8563n44135o09568j69251M22587Q65291R58073O69344K89277K18839
41516I809694M81488O97603O43457N33648N72438N45043K00820j46659J32445
41507A3469977J070630J841960J692502R07696M88228R15350J636934J896183
41499B3919460J657560J362470J075206M50065m68354j014818p57173j76559j13721
41490B5934136p53710j517541j838803j702656j439222j283612j224819j132811
41482A5040962r51331p76895p19129p23762o87923p19963j006449j375625j356911
41473F722974q40821l09112j64076k15297j62482j70903m76346p62912n52180
$$ plain form
41464 3068845 3054225 3297098 3397434 3397187 3522157 3679690 3606831 3304782 2974510 2714275
41454 2714275 2596898 2797648 3256726 3451452 2980770 2233528 1987565 2409096 2911573
41445 2911573 2974265 2636891 2169703 1720652 1387743 1250016 1212120 1121326 1067402 1233557
41435 1233557 1469405 1438530 1208970 1192377 1381874 1201369 392364 -425585 -476935 205995
41425 205995 921793 1164130 983274 679622 535965 776077 1415196 2094525 2309100 1900742
41415 1900742 1226509 804516 855431 1206379 1591007 1951330 2341510 2597961 2410692 1873520
41405 1873520 1615471 2010599 2520120 2334560 1518736 920825 994591 1386487 1755025 2234620
41395 2234620 2815201 3005571 2587294 2106067 2077848 2210324 1993132 1625528 1703411 2279757
$$ packed form
41464C068845j4620K42873J00336k47J24970J57533p2859l02049l30272k60235
41454B714275j17377K00750M59078J94726m70682p47242k45963M21531N02477
41445B911573O2692l37374m67188m49051l32909j37727l7896r0794n3924J66155
41435A233557K35848l0875k29560j6593J89497j80505q09005q17949n1350O82930
41425B05995P15798K42337j80856l03652j43657K40112O39119O79329K14575m08358
41415A900742o74233m21993N0915L50948L84628L60323L90180K56451j87269n37172
41405A873520k58049L95128N09521j85560q15824n97911P3766L91896L68538M79595
41395B234620N80581J90370m18277m81227k8219J32476k17192l67604P7883N76346
$$ plain form
41385 2279757 2863823 3150855 3201080 3106231 3017068 3268041 3903376 4320602 4012235 3422292
41375 3422292 3345269 3679409 3639083 3137365 2984853 3536775 4078975 3953106 3488197 3290622
41365 3290622 3280160 3064389 2765066 2767158 2941452 2803978 2342688 2083796 2312156 2733147
41355 2733147 3030101 3328170 3850739 4394049 4505215 4148683 3860638 4065731 4487004
41346 4487004 4585314 4455413 4732278 5479955 5827434 5192870 4335378 4441859 5466506
41337 5466506 6243687 6187322 5976366 6383168 7274312 8144578 8909218 9653899 10164893 10289073
41327 10289073 10394810 10953283 11905389 12849762 13606995 14206870 14539104 14404738 13793526
41318 13793526 12869677 11852502 11056713 10748519 10772849 10657021 10261057 9916465 9743967
$$ packed form
41385B279757N84066K87032N0225r4849q9163K50973O35335M17226l08367n89943
41375C422292p7023L34140m0326n01718j52512N51922N42200j25869m64909j97575
41365C290622j0462k15771k99323K092J74294j37474m61290k58892K28360M20991
41355B733147K96954K98069N22569N43310J11166l56532k88045K05093M21273
41346D487004R8310j29901K76865P47677L47479o34564q57492J06481J024647
41337E466506P77181n6365k10956M06802Q91144Q70266P64640P44681N10994J24180
41327A0289073J05737N58473R52106R44373P57233N99875L32234j34366o11212
41318A3793526r23849j017175p95789l08194K4330j15828l95964l44592j72498
$$ plain form
41309 9743967 9395726 8790668 8465241 8669925 8718016 7953136 6912320 6689658 7389595
41300 7389595 8047084 8000995 7559813 7249845 7103024 6868225 6410656 5739265 5014231 4577320
41290 4577320 4619512 4851086 4883081 4836042 5086969 5480451 5375641 4583220 3760895 3675202
41280 3675202 4373067 5200770 5430631 4874108 4075633 3804217 4177696 4538975 4414603
41271 4414603 4142336 4134352 4087061 3637238 3291116 3713979 4416309 4302550 3446639 3092311
41261 3092311 3721710 4356911 4196024 3782693 3898342 4283046 4272213 3950671 3818847 3848289
41251 3848289 3675591 3365498 3287820 3520263 3924963 4496852 5133847 5425723 5182573 4810530
41241 4810530 4680739 4556629 4186825 3985188 4429425 5167687 5487904 5420521 5602511 6178787
$$ packed form
41309I743967l48241o05058l25427K04684M8091p64880j040816k22662O99937
41300G389595O57489m6089m41182l09968j46821k34799m57569o71391p25034m36911
41290D577320M2192K31574L1995m7039K50927L93482j04810p92421q22325q5693
41280C675202O97865Q27703K29861n56523p98475k71416L73479L61279j24372
41271D414603k72267p984m7291m49823l46122M22863P02330j13759q55911l54328
41261C092311O29399O35201j60887m13331J15649L84704j0833l21542j31824K9442
41251C848289j72698l10093p7678K32443M04700N71889O36995K91876k43150l72043
41241D810530j29791j24110l69804k01637M44237P38262L20217o7383J81990N76276
$$ plain form
41231 6178787 6579581 6382474 5771797 5119803 4648387 4529919 4849994 5431253 6044615
41222 6044615 6726278 7548908 8250819 8517022 8481929 8525898 8724186 8923717 9184881 9682714
41212 9682714 10337567 11000921 11807147 12867377 13885983 14663360 15703281 17599477 20017204
41203 20017204 22127777 24017278 26768819 30985413 36111852 41648741 48347032 57506446
41195 57506446 69170940 81236247 90236697 93138235 88980124 79285890 66974019 54806947
41187 54806947 44588975 37059228 31872511 27929447 24374760 21249491 18833485 16773728
41179 16773728 14549723 12440880 11124469 10485698 9785015 8938115 8592899 8856496 9009695
41170 9009695 8704506 8387794 8207241 7579217 6350153 5365021 5219684 5341204 5028822
$$ packed form
41231F178787M00794j97107o10677o51994m71416j18468L20075N81259O13362
41222F044615O81663Q22630P01911K66203l5093M3969J98288J99531K61164M97833
41212I682714O54853O63354Q06226J060230J018606P77377J039921J896196K417727
41203B0017204K110573J889501K751541M216594N126439N536889O698291R159414
41195E7506446J1664494J2065307R000450K901538m158111r694234j2311871j2167072
41187E4806947j0217972p529747n186717l943064l554687l125269k416006k059757
41179A6773728k224005k108843j316411o38771p00683q46900l45216K63597J53199
41170I009695l05189l16712j80553o28024j229064r85132j45337J21520l12382
$$ plain form
41161 5028822 4584739 4599564 4843117 4769945 4552813 4685239 4982605 4878804 4411651 4085852
41151 4085852 4008179 3935134 3940353 4240647 4524521 4235852 3462179 2858670 2751493 2951718
41141 2951718 3366424 4096041 4899307 5208824 4833567 4212710 3898163 4106411 4708364
41132 4708364 5310669 5476284 5223646 5113199 5470291 5838959 5704217 5387134 5522094
41123 5522094 5910093 5729368 4831426 4024943 3984912 4568784 5307915 5907808 6127377 5810416
41113 5810416 5241444 4923226 4839299 4477974 3736066 3214799 3378936 3933836 4299362 4268337
41103 4268337 3962990 3540241 3166700 2958782 2807668 2576154 2478594 2828583 3410246 3654229
41093 3654229 3499805 3458714 3689335 3704239 3268658 2887848 2979041 3192785 3100965 3029087
$$ packed form
41161E028822m44083J4825K43553p3172k17132J32426K97366j03801m67153l25799
41151D085852p7673p3045N219L00294K83874k88669p73673o03509j07177K00225
41141B951718M14706P29617Q03266L09517l75257o20857l14547K08248O01953
41132D708364O02305J65615k52638j10447L57092L68668j34742l17083J34960
41123E522094L87999j80725q97942q06483m0031N83872P39131N99893K19569l16961
41113E810416n68972l18218q3927l61325p41908n21267J64137N54900L65526l1025
41103D268337l05347m22749l73541k07918j51114k31514r7560L49989N81663K43983
41093C654229j54424m1091K30621J4904m35581l80810R1193K13744r1820p1878
$$ plain form
41083 3029087 3541293 4422664 4840991 4423438 3666285 3296461 3588967 4297706 4979238
41074 4979238 5352528 5449568 5399488 5158881 4702748 4367312 4519518 4859373 4641782 3781158
41064 3781158 3131179 3350271 4065685 4561117 4727253 4839530 4934116 4995992 5283251 5794371
41054 5794371 5840514 4916754 3686507 3288289 3870196 4627545 5117980 5600129 6088143
41045 6088143 6104622 5644170 5462112 5948914 6479194 6441070 6291357 6915257 8337876 9743318
41035 9743318 10577729 11074804 11809249 13222222 15516256 18569907 21978657 25560620 29751450
41026 29751450 35022494 40844851 45675138 48147848 47981283 45646598 41657450 36548364
41018 36548364 31171760 26432772 22718763 19905660 17832574 16374606 15118454 13535094
$$ packed form
41083C029087N12206Q81371M18327m17553p57153l69824K92506P08739O81532
41074D979238L73290R7040n0080k40607m56133l35436J52206L39855k17591q60624
41064C781158o49979K19092P15414M95432J66136J12277R4586O1876K87259N11120
41054E794371M6143r23760j230247l98218N81907P57349M90435M82149M88014
41045F088143J6479m60452j82058M86802N30280l8124j49713O23900J422619J405442
41035I743318Q34411M97075P34445J412973K294034L053651L408750L581963M190830
41026B9751450N271044N822357M830287K472710j66565k334685l989148n109086
41018C6548364n376604m738988l714009k813103k073086j457968j256152j583360
$$ plain form
41010 13535094 11689000 10336134 9998273 10249288 10228986 9571948 8486456 7238461 6053003
41001 6053003 5305036 5215137 5409905 5336725 5100688 5294445 5937921 6268153 5846582 5253173
40991 5253173 5248935 5723274 5978812 5745182 5400983 5352334 5616185 5939747 6027974 5743123
40981 5743123 5300530 5122337 5319844 5544944 5528601 5434707 5427153 5298015 4944827 4845278
40971 4845278 5487203 6538029 7156908 7031384 6580192 6218259 5985516 5891004 6032318
40962 6032318 6236163 6070621 5418288 4682267 4262310 4134442 4086210 4076086 4190651 4439252
40952 4439252 4710411 4822326 4628875 4212545 3879219 3780539 3697154 3428086 3160513 3110729
40942 3110729 3072013 2811908 2669954 3105176 3790446 3937718 3549147 3498791 4151402 4761330
$$ packed form
41010A3535094j846094j352866l37861K51015k0302o57038j085492j247995j185458
41001F053003p47967q9899J94768p3180k36037J93757O43476L30232m21571n93409
40991E253173m238M74339K55538k33630l44199m8649K63851L23562Q8227k84851
40981E743123m42593j78193J97507K25100j6343r3894p554j29138l53188r9549
40971D845278O41925J050826O18879j25524m51192l61933k32743r4512J41314
40962F032318K03845j65542o52333p36021m19957j27868m8232j0124J14565K48601
40952D439252K71159J11915j93451m16330l33326r8680q3385k69068k67573m9784
40942C110729l8716k60105j41954M35222O85270J47272l88571n0356O52611O09928
$$ plain form
40932 4761330 4703493 4531531 5111955 6227883 6846099 6554656 6009858 5954654 6370440 6754429
40922 6754429 6874909 7044948 7737790 8991960 10256640 11001344 11448560 12330677 13780199
40913 13780199 14890209 14726786 13473391 12153290 11397901 10906600 10054311 8666921 7168080
40904 7168080 6181359 5982357 6215859 6239656 5827189 5326652 5028330 4720244 4117628 3370090
40894 3370090 2756928 2191946 1521993 1080368 1343760 2107553 2593359 2439903 2058460
40885 2058460 1882341 1793398 1560948 1421161 1822632 2775059 3750330 4182950 3946969 3429755
40875 3429755 3183633 3358134 3472438 2990656 2142117 1806798 2418197 3348146 3702796
40866 3702796 3446920 3306157 3702609 4286797 4559500 4479702 4249940 3885674 3341041 2834809
$$ packed form
40932D761330n7837j71962N80424J115928O18216k91443n44798n5204M15786L83989
40922F754429J20480J70039O92842J254170J264680P44704M47216Q82117J449522
40913A3780199J110010j63423j253395j320101p55389m91301q52289j387390j498841
40904G168080r86721j99002K33502K3797m12467n00537k98322l08086o02616p47538
40894C370090o13162n64982o69953m41625K63392P63793M85806j53456l81443
40885B058460j76119q8943k32450j39787M01471R52427R75271M32620k35981n17214
40875C429755k46122J74501J14304m81782q48539l35319O11399R29949L54650
40866C702796k55876j40763L96452N84188K72703p9798k29762l64266n44633n06232
$$ plain form
40856 2834809 2663254 2759670 2784463 2651856 2637816 2908690 3274319 3539524 3780420 4064928
40846 4064928 4193283 4000142 3676029 3470837 3302654 3051478 3040536 3696447 4765859
40837 4765859 5410023 5197512 4560247 4127115 4038299 4102206 4195160 4232579 4118960 4041613
40827 4041613 4484813 5580369 6685332 7000344 6495160 5913586 5946707 6645983 7558406
40818 7558406 8205824 8469530 8635485 9009864 9505273 9829294 10049472 10534570 11200545
40809 11200545 11324100 10450450 9085688 8095309 7757611 7803367 8006278 8215238 8112655
40800 8112655 7542259 6910862 6721007 6840397 6752603 6388505 6156040 6249736 6496602 6825270
40790 6825270 7330020 7911632 8417118 9110307 10422736 12222095 13887094 15106538 16012233
$$ packed form
40856B834809j71555R6416K4793j32607j4040K70874L65629K65205K40896K84508
40846D064928J28355j93141l24113k05192j68183k51176j0942O55911J069412
40837D765859O44164k12511o37265m33132q8816O3907R2954L7419j13619p7347
40827D041613M43200J095556J104963L15012n05184n81574L3121O99276R12423
40818G558406O47418K63706J65955L74379M95409L24021K20178M85098O65975
40809A1200545J23555q73650j364762r90379l37698M5756K02911K08960j02583
40800H112655n70396o31397j89855J19390q7794l64098k32465R3696K46866L28668
40790F825270N04750N81612N05486O93189J312429J799359J664999J219444R05695
$$ plain form
40781 16012233 16532405 16312041 15383261 14243594 13127615 11872454 10640355 9993060 9984405
40772 9984405 9984714 9797215 10129164 11385362 12756718 13281430 13249255 13702963 14914439 16219405
40762 16219405 17185616 18124147 19439904 21177633 23337601 26099977 29555335 33566449
40754 33566449 38032346 43086929 49030747 56223172 64952962 75321251 87531890 102463886
40746 102463886 121532826 145703615 175229940 210884875 254582774 307239567 365559691
40739 365559691 421558314 465522893 489421894 488691317 463256612 418301519 363076282
40732 363076282 307068187 256341436 213069642 177465182 149102476 126816252 108803594
40725 108803594 93608478 80717137 70036665 61268519 54022658 48076399 43168297
$$ packed form
40781A6012233N20172k20364r28780j139667j115979j255161j232099o47295q655
40772I984405L09j87499L31949J256198J371356N24712l2175M53708J211476J304966
40762A6219405R66211R38531J315757J737729K159968K762376L455358M011114
40754C3566449M465897N054583N943818P192425Q729790J0368289J2210639J4931996
40746A02463886J9068940K4170789K9526325L5654935M3697899N2656793N8320124
40739C65559691N5998623M3964579K3899001p30577k5434705m4955093n5225237
40732C63076282n6008095n0726751m3271794l5604460k8362706k2286224j8012658
40725A08803594j5195116j2891341j0680472q768146p245861n946259m908102
$$ plain form
40718 43168297 38874096 35026331 31930155 29733816 27839470 25471293 22724518 20477492
40710 20477492 19191030 18324870 17139029 15591641 14133405 13024365 12266355 11894612
40702 11894612 11830820 11613922 10799146 9604265 8700225 8318789 8004860 7372727 6696509
40693 6696509 6499910 6817630 7138022 6998407 6463196 5988325 5841126 5730890 5201070
40684 5201070 4391855 4023223 4380557 4759933 4417438 3703095 3545772 4018610 4267977
40675 4267977 3890547 3500992 3687432 4204763 4583517 4824228 5018083 4914303 4428172
40666 4428172 4088041 4415986 5223055 5956288 6345081 6309249 5740407 4886416 4451601 4713077
40656 4713077 4974822 4523590 3697986 3317899 3452868 3542203 3426608 3404332 3432393 3129382
$$ packed form
40718D3168297m294201l847765l096176k196339j894346k368177k746775k247026
40710B0477492j286462q66160j185841j547388j458236j109040p58010l71743
40702A1894612o3792k16898q14776j194881r04040l81436l13929o32133o76218
40693F696509j96599L17720L20392j39615n35211m74871j47199j10236n29820
40684E201070q09215l68632L57334L79376l42495p14343j57323M72838K49367
40675D267977l77430l89555J86440N17331L78754K40711J93855j03780m86131
40666D428172l40131L27945Q07069P33233L88793l5832n68842q53991m34815K61476
40656D713077K61745m51232q25604l80087J34969Q9335j15595k2276K8061l03011
$$ plain form
40646 3129382 2556180 2239591 2375639 2650725 2864870 3114572 3344838 3319940 3083503 2930479
40636 2930479 2924040 2901873 2857717 2831049 2609298 2099504 1755915 1989302 2412739 2410753 2164829
40625 2164829 2236189 2412779 2040313 1344850 1232405 1759967 2049298 1870058 1999553 2674391
40615 2674391 3014774 2549298 2075199 2295720 2734337 2797198 2836505 3230591 3385615 2715635
40605 2715635 1822770 1614254 1894298 1899760 1651909 1667301 1797427 1487044 861431 493871
40595 493871 358070 42458 -218563 228091 1310757 2275669 2784962 3081294 3185959
40586 3185959 2868060 2337988 2055006 1907395 1495692 1126293 1481049 2296056 2485137
40577 2485137 1765485 1104122 1248138 1790845 2063183 2028762 1862452 1501458 1109784 1216855
$$ packed form
40646C129382n73202l16589J36048K75086K14145K49702K30266k4898k36437j53024
40636B930479o439k2167m4156k6668k21751n09794l43589K33387M23437j986k45924
40625B164829P1360J76590l72466o95463j12445N27562K89331j79240J29495O74838
40615B674391L40383m65476m74099K20521M38617O2861L9307L94086J55024o69980
40605B715635q92865k08516K80044N462k47851J5392J30126l10383o25613l67560
40595D93871j35801l15612k61021M46654J082666R64912N09293K96332J04665
40586C185959l17899n30072k82982j47611m11703l69399L54756Q15007J89081
40577B485137p19652o61363J44016N42707K72338l4421j66310l60994l91674J07071
$$ plain form
40567 1216855 1880125 2406357 2393897 2340512 2670483 2880198 2360833 1504925 1220158 1698892
40557 1698892 2360318 2752883 2886272 2848502 2656117 2405460 2178422 1910311 1621509 1550332
40547 1550332 1795336 2131819 2441309 2906386 3450449 3509096 2880653 2317285 2584250 3295780
40537 3295780 3468363 3002122 2748533 3136097 3593523 3526429 3111731 2791201 2602346 2446217
40527 2446217 2530760 3013635 3487596 3378240 2802258 2554548 3097833 3879920 3929356 3037113
40517 3037113 2052083 1882690 2439419 2873435 2752132 2524212 2691883 3033831 3043720 2754838
40507 2754838 2592961 2661981 2793012 3139989 3963564 4793712 4672493 3554807 2660247
40498 2660247 2870371 3487518 3380091 2786755 2893251 3840916 4384107 3753736 2751548
$$ packed form
40567A216855O63270N26232j2460n3385L29971K09715n19365q55908k84767M78734
40557A698892O61426L92565J33389l7770j92385k50657k27038k68111k88802p1177
40547A550332K45004L36483L09490M65077N44063N8647o28443n63368K66965P11530
40537C295780J72583m66241k53589L87564M57426o7094m14698l20530j88855j56129
40527B446217Q4543M82875M73961j09356n75982k47710N43285P82087M9436q92243
40517C037113r85030j69393N56729M34016j21303k27920J67671L41948R889k88882
40507B754838j61877O9020J31031L46977Q23575Q30148j21219j117686q94560
40498B660247K10124O17147j07427n93336J06496R47665N43191o30371j002188
$$ plain form
40489 2751548 2449192 2718396 2810196 2671985 2749820 2946632 2800138 2485823 2622895 3103971
40479 3103971 3138205 2627290 2486569 3196041 3944951 3819491 3109273 2736535 2957574 3374716
40469 3374716 3803010 4341367 4853242 5122208 5368978 5941413 6600940 6753884 6330708
40460 6330708 5854328 5687249 5748354 5893056 6022265 5896180 5392202 4849737 4610176 4398326
40450 4398326 3817471 3233620 3316006 3832209 3908374 3507896 3511634 4074518 4119306 3064235
40440 3064235 1965187 2066248 3042883 3665255 3597391 3484502 3626506 3653647 3457329 3482238
40430 3482238 3903938 4215343 3913814 3177365 2627184 2636122 2986868 3136586 2851334 2545142
40420 2545142 2726952 3142760 2997157 2170544 1522775 1587856 1705066 1137986 413757 589664
$$ packed form
40489B751548l02356K69204R1800j38211P7835J96812j46494l14315J37072M81076
40479C103971L4234n10915j40721P09472P48910j25460p10218l72738K21039M17142
40469C374716M28294N38357N11875K68966K46770N72435O59527J52944m23176
40460F330708m76380j67079O1105J44702J29209j26085n03978n42465k39561k11850
40450D398326n80855n83851Q2386N16203P6165m00478L738N62884M4788j055071
40440C064235j099048J01061R76635O22372o7864j12889J42004K7141j96318K4909
40430C482238M21700L11405l01529p36449n50181Q938L50746J49718k85252l06192
40420B545142J81810M15808j45603q26613o47769O5081J17210n67080p24229J75907
$$ plain form
40410 589664 1572099 2231978 2086025 1817897 2001392 2265286 2066111 1528621 1096402 915117
40400 915117 960784 1312567 1887535 2246290 2056506 1565030 1338402 1652893 2275517 2709204
40390 2709204 2594329 2024934 1472630 1255160 1206803 1090086 1065400 1319076 1492098 1154181
40380 1154181 741864 1188828 2444732 3180160 2415854 826994 -117870 128037 896728
40371 896728 1405695 1540237 1624489 1902813 2324527 2607665 2512725 2160886 1949594 2038771
40361 2038771 2130271 1921573 1548746 1366559 1500141 1845172 2306680 2763226 2946677 2649942
40351 2649942 2010812 1413665 1168163 1357143 1813351 2133077 1972107 1527840 1465729 2094735
40341 2094735 2852870 2956124 2390663 1880447 1953998 2426158 2805620 2852708 2630698 2285964
$$ packed form
40410E89664R82435O59879j45953k68128J83495K63894j99175n37490m32219j81285
40400I15117M5667L51783N74968L58755j89784m91476k26628L14491O22624M33687
40390B709204j14875n69395n52304k17470m8357j16717k4686K53676J73022l37917
40380A154181m12317M46964J255904P35428p64306j588860r44864K45907P68691
40371H96728N08967J34542Q4252K78324M21714K83138r4940l51839k11292Q9177
40361B038771R1500k08698l72827j82187J33582L45031M61508M56546J83451k96735
40351B649942o39130n97147k45502J88980M56208L19726j60970m44267o2111O29006
40341B094735P58135J03254n65461n10216P3551M72160L79462M7088k22010l44734
$$ plain form
40331 2285964 1960576 1810704 1978213 2510864 3252704 3799699 3742190 3111526 2450749 2237089
40321 2237089 2344964 2319689 2076098 1990715 2297828 2747734 2995558 3037204 3051540 3039532
40311 3039532 2915942 2850640 3167134 3809868 4173536 3694255 2545471 1556124 1408903
40302 1408903 2029735 2775617 3082660 2877580 2506484 2391636 2673149 3061746 3100058 2665170
40292 2665170 2131236 1939582 2143387 2525988 2980415 3473108 3744773 3464770 2770196
40283 2770196 2299333 2486547 3047236 3361237 3208005 2932441 2995354 3542193 4354345 5063327
40273 5063327 5414844 5426724 5322666 5301469 5374602 5394138 5192853 4745595 4260464 4043398
40263 4043398 4186555 4474952 4681211 4791235 4802558 4545253 3997473 3574471 3695096 4163677
$$ packed form
40331B285964l25388j49872J67509N32651P41840N46995n7509o30664o60777k13660
40321B237089J07875k5275k43591q5383L07113M49906K47824M1646J4336j2008
40311C039532j23590o5302L16494O42734L63668m79281j148784r89347j47221
40302A408903O20832P45882L07043k05080l71096j14848K81513L88597L8312m34888
40292B665170n33934j91654K03805L82601M54427M92693K71665k80003o94574
40283B770196m70863J87214N60689L14001j53232k75564O2913N46839Q12152P08982
40273E063327L51517J1880j04058k1197P3133J9536k01285m47258m85131k17066
40263D043398J43157K88397K06259J10024J1323k57305n47780m23002J20625M68581
$$ plain form
40253 4163677 4412011 4291628 4149417 4143478 4054979 3877258 3983973 4449574 4741478 4451921
40243 4451921 3905385 3663257 3803091 4065210 4331817 4518352 4341892 3739389 3285235
40234 3285235 3625593 4589136 5357174 5466834 5167754 4794723 4314888 3681947 3235959
40225 3235959 3404265 4093033 4610191 4302455 3262241 2289514 2036328 2323876 2564437
40216 2564437 2699241 3191947 4050262 4514857 4070730 3229182 2827131 2971611 3203324
40207 3203324 3346042 3590201 3957964 4253458 4394272 4322461 3823412 2962056 2433354 2835554
40197 2835554 3779874 4385302 4489140 4634320 4993361 5172297 5106767 5247444 5653010 5757788
40187 5757788 5377794 5159491 5579625 6197289 6441564 6544683 7047732 7804864 8164139
$$ packed form
40253D163677K48334j20383j42211n939q8499j77721J06715M65601K91904k89557
40243D451921n46536k42128J39834K62119K66607J86535j76460o02503m54154
40234C285235L40358R63543P68038J09660k99080l73031m79835o32941m45988
40225C235959J68306O88768N17158l07736j040214r72727k53186K87548K40561
40216B564437J34804M92706Q58315M64595m44127q41548m02051J44480K31713
40207C203324J42718K44159L67763K95494J40814p1811m99049q61356n28702M02200
40197B835554R44320O05428J03838J45180L59041J78936o5530J40677M05566J04778
40187E757788l79994k18303M20134O17664K44275J03119N03049P57132L59275
$$ plain form
40178 8164139 7930219 7548767 7400457 7394537 7291265 7073277 6897825 6860423 6900672 6934986
40168 6934986 7056314 7449919 7989666 8171264 7778189 7378142 7651558 8381133 8730857
40159 8730857 8460315 8136964 8106695 8081779 7957494 8176850 8884050 9498564 9626303 9674614
40149 9674614 10021538 10307076 10211427 10227590 10832433 11476256 11335686 10654205 10369403 10688977
40139 10688977 11009619 11093758 11343067 11883825 12279055 12302349 12263271 12406727 12612693 12800963
40129 12800963 13049523 13240786 13168576 13036596 13243917 13632908 13597077 13023077 12468952 12278412
40119 12278412 12188021 12003681 11988276 12268140 12439742 12139328 11571572 11163286 11050080 11128470
40109 11128470 11264266 11274881 11038140 10712313 10503910 10245486 9674580 9067359 8969931 9301067
$$ packed form
40178H164139k33920l81452j48310n920j03272k17988j75452l7402M0249L4314
40168F934986J21328L93605N39747J81598l93075m00047K73416P29575L49724
40159H730857k70542l23351l0269k4916j24285K19356P07200O14514J27739M8311
40149I674614L46924K85538r5649J6163O04843O43823j40570o81481k84802L19574
40139A0688977L20642Q4139K49309N40758L95230K3294l9078J43456K05966J88270
40129A2800963K48560J91263p2210j31980K07321L88991l5831n74000n54125j90540
40119A2278412r0391j84340j5405K79864J71602l00414n67756m08286j13206P8390
40109A1128470J35796J0615k36741l25827k08403k58424n70906o07221r7428L31136
$$ plain form
40099 9301067 9436269 9240936 9211182 9443719 9376591 8862335 8565475 8815827 8953929 8425224
40089 8425224 7717406 7519814 7684750 7759701 7846026 8110496 8107118 7515298 6997508 7330322
40079 7330322 8114321 8338360 7862219 7347087 7059864 6810636 6791532 7319189 7895038 7702021
40069 7702021 6992398 6796351 7235846 7404906 7085078 7202053 8122841 8797245 8311421
40060 8311421 7237729 6657675 6743195 7111116 7751711 8673629 9268139 8993353 8279648
40051 8279648 7924556 7955263 7871419 7660211 7741118 8121778 8366047 8271678 7973493 7568707
40041 7568707 7192603 7164596 7459699 7423971 6739438 6235987 6797691 7802878 7811893 6702433
40031 6702433 5865811 6120749 6707685 6799141 6779397 7243514 7736351 7519864 6929023 6869723
$$ packed form
40099I301067J35202j95333k9754K32537o7128n14256k96860K50352J38102n28705
40089H425224p07818j97592J64936P4951Q6325K64470l378n91820n17790L32814
40079G330322P83999K24039m76141n15132k87223k49228j9104N27657N75849j93017
40069G702021p09623j96047M39495J69060l19828J16975R20788O74404m85824
40060H311421j073692n80054Q5520L67921O40595R21918N94510k74786p13705
40051H279648l55092L0707q3844k11208Q0907L80660K44269r4369k98185m04786
40041G568707l76104k8007K95103l5728o84533n03451N61704J005187R015j109460
40031F702433q36622K54938N86936R1456j9744M64117M92837k16487n90841n9300
$$ plain form
40021 6869723 7332918 7476860 7064496 6794187 7074788 7391163 7254266 7056085 7423042
40012 7423042 8154671 8418322 7873012 7087940 6760898 6882039 6895931 6519384 6107523 6149202
40002 6149202 6609774 6985630 6956062 6744874 6767747 7120251 7559578 7859094 8004394 8091939
39992 8091939 8175658 8200486 8019494 7542791 6935028 6542009 6493653 6503884 6257931 5913252
39982 5913252 5960596 6568834 7309295 7645329 7529042 7355682 7421606 7629552 7767460 7898021
39972 7898021 8257920 8761045 8855830 8132664 6989541 6351595 6619345 7189381 7229124 6669825
39962 6669825 6116539 5961606 6008374 5940173 5743158 5568384 5513012 5660159 6035818 6414296
39952 6414296 6494644 6402822 6619019 7173824 7368351 6715998 5785013 5531506 6030948 6516776
$$ packed form
40021F869723M63195J43942m12364k70309K80601L16375j36897j98181L66957
40012G423042P31629K63651n45310p85072l27042J21141J3892l76547m11861M1679
40002F149202M60572L75856k9568k11188K2873L52504M39327K99516J45300Q7545
39992H091939Q3719K4828j80992m76703o07763l93019m8356J0231k45953l44679
39982E913252M7344O08238P40461L36034j16287j73360O5924K07946J37908J30561
39972G898021L59899N03125R4785p23166j143123o37946K67750N70036L9743n59299
39962F669825n53286j54933M6768o8201j97015j74774n5372J47147L75659L78478
39952F414296Q0348r1822K16197N54805J94527o52353r30985k53507M99442M85828
$$ plain form
39942 6516776 6552987 6426046 6335319 6029972 5560876 5598399 6411378 7132579 6791396 5697904
39932 5697904 4993929 5050861 5212833 5118476 5267013 5886252 6124331 5148934 3590138 3018149
39922 3018149 4012573 5438315 5826818 4978941 3898009 3474577 3661823 3879400 3830795
39913 3830795 3715099 3793354 4008345 4094400 3918996 3598747 3323764 3156243 2997481 2723901
39903 2723901 2380006 2207254 2365605 2651948 2719893 2618407 2784248 3327414 3715212 3536500
39893 3536500 3223329 3443354 4002921 4079864 3523027 3119196 3345227 3620825 3252190 2489720
39883 2489720 2055145 2079285 2172169 2245960 2564546 3079772 3359228 3223329 2960938 2843245
39873 2843245 2842044 2914401 3185451 3681010 4110271 4080087 3499462 2788694 2635517 3283426
$$ packed form
39942F516776L6211j26941r0727l05347m69096L7523Q12979P21201l41183j093492
39932E697904p03975N6932J61972r4357J48537O19239K38079r75397j558796n71989
39922C018149R94424J425742L88503q47877j080932m23432J87246K17577m8605
39913C830795j15696P8255K14991Q6055j75404l20249k74983j67521j58762k73580
39903B723901l43895j72752J58351K86343O7945j01486J65841N43166L87798j78712
39893C536500l13171K20025N59567P6943n56837m03831K26031K75598l68635p62470
39883B489720m34575K4140R2884P3791L18586N15226K79456j35899k62391j17693
39873B843245j201P2357K71050M95559M29261l0184n80625p10768j53177O47909
$$ plain form
39863 3283426 4031273 3878299 2848504 2113668 2422495 3049074 2953102 2373601 2319918 2906366
39853 2906366 3347300 3420191 3654337 3994361 3640146 2612531 2156131 2887996 3733046
39844 3733046 3624610 3211014 3689124 4748977 5066280 4396930 3770410 3721778 3679342 3269192
39834 3269192 3010511 3299027 3661589 3541632 3133212 2969225 3207549 3670496 4105327
39825 4105327 4160952 3648177 3039887 3086409 3693694 3933681 3523631 3401153 4185240 4961009
39815 4961009 4611102 3682003 3617934 4443679 4678088 3717243 2867631 3357685 4492471
39806 4492471 4778564 4090391 3555693 3695009 3890364 3688799 3506981 3716966 3945174
39797 3945174 3802990 3628017 3878770 4287161 4286871 3953623 3808616 3866352 3632916 3071684
$$ packed form
39863C283426P47847j52974j029795p34836L08827O26579r5972n79501n3683N86448
39853B906366M40934P2891K34146L40024l54215j027615m56400P31865Q45050
39844C733046j08436m13596M78110J059853L17303o69350o26520m8632m2436m10150
39834C269192k58681K88516L62562j19957m08420j63987K38324M62947M34831
39825D105327N5625n12775o08290M6522O07285K39987m10050j22478P84087P75769
39815D961009l49907r29099o4069Q25745K34409r60845q49612M90054J134786
39806D492471K86093o88173n34698J39316J95355k01565j81818K09985K28208
39797C945174j42184j74973K50753M08391k90l33248j45007N7736k33436n61232
$$ plain form
39787 3071684 2833522 3282715 3892624 3981845 3617518 3373939 3493265 3710020 3742143 3575355
39777 3575355 3324805 3101339 2981684 2927980 2829056 2762467 3008795 3576728 3960207 3739756
39767 3739756 3262176 3270242 3894205 4471397 4444259 4012136 3730349 3847296 4285249 4950189
39757 4950189 5703456 6196685 6104187 5525555 4923888 4640878 4628997 4657136 4623527 4643358
39747 4643358 4937385 5622754 6494340 7057217 6984417 6578027 6538076 7131068 7797573 7818128
39737 7818128 7200136 6560116 6207084 5822108 5187855 4744940 5018903 5798089 6368400
39728 6368400 6418631 6232235 6079346 5980505 6081766 6613511 7266839 7246002 6348708 5463317
39718 5463317 5447604 5919544 5817469 4915373 4050085 3877679 4121023 4220371 4104681 3980923
$$ packed form
39787C071684k38162M49193O09909Q9221l64327k43579J19326K16755L2123j66788
39777C575355k50550k23466j19655n3704r8924o6589K46328N67933L83479k20451
39767C739756m77580Q066O23963N77192k7138m32123k81787J16947M37953O64940
39757D950189P53267M93229r2498n78632o01667k83010j1881K8139l3609J9831
39747D643358K94027O85369Q71586N62877p2800m06390l9951N92992O66505K0555
39737G818128o17992o40020l53032l84976o34253m42915K73963P79186N70311
39728F368400N0231j86396j52889r8841J01261N31745O53328k0837q97294q85391
39718E463317j5713M71940j02075r02096q65288j72406K43344R9348j15690j23758
$$ plain form
39708 3980923 3827375 3536697 3296587 3388139 3694299 3777211 3471746 3122315 3130672 3466813
39698 3466813 3782380 3885469 3879555 3839821 3632427 3241895 3060306 3497684 4346234 4900548
39688 4900548 4784511 4327600 4027107 4018542 4244561 4709920 5247456 5414655 5048106 4640753
39678 4640753 4733668 5175763 5442681 5453972 5538579 5754448 5829840 5727541 5707053 5810523
39668 5810523 5794127 5599908 5423695 5302560 5107508 4936973 5013694 5203034 5172530 5006450
39658 5006450 5054721 5190364 4939759 4412675 4287049 4673852 4856961 4514889 4354621 5013596
39648 5013596 6074921 6760799 6944869 6876049 6558329 6087393 5973605 6361621 6505605
39639 6505605 5854257 5104740 5228419 5934919 6175299 5789069 5468639 5353655 4992175
$$ packed form
39708C980923j53548k90678k40110R1552L06160Q2912l05465l49431Q357L36141
39698C466813L15567J03089n914l9734k07394l90532j81589M37378Q48550N54314
39688D900548j16037m56911l00493q565K26019M65359N37536J67199l66549m07353
39678D640753R2915M42095K66918J1291Q4607K15869P5392j02299k0488J03470
39668E810523j6396j94219j76213j21135j95052j70535P6721J89340l0504j66080
39658E006450M8271J35643k50605n27084j25626L86803J83109l42072j60268O58975
39648E013596J061325O85878J84070o8820l17720m70936j13788L88016J43984
39639F505605o51348p49517J23679P06500K40380l86230l20430j14984l61480
$$ plain form
39630 4992175 4637829 5128505 6214843 6453468 5353515 4331938 4691491 5757728 6084567
39621 6084567 5642521 5557046 6179836 6713533 6634255 6345622 6273211 6223013 5920427 5512784
39611 5512784 5252085 5177306 5312621 5719711 6179091 6279885 6025673 5907995 6153971 6357349
39601 6357349 6166553 5903499 6059513 6497332 6668491 6445142 6200686 6118063 5979821 5764398
39591 5764398 5913291 6658590 7435322 7425516 6597861 5815935 5849083 6548666 7133589 7114184
39581 7114184 6747655 6608310 6870516 7160962 7127496 6946439 7014469 7232693 7039652 6319143
39571 6319143 5808694 6166465 6948126 7098661 6325460 5348082 4798448 4586535 4522244 4807093
39561 4807093 5473290 5948981 5754405 5198990 4831281 4599341 4187427 3831860 4033080
$$ packed form
39630D992175l54346M90676J086338K38625j099953j021577L59553J066237L26839
39621F084567m42046q5475O22790N33697p9278k88633p2411n0198l02586m07643
39611E512784k60699p4779J35315M07090M59380J00794k54212j17678K45976K03378
39601F357349j90796k63054J56014M37819J71159k23349k44456q2623j38242k15423
39591E764398J48893P45299P76732r806q27655p81926L3148O99583N84923j9405
39581G114184l66529j39345K62206K90446l3466j81057O8030K18224j93041p20509
39571F319143n10449L57771P81661J50535p73201r77378n49634k11913o4291K84849
39561D807093O66197M75691j94576n55415l67709k31940m11914l55567K01220
$$ plain form
39552 4033080 4622186 4886026 4616203 4347996 4510045 4969699 5467303 5848142 5798475 5074694
39542 5074694 4156904 3924012 4407426 4620958 4004280 3257766 3196741 3524613 3511966 3294009
39532 3294009 3538134 4160078 4385961 4037997 3817642 4146242 4529774 4392442 3914542
39523 3914542 3662135 3839116 4266924 4755160 5149894 5275052 5132268 4980508 5007081 5114719
39513 5114719 5191546 5318978 5505057 5515578 5260662 5063550 5174418 5267596 4900129 4317363
39503 4317363 4232737 4796459 5374324 5522148 5583518 5934566 6153616 5577226 4435928 3739264
39493 3739264 4011889 4758681 5338216 5786164 6448731 7270300 7892740 8169754 8164949 7885796
39483 7885796 7453242 7298611 7661460 8041322 7744110 6923601 6422197 6504189 6488048 5945185
$$ packed form
39552D033080N89106K63840k69823k68207J62049M59654M97604L80839m9667p23781
39542E074694r17790k32892M83414K13532o16678p46514o1025L27872j2647k17957
39532C294009K44125O21944K25883l47964k20355L28600L83532j37332m77900
39523C914542k52407J76981M27808M88236L94734J25158j42784j51760K6573J07638
39513E114719P6827J27432J86079J0521k54916j97112J10868R3178l67467n82766
39503D317363q4626N63722N77865J47824O1370L51048K19050n76390j141298o96664
39493C739264K72625P46792N79535M47948O62567Q21569O22440K77014m805k79153
39483G885796m32554j54631L62849L79862k97212q20509n01404Q1992j6141n42863
$$ plain form
39473 5945185 5545862 6110283 7298570 7985654 7759247 7348148 7529281 8210840 8802005
39464 8802005 9041048 9137544 9320315 9542806 9605129 9416353 9109715 8909102 8862828 8762258
39454 8762258 8409479 7921266 7651157 7813290 8264632 8651618 8734340 8630589 8780353 9536796
39444 9536796 10682483 11487376 11423287 10736836 10137934 9998962 10073635 9961993 9588427 9146098
39434 9146098 8788416 8560902 8558410 8927707 9593351 10096949 9976111 9394282 9110332 9547631
39424 9547631 10147436 10116643 9654244 9738711 10608568 11256138 10847985 9928646 9551428 9780324
39414 9780324 9889445 9666372 9554662 9646236 9521527 9180475 9223021 9862452 10545615 10827551
39404 10827551 10881100 10857131 10545245 10075583 10137601 10925046 11603430 11509332 11203994 11547593
$$ packed form
39473E945185l99323N64421J188287O87084k26407m11099J81133O81559N91165
39464H802005K39043R6496J82771K22491O2323j88776l06638k00613m6274j00570
39454H762258l52779m88213k70109J62133M51342L86986Q2722j03751J49764P56443
39444I536796J145687Q04893o4089o86451n98902j38972P4673j11642l73566m42329
39434I146098l57682k27514k492L69297O65644N03598j20838n81829k83950M37299
39424I547631N99805l0793m62399Q4467Q69857O47570m08153r19339l77218K28896
39414I780324J09121k23073j11710R1574j24709l41052M2546O39431O83163K81936
39404A0827551N3549k3969l11886m69662O2018P87445O78384r4098l05338L43599
$$ plain form
39394 11547593 12354229 12915919 13339908 14214240 15221178 15342598 14495099 13768161 13737483
39385 13737483 13616724 12595227 11123056 10202943 10049733 10134134 10126575 10178689 10527128 11269072
39375 11269072 12286635 13078042 13021105 12147002 11263140 10958760 10947029 10794562 10731325 11113404
39365 11113404 11577715 11513210 11046121 10762641 10708955 10507609 10270193 10460179 10921089 11026875
39355 11026875 10849957 11142918 11953801 12323450 11747224 10910694 10454291 10040471 9350117
39346 9350117 8976764 9348667 9635422 8928678 7867645 7753395 8453056 8626698 7912627
39337 7912627 7406663 7776590 8300306 8245798 7980857 8070188 8308101 8379723 8600855 9213112
39327 9213112 9684865 9509980 9051058 8800363 8460759 7661208 6974113 7142740 7715909
$$ packed form
39394A1547593Q06636N61690M23989Q74332J006938J21420q47499p26938l0678
39385A3737483j20759j021497j472171r20113j53210Q4401p559N2114L48439P41944
39375A1269072J017563P91407n6937q74103q83862l04380j1731j52467o3237L82079
39365A1113404M64311o4505m67089k83480n3686k01346k37416J89986M60910J05786
39355A1026875j76918K92961Q10883L69649n76226q36530m56403m13820o90354
39346I350117l73353L71903K86755p06744j061033j14250O99661J73642p14071
39337G912627n05964L69927N23716n4508k64941Q9331K37913P1622K21132O12257
39327I213112M71753j74885m58922k50695l39604p99551o87095J68627N73169
$$ plain form
39318 7715909 7600123 6750849 6173011 6317496 6630244 6763704 7052504 7498306 7421984 6653992
39308 6653992 6100857 6458919 7146663 7242035 6837873 6668462 6860377 6894056 6565980 6244331
39298 6244331 6261194 6630946 7265799 7940171 8161028 7633489 6818865 6526283 6954884 7583847
39288 7583847 7966485 8138122 8225381 8170078 7971001 7775408 7584938 7234196 6789905 6610252
39278 6610252 6843032 7181069 7290266 7212538 7197936 7403016 7890023 8630865 9331973 9535043
39268 9535043 9123285 8525414 8226402 8275890 8449407 8647928 8898142 9160345 9393815 9661594
39258 9661594 9955024 10092166 10011260 9947378 10044480 10035376 9679334 9298569 9383784 9773083
39248 9773083 9792197 9265554 8831106 9049579 9675093 10083579 10020999 9616334 9034506 8517535
$$ packed form
39318G715909j15786q49274n77838J44485L12748J33460K88800M45802p6322p67992
39308F653992n53135L58062O87744R5372m04162j69411J91915L3679l28076l21649
39298F244331J6863L69752O34853O74372K20857n27539q14624k92582M28601O28963
39288G583847L82638J71637Q7259n5303j99077j95593j90470l50742m44291j79653
39278F610252K32780L38037J09197p7728j4602K05080M87007P40842P01108K03070
39268I535043m11758n97871k99012M9488J73517J98521K50214K62203K33470K67779
39258I661594K93430J37142q0906o3882R7102r104l56042l80765Q5215L89299
39248I773083J9114n26643m34448K18473O25514M08486o2580m04665n81828n16971
$$ plain form
39238 8517535 8464806 8997262 9616436 9747622 9498901 9433338 9701606 9933274 9970749 10108013
39228 10108013 10442615 10567222 10228972 9820442 9789663 9941783 9857410 9749000 10239280 11276620
39218 11276620 11915318 11481089 10526385 10179406 10721425 11290410 11071317 10349673 10032449
39209 10032449 10351627 10607647 10337968 10164664 10926322 12274720 12929452 12418574 11772682
39200 11772682 12049737 12829177 12921515 12220948 11935604 12886157 14349818 14995740 14515992
39191 14515992 13865897 14053269 15061571 16004935 16155039 15684096 15348931 15518749 15770254
39182 15770254 15576253 15090678 14889924 15119708 15357435 15274088 14979434 14694882 14536917
39173 14536917 14670455 15189975 15763018 15939345 15973497 16708167 18314415 19802818 20345598
$$ packed form
39238H517535n2729N32456O19174J31186k48721o5563K68268K31668L7475J37264
39228A0108013L34602J24607l38250m08530l0779J52120q4373j08410M90280J037340
39218A1276620O38698m34229r54704l46979N42019N68985k19093p21644l17224
39209A0032449L19178K56020k69679j73304P61658J348398O54732n10878o45892
39200A1772682K77055P79440R2338p00567k85344R50553J463661O45922m79748
39191A4515992o50095J87372J008302R43364J50104m70943l35165J69818K51505
39182A5770254j94001m85575k00754K29784K37727q3347k94654k84552j57965
39173A4536917J33538N19520N73043J76327L4152P34670J606248J488403N42780
$$ plain form
39164 20345598 20539994 21595448 23572751 25261464 25746311 25305630 24628005 23881376 22933123
39155 22933123 21958690 21318438 21051193 20898769 20764966 20861894 21396369 22286215 23210456
39146 23210456 23864219 24184964 24390498 24788619 25531115 26557456 27730872 28973744 30333286
39137 30333286 32001096 34174528 36749222 39263380 41438516 43784033 47313858 52473786
39129 52473786 58650992 65102939 72202696 81269619 93118403 107365583 123612836 142946632
39121 142946632 167638408 199483308 239055300 286307460 340333395 397331544 449415682
39114 449415682 486981430 503048647 495586967 466808716 421864389 368185707 313952695
39107 313952695 265227385 224260572 190663640 163489816 141780919 124225449 109635233
$$ packed form
39164B0345598J94396J055454J977303J688713M84847m40681o77625p46629r48253
39155B2933123r74433o40252k67245j52424j33803R6928N34475Q89846R24241
39146B3210456O53763L20745K05534L98121P42496J026341J173416J242872J359542
39137C0333286J667810K173432K574694K514158K175136K345517L529825N159928
39129E2473786O177206O451947P099757R066923J1848784J4247180J6247253J9333796
39121A42946632K4691776L1844900L9571992M7252160N4025935N6998149N2084138
39114D49415682L7565748J6067217p461680k8778251m4944327n3678682n4233012
39107C13952695m8725310m0966813l3596932k7173824k1708897j7555470j4590216
$$ plain form
39100 109635233 97612968 87978081 79886700 72408057 65675411 60445587 56611630 53153342
39092 53153342 49585759 46426334 44016251 41869090 39597613 37624819 36405625 35580722
39084 35580722 34493624 33093941 31785485 30712432 29693719 28658356 27754533 27155700
39076 27155700 26987955 27263946 27714023 27904350 27673493 27245126 26863056 26615201 26622214 26963332
39066 26963332 27340226 27300233 26928220 26816209 27185979 27583689 27644256 27555497 27477830 27148216
39056 27148216 26486643 26001148 26068443 26319245 26277778 26126178 26238996 26418567 26285665 26072110
39046 26072110 26287528 26837552 27196042 27291456 27507806 27889667 28047684 27865690 27662012
39037 27662012 27572834 27337495 26806471 26192179 25714722 25381119 25146904 24946038 24617804
$$ packed form
39100A09635233j2022265r634887q091381p478643o732646n229824l833957l458288
39092E3153342l567583l159425k410083k147161k271477j972794j219194q24903
39084C5580722j087098j399683j308456j073053j018713j035363r03823n98833
39076B7155700j67745K75991M50077J90327k30857m28367l82070k47855P013L41118
39066B6963332L76894l9993l72013j12011L69770L97710O0567q8759p7667l29614
39056B7148216o61573m85495O7295K50802m1467j51600J12818J79571j32902k13555
39046B6072110K15418N50024L58490R5414K16350L81861J58017j81994k03678
39037B7662012q9178k35339n31024o14292m77457l33603k34215k00866l28234
$$ plain form
39028 24617804 24182703 24048093 24454875 24884413 24647794 23977643 23784549 24270548 24603208
39019 24603208 24226705 23688729 23668998 23860888 23519260 22716751 22303520 22727531 23525877
39010 23525877 24044182 24160031 24119394 24014041 23699576 23121614 22532117 22347970 22802611
39001 22802611 23696209 24494363 24762871 24564327 24368682 24488013 24657013 24356852 23586498
38992 23586498 23039054 23280892 23973209 24283304 23954248 23503674 23374953 23440359 23486155 23622819
38982 23622819 23917330 24122965 24145573 24314011 24766570 25035092 24760410 24397187 24587600
38973 24587600 25166404 25448397 25239756 24865852 24400215 23634183 22750919 22294485 22416704
38964 22416704 22762133 23099996 23454980 23632699 23311092 22690758 22400758 22610896 22807237
$$ packed form
39028B4617804m35101j34610M06782M29538k36619o70151j93094M85999L32660
39019B4603208l76503n37976j9731J91890l41628q02509m13231M24011P98346
39010B3525877N18305J15849m0637j05353l14465n77962n89497j84147M54641
39001B2802611Q93598P98154K68508j98544j95645J19331J69000l00161p70354
38992B3586498n47444K41838O92317L10095l29056m50574j28721O5406M5796J36664
38982B3622819K94511K05635K2608J68438M52559K68522k74682l63223J90413
38973B4587600N78804K81993k08641l73904m65637p66032q83264m56434J22219
38964B2416704L45429L37863L54984J77719l21607o20334k90000K10138J96341
$$ plain form
38955 22807237 22574755 22076694 21678462 21606207 21972090 22563645 22674155 21852601 20794375
38946 20794375 20674740 21560811 22379294 22546226 22570283 22765665 22545212 21616063 20837644
38937 20837644 21027349 21691738 21855766 21553519 21547532 21970217 22179121 21791622 21093742 20491462
38927 20491462 20150597 20109686 20270129 20352278 20212667 20054250 20060763 20099865 20057134 20106199
38917 20106199 20347537 20573924 20695694 20945624 21343313 21473060 21153699 20779331 20634858
38908 20634858 20508371 20357424 20563922 21024104 20914845 20086085 19702711 20519211 21459679
38899 21459679 21163869 20138988 19891878 20507202 20733962 20177231 19707325 19716445 19615653
38890 19615653 19243849 19210423 19518678 19349856 18639548 18392531 18883627 19016737 18196712
$$ packed form
38955B2807237k32482m98061l98232p2255L65883N91555J10510q21554j058226
38946B0794375j19635Q86071Q18483J66932K4057J95382k20453r29149p78419
38937B0837644J89705O64389J64028l02247n987M22685K08904l87499o97880o02280
38927B0491462l40865m0911J60443Q2149j39611j58417O513L9102m2731M9065
38917B0106199K41338K26387J21770K49930L97689J29747l19361l74368j44473
38908B0634858j26487j50947K06498M60182j09259q28760l83374Q16500R40468
38899B1459679k95810j024881k47110O15324K26760n56731m69906R120j00792
38890A9615653l71804l3426L08255j68822p10308k47017M91096J33110q20025
$$ plain form
38881 18196712 17412283 17529949 17835597 17414352 16842635 17189569 18190413 18764532 18736995
38872 18736995 18742648 18888692 18810788 18737003 19192226 19782848 19543847 18544423 17959130 18315418
38862 18315418 18740113 18338376 17433469 16940977 17173541 17753974 18219999 18272421 17806539
38853 17806539 17113681 16793937 17124663 17682052 17828465 17420455 16847147 16521514 16524602 16668764
38843 16668764 16765653 16825984 16990302 17231403 17252240 16855575 16316321 16124352 16368704 16634745
38833 16634745 16550949 16193978 15867255 15698226 15604416 15524756 15522627 15686715 16018374 16412395
38823 16412395 16700973 16715224 16359163 15707613 15060076 14791745 15023277 15481733 15806742
38814 15806742 15921645 15947779 15885952 15690174 15598192 15976463 16733697 17262275 17148565 16636668
$$ packed form
38881A8196712p84429J17666L05648m21245n71717L46934J000844N74119k7537
38872A8736995N653J46044p7904p3785M55223N90622k39001r99424n85293L56288
38862A8315418M24695m01737r04907m92492K32564N80433M66025N2422m65882
38853A7806539o92858l19744L30726N57389J46413m08010n73308l25633L088J44162
38843A6668764R6889O0331J64318K41101K0837l96665n39254j91969K44352K66041
38833A6634745q3796l56971l26723j69029r3810p9660k129J64088L31659L94021
38823A6412395K88578J4251l56061o51550o47537k68331K31532M58456L25009
38814A5806742J14903K6134o1827j95778r1982L78271P57234N28578j13710n11897
$$ plain form
38804 16636668 16206969 16015740 15983928 16123873 16452556 16781167 16881998 16734700 16430610
38795 16430610 16040480 15741249 15778581 16067229 16138935 15772545 15344233 15195532 15003603 14278450
38785 14278450 13243898 12660483 12862596 13476924 14059351 14527262 14929665 15228339 15415277
38776 15415277 15536081 15523758 15242777 14710006 14094183 13583642 13415499 13794900 14510073
38767 14510073 14932334 14802729 14703626 15225470 15983598 16155270 15756897 15549521 15773212
38758 15773212 15920690 15844605 16063857 16649581 16812454 16168033 15546468 15817085 16614288
38749 16614288 17040065 17033870 17118612 17241080 16932540 16432495 16562859 17382427 17931471 17610979
38739 17610979 17013659 16965641 17377834 17552553 17198950 16649459 16324909 16389899 16764032 17147191
$$ packed form
38804A6636668m29699j91229l1812J39945L28683L28611J00831j47298l04090
38795A6430610l90130k99231L7332K88648P1706l66390m28312j48701j91929p25153
38785A4278450j034552n83415K02113O14328N82427M67911M02403K98674J86938
38776A5415277J20804j2323k80981n32771o15823n10541j68143L79401P15173
38767A4510073M22261j29605r9103N21844P58128J71672l98373k07376K23691
38758A5773212J47478p6085K19252N85724J62873o44421o21565K70617P97203
38749A6614288M25777o195Q4742J22468l08540n00045J30364Q19568N49044l20492
38739A7610979n97320m8018M12193J74719l53603n49491l24550O4990L74133L83159
$$ plain form
38729 17147191 17168103 16769233 16317435 16128282 16059318 15813729 15457550 15308600 15399728 15384968
38719 15384968 15010666 14440030 14046984 14040762 14326776 14614893 14653086 14466892 14369494 14630941
38709 14630941 15153449 15590627 15765694 15821170 15944355 16120278 16249166 16378920 16659001
38700 16659001 17066787 17302248 17051641 16367220 15722898 15612834 16085957 16749114 17248579
38691 17248579 17636246 18164818 18808473 19166995 18907121 18215194 17709257 17843814 18399327
38682 18399327 18654835 18184355 17422397 17223506 17838346 18615209 18866533 18708559 18702506 18906482
38672 18906482 18806784 18191745 17582879 17587358 18170023 18802708 19069356 18886912 18366136 17755897
38662 17755897 17408527 17533156 17996563 18495577 18862397 19129318 19436399 19963725 20770718
$$ packed form
38729A7147191K0912l98870m51798j89153o8964k45589l56179j48950R1128j4760
38719A5384968l74302n70636l93046o222K86014K88117L8193j86194r7398K61447
38709A4630941N22508M37178J75067N5476J23185J75923J28888J29754K80081
38700A6659001M07786K35461k50607o84421o44322j10064M73123O63157M99465
38691A7248579L87667N28572O43655L58522k59874o91927n05937J34557N55513
38682A8399327K55508m70480p61958j98891O14840P76863K51324j57974o053K03976
38672A8906482r9698o15039o08866M479N82665O32685K66648j82444n20776o10239
38662A7755897l47370J24629M63407M99014L66820K66921L07081N27326Q06993
$$ plain form
38653 20770718 21592355 22006604 21931503 21712479 21580902 21354418 20898524 20505037 20440643 20456795
38643 20456795 20230014 20024795 20340155 21030946 21381329 21051088 20424746 20008121 19981173
38634 19981173 20338707 20904748 21169258 20730712 20008545 19862437 20338603 20532159 20001699
38625 20001699 19521158 19872365 20601738 20743806 20266003 19918853 19949717 19877432 19472475 19107908
38615 19107908 19030026 19008945 18902701 18937340 19188323 19339963 19239921 19210026 19506572 19897987
38605 19897987 20084023 20131482 20165712 20037423 19711038 19622373 20134651 20881261 21196599 21060333
38595 21060333 21054443 21443339 21896137 22177151 22482201 22872101 22975237 22640565 22377560 22634174
38585 22634174 23038407 22978615 22657616 22835891 23628673 24365775 24783825 25587214 27475290
$$ packed form
38653B0770718Q21637M14249p5101k19024j31577k26484m55894l93487o4394J6152
38643B0456795k26781k05219L15360O90791L50383l30241o26342m16625k6948
38634A9981173L57534N66041K64510m38546p22167j46108M76166J93556n30460
38625B0001699m80541L51207P29373J42068m77803l47150L0864p2285m04957l64567
38615A9107908p7882k1081j06244L4639K50983J51640j00042k9895K96546L91415
38605A9897987J86036M7459L4230j28289l26385q8665N12278P46610L15338j36266
38595B1060333n890L88896M52798K81014L05050L89900J03136l34672k63005K56614
38585B2634174M04233n9792l20999J78275P92782P37102M18050Q03389J888076
$$ plain form
38576 27475290 30253206 33370180 36833418 41115397 46644082 53926892 63635454 75674450
38568 75674450 88272074 98689080 104827467 105752186 101177574 91616821 79142648 66861163
38560 66861163 56935962 49515285 43767671 39251110 35882944 33315798 31079213 29032217
38552 29032217 27184457 25394648 23704840 22612383 22439007 22645967 22329890 21314545
38544 21314545 20300745 19977750 20352208 20919734 21187493 21027023 20704978 20539544 20491671
38535 20491671 20306793 20065635 20144102 20458465 20320308 19452508 18623997 18672965 19296208 19531185
38525 19531185 19202952 19084632 19625656 20299626 20457696 20232829 20210693 20539557 20755377
38516 20755377 20415795 19667538 19096514 19036266 19156595 18935921 18456312 18317994 18679691
$$ packed form
38576B7475290K777916L116974L463238M281979N528685P282810R708562J2038996
38568G5674450J2597624J0417006O138387R24719m574612r560753j2474173j2281485
38560F6861163r925201p420677n747614m516561l368166k567146k236585k046996
38552B9032217j847760j789809j689808j092457j73376K06960l16077j015345
38544B1314545j013800l22995L74458N67526K67759j60470l22045j65434m7873
38535B0491671j84878k41158P8467L14363j38157q67800q28511M8968O23243K34977
38525A9531185l28233j18320N41024O73970J58070k24867k2136L28864K15820
38516B0755377l39582p48257n71024o0248J20329k20674m79609j38318L61697
$$ plain form
38507 18679691 18913612 18540668 18018679 18084832 18663050 19021634 18827060 18460966 18357458
38498 18357458 18529757 18762051 18892224 18905929 18995709 19406112 20024171 20399357 20407484 20485778
38488 20485778 20878043 21173322 21081431 21065296 21500355 21799865 21318487 20645879 20855714 21748595
38478 21748595 22113128 21681648 21478311 21991900 22329094 21732410 20815322 20553641 20915685
38469 20915685 21280765 21571157 22169577 23093915 23904144 24222313 23975288 23408887 23095223
38460 23095223 23496899 24280552 24555107 24043900 23466785 23477680 23849040 24084108 24191801
38451 24191801 24360259 24444181 24343635 24414753 24943368 25613996 26011226 26244941 26578577 26859987
38441 26859987 26871784 26863662 27151208 27493636 27448874 27122300 27043279 27462674 28169937 28795305
$$ packed form
38507A8679691K33921l72944n21989O6153N78218L58584j94574l66094j03508
38498A8357458J72299K32294J30173J3705Q9780M10403O18059L75186Q127P8294
38488B0485778L92265K95279r1891j6135M35059K99510m81378o72608K09835Q92881
38478B1748595L64533m31480k03337N13589L37194n96684r17088k61681L62044
38469B0915685L65080K90392N98420R24338Q10229L18169k47025n66401l13664
38460B3095223M01676P83653K74555n11207n77115J0895L71360K35068J07693
38451B4191801J68458Q3922j00546P1118N28615O70628L97230K33715L33636K81410
38441B6859987J1797q122K87546L42428m4762l26574p9021M19395P07263O25368
$$ plain form
38431 28795305 28971417 28513664 27788680 27534663 27939549 28308441 28051835 27524523 27376132
38422 27376132 27562833 27650784 27697386 28095454 28769132 29189156 29057157 28471870 27639546 26897982
38412 26897982 26701973 27025485 27118438 26473509 25670052 25538375 25835214 25622056 24752742
38403 24752742 24041759 23969498 24124418 24074544 23992196 24155748 24470505 24773669 25157566 25778122
38393 25778122 26662661 27736483 28711113 29093175 28794850 28563680 29159516 30201958 30577957
38384 30577957 29994887 29303754 29124219 29018146 28430397 27692489 27474539 27727979 27825327
38375 27825327 27515922 27168662 27115418 27213713 27167424 26991324 26954730 27151943 27353030 27384328
38365 27384328 27445373 27735413 27907481 27448230 26671373 26622547 27606846 28497540 28182854 27172048
$$ packed form
38431B8795305J76112m57753p24984k54017M04886L68892k56606n27312j48391
38422B7376132J86701Q7951M6602L98068O73678M20024j31999n85287q32324p41564
38412B6897982j96009L23512R2953o44929q03457j31677K96839k13158q69314
38403B4752742p10983p2261J54920m9874q2348J63552L14757L03164L83897O20556
38393B5778122Q84539J073822R74630L82062k98325k31170N95836J042442L75999
38384C0577957n83070o91133j79535j06073n87749p37908k17950K53440R7348
38375B7825327l09405l47260n3244R8295m6289j76100l6594J97213K01087L1298
38365B7384328O1045K90040J72068m59251p76857m8826R84299Q90694l14686j010806
$$ plain form
38355 27172048 26906370 27777330 28744662 28834950 28149364 27325826 26806493 26823711 27416666 28174411
38345 28174411 28452985 28083506 27535684 27319288 27558194 28099771 28643371 28839577 28657429
38336 28657429 28502354 28589072 28524672 28027607 27606969 27783470 28094202 27838286 27411413 27702970
38326 27702970 28424390 28447135 27800365 27806456 28918172 29922973 29884756 29479133 29584852 29793501
38316 29793501 29346686 28593501 28437990 28993382 29690900 30162798 30272350 29880447 29281310
38307 29281310 29207892 29730749 29912689 29276917 28723287 29075210 29647600 29429054 28858402
38298 28858402 29012476 29629389 29523320 28697108 28442561 29265004 30162635 30281112 30023998
38289 30023998 30046132 30189148 30013123 29640200 29504142 29731874 30149201 30529452 30620182 30275279
$$ packed form
38355B7172048k65678Q70960R67332R0288o85586q23538n19333J7218N92955P57745
38345B8174411K78574l69479n47822k16396K38906N41577N43600J96206j82148
38336B8657429j55075Q6718o4400m97065m20638J76501L10732k55916m26873K91557
38326B7702970P21420K2745o46770O091J111716J004801l8217m05623J05719K08649
38316B9793501m46815p53185j55511N55392O97518M71898J09552l91903n99137
38307B9281310p3418N22857J81940o35772n53630L51923N72390k18546n70652
38298B8858402J54074O16913j06069q26212k54547Q22443Q97631J18477k57114
38289C0023998K2134J43016j76025l72923j36058K27732M17327L80251R0730l44903
$$ plain form
38279 30275279 29687720 29203231 28946177 28941150 29367069 30195560 30848802 30858769 30620972 30759080
38269 30759080 31004846 30636949 29884180 29806759 30688120 31607147 31863614 31815184 31921669 31939761
38259 31939761 31628791 31442485 31880925 32757833 33642884 34448555 35074511 35086397 34355675
38250 34355675 33512000 33150989 33021844 32581626 31937117 31605862 31677347 31848251 32036441
38241 32036441 32334136 32526369 32261167 31625531 31047845 30696345 30430855 30264066 30378448
38232 30378448 30689477 30846197 30734962 30613055 30653031 30667398 30416665 29976846 29661801 29664088
38222 29664088 29833986 29805782 29390967 28854798 28678298 29005337 29476564 29657871 29454973
38213 29454973 29065370 28756311 28760963 29122665 29520805 29502567 28997940 28353655 27820304 27393726
$$ packed form
38279C0275279n87559m84489k57054n027M25919Q28491O53242R967k37797J38108
38269C0759080K45766l67897p52769p7421Q81361R19027K56467m8430J06485J8092
38259C1939761l10970j86306M38440Q76908Q85051Q05671O25956J1886p30722
38250C4355675q43675l61011j29145m40218o44509l31255P1485J70904J88190
38241C2036441K97695J92233k65202o35636n77686l51500k65490j66789J14382
38232C0378448L11029J56720j11235j21907L9976J4367k50733m39819l15045K287
38222B9664088J69898k8204m14815n36169j76500L27039M71227J81307k02898
38213B9454973l89603l09059M652L61702L98140j8238n04627o44285n33351m26578
$$ plain form
38203 27393726 27237170 27698506 28609746 29111844 28661090 27804522 27429814 27600438 27743775
38194 27743775 27700447 27825336 28114671 28004355 27228157 26293317 25828190 25862531 26000043 25978879
38184 25978879 25813962 25611622 25457735 25361758 25208853 24897984 24556278 24437655 24581547
38175 24581547 24746832 24680152 24275864 23556948 22772612 22421887 22780004 23400709 23537428
38166 23537428 23141800 22942450 23320214 23635340 23101128 21930224 21053210 20896601 21021087
38157 21021087 20950802 20811210 20987933 21566229 22324314 22979537 23231484 22845922 21987917
38148 21987917 21288423 21259941 21708458 21984878 21777019 21392827 21272203 21501271 21860531
38139 21860531 22071771 21890410 21245947 20488704 20226815 20618826 21035359 20816749 20257166
$$ packed form
38203B7393726j56556M61336R11240N02098m50754q56568l74708J70624J43337
38194B7743775m3328J24889K89335j10316p76198r34840m65127L4341J37512k1164
38184B5978879j64917k02340j53887r5977j52905l10869l41706j18623J43892
38175B4581547J65285o6680m04288p18916p84336l50725L58117O20705J36719
38166B3537428l95628j99350L77764L15126n34212j170904q77014j56609J24486
38157B1021087p0285j39592J76723N78296P58085O55223K51947l85562q58005
38148B1987917o99494k8482M48517K76420k07859l84192j20624K29068L59260
38139B1860531K11240j81361o44463p57243k61889L92011M16533k18610n59583
$$ plain form
38130 20257166 20340163 21399792 22522741 22599700 21667375 20801652 20801983 21395861 21790781 21630848
38120 21630848 21165728 20705956 20299038 19988939 20039953 20587592 21201871 21210907 20562261 19988857
38110 19988857 20060652 20398596 20243860 19569359 19053772 19011095 19007747 18717809 18514164 18801712
38100 18801712 19271689 19373803 19200277 19286953 19694882 19907013 19638454 19189703 18885587
38091 18885587 18652704 18341192 18054081 17914684 17825349 17706797 17731924 18099190 18790537 19740932
38081 19740932 20979994 22359656 23438646 24024330 24612477 25782096 27216612 27916620
38073 27916620 27569188 27153725 27722059 28897914 29200577 27852519 25699144 24103227 23376891
38064 23376891 22732277 21525980 20000410 18760851 18004833 17519747 17134616 16833276 16527796
$$ packed form
38130B0257166Q2997J059629J122949P6959r32325q65723L31N93878L94920j59933
38120B1630848m65120m59772m06918l10099N1014N47639O14279R036o48646n73404
38110A9988857P1795L37944j54736o74501n15587m2677l348k89938k03645K87548
38100A8801712M69977J02114j73526Q6676M07929K12131k68559m48751l04116
38091A8885587k32883l11512k87111j39397q9335j18552K5127L67266O91347R50395
38081A9740932J239062J379662J078990N85684N88147J169619J434516P00008
38073B7916620l47432m15463N68334J175855L02663j348058k153375j595917p26336
38064B3376891o44614j206297j525570j239559p56018m85086l85131l01340l05480
$$ plain form
38055 16527796 16025639 15269206 14442307 13783382 13378532 13167017 13084893 13151766 13405741 13771235
38045 13771235 14067302 14210334 14321417 14498912 14575878 14339839 13962416 13894869 14255493 14645547
38035 14645547 14744714 14757178 14963294 15096080 14607016 13497458 12491330 12282313 12837451
38026 12837451 13524380 13769504 13528507 13204791 13151239 13269528 13200441 12895888 12737384 12947759
38016 12947759 13175561 12954882 12372942 11930197 11848967 11867489 11675582 11246651 10748928 10376373
38006 10376373 10243220 10255885 10179659 9989312 9934894 10050322 9958343 9551449 9456217 10196259
37996 10196259 11204603 11454841 10908675 10454409 10443624 10291531 9712922 9307288 9464534
37987 9464534 9637176 9331479 9005625 9238015 9699339 9787033 9706897 10015096 10529908 10656777
$$ packed form
38055A6527796n02157p56433q26899o58925m04850k11515q2124O6873K53975L65494
38045A3771235K96067J43032J11083J77495P6966k36039l77423o7547L60624L90054
38035A4645547R9167J2464K06116J32786m89064j109558j006128k09017N55138
38026A2837451O86929K45124k40997l23716n3552J18289o9087l04553j58504K10375
38016A2947759K27802k20679n81940m42745q1230J8522j91907m28931m97723l72555
38006A0376373j33153J2665p6226j90347n4418J15428r1979m06894r5232P40042
37996A0196259J008344K50238n46166m54266j0785j52093n78609m05634J57246
37987I464534J72642l05697l25854K32390M61324Q7694q0136L08199N14812J26869
$$ plain form
37977 10656777 10476868 10519777 10653435 10246080 9409770 9042083 9457797 9917410 9799514
37968 9799514 9394341 9170973 9040083 8815533 8747238 9065272 9508919 9794894 10069997 10402760
37958 10402760 10325028 9519259 8594666 8452730 9040317 9424994 9101885 8586101 8562911 8992217
37948 8992217 9344088 9360707 9247898 9282898 9518192 9826130 10035030 10014760 9768261 9476727
37938 9476727 9364898 9473877 9625107 9645238 9540229 9368390 9067349 8622851 8358282 8729834
37928 8729834 9706806 10639487 10961606 10797914 10633434 10628398 10611898 10557338 10609446 10706397
37918 10706397 10637932 10512750 10729913 11375334 12044137 12428888 12729328 13251104 13876857
37909 13876857 14209082 14103714 13867470 13987468 14731835 15909400 16991695 17595571 17842155
$$ packed form
37977A0656777j79909M2909J33658m07355q36310l67687M15714M59613j17896
37968I799514m05173k23368j30890k24550o8295L18034M43647K85975K75103L32763
37958A0402760p7732q05769r24593j41936N87587L84677l23109n15784k3190M29306
37948H992217L51871J6619j12809L5000K35294L07938K08900k0270k46499k91534
37938I476727j11829J08979J51230K0131j05009j71839l01041m44498k64569L71552
37928H729834R76972R32681L22119j63692j64480n036j6500n4560N2108R6951
37918A0706397o8465j25182K17163O45421O68803L84751L00440N21776O25753
37909A3876857L32225j05368k36244J19998P44367J177565J082295O03876K46584
$$ plain form
37900 17842155 18112963 18537622 18941391 19213827 19435977 19668579 19895185 20159968 20520180
37891 20520180 20942403 21487566 22389316 23589007 24498688 24818575 25326815 27015366 29480266
37882 29480266 31094113 30959412 29814651 28751917 28012198 27526627 27666829 28668436 30043525
37873 30043525 31415967 33351548 36448763 40046056 42773716 44103027 44429981 43835212
37865 43835212 41797034 38263694 34186345 30683099 28129212 26188155 24342692 22346327
37857 22346327 20469445 19251713 18772482 18421793 17714097 16924586 16441167 15976698 15139406
37848 15139406 14351167 14280314 14627572 14482549 13779410 13345812 13452973 13390580 12738196 12074762
37838 12074762 12023086 12412426 12803407 13106244 13267817 13048353 12552550 12347950 12627964
$$ packed form
37900A7842155K70808M24659M03769K72436K22150K32602K26606K64783L60212
37891B0520180M22223N45163R01750J199691R09681L19887N08240J688551K464900
37882B9480266J613847j34701j144761j062734p39719m85571J40202J001607J375089
37873C0043525J372442J935581L097215L597293K727660J329311L26954n94769
37865D3835212k038178l533340m077349l503246k553887j941057j845463j996365
37857B2346327j876882j217732m79231l50689p07696p89511m83419m64469q37292
37848A5139406p88239p0853L47258j45023p03139m33598J07161o2393o52384o63434
37838A2074762n1676L89340L90981L02837J61573k19464m95803k04600K80014
$$ plain form
37829 12627964 12867733 12722989 12623541 12986183 13453571 13478641 13148972 12879364 12756667 12732586
37819 12732586 13014782 13694162 14361643 14622203 14631130 14662890 14606104 14413905 14546423 15281575
37809 15281575 15996407 15882469 15088453 14436915 14269972 14315135 14453533 14789168 15066191
37800 15066191 14855771 14348483 14210417 14601325 15056488 15385124 15881844 16485688 16570795
37791 16570795 15941649 15324118 15402140 15937088 16314811 16450903 16625587 16864204 17087377
37782 17087377 17565180 18591651 19875849 20839887 21423503 22030585 22747135 23256137 23610194
37773 23610194 24420911 25976058 27707630 28957358 29858907 30972309 32355236 33564628
37765 33564628 34394858 34996307 35326158 35166399 34806271 35019262 36033201 37090022 37439086
$$ packed form
37829A2627964K39769j44744r9448L62642M67388K5070l29669k69608j22697k4081
37819A2732586K82196O79380O67481K60560Q927L1760n6786j92199J32518P35152
37809A5281575P14832j13938p94016o51538j66943M5163J38398L35635K77023
37800A5066191k10420n07288j38066L90908M55163L28636M96720O03844Q5107
37791A6570795o29146o17531P8022N34948L77723J36092J74684K38617K23173
37782A7087377M77803J026471J284198R64038N83616O07082P16550N09002L54057
37773B3610194Q10717J555147J731572J249728R01549J113402J382927J209392
37765C3564628Q30230O01449L29851j59759l60128K12991J013939J056821L49064
$$ plain form
37756 37439086 37262122 37122646 36989876 36489065 35797730 35517578 35744711 35954346 35796269
37747 35796269 35364391 34665768 33500276 31999561 30677649 29772110 29059861 28423333 27988795
37738 27988795 27568249 26665977 25323297 24294466 24018280 24030260 23794797 23484235 23411235
37729 23411235 23274125 22627208 21699414 21107453 21032451 21211784 21447521 21607280 21455626
37720 21455626 21053536 21004283 21678890 22484329 22582620 22096912 21844313 22028407 22067374 21772488
37710 21772488 21811844 22660700 23772351 24280084 24101439 23858225 23926490 24035768 23813544
37701 23813544 23379236 23206075 23513612 24032396 24425649 24680597 24839137 24615013 23800273
37692 23800273 22954644 22999215 23961139 24808706 24860959 24676144 25040997 25728711 25968583 25670392
$$ packed form
37756C7439086j76964j39476j32770n00811o91335k80152K27133K09635j58077
37747C5796269m31878o98623j165492j500715j321912r05539p12249o36528m34538
37738B7988795m20546r02272j342680j028831k76186J1980k35463l10562p3000
37729B3411235j37110o46917r27794n91961p5002J79333K35737J59759j51654
37720B1455626m02090m9253O74607Q05439R8291m85708k52599J84094L8967k94886
37710B1772488L9356Q48856J111651N07733j78645k43214O8265J09278k22224
37701B3813544m34308j73161L07537N18784L93253K54948J58540k24124q14740
37692B3800273q45629M4571R61924Q47567N2253j84815L64853O87714K39872k98191
$$ plain form
37682 25670392 25388444 25366115 25398984 25488322 25905828 26659129 27472761 28209722 28812436 29044652
37672 29044652 28868239 28815104 29308590 29864036 29736617 29154106 29010511 29417725 29523122
37663 29523122 28857082 27934455 27301065 26853288 26424356 26242946 26366797 26302064 25652617
37654 25652617 24680148 23847929 23212525 22562016 21784048 20876222 19952370 19357658 19345727
37645 19345727 19562028 19368830 18783714 18504478 18844316 19274377 19267830 18979704 18773885 18646994
37635 18646994 18484158 18396391 18459483 18546408 18681451 19089714 19648922 19816260 19388225 18819145
37625 18819145 18507666 18320885 18122858 18154156 18482975 18673501 18477681 18328257 18647308
37616 18647308 19144460 19295234 19064358 18682330 18182867 17663457 17505245 17762613 17809616
$$ packed form
37682B5670392k81948k2329L2869Q9338M17506P53301Q13632P36961O02714K32216
37672B9044652j76413n3135M93486N55446j27419n82511j43595M07214J05397
37663B9523122o66040r22627o33390m47777m28932j81410J23851o4733o49447
37654B5652617r72469q32219o35404o50509p77968r07826r23852n94712j1931
37645A9345727K16301j93198n85116k79236L39838M30061o547k88126k05819j26891
37635A8646994j62836q7767O3092Q6925J35043M08263N59208J67338m28035n69080
37625A8819145l11479j86781j98027L1298L28819J90526j95820j49424L19051
37616A8647308M97152J50774k30876l82028m99463n19410j58212K57368M7003
$$ plain form
37607 17809616 17221252 16560823 16589393 17070775 17133184 16558912 15929643 15629096 15461954 15242591
37597 15242591 15068553 14930480 14633520 14242243 14160940 14639444 15483303 16266178 16603201
37588 16603201 16353327 15858336 15810082 16509211 17400162 17716484 17441183 17238971 17575812
37579 17575812 18305119 19012699 19398326 19430795 19451550 19940191 20843389 21418292 21180035 20689265
37569 20689265 20811075 21442452 21691555 21226254 20692690 20706007 21091404 21313824 21108338
37560 21108338 20490279 19650043 19068502 19276268 20208524 21131954 21443680 21246265 20956922
37551 20956922 20716006 20477653 20401528 20761420 21514146 22222027 22460219 22223204 21927530
37542 21927530 22036094 22657087 23506190 24235716 24700109 24903973 24899224 24829983 24858290 24905943
$$ packed form
37607A7809616n88364o60429K8570M81382O2409n74272o29269l00547j67142k19363
37597A5242591j74038j38073k96960l91277q1303M78504Q43859P82875L37023
37588A6603201k49874m94991m8254O99129Q90951L16322k75301k02212L36841
37579A7575812P29307P07580L85627L2469K0755M88641R03198N74903k38257m90770
37569B0689265J21810O31377K49103m65301n33564J3317L85397K22420k05486
37560B1108338o18059q40236n81541K07766R32256R23430L11726j97415k89343
37551B0956922k40916k38353p6125L59892P52726P07881K38192k37015k95674
37542B1927530J08564O20993Q49103P29526M64393K03864m749o9241K8307M7653
$$ plain form
37532 24905943 24720324 24374453 24374658 24949265 25527479 25372723 24541448 23717930 23208037 22664869
37522 22664869 21878257 21293478 21452885 22211938 22806783 22644723 21899000 21311945 21409087
37513 21409087 21945781 22254372 22070556 21692165 21305941 20686195 19818402 19243498 19263642
37504 19263642 19285923 18639803 17681636 17260713 17300386 16864717 15674337 14604244 14396903
37495 14396903 14716086 14897855 14919793 15088307 15335818 15423692 15429316 15465928 15276733 14707126
37485 14707126 14284329 14631647 15427357 15654730 14958426 14110583 13904681 14139898 14083801
37476 14083801 13545650 13003558 12854005 13025051 13321658 13708134 14113756 14316851 14249349
37467 14249349 14164096 14256760 14331302 14107333 13660129 13230343 12783377 12183227 11680817 11698586
$$ packed form
37532B4905943j85619l45871K05N74607N78214j54756q31275q23518n09893n43168
37522B2664869p86612n84779J59407P59053N94845j62060p45723n87055R7142
37513B1409087N36694L08591j83816l78391l86224o19746q67793n74904K0144
37504A9263642K2281o46120r58167m20923L9673m35669j190380j070093k07341
37495A4396903L19183J81769K1938J68514K47511Q7874N624L6612j89195n69607
37485A4707126m22797L47318P95710K27373o96304q47843k05902K35217n6097
37476A4083801n38151n42092j49553J71046K96607L86476M05622K03095o7502
37467A4249349q5253R2664P4542k23969m47204m29786m46966o00150n02410J7769
$$ plain form
37457 11698586 12116445 12338036 12215211 12338175 13107848 14030272 14373746 14163416 14038645
37448 14038645 14341425 14804351 15040856 14960448 14712811 14474476 14298023 14098837 13901693
37439 13901693 14048619 14799272 15695791 15870863 15217680 14682643 15010440 15752665 16040413
37430 16040413 15816107 15614250 15523133 15178342 14610298 14315944 14487364 14808446 15044472
37421 15044472 15267346 15460661 15440508 15266585 15290887 15681257 16193561 16439670 16160004 15343215
37411 15343215 14315324 13522294 13003093 12403728 11758852 11703697 12414778 12947817 12411287
37402 12411287 11335068 10951245 11437559 11895386 11912494 12061328 12764560 13650469 14267330
37393 14267330 14651599 14983214 15340704 15892785 16693384 17331819 17530741 17960864 19485492
$$ packed form
37457A1698586M17859K21591j22825J22964P69673R22424L43474k10330j24771
37448A4038645L02780M62926K36505q0408k47637k38335j76453j99186j97144
37439A3901693J46926P50653Q96519J75072o53183n35037L27797P42225K87748
37430A6040413k24306k01857r1117l44791n68044k94354J71420L21082K36026
37421A5044472K22874J93315k0153j73923K4302L90370N12304K46109k79666q16789
37411A5343215j027891p93030n19201n99365o44876n5155P11081N33039n36530
37402A2411287j076219l83823M86314M57827J7108J48834P03232Q85909O16861
37393A4267330L84269L31615L57490N52081Q00599O38435J98922M30123J524628
$$ plain form
37384 19485492 21590073 22641376 21900342 20260671 18782370 17602216 16651023 16290445
37376 16290445 16601728 16956922 16938734 16949710 17419747 18194259 19153150 20552567 22255300
37367 22255300 23587110 24561871 26208864 28844892 30962348 30857591 28681675 25939732
37359 25939732 23615887 21763105 20321471 19239173 18166753 16990922 16321195 16606757
37351 16606757 17244341 17481603 17677155 18554528 19623336 19609086 18307225 16813804 15903997
37342 15903997 15277926 14504282 13668971 12874281 11983957 11092511 10501130 10110871 9600446
37333 9600446 9254234 9712516 10728593 11124642 10358590 9299143 8958194 9169424 9117355
37324 9117355 8639352 8326705 8564391 9020943 9102958 8653242 8147851 8193949 8775378 9181571
$$ packed form
37384A9485492K104581J051303p41034j639671j478301j180154r51193l60578
37376A6290445L11283L55194j8188J0976M70037P74512R58891J399417J702733
37367B2255300J331810R74761J646993K636028K117456j04757k175916k741943
37359B5939732k323845j852782j441634j082298j072420j175831o69727K85562
37351A6606757O37584K37262J95552Q77373J068808j4250j301861j493421r09807
37342A5903997o26071p73644q35311p94690q90324q91446n91381l90259n10425
37333I600446l46212M58282J016077L96049p66052j059447l40949K11230n2069
37324I117355m78003l12647K37686M56552Q2015m49716n05391M6098N81429M06193
$$ plain form
37314 9181571 8920615 8439075 8489374 9009118 9257692 8978604 8701165 8794675 8951771 8884587
37304 8884587 8888863 9294375 9823465 9955499 9643572 9280251 9139188 9173947 9263413 9410131
37294 9410131 9719538 10280647 11021443 11680633 12014818 11997036 11733759 11335390 10999243 10966685
37284 10966685 11151705 11099592 10652881 10339964 10663007 11345264 11845788 12242774 12844117
37275 12844117 13254348 12848630 12068203 12094692 13069834 13797758 13609966 13369964 13957320
37266 13957320 14816915 14968250 14630299 14714277 15242937 15471659 15315900 15458886 16028126
37257 16028126 16283474 15878745 15474900 15680424 16174479 16410894 16546217 17016465 17636795
37248 17636795 17851377 17684924 17746109 18271394 18797476 18982076 19216635 20029994 21198247
$$ packed form
37314I181571k60956m81540N0299N19744K48574k79088k77439R3510J57096o7184
37304H884587M276M05512N29090J32034l11927l63321j41063L4759Q9466J46718
37294I410131L09407N61109P40796O59190L34185j7782k63277l98369l36147l2558
37284A0966685J85020n2113m46711l12917L23043O82257N00524L96986O01343
37275A2844117M10231m05718p80427K6489R75142P27924j87792k40002N87356
37266A3957320Q59595J51335l37951Q3978N28660K28722j55759J42986N69240
37257A6028126K55348m04729m03845K05524M94055K36415J35323M70248O20330
37248A7636795K14582j66453O1185N25285N26082J84600K34559Q13359J168253
$$ plain form
37239 21198247 21903433 21683123 20848539 19994999 19478392 19419632 19803759 20345731 20566022
37230 20566022 20303141 19983613 20135329 20778712 21505721 21950818 21919411 21310436 20335378
37221 20335378 19654268 19797403 20474694 20907531 20825400 20631461 20569733 20368888 19930105 19735942
37211 19735942 20149581 20803711 21192013 21444466 21889779 22170757 21595099 20311793 19326045
37202 19326045 19150471 19176284 18753659 18199958 18094617 18095717 17364129 16010381 15151347 15304886
37192 15304886 15592075 15046910 14014732 13478223 13441822 12948208 11636394 10344916 9892604
37183 9892604 10004995 9895517 9361805 8776276 8353344 7984199 7639079 7463866 7508084 7663307
37173 7663307 7814606 7827871 7521585 6912978 6370268 6247437 6450003 6600989 6556632 6524896
$$ packed form
37239B1198247P05186k20310q34584q53540n16607n8760L84127N41972K20291
37230B0566022k62881l19528J51716O43383P27009M45097l1407o08975r75058
37221B0335378o81110J43135O77291M32837q2131j93939o1728k00845m38783j94163
37211A9735942M13639O54130L88302K52453M45313K80978n75658j283306r85748
37202A9326045j75574K5813m22625n53701j05341J100p31588j353748q59034J53539
37192A5304886K87189n45165j032178n36509l6401m93614j311814j291478m52312
37183I892604J12391j09478n33712n85529m22932l69145l45120j75213M4218J55223
37173G663307J51299J3265l06286o08607n42710j22831K02566J50986m4357l1736
$$ plain form
37163 6524896 6705463 6975392 6931575 6252843 5160207 4431121 4605825 5211876 5298342 4805196
37153 4805196 4680815 5327413 5760264 5014720 3728112 3354329 4155683 4999706 5064695
37144 5064695 4750487 4735051 4991800 5090498 4847941 4322182 3612725 2975882 2809274 3276643
37134 3276643 4142009 5030213 5624001 5677691 5193206 4552327 4142215 3924061 3672206 3407393
37124 3407393 3172477 2708259 1968029 1626271 2255369 3231880 3446726 2998872 3041807 3854638
37114 3854638 4342610 3855627 3219448 3222134 3233599 2390816 1289699 1236824 2274005 3161155
37104 3161155 3164974 2783346 2671704 2830016 3061959 3413559 3795698 3781592 3198051 2520507
37094 2520507 2289385 2395194 2328813 2010743 1950530 2471908 3113960 3156400 2633083 2339864
$$ packed form
37163F524896J80567K69929m3817o78732j092636p29086J74704O06051Q6466m93146
37153D805196j24381O46598M32851p45544j286608l73783Q01354Q44023O4989
37144E064695l14208j5436K56749R8698k42557n25759p09457o36843j66608M67369
37134C276643Q65366Q88204N93788N3690m84485o40879m10112k18154k51855k64813
37124C407393k34916m64218p40230l41758O29098R76511K14846m47854M2935Q12831
37114C854638M87972m86983o36179K686J1465q42783j101117n2875J037181Q87150
37104C161155L819l81628j11642J58312K31943L51600L82139j4106n83541o77544
37094B520507k31122J05809o6381l18070o0213N21378O42052M2440n23317k93219
$$ plain form
37084 2339864 2678509 3016596 2637623 1867955 1556168 1733883 1700395 1349046 1344658 1780096
37074 1780096 1781000 990799 420490 991650 2064708 2432239 2159320 2266685 2924566 3220583
37064 3220583 2748412 2265870 2445090 2900676 2948835 2639943 2481675 2603156 2742381 2787807
37054 2787807 2837790 2844726 2609457 2125753 1650460 1406170 1404180 1564702 1817641 2037652
37044 2037652 2075152 1989268 2102185 2599139 3142441 3178562 2676059 2237486 2323976 2690291
37034 2690291 2832834 2674124 2464708 2322133 2303970 2642247 3357011 3865537 3586979 2766898
37024 2766898 2081709 1648302 1182226 899217 1254010 1849604 1757532 1074846 951618 1717142
37014 1717142 2236964 1735548 1030716 1098008 1513740 1397308 990934 1096928 1620825 1894136
$$ packed form
37084B339864L38645L38087l78973p69668l11787J77715l3488l51349m388M35438
37074A780096R04p90201n70309N71160J073058L67531k72919J07365O57881K96017
37064C220583m72171m82542J79220M55586M8159l08892j58268J21481J39225M5426
37054B787807M9983O936k35269m83704m75293k44290j990J60522K52939K20011
37044B037652L7500q5884J12917M96954N43302L6121n02503m38573Q6490L66315
37034B690291J42543j58710k09416j42575j8163L38277P14764N08526k78558q20081
37024B766898o85189m33407m66076k83009L54793N95594r2072o82686j23228P65524
37014A717142N19822n01416p04832O7292M15732j16432m06374J05994N23897K73311
$$ plain form
37004 1894136 1935274 2179581 2348378 1818874 895118 537782 927482 1357234 1468902 1559395
36994 1559395 1700120 1582108 1285899 1261539 1471495 1412113 1010258 660507 418414 67661
36984 67661 -67781 587850 1701679 2209372 1819270 1331443 1253252 1135768 608641 74317
36974 74317 -64813 1234 94061 417576 899816 969409 458271 3022 108560 503790
36964 503790 810982 1106734 1407644 1381513 1033776 892988 1024907 728392 -158436 -540273
36954 -540273 472475 2078744 2742366 2170166 1391766 1183016 1351659 1480880 1532653
36945 1532653 1603878 1664485 1669810 1602447 1405502 1110960 924472 983708 1202402 1488990
36935 1488990 1850001 2168259 2254900 2241271 2461212 2824413 2874790 2616596 2572172 2777621
$$ packed form
37004A894136M1138K44307J68797n29504r23756l57336L89700M29752J11668R0493
36994A559395J40725j18012k96209k4360K09956n9382m01855l49751k42093l50753
36984F7661j35442O55631J113829N07693l90102m87827p8191j17484n27127n34324
36974G4317j39130O6047R2827L23515M82240O9593n11138m55249J05538L95230
36964E03790L07192K95752L00910k6131l47737j40788J31919k96515q86828l81837
36954e40273J012748J606269O63622n72200p78400k08750J68643J29221N1773
36945A532653P1225O0607N325o7363j96945k94542j86488N9236K18694K86588
36935A488990L61011L18258Q6641j3629K19941L63201N0377k58194m4424K05449
$$ plain form
36925 2777621 2566341 1783416 1332250 1869784 2759294 3070453 2866658 2649472 2270549
36916 2270549 1451143 793129 1084802 1948591 2321110 2034857 1791240 1746327 1354216 643984
36906 643984 444095 1081711 1889572 2312098 2556656 2791232 2624845 1927501 1426521 1842507
36896 1842507 2874643 3569743 3416136 2708836 2084419 1977615 2328992 2627735 2400840
36887 2400840 1734821 1147968 995968 1238467 1666734 2027801 2044437 1682768 1291749 1161042
36877 1161042 1172370 1233005 1628826 2388097 2784151 2290079 1614113 1773284 2454308 2509886
36867 2509886 1933683 1929568 2871524 3667217 3599719 3374159 3620501 3699189 2989798 2229163
36857 2229163 2366770 2927887 2761227 1835416 1105722 1015611 1251503 1656066 2282056 2757943
$$ packed form
36925B777621k11280p82925m51166N37534Q89510L11159k03795k17186l78923
36916B270549q19406o58014K91673Q63789L72519k86253k43617m4913l92111p10232
36906F43984j99889O37616Q07861M22526K44558K34576j66387o97344n00980M15986
36896A842507J032136O95100j53607p07300o24417j06804L51377K98743k26895
36887B400840o66019n86853j52000K42499M28267L61067J6636l61669l91019j30707
36877A161042J1328O0635L95821P59271L96054m94072o75966J59171O81024N5578
36867B509886n76203m115R41956P95693o7498k25560K46342P8688p09391p60635
36857B229163J37607N61117j66660r25811p29694r0111K35892M04563O25990M75887
$$ plain form
36847 2757943 2661211 2397925 2716925 3437896 3643201 3106584 2566079 2534817 2774467 3040433
36837 3040433 3417630 3737931 3562669 3018640 2850108 3346874 3953581 4207266 4305308 4435362
36827 4435362 4319441 3842855 3439606 3398700 3417489 3291598 3420055 4126116 5059689 5787705
36817 5787705 6411726 7077777 7483367 7488223 7603714 8134603 8404092 7718871 6646782 6331519
36807 6331519 6836076 7226254 7131867 7072023 7182210 6811940 5740475 4764972 4576292 4893869
36797 4893869 5223265 5650640 6272541 6605798 6319968 5931181 5976366 6074770 5701645 5352081
36787 5352081 5819683 6668685 6727131 6054972 6019577 7070688 7803430 7002035 5497870
36778 5497870 4930830 5452334 5889845 5735222 5625798 5906718 6026323 5699457 5560104
$$ packed form
36847B757943r6732k63286L19000P20971K05305n36617n40505l1262K39650K65966
36837C040433L77197L20301j75262n44029j68532M96766O06707K53685R8042J30054
36827D435362j15921m76586m03249m0906J8789j25891J28457P06061R33573P28016
36817E787705O24021O66051M05590M856J15491N30889K69489o85221j072089l15263
36807F331519N04557L90178r4387n9844J10187l70270j071465r75503j88680L17577
36797D893869L29396M27375O21901L33257k85830l88787M5185R8404l73125l49564
36787E352081M67602Q49002N8446o72159l5395J051111P32742q01395j504165
36778E497870n67040N21504M37511j54623j09424K80920J19605l26866j39353
$$ plain form
36769 5560104 6047187 6498040 6120192 5263505 4872325 5044430 5054095 4694452 4651814 5325852
36759 5325852 6081531 6159942 5791963 5803539 6387085 6878842 6730991 6182450 5820493 5865424
36749 5865424 6125538 6400003 6633264 6776996 6763185 6623061 6467122 6333609 6172167 5957356
36739 5957356 5692268 5340712 4930892 4697014 4868935 5273109 5425840 5168582 4927969
36730 4927969 5099592 5437608 5426948 5074909 4851265 4899234 4862899 4613498 4571176 4986331
36720 4986331 5402789 5322267 5030767 5152598 5586285 5578824 4877452 4138190 3980549 4212717
36710 4212717 4322616 4239802 4157667 3979177 3499925 2949980 2787733 2987307 3040680 2726313
36700 2726313 2400581 2381681 2491270 2460128 2403577 2531871 2667647 2506364 2236989 2402700
$$ packed form
36769E560104M87083M50853l77848q56687l91180J72105R665l59643m2638O74038
36759E325852P55679P8411l67979J1576N83546M91757j47851n48541l61957M4931
36749E865424K60114K74465K33261J43732j3811j40124j55939j33513j61442k14811
36739E957356k65088l51556m09820k33878J71921M04174J52731k57258k40613
36730D927969J71623L38016j0660l52039k23644M7969l6335k49401m2322M15155
36720D986331M16458q0522k91500J21831M33687p461p01372p39262j57641K32168
36710D212717J09899q2814q2135j78490m79252n49945j62247J99574N3373l14367
36700B726313l25732j8900J09589l1142n6551J28294J35776j61283k69375J65711
$$ plain form
36690 2402700 3047802 3441010 2953596 1973783 1552801 2141303 3021929 3176811 2484089
36681 2484089 1745266 1612534 1895904 2073206 2082886 2196391 2315696 1979966 1179602 649231
36671 649231 1008638 1930755 2561634 2575978 2379630 2339836 2302652 2007053 1587818 1399635
36661 1399635 1555648 1893315 2263798 2592781 2703726 2362804 1613376 904395 706282
36652 706282 1015881 1387832 1499912 1524671 1777985 2130634 2097394 1562352 1057362 1086172
36642 1086172 1460451 1649210 1567123 1564912 1742413 1795763 1600354 1436007 1467532 1482347
36632 1482347 1394383 1531128 2031654 2365049 1964820 1094536 546234 611137 877220 984165
36622 984165 1011428 1044376 906951 564666 378238 655849 1220745 1680095 1902434 1983023
$$ packed form
36690B402700O45102L93208m87414r79813m20982N88502Q80626J54882o92722
36681B484089p38823j32732K83370J77302R680J13505J19305l35730q00364n30371
36671F49231L59407R22117O30879J4344j96348l9794l7184k95599m19235j88183
36661A399635J56013L37667L70483L28983J10945l40922p49428p08981j98113
36652G06282L09599L71951J12080K4759K53314L52649l3240n35042n04990K8810
36642A086172L74279J88759q2087k211J77501N3350j95409j64347L1525J4815
36632A482347q7964J36745N00526L33395m00229q70284n48302O4903K66083J06945
36622I84165K7263L2948j37425l42285j86428K77611N64896M59350K22339Q0589
$$ plain form
36612 1983023 1938886 1746061 1592057 1782054 2312438 2703380 2415569 1483099 653905 707223
36602 707223 1550759 2226059 2021403 1321096 967652 1025345 817867 161738 -228550 143267
36592 143267 762170 950299 908664 1213833 1722829 1833142 1613148 1751401 2349326 2652031
36582 2652031 2223891 1601421 1385587 1377064 1137308 833956 879389 1129254 1141233 992570
36572 992570 1122963 1458660 1433246 978874 801097 1361955 2131894 2283913 1785795 1344620
36562 1344620 1436513 1814742 1955684 1659365 1148804 799015 843261 1203619 1548041 1594617
36552 1594617 1373295 1119866 958642 834373 752272 886052 1320919 1803932 1936505 1634374
36542 1634374 1263454 1240976 1577198 1906994 1921122 1627967 1204992 798900 570700 722281
$$ packed form
36612A983023m4137j92825j54004J89997N30384L90942k87811r32470q29194N3318
36602G07223Q43536O75300k04656p00307l53444N7693k07478o56129l90288L71817
36592A43267O18903J88129m1635L05169N08996J10313k19994J38253N97925L02705
36582B652031m28140o22470k15834q523k39756l03352M5433K49865J1979j48663
36572I92570J30393L35697k5414m54372j77777N60858P69939J52019m98118m41175
36562A344620R1893L78229J40942k96319n10561l49789M4246L60358L44422M6576
36552A594617k21322k53429j61224j24269q2101J33780M34867M83013J32573l02131
36542A634374l70920k2478L36222L29796J4128k93155m22975m06092k28200J51581
$$ plain form
36532 722281 1232133 1678475 1638541 1268047 1168244 1595198 2133702 2341302 2381616 2677563
36522 2677563 3169986 3371954 3096161 2675483 2388655 2085887 1581439 1082639 942950
36513 942950 1186846 1545178 1824020 1983405 1957645 1692348 1360456 1290360 1595767 2021775
36503 2021775 2228051 2134163 1938991 1868962 1961126 2084429 2149085 2235090 2443407 2685633
36493 2685633 2790953 2797349 2883447 2969792 2731840 2188348 1899037 2218744 2670266 2564323
36483 2564323 2043556 1892906 2349005 2771742 2650958 2273583 2045102 1745230 1009392
36474 1009392 153710 -121394 297783 821683 984939 916639 941576 1118746 1296984 1357134
36464 1357134 1298666 1240005 1305202 1352266 977699 101073 -610542 -364832 716656 1650241
$$ packed form
36532G22281N09852M46342l9934l70494r9803M26954N38504K07600M0314K95947
36522B677563M92423K01968k75793m20678k86828l02768n04448m98800j39689
36513I42950K43896L58332K78842J59385k5760k65297l31892p0096L05407M26008
36503B021775K06276r3888j95172p0029R2164J23303O4656Q6005K08317K42226
36493B685633J05320O396Q6098Q6345k37952n43492k89311L19707M51522j05943
36483B564323n20767j50650M56099M22737j20784l77375k28481k99872p35838
36474A009392q55682k75104M19177N23900J63256o8300K4937J77170J78238O0150
36464A357134n8468n8661O5197M7064l74567q76626p11615K45710J081488R33585
$$ plain form
36454 1650241 1764648 1364871 1080063 1055404 1108351 1248275 1547292 1719269 1350584 554608
36444 554608 -3265 149106 765594 1218574 1187567 862265 539458 218392 -277112 -863736
36434 -863736 -1158957 -1009455 -801782 -940566 -1208754 -1108280 -772276 -939145 -1835182 -2649352
36424 -2649352 -2506008 -1539591 -564036 -33755 146549 74814 -226123 -436603 -153361 437935
36414 437935 668836 325306 -35512 75197 419419 545756 527801 730167 1121285 1328683
36404 1328683 1252882 1141265 1085812 938203 787912 1000534 1545990 1787469 1374668 950480
$$ packed form
36454A650241J14407l99777k84808k4659N2947J39924K99017J71977l68685p95976
36444E54608n57873J52371O16488M52980l1007l25302l22807l21066m95504n86624
36434h63736k95221J49502K07673j38784k68188J00474L36004j66869q96037q14170
36424b649352J43344R66417R75555N30281J80304p1735l00937k10480K83242N91296
36414D37935K30901l43530l60818J10709L44222J26337j7955K02366L91118K07398
36404A328683p5801j11617n5453j47609j50291K12622N45456K41479m12801m24188
$$ [...]
##END NTUPLES=NMR SPECTRUM
##END=
