##TITLE=31Pdec_SR104_4
 , 124 sc
 17.2.2022
##JCAMPDX= 6.0         $$ Bruker NMR JCAMP-DX V2.0
##DATA TYPE= NMR SPECTRUM
##DATA CLASS= NTUPLES
##ORIGIN= UXNMR, Bruker Analytische Messtechnik GmbH
##OWNER= root
$$ XWIN-NMR		Version 3.5
$$ Thu Feb 17 13:41:01 2022 Russian Standard Time (UT+4h)  she@DPX200
##.OBSERVE FREQUENCY= 81.013821
##.OBSERVE NUCLEUS= ^31P
##.ACQUISITION MODE= SIMULTANEOUS
##.ACQUISITION SCHEME= undefined
##.AVERAGES= 124
##.DIGITISER RES= 16
##SPECTROMETER/DATA SYSTEM= spect
##.PULSE SEQUENCE= zgpg30
##.SOLVENT NAME= CDCl3
##.SHIFT REFERENCE= (INTERNAL, CDCl3, 0, 248.564)
##AUDIT TRAIL= $$ (NUMBER, WHEN, WHO, WHERE, WHAT)
$$ ##TITLE= Audit trail, XWIN-NMR		Version 3.5
$$ ##JCAMPDX= 5.01
$$ ##ORIGIN= Bruker BioSpin GmbH
$$ ##OWNER= she
$$ F:/spectra/data/she/nmr/P31/1/pdata/1/auditp.txt
$$ ##AUDIT TRAIL=  $$ (NUMBER, WHEN, WHO, WHERE, WHAT)
(   1,<2022-02-17 13:40:00.46 +0400>,<she>,<DPX200>,
      <created by zg, POWCHK disabled, PULCHK disabled
       configuration hash MD5:
       00 E9 B6 7A A2 85 ED C7 34 08 36 98 17 FE 4E 26
       data hash MD5: 32K
       21 2F 88 12 91 EF EF F8 A7 21 0F EB 0A 04 3E 32>)
(   2,<2022-02-17 13:40:02.79 +0400>,<she>,<DPX200>,
      <Start of raw data processing
       efp BC_mod = 2 LB = 1 FT_mod = 6 PKNL = 1 PHC0 = -9185.939 PHC1 = 108.0745 SI = 64K 
       data hash MD5: 64K
       38 67 2E 69 09 33 60 00 E7 F1 EF 10 43 19 EA 56>)
(   3,<2022-02-17 13:40:32.96 +0400>,<she>,<DPX200>,
      <pk PHC0 = -2.102885 PHC1 = -7.999998 
       data hash MD5: 64K
       CD 42 B7 92 6D 9D F3 78 8B 69 20 0E E6 DD 46 B2>)
(   4,<2022-02-17 13:40:36.53 +0400>,<she>,<DPX200>,
      <abs ABSG = 5 
       data hash MD5: 64K
       AA 24 B3 EC E1 C7 1B 31 95 C5 B4 58 86 B5 B6 F4>)
$$ ##END=
$$ 
$$ hash MD5
$$ 82 89 89 B1 78 82 1C 44 80 7E B7 76 04 58 1D 3B
##$RELAX= 
##$RELAX= 
##$RELAX= 
##$RELAX= 
##$RELAX= 
##$RELAX= 
##$RELAX= 
##$RELAX= 
$$ Bruker specific parameters
$$ --------------------------
##$DU= <F:/spectra>
##$EXPNO= 1
##$NAME= <P31>
##$PROCNO= 1
##$TYPE= <nmr>
##$USER= <she>
##$AMP= (0..31)
100 100 100 100 100 100 100 100 100 100 100 100 100 100 100 100 100 100 
100 100 100 100 100 100 100 100 100 100 100 100 100 100 
##$AQSEQ= 0
##$AQ_mod= 1
##$AUNM= <au_zg>
##$AUTOPOS= <>
##$BF1= 81.014009
##$BF2= 200.13
##$BF3= 200.13
##$BF4= 200.13
##$BF5= 200.13
##$BF6= 200.13
##$BF7= 200.13
##$BF8= 200.13
##$BYTORDA= 1
##$CFDGTYP= 0
##$CFRGTYP= 5
##$CHEMSTR= <none>
##$CNST= (0..31)
1 1 145 1 1 1 1 1 1 1 1 1 1 1 1 1 1 1 1 1 1 1 1 1 1 1 1 1 1 1 1 1 
##$CPDPRG= <waltz16>
##$CPDPRG1= <>
##$CPDPRG2= <waltz16>
##$CPDPRG3= <>
##$CPDPRG4= <mlev>
##$CPDPRG5= <mlev>
##$CPDPRG6= <mlev>
##$CPDPRG7= <mlev>
##$CPDPRG8= <mlev>
##$CPDPRGB= <>
##$CPDPRGT= <>
##$D= (0..31)
0 1 0 0 0 0 0 0 0 0 0 0.03 2e-05 3e-06 0 0 0 0 0 0 0 0 0 0 0 0 0 0 0 0 
0 0 
##$DATE= 1645090799
##$DBL= (0..7)
120 120 120 11 120 120 24 19 
##$DBP= (0..7)
150 150 150 150 150 150 150 150 
##$DBP07= 0
##$DBPNAM0= <>
##$DBPNAM1= <>
##$DBPNAM2= <>
$$ [...]
##$SUBNAM3= <"">
##$SUBNAM4= <"">
##$SUBNAM5= <"">
##$SUBNAM6= <"">
##$SUBNAM7= <"">
##$SUBNAM8= <"">
##$SUBNAM9= <"">
##$SW= 501.771253377433
##$SWIBOX= (0..15)
0 1 3 0 0 0 0 0 0 0 0 0 0 0 0 0 
##$SW_h= 40650.406504065
##$TD= 32768
##$TD0= 1
##$TE= 0
##$TE2= 300
##$TE3= 300
##$TEG= 300
##$TL= (0..7)
0 120 53 12 22 120 120 120 
##$TP= (0..7)
150 150 150 150 150 150 150 150 
##$TP07= 0
##$TPNAME0= <>
##$TPNAME1= <>
##$TPNAME2= <>
##$TPNAME3= <>
##$TPNAME4= <>
##$TPNAME5= <>
##$TPNAME6= <>
##$TPNAME7= <>
##$TPOAL= (0..7)
0.5 0.5 0.5 0.5 0.5 0.5 0.5 0.5 
##$TPOFFS= (0..7)
0 0 0 0 0 0 0 0 
##$TUNHIN= 0
##$TUNHOUT= 0
##$TUNXOUT= 0
##$USERA1= <user>
##$USERA2= <user>
##$USERA3= <user>
##$USERA4= <user>
##$USERA5= <user>
##$V9= 5
##$VALIST= <valist>
##$VCLIST= <CCCCCCCCCCCCCCC>
##$VD= 0
##$VDLIST= <DDDDDDDDDDDDDDD>
##$VPLIST= <PPPPPPPPPPPPPPP>
##$VTLIST= <TTTTTTTTTTTTTTT>
##$WBST= 1024
##$WBSW= 4
##$XGAIN= (0..3)
0 0 0 0 
##$XL= 0
##$YL= 0
##$YMAX_a= 86342
##$YMIN_a= -138606
##$ZGOPTNS= <>
##$ZL1= 120
##$ZL2= 120
##$ZL3= 120
##$ZL4= 120
##$ABSF1= 248.5645
##$ABSF2= -253.2056
##$ABSG= 5
##$ABSL= 3
##$ALPHA= 0
##$AQORDER= 0
##$ASSFAC= 0
##$ASSFACI= 0
##$ASSFACX= 0
##$ASSWID= 0
##$AUNMP= <proc_1d>
##$AZFE= 0.1
##$AZFW= 0.5
##$BCFW= 0
##$BC_mod= 2
##$BYTORDP= 0
##$COROFFS= 0
##$CY= -3
##$DATMOD= 1
##$DC= 0
##$DFILT= <>
##$DTYPP= 0
##$F1P= 0
##$F2P= 0
##$FCOR= 1
##$FTSIZE= 65536
##$FT_mod= 6
##$GAMMA= 0
##$GB= 0
##$INTBC= 1
##$INTSCL= 5.30512e-09
##$ISEN= 30
##$LB= 1
##$LEV0= 0
##$LPBIN= 0
##$MAXI= 10000
##$MC2= 0
##$MEAN= 0
##$ME_mod= 0
##$MI= 50
##$NCOEF= 0
##$NC_proc= -4
##$NLEV= 6
##$NOISF1= 182.463
##$NOISF2= 159.3651
##$NSP= 0
##$NTH_PI= 0
##$NZP= 0
##$OFFSET= 248.5645
##$PC= 4
##$PHC0= -9188.042
##$PHC1= 100.0745
##$PH_mod= 1
##$PKNL= yes
##$PPARMOD= 0
##$PSCAL= 0
##$PSIGN= 0
##$REVERSE= no
##$SF= 81.014009
##$SI= 65536
##$SIGF1= 159.3651
##$SIGF2= -187.1042
##$SINO= 113.3802
##$SIOLD= 16384
##$SREGLST= <1H.CDCl3>
##$SSB= 0
##$STSI= 65536
##$STSR= 0
##$SW_p= 40650.406504065
##$SYMM= 0
##$S_DEV= 0
##$TDeff= 32768
##$TDoff= 0
##$TI= <>
##$TILT= no
##$TM1= 0
##$TM2= 0
##$TOPLEV= 0
##$USERP1= <user>
##$USERP2= <user>
##$USERP3= <user>
##$USERP4= <user>
##$USERP5= <user>
##$WDW= 1
##$XDIM= 65536
##$YMAX_p= 329690623
##$YMIN_p= -20869404
$$ End of Bruker specific parameters
$$ ---------------------------------
##NTUPLES= NMR SPECTRUM
##VAR_NAME=  FREQUENCY,     SPECTRUM/REAL,   SPECTRUM/IMAG
##SYMBOL=    X,             R,               I
##VAR_TYPE=  INDEPENDENT,   DEPENDENT,       DEPENDENT
##VAR_FORM=  AFFN,          ASDF,            ASDF
##VAR_DIM=   65536,         65536,           65536
##UNITS=     HZ,            ARBITRARY UNITS, ARBITRARY UNITS
##FACTOR=    0.620285442955139, 1,           1
##FIRST=     20137.2065510759, 0,            0
##LAST=      -20513.1999529892, 0,           0
##MIN=       -20513.1999529892, -20869404,   0
##MAX=       20137.2065510759, 329690623,    0
$$ Real data points
##PAGE= N=1
##DATA TABLE= (X++(R..R)), XYDATA
$$ [...]
43519B559563n19502m06138N0876m2353o05723p38080k62067O8888j29041l84550
$$ 2559563 2040061 1633923 1684799 1642446 1036723 298643 36576 105464 -23577 -408127
43509d08127k75822K1110K18790K87377K45122R6643k6378n9189j56054l03902
$$ -408127 -683949 -662839 -444049 -156672 88450 185093 158715 99526 -56528 -360430
43499c60430k08591K4006k14973q28786o13619Q93904K080122J253144o85303
$$ -360430 -569021 -545015 -759988 -1588774 -2202393 -1308489 771633 2024777 1339474
43490A339474j344153k79788O20341K09828m96122m24280l7917l583O5331M91929
$$ 1339474 -4679 -284467 335874 545702 49580 -374700 -412617 -416200 -350869 141060
43480A41060N50132k63708j077949q88701p4564L58823K79132K11695L00342L69291
$$ 141060 691192 427484 -650465 -1539166 -1613730 -1254907 -975775 -764080 -463738 -94447
43470i4447M36076M34033N5389n15262n04654J70853M77876j01050n53693K2188
$$ -94447 341629 775662 831051 315789 -188865 -18012 459864 358814 -194879 -172691
43460a72691P95235N20488l59514m39916L64661Q22023M17376j11294k65983m26042
$$ -172691 622544 1143032 783518 343602 708263 1530286 1947662 1836368 1570385 1144343
43450A144343p72189p75298j62921N03865O26754L03637j8837j17957m1766P939
$$ 1144343 372154 -403144 -566065 -62200 564554 868191 849354 731397 689631 697570
43440F97570k11184o30216p37108k05897N24419P69657M90166J57257k5912j92806
$$ 697570 486386 -143830 -880938 -1086835 -562416 207241 697407 854664 828752 635946
43430F35946l11667k22250m0408M334k0524K9494q540k79987m98906l68575q3678
$$ 635946 324279 102029 61621 65955 45431 74925 66385 -213602 -712508 -1081083 -1164761
43419a164761Q1675K46136M43157K56663l64338n79708J39648Q97422N53620m98239
$$ -1164761 -1083086 -836950 -393793 -137130 -501468 -1081176 -941528 -44106 509514 11275
43409A1275r56148n82115k03827p9105K29557M98839O471q45038p40902L54053
$$ 11275 -944873 -1526988 -1730815 -1809920 -1580363 -1081524 -1075053 -1920091 -2660993 -2306940
43399b306940Q68604Q1778p07573l35435M06382K77582l37229k84568L04524L36132
$$ -2306940 -1438336 -1356558 -2064131 -2399566 -1993184 -1715602 -2052831 -2337399 -2032875 -1696743
43389a696743l20811o60209k01369L80818M29273J64524J09871L34575N55982
$$ -1696743 -2017554 -2677763 -2879132 -2498314 -2069041 -1904517 -1794646 -1460071 -904089
43380i04089N58772K94897j44952n06421m98736o0930N33249Q39972N82456k8058
$$ -904089 -345317 -50420 -195372 -701793 -1200529 -1261459 -728210 111762 694218 666160
43370F66160l93383k06259Q2647j34329o56243o79086k050O25127N67829R6275
$$ 666160 272777 66518 149165 14836 -641407 -1320493 -1322543 -697416 -129587 -33312
43360c3312j98727j94604n0066K35806O01604O88166L12516j54113l11154k97459
$$ -33312 -232039 -426643 -476709 -240903 360701 1048867 1361383 1207270 896116 598657
43350E98657m02678m61083j62227K79317L28621q3354m61575m38082j75547j8763
$$ 598657 195979 -265104 -427331 -148014 180607 97253 -364322 -802404 -977951 -996714
43340i96714k9554K699K04260L93248K92912l4452j84284j0826N6167l26830p13891
$$ -996714 -1026268 -1023569 -819309 -426061 -133149 -167601 -351885 -362711 -306544 -633374 -1347265
43329a347265m18947L81845Q11665N53353J83666J36684J41944n7781k33239k62186
$$ -1347265 -1766212 -1384367 -572702 -19349 164317 301001 442945 385164 151925 -110261
43319a10261m10706o11715k87020N75265J003463M07051m14154m62402l5622l0637
$$ -110261 -520967 -1132682 -1419702 -844437 159026 566077 151923 -310479 -346101 -376738
43309c76738l45715j70480M56838O35449J15724l25586j82817J31541J99694K09603
$$ -376738 -722453 -892933 -436095 199354 315078 -10508 -193325 -61784 137910 347513
43299C47513K74586J8824o20307r11170l25758N03034N59128j19462n22375j14534
$$ 347513 622099 640923 20616 -890554 -1216312 -713278 -154150 -273612 -795987 -910521
43289i10521M94663N06458J0878k69142j8116L37706L09367k6549k42563j59952
$$ -910521 -415858 90600 101478 -167664 -185780 151926 461293 434744 192181 32229
43279C2229P958J2672j45734k72701j82432J11382L26710J67389k46862m18114
$$ 32229 40187 52859 -92875 -365576 -548008 -436626 -109916 57473 -189389 -607503
43269f07503j10234L17467M54039L69192K61142O925m03390m41198J80659O78414
$$ -607503 -717737 -400270 53769 422961 684103 691028 287638 -153560 27099 705513
43259G05513J34781r47996j172374l01665M48273L48502O1343J85624K55852r2286
$$ 705513 840294 -107702 -1280076 -1581741 -1133468 -784966 -723623 -537999 -282147 -374433
43249c74433k18444L12216P03750J93906n76609n98274r4768R0909j3003J12315
$$ -374433 -592877 -280661 423089 616995 40386 -557888 -652656 -561747 -574750 -462435
43239d62435K38059j32292n55130k94286K38967J12549m03285k57669M43504N32293
$$ -462435 -224376 -356668 -911798 -1206084 -967117 -854568 -1257853 -1515522 -1072018 -539725
43229e39725j84189n92586j83091K58389K16559K18638N57547O43606K16212r3311
$$ -539725 -723914 -1316500 -1499591 -1241202 -1024643 -806005 -248458 395148 611360 518049
43219E18049j5639j74652p04487o76234K43880Q66192K73201o19413n27955J64862
$$ 518049 502410 327758 -376729 -1052963 -809083 57109 330310 -289103 -817058 -652196
43209f52196K24474l36741m58706R1789M67332K22027j72170k78859j53447J26055
$$ -652196 -427722 -764463 -1223169 -1131380 -664048 -442021 -614191 -893050 -1046497 -920442
43199i20442M75239M34658k96272j041447q32433J10086N85423J75538k52273
$$ -920442 -445203 -10545 -306817 -1348264 -2180697 -2070611 -1485188 -1309650 -1561923
43190a561923l4439L55178L19443J48239L54942O96573N79024J559n34864p41943
$$ -1561923 -1596362 -1241184 -921741 -773502 -418560 278013 857037 858596 323732 -418211
43180d18211o30132j98886L96711O33933J91969m12769l80059K26243N18023P2201
$$ -418211 -1048343 -1247229 -850518 -216585 -24616 -437385 -817444 -591201 -73178 -977
43170i77m50607k86616L47499O40103L50439J4821L5427J10583k09876p58769
$$ -977 -451584 -738200 -390701 249402 599841 614662 650089 760672 550796 -207973
43160b07973q94163l26179M72751P66005L45020k83442m95582k20380J10697K07542
$$ -207973 -1102136 -1428315 -955564 -189559 155461 -127981 -623563 -843943 -733246 -525704
43150e25704K31247L60901L90596Q3152l18405l83847j71275r9873k00508q6237
$$ -525704 -294457 66444 457040 540192 221787 -162060 -333335 -433208 -633716 -719953
43140g19953K69579L82036Q2079j71585j23255j71334n24470n99492O5087Q61373
$$ -719953 -450374 -68338 13741 -157844 -281099 -452433 -976903 -1576395 -1511308 -649935
43130f49935Q74689J90153l72837n03602n17685m77944j36533L18921L62049J9151
$$ -649935 224754 414907 42070 -461532 -979217 -1457161 -1593694 -1274773 -912724 -893573
43120h93573j34380P6504K43765J86681J62927K04334M3685j97835o9626L37727
$$ -893573 -1027953 -951449 -707684 -521003 -358076 -153742 -110057 -307892 -377518 -39791
43110c9791M29147J60977J42193M55611L75314l41586q53312m87085K47247N16457
$$ -39791 389356 550333 692526 1148137 1523451 1181865 328553 -158532 88715 605172
43100F05172L00417L9477j77476m04327l95140l0733K81761J98988k7703q4702
$$ 605172 905589 945066 767590 363263 -31877 -62610 219151 418139 390436 305734
43090C05734j23324k77185k45539J15091L78233K63298J44780L03104L54733L8652
$$ 305734 182410 -94775 -340314 -225223 153010 416308 561088 864192 1218925 1257577
43080A257577j69296O3970J96056k28331o43793m27870n3729k06792m46491R768
$$ 1257577 1088281 1152251 1348307 1119976 476183 48313 -5416 -212208 -658699 -648931
43070f48931P34943O92630L745k96083l4295j814l56519l79167P1049K56909l2855
$$ -648931 86012 778642 782387 486304 452009 450195 93676 -285491 -214442 42467 9612
43059I612j01655K85526M15497l1948l42200l1597L10545P3634m11434n81867
$$ 9612 -92043 193483 608980 577032 234832 203235 513780 587414 175980 -405887
43049d05887m75810k82662J03055N04647L11262m44830p32373j4076P36189M27702
$$ -405887 -881697 -1164359 -1061304 -556657 -245395 -690225 -1422598 -1436674 -700485 -272783
43039b72783m58696o44563M135M59525J99051k29274k98523j63842n4751J67717
$$ -272783 -731479 -1376042 -1371907 -912382 -713331 -942605 -1241128 -1404970 -1459721 -1292004
43029a292004N35727O67157K97347k55087m50498j48620L00789M39816J09318
$$ -1292004 -756277 -89120 208227 -46860 -497358 -645978 -345189 94627 203945
43020B03945l87065n28928j43190L25814L14426j23643l32243J17978Q12495Q92313
$$ 203945 -183120 -712048 -855238 -529424 -214998 -338641 -670884 -552906 259589 1151902
43010A151902O1900r52260j110453k26725P83826R52804L23771k91810m04764
$$ 1151902 1213802 261542 -848911 -1075636 -291810 660994 984765 692955 288191
43001B88191k54249j92209j79419n1325J03403O7583k04297n37382o43494l08051
$$ 288191 33942 -158267 -337686 -389011 -285608 -218025 -422322 -959704 -1603198 -1911249
42991a911249K98351O02685K83947j68841m6357N03932O32667Q7960l79106j89171
$$ -1911249 -1612898 -1010213 -726266 -895107 -941464 -437532 195135 283095 -96011 -285182
42981b85182K07426J40397k13911k31277R1402J90172r2824k62842K4796M23041
$$ -285182 -77756 62641 -151270 -382547 -291145 -100973 -193797 -456639 -431843 -8802
42971h802L77816j10887m61353k30648K89483L88164j16650n58115l33743J80716
$$ -8802 369014 258127 -203226 -433874 -144391 243773 127123 -430992 -764735 -584019
42961e84019J72529l54432n96890k10505K68575M31509N54142P69113N55181l13081
$$ -584019 -411490 -765922 -1362812 -1573317 -1304742 -873233 -319091 450022 1005203 692122
42951F92122j031439p69063J15570O52115O19423M91794L75927m2232o11988p15318
$$ 692122 -339317 -1108380 -992810 -340695 278728 770522 1146449 1104217 492229 -223089
42941b23089k47965J75402J68850N4868J72357L02863J12703k57583l83487j10040
$$ -223089 -471054 -295652 -126802 -71934 100423 403286 515989 258406 -125081 -235121
42931b35121K99175M36910J19032l80913n14340p5116M68640N15631O5234m10123
$$ -235121 64054 500964 619996 239083 -275257 -350373 118267 633898 699132 289009
42921B89009o54639p45711o38361j65060M42609N89128J14896l59409k03704L82391
$$ 289009 -365630 -1111341 -1749702 -1914762 -1472153 -883025 -768129 -1127538 -1331242 -948851
42911i48851O37816K25433l62581m42707O289L35064J05392k72399j07808M87966
$$ -948851 -311035 -85602 -448183 -890890 -884601 -549537 -444145 -716544 -824352 -336386
42901c36386O40012k1735p35079o61472m2452L04375K30253K26944L97168L37539
$$ -336386 303626 281891 -453188 -1114660 -1157112 -852737 -622484 -395540 1628 339167
42891C39167M5424N5008M47312N33946o1774o78527n21571J80000N26365J87383
$$ 339167 384591 439599 886911 1420857 1359083 680556 158985 338985 865350 1052733
42881A052733l01573m02362k05915r5260j50820j34647O2559J97958j208l99429
$$ 1052733 751160 348798 142883 47623 -103197 -237844 -175285 22673 21465 -377964
42871c77964n59017l32245p8613r8663j35100J95217O79921P27927K61394j42166
$$ -377964 -936981 -1269226 -1347839 -1446502 -1581602 -1386385 -706464 21463 282857 140691
42861A40691r8051R2081J946k88987m14184k66124m1798N8730k3514j91119k02467
$$ 140691 42640 134721 136667 -152320 -566504 -832628 -874426 -815696 -839210 -1030329 -1232796
42850a232796Q2994M03406L48221K412o6953L45730O97115M67321q4414l53200
$$ -1232796 -1149802 -746396 -398175 -395763 -462716 -116986 580129 1047450 963036 609836
42840F09836k45668j16543r5866k4325O6554m3392k93852l65131j99910n9456
$$ 609836 364168 247625 151759 127434 193988 150596 -143256 -508387 -708297 -767753
42830g67753k7054Q1813K55040K31381L1208O908J76796R8631k90650l68353J32125
$$ -767753 -794807 -712994 -457954 -226573 -195365 -188457 -11661 86970 -203680 -572033 -439908
42819d39908M40380r6192p31236k96693Q12544R68117k29681j213388p64222K34370
$$ -439908 472 -95720 -826956 -1123649 -311105 657012 427331 -786057 -1550279 -1315909
42809a315909L63861j05828L9209P15494P25449l9594l17103L40285P22494j6173
$$ -1315909 -952048 -1057876 -1018667 -303173 422276 382682 65579 405864 1128358 1112185
42799A112185q90871o38845L31256P03852K33429k41869l03308k82790k90573
$$ 1112185 221314 -417531 -86275 617577 851006 609137 305829 23039 -267534
42790b67534j2622M83847O48380K96794j23693k24790o9854J44865K68486R6665
$$ -267534 -280156 203691 852071 1148865 1025172 800382 730528 875393 1143879 1240544
42780A240544l57938n79183j28946N69197O80828J40040l24310l28770k30814
$$ 1240544 882606 303423 174477 743674 1424502 1564542 1240232 911462 680648
42771F80648k85549j97228K19504N91629N23095Q5609m32992p94597p19460r9688
$$ 680648 395099 197871 417375 1009004 1532099 1617708 1184716 390119 -329341 -429029
42761d29029N71946O01087O5023k56516n5249J53451N0690J4863K24924J56539
$$ -429029 142917 744004 809027 552511 497262 650713 701403 716266 941190 1097729
42751A097729m38753q49148m30255L30590N61352K78514R1302Q4417j05991l92282
$$ 1097729 658976 -190172 -620427 -289837 271515 550029 641331 725748 619757 227475
42741B27475l22906L9135J49369j07988k63301o2419K14255L09622K98737K50039
$$ 227475 -95431 -56296 93073 -14915 -278216 -340635 -126380 183242 481979 732018
42731G32018Q6145j20194j56966n3709m1956j02332J3707K63414K78454k4946
$$ 732018 818163 697969 541003 487294 445338 343006 356713 620127 898581 873635
42721H73635k28453p031L77744M05970n5452n93917o70865j79072L84089M24845
$$ 873635 645182 638151 1015895 1421865 1366413 772496 101631 -77441 306648 731493
42711G31493k72k18665J07280M63227K98988m3998J53887P93593J034110N62900
$$ 731493 731221 512556 619836 1083063 1382051 1338053 1491940 2285533 3319643 3882543
42701C882543N5408J76015P29380J088264R99498O80537M71012O16276J087840
$$ 3882543 3937951 4113966 4843346 5931610 6931108 7611645 8082657 8698933 9786773
42692I786773J452974J229722M86723k37796o62780r76484j265267j304685j120467
$$ 9786773 11239747 12469469 12956192 12718396 12055616 11079132 9813865 8509180 7388713
42683G388713j143413j447725j423066p12150L9477K1387n24813o69599j82112
$$ 7388713 6245300 4797575 3374509 2662359 2701836 2723223 2198410 1528811 1346699
42674A346699K38514J35807p4350Q9231L66030K08984l31872o84117n72323l08782
$$ 1346699 1585213 1721020 1646670 1735901 2101931 2310915 1979043 1294926 722603 413821
42664D13821k18889j54980J73002N90048N66711L499m65437k59404L10232M56914
$$ 413821 194932 39952 212954 803002 1369713 1373212 907775 648371 958603 1415517
42654A415517N9830k24111o5890M2433k46467m08272M9000N57456K98363l37999
$$ 1415517 1475347 1251236 1185346 1227779 981312 573040 622040 1179496 1477859 1139860
42644A139860k31792O07396R08656J44942n74112k60448M18515L35714k64183
$$ 1139860 908068 1515464 2424120 2569062 1994950 1734502 2153017 2488731 2224548
42635B224548l69775l8042j83347p54413o47011L62176J040832O13687l3535J03130
$$ 2224548 1854773 1816731 1633384 878971 231960 594136 1634968 2248655 2215120 2318250
42625B318250N04224J56713n87259n45549K89371O95698J98180k26879J87740
$$ 2318250 2822474 2979187 2391928 1846379 2135750 2831448 3029628 2802749 2990489
42616B990489P72761N63995j52579l39683J82002N48026K06398l44436l92918
$$ 2990489 3763250 4327245 4174666 3834983 4016985 4565011 4771409 4426973 4034055
42607D034055L952K74685K12957J07106R8386o2243m54328o38846k61993K85028
$$ 4034055 4038007 4312692 4525649 4632755 4731141 4668898 4214570 3575724 3313731 3598759
42597C598759L43613n951n8316L48357N16065M2698m37207k28895L23449M62774
$$ 3598759 3942372 3936421 3878105 4226462 4742527 4785225 4348018 4119123 4442572 4905346
42587D905346K63814L40167O09526M03392k34979m55677k6931J90154l38688q53841
$$ 4905346 5169160 5509327 6118853 6522245 6287266 5831589 5804658 5994812 5656124 4802283
42577D802283m59676M47623P56063K43261k35937m5949M66015N96664J79512l27880
$$ 4802283 4342607 4790230 5546293 5789554 5553617 5507668 5973683 6570347 6749859 6421979
42567F421979l97033N8187O41114R19430Q68015P45260O49541N33350N95161J146909
$$ 6421979 6024946 6083133 6724247 7643677 8511692 9256952 9906493 10439843 11035004 12181913
42557A2181913J986342K453470K359061K325978K871992L684982M270607M843172
$$ 12181913 14168255 16621725 18980786 21306764 24178756 27863738 32134345 36977517
42549C6977517N985691P757696R749976J1794247J3964242J5902393J6695461
$$ 36977517 42963208 50720904 60470880 72265127 86229369 102131762 118827223
42542A18827223J5566511J2480296Q137604L562981n16349m171879p975040j1962741
$$ 118827223 134393734 146874030 155011634 158574615 158058266 153886387 145911347 133948606
42534A33948606j5177402j6532193j5856998j3830294j1289914q972529p423384
$$ 133948606 118771204 102239011 86382013 72551719 61261805 52289276 44865892
42527D4865892o558692n651792m316597l149462k798743k835101k356738j406977
$$ 44865892 38307200 32655408 28338811 25189349 22390606 19555505 17198767 15791790
42519A5791790q72909j107724j550896j683420j504172j070954m47500j18769
$$ 15791790 14918881 13811157 12260261 10576841 9072669 8001715 7554215 7435446
42511G435446n17179j075384p91892J09582K83222n97585j105853k34841Q97925
$$ 7435446 6918267 5842883 5050991 5160573 5443795 4846210 3740357 3505516 4403441
42502D403441O77381n66111j132914m85141K64263K99035R9426J90195J69502
$$ 4403441 5080822 4514711 3381797 2896656 3160919 3459954 3559380 3749575 3919077
42493C919077l34950p05321k34788N96307P10316L7365m23156j64506J32805j96845
$$ 3919077 3584127 2878806 2644018 3240325 3950641 3988006 3564850 3400344 3533149 3336304
42483C336304p09643n92070M9955M30715L21802J90503J87935o6954n38260n62901
$$ 3336304 2626661 2034591 2084546 2515261 2837063 3027566 3215501 3148547 2610287 2047386
42473B047386Q029L63810L1697k54141J79292O17275N5514r52581r51656J23922
$$ 2047386 2055415 2419225 2450922 2196781 2376073 2993348 3048862 2096281 1144625 1268547
42463A268547P92691L04602l63115k56579J24961q1224o39927p77009m43273j05898
$$ 1268547 2061238 2365840 2002725 1746146 1871107 1789883 1149956 372947 -70326 -176224
42453a76224J49095M36959M77887N4514l12910k4365N50834N64771L9408j90721
$$ -176224 -27129 409830 887717 942231 629321 604956 1155790 1720561 1759969 1569248
42443A569248J55868M04565L9836n62079p92572n83318k22423R4437K33738P9872
$$ 1569248 1725116 2129681 2169517 1607438 814866 231548 9125 103562 337300 417172
42433D17172j76900q4884M19015P35465L54264l56278n38599M9100P12038O82381
$$ 417172 240272 155388 574403 1309868 1664132 1307854 769255 818355 1530393 2212774
42423B212774Q164o02243o49095l02135j1088P9606J56951L25517M29148L18810
$$ 2212774 2220938 1618695 969600 667465 656377 735983 892934 1218451 1647599 1966409
42413A966409J02762R642P4303N7057k86848q33134j052549n50468L24890P33966
$$ 1966409 2069171 2078813 2153116 2210173 1923325 1090191 37642 -512826 -187936 546030
42403E46030M02731N5888L95938J001840Q86533k3171p39776o06124o3666J97457
$$ 546030 948761 1004649 1400587 2402427 3288960 3265789 2526013 1919889 1856223 2053680
42393B053680J24844k5791k35948m56974l71595L9733K06274j76313m85810o0004
$$ 2053680 2178524 2152733 1916785 1459811 1088216 1127949 1334223 1157910 672100 612096
42383F12096O69037P35045P8491m23853k82573R1867K56762K98227L00974L329
$$ 612096 1281133 2016178 2094669 1670816 1388243 1480110 1736872 2035099 2336073 2339402
42373B339402o14123r63572n73380J66623M52241P5137m12638m65872j34251J55245
$$ 2339402 1725279 761707 188327 354950 807191 882328 469690 3818 -130433 24812
42363B4812J59467K5202J1083J41642K14948J02446j02118k60930l53410l71188
$$ 24812 184279 209481 220564 362206 577154 679600 577482 316552 -36858 -408046
42353d08046k28371O7514K97859K70761P7771n0303m3012J2678O1714R2358N6893
$$ -408046 -636417 -568903 -271044 -283 77488 27185 -15827 -3149 58565 150923 207816
42342B07816n1007j30116j25087j30966k07766k37433j21198L9138J24678J91817
$$ 207816 156809 26693 -98394 -229360 -437126 -674559 -795757 -756619 -631941 -440124
42332d40124K97815L18473J51857o6380j63049j71491j72546r2728J06854K41853
$$ -440124 -142309 176164 328021 261641 98592 -72899 -245445 -338173 -231319 10534
42322A0534J55237l2426j54422k55169l71468l24200k9033K48886K78318K25275
$$ 10534 165771 133345 -21077 -276246 -647714 -971914 -1000947 -752061 -473743 -248468
42312b48468K78496K26647j42154n09982m31290m6331J68706J87378L52293O04238
$$ -248468 30028 256675 114521 -395461 -826751 -873082 -704376 -516998 -164705 439533
42302D39533M57417j79585p25730o44113n2209M94488N46814R1901m05762m00584
$$ 439533 896950 717365 -8365 -652478 -704687 -210199 336615 428516 22754 -377830
42292c77830M9008K53527j21966m70793j89861K64285R1955m43663l85635K80576
$$ -377830 -328822 -75295 -197261 -668054 -857915 -593630 -501675 -945338 -1330973 -1050397
42282a050397N35304l338m83756k52012K13246L18841L05135N02808N30054M0638
$$ -1050397 -515093 -518431 -1002187 -1254199 -1040953 -722112 -416977 85831 615885 656523
42272F56523m40909k94774J39969J52338j45583j04032K88270M06255M2711l27849
$$ 656523 215614 -79160 60809 213147 67564 -36468 251802 658057 700768 372919
42262C72919l26619p7114J55504K08690k6287m18412n00387n7034L79361J95188
$$ 372919 46300 -30814 124690 333380 307093 -111319 -611706 -668740 -289379 -94191
42252i4191l32967m03626R3262M67499L28894K9472j09339k49072m57442l81419
$$ -94191 -427158 -830784 -737522 -270023 58871 88343 -20996 -270068 -727510 -1108929
42242a108929J13725N44303M76055J36375n6137j41790l21508l84895k4332M83870
$$ -1108929 -995204 -450901 25154 161529 105392 -36398 -357906 -742801 -767133 -283263
42232b83263N11728k9063n33890n09063j02785K77082M72912M94035K60906k30746
$$ -283263 228465 199402 -334488 -843551 -946336 -669254 -196342 297693 558599 327853
42222C27853o50694n86091n6795M74427O48040N33783L34912M2252l79425o56514
$$ 327853 -322841 -908932 -965727 -491300 156740 690523 1025435 1067687 688262 31748
42212C1748m38360J34767M72118K98078N7178K73941P45125P79192J87563l97227
$$ 31748 -406612 -271845 200273 498351 555529 829470 1574595 2353787 2541350 2144123
42202B144123l49857J25171K88904j57418p08072p09538j58655L23936K57856
$$ 2144123 1794266 1919437 2208341 2050923 1342851 633313 474658 798594 1056450
42193A056450j44255l01866n8813R2281k80160q12616o98246J73763Q54007M64332
$$ 1056450 912195 610329 551516 643797 363637 -448979 -1147225 -973462 -119455 344877
42183C44877n66422r46755k04077O85687O39183j04018m52874l2289M51748L70250
$$ 344877 -221545 -1168300 -1372377 -686690 -47507 -151525 -604399 -636688 -184940 185310
42173A85310m0931k57403k05925q1773P6570K32732J78915q3994j77099M0775
$$ 185310 144379 -113024 -318949 -400722 -324152 -91420 87495 3501 -173598 -132823
42163a32823J27286j69811k85368K91621R27545N78631n51837j136112n94319
$$ -132823 -5537 -175348 -460716 -169095 758450 1337081 785244 -350868 -945187
42154i45187J87285L19306R6477J66331L66080J66174k97283m40522j56907J66186
$$ -945187 -757902 -438596 -342119 -175788 190292 356466 59183 -381339 -538246 -372060
42144c72060L13939L22200J25893k68910m75768k05715J39724R480l34513j61941
$$ -372060 -58121 264079 389972 121062 -354706 -560421 -420697 -411217 -745730 -907671
42134i07671M69717O63610O4136n44083m23945L4782K5880l77231l73717K88043
$$ -907671 -437954 225656 289792 -254291 -678236 -643454 -617574 -994805 -1368522 -1080479
42124a080479Q83423O95362m8112m92501j92006M43809P17977M56446R5179J0221
$$ -1080479 -197056 498306 450194 -42307 -234313 209496 927473 1383919 1479098 1489319
42114A489319K8487k01835n66622o05227k42395N9780K3304m1419J38981K25335
$$ 1489319 1517806 1315971 749349 144122 -98273 -38493 -15189 -56608 82373 307708
42104C07708j53649n67556k61004N93420R12066K01964o73918o85501K840M70887
$$ 307708 154059 -413497 -674501 -81081 830985 1032949 359031 -326470 -323630 147257
42094A47257L85600J51361l58k10846l44692k1284N59879O52806R5021l85816
$$ 147257 532857 684218 683860 473014 128322 107038 666917 1319723 1414744 1028928
42084A028928l47635k83800n84608p13672j89361L86148K71351o8368K53861Q61301
$$ 1028928 681293 397493 -187115 -900787 -1090148 -704000 -432649 -501017 -247156 614145
42074F14145O13460l55321o28665K15153Q28351K26586o59419n38307K18143L35748
$$ 614145 1227605 872284 243619 458772 1287123 1513709 854290 315983 534126 869874
42064H69874k75340n25031L8521O46111O01399J46268k02175l68979m23531j82853
$$ 869874 594534 69503 108024 754135 1355534 1501802 1299627 930648 507117 324264
42054C24264M26275R57326Q49024J61629m02587k95239K18893L84866o3053n35628
$$ 324264 750539 1707865 2556889 2718518 2315931 2020692 2239585 2624451 2561398 2025770
42044B025770m26183M832P9642j84951j59190K16175K31533l31421o77379k89530
$$ 2025770 1599587 1604419 1684061 1499110 1339920 1556095 1787628 1456207 778828 489298
42034D89298J29744j85833p07666m30818M52240Q28964L76348j29750j73121q1914
$$ 489298 619042 433209 -274457 -705275 -253035 575929 952277 822527 649406 567492
42024E67492j20614j4988L02984L53166o4468m03658j87368K60734L24928r4812
$$ 567492 446878 431890 734874 1088040 1023572 619914 432546 693280 1018208 923396
42014I23396o31453r18339p21531n997Q27425J121382O68240l2989m01289l41007
$$ 923396 291943 -626396 -1347927 -1353924 -526499 594883 1263123 1230134 828845 487838
42004D87838o8012K16090K97637K2005l88357m72766j75353O7143M2220M8131
$$ 487838 419826 635916 933553 955558 567201 94435 -80918 -13775 28445 76576
41994G6576K30939K35710r1224k43334J51464N82139L82193j64160k25934K44031
$$ 76576 307515 543225 452001 208667 360131 942270 1324463 1160303 934369 1178400
41984A178400M06103j74243q68676q82581k54090L82280O28555N38323K54479
$$ 1178400 1584503 1410260 541584 -340997 -595087 -212807 415748 954071 1208550
41975A208550j53704n36336o54973m12549L6279M36680O14813N23787K38729m9076
$$ 1208550 1054846 518510 -136463 -549012 -512733 -76053 538760 1062547 1301276 1252200
41965A252200j48320p3882o0056k55805m84253m67627k22647N348J65088M18160
$$ 1252200 1103880 1029998 969942 714137 229884 -237743 -460390 -455042 -289954 128206
41955A28206O79381N60651j399m63777l77707l0407M4246j10603p7436J35484
$$ 128206 807587 1368238 1366839 903062 525355 494948 539194 428591 351155 486639
41945D86639J20599j93785m48612m72826m00561j85897L35419Q44511P24336K9492
$$ 486639 607238 413453 -35159 -507985 -908546 -1094443 -759024 85487 809823 839315
41935H39315m33553k58117K6477r4641l44078k84674o9107N708J08250M04620
$$ 839315 405762 147645 174122 79481 -264597 -549271 -618378 -612670 -504420 -99800
41925i9800N04104Q5599l53326j52818M21166N57193J59924j07692L0751J19905
$$ -99800 404304 489903 136577 -16241 404925 962118 1122042 1014350 1045101 1165006
41915A165006j33229l78338k64313L7128K07482K16780J64328O7676k3407l2247
$$ 1165006 1031777 653439 389126 426254 633736 850516 1014844 1082520 1059113 1026866
41905A026866n4903k13935l16638r2435K45456K25281n5200J2280M81349N81284
$$ 1026866 971963 758028 441390 348955 594411 819692 764492 776772 1258121 1839405
41895A839405q4928p60874n80581J29271L62300n2493k89500J58943Q07194J014177
$$ 1839405 1754477 993603 413022 542293 904593 852100 562600 721543 1528737 2542914
41885B542914Q29786O44103N07546L01725K86460Q97430J999895K790387K600143
$$ 2542914 3372700 4016803 4524349 4826074 5112534 6009964 8009859 10800246 13400389
41876A3400389J541204K26219r03593j749847k242487k215310j679513j002580
$$ 13400389 14941593 15167812 14264219 12514372 10271885 8056575 6377062 5374482
41868E374482o38867p08659r06100q12257l14660K28914K97260k04579p27593
$$ 5374482 4735615 4026956 3120856 2308599 1993939 2222853 2520113 2315534 1587941
41859A587941o60689j00392K63965Q8150j95493j04512J39521K0414l78298m62794
$$ 1587941 927252 826860 1090825 1178975 983482 878970 1018491 1038905 660607 197813
41849A97813n4787L50153L58502J81293J29334Q7366j41664l42650k06331Q1201
$$ 197813 143026 493179 851681 1032974 1162308 1249674 1108010 765360 559029 640230
41839F40230O3390k51495l60971k0096M09843N05810L04230O5491j58250m13885
$$ 640230 703620 452125 91154 71058 480901 986711 1290941 1356432 1198182 784297
41829G84297n39863l51396l6699K4595j46954j16365K57327M91099J55193m18857
$$ 784297 244434 -106962 -143661 -119066 -266020 -382385 -125058 366041 521234 102377
41819A02377n42795j43528J71271M8999j32279M5777L42475K69290j07241k86794
$$ 102377 -440418 -583946 -412675 -363676 -495955 -450178 -107703 161587 54346 -232448
41809b32448j21302N0728M7979Q4430K39567K25795l6279r7331L22629O87158
$$ -232448 -353750 -303022 -255043 -170613 68954 294749 258470 161139 483768 1170926
41799A170926K86297o37929j055417n11364K58235L39788j89612n23885k86732
$$ 1170926 1457223 819294 -236123 -747487 -489252 -149464 -339076 -862961 -1149693
41790a149693P5474N3070k15040k22889J32349L94543K03369j73061k12309Q6617
$$ -1149693 -1074219 -1021149 -1236189 -1459078 -1326729 -932186 -728817 -901878 -1114187 -1027570
41780a027570J96474r4658k94587J0336M00430K21637l27272m57665p5687P7860
$$ -1027570 -831096 -925754 -1220341 -1210005 -809575 -587938 -915210 -1372875 -1448562 -1370702
41770a370702k47260l18078K36429N36064j95555j112829p87184N84149J322122
$$ -1370702 -1617962 -1936040 -1699611 -1163547 -1359102 -2471931 -3259115 -2674966 -1352844
41761a352844O63490k53391j90398N12766P38802K39772l36392n55013n26384
$$ -1352844 -689354 -942745 -1133143 -620377 118425 358197 21805 -533208 -1059592
41752a059592l74060n7462L23981N21912M37337J74379j05876k22772p5807J40629
$$ -1059592 -1433652 -1491114 -1167133 -645221 -207884 -33505 -139381 -362153 -437960 -297331
41742b97331R2908j86009k92175q6914J01909R2869J44609L76370M51717J80015
$$ -297331 -204423 -390432 -682607 -769521 -667612 -574743 -430134 -53764 397953 577968
41732E77968j18332k02584k64860l20466K4066O95990Q72501K52177k43338R5818
$$ 577968 459636 257052 -7808 -328274 -304208 391782 1264283 1516460 1273122 1368940
41722A368940N13359Q9771n38270k04875O65112O57597k12684n02239J94491O02895
$$ 1368940 1882299 1972070 1433800 1228925 1894037 2551634 2338950 1836711 2031202 2634097
41712B634097j1630o94294n51248j27951j68411l01340N6548N62134O81826O29500
$$ 2634097 2622467 1928173 1376925 1248974 1080563 779223 835771 1397905 2079731 2709231
41702B709231O44094K54577p29952j364335q35851J15935K37185l25904l85095
$$ 2709231 3353325 3607902 2877950 1513615 677764 793699 1030884 704980 319885
41693C19885L53226R37794O98078P0962k17319l1282K37007J19999n01250j090857
$$ 319885 673111 1610905 2308983 2379945 2162626 2131344 2368351 2488350 1987100 896243
41683H96243q72086P7217O41139J18706p15215p29774n6002L31864K04749J90911
$$ 896243 24157 101374 742513 861219 146004 -583770 -639772 -307908 -103159 87752
41673H7752N31798P72680O50284L77344N1376l98145p05210n06486m5141J25465
$$ 87752 619550 1392230 2042514 2419858 2471234 2073089 1367879 861393 816252 941717
41663I41717L7175J02966J86298j66081o56664m88316K51728N77607J85688q5405
$$ 941717 978892 1081858 1268156 1102075 445411 -42905 208823 786430 972118 886713
41653H86713K44758M68920j6302n86910l89186K81460N04780J56155q6651Q8993
$$ 886713 1131471 1600391 1584089 997179 607993 889453 1394233 1550388 1463737 1552730
41643A552730K67605Q9467k37149l27054j11892J93551L78106L69478J97196o8975
$$ 1552730 1820335 1909802 1672653 1345599 1233707 1427258 1805364 2174842 2372038 2303063
41633B303063l03333k97768N9957M97697N09949K0334l82903k07933K23198K69712
$$ 2303063 1999730 1701962 1761919 2259616 2769565 2789899 2406996 2199063 2422261 2691973
41623B691973o1749k06791O3524M42595O79416P45396M93175j55772o93881m41588
$$ 2691973 2630224 2423433 2486957 2929552 3608968 4354364 4847539 4691767 3997886 3556298
41613C556298M25675R78830P93172L87919K64642L00651L56178O63973J202884
$$ 3556298 3981973 4960803 5753975 6141894 6406536 6707187 7063365 7727338 8930222
41604H930222J435027J171082J025048J449294J946811J903306J663879K006112
$$ 8930222 10365249 11536331 12561379 14010673 15957484 17860790 19524669 21530781
41596B1530781K892165L551890L684089L852218M612670N772306O645716O720925
$$ 21530781 24422946 27974836 31658925 35511143 40123813 45896119 52541835 59262760
41588E9262760N980214M781989L490174K140385N31357j324873l058691m361561
$$ 59262760 65242974 70024963 73515137 75655522 76186879 74862006 71803315 67441754
41580F7441754n294101n979582o235237n809547m870866l967460l479827l285074
$$ 67441754 62147653 56168071 49932834 44123287 39252421 35284961 31805134 28520060
41572B8520060l017607k562267k163900k007680j862854j415787q77350p90864
$$ 28520060 25502453 22940186 20776286 18768606 16905752 15489965 14612615 13821751
41564A3821751j132605j188029o44524j82546m34502r49955r39704n30579l73920
$$ 13821751 12689146 11501117 10856593 10674047 10239545 9289590 8349886 7819307 7445387
41555G445387m32972k18607P4402j42699n85876m08439K22120K23491n47041r58432
$$ 7445387 7012415 6793808 6868210 6725511 6139635 5731196 5953316 6176807 5629766 4671334
41545D671334n03887r1744l45573n40619q0372K96905j29046o39067k54776N44127
$$ 4671334 4167447 4075703 3730130 3189511 3109139 3406044 3276998 2637931 2383155 2927282
41535B927282N89135j24775o15791m92652j88023L9704K52167K52098j36297m45349
$$ 2927282 3516417 3391642 2775851 2283199 2095176 2134880 2387047 2639145 2502848 2057499
41525B057499j55118L41113K76118k39309m38260j51436J15603J96414L88093
$$ 2057499 1902381 2243494 2519612 2280303 1842043 1690607 1806210 2002624 2390717
41516B390717O33249N10024N7162k28947k46802l49552n27649l29633K79111O86544
$$ 2390717 3023966 3533990 3591152 3362205 3115403 2765851 2238202 1908569 2187680 2874224
41506B874224M59304j21105m80134l34383J39308M17971Q8156n28149n77685J22543
$$ 2874224 3333528 3212423 2732289 2397906 2537214 2955185 3043341 2515192 1937507 2060050
41496B060050O43027K69135l63132k63371L73578O25573L64754J93149J99811
$$ 2060050 2703077 2972212 2609080 2345709 2719287 3344860 3709614 3902763 4102574
41487D102574q775k40878O3097O14104N46522m0299j05945N57673Q61957J44253
$$ 4102574 4093799 3852921 3916018 4530122 5076644 5036345 4930400 5488073 6350030 6494283
41477F494283p94701r13651k36397N80230J118958J145372N08659l49982n06584
$$ 6494283 5699582 4785931 4549534 5129764 6248722 7394094 7902753 7552771 7046187
41468G046187K85856J147675J231638P40038L73844L75626N73370Q35577J021978
$$ 7046187 7332043 8479718 9711356 10451394 10825238 11200864 11774234 12609811 13631789
41459A3631789R02967M92938J11958q6389k51311m24334m98720o01283q92656
$$ 13631789 14534756 15027694 15139652 15053263 14801952 14377618 13878898 13277615 12384959
41450A2384959j019789n57836J2433k40863j134448j384843n48420K09941j13006
$$ 12384959 11365170 10807334 10819767 10578904 9444456 8059613 7511193 7721134 7608128
41441G608128r01847j041433n73006k89959l81740m60191m53950n54123n82764
$$ 7608128 6706281 5664848 5091842 4801883 4420143 3959952 3506002 2951879 2369115
41432B369115k25406L04053M81279J90797k52349n63870n79554k12677K93761
$$ 2369115 2143709 2447762 2929041 3119838 2867489 2303619 1724065 1511388 1805149
41423A805149M37541J23030j72074j86368k47045m95474m58916O8684M42183J53841
$$ 1805149 2242690 2365720 2193646 2007278 1760233 1264759 805843 874527 1316710 1470551
41413A470551k55672q0386L41884K24319l13835m83300j57510J7655k18155l71001
$$ 1470551 1214879 1134493 1476377 1700696 1386861 903561 746051 763706 545551 174550
41403A74550r3313K61630K00398k45215n75316l29298M34453J047820Q48826M279
$$ 174550 81237 342867 543265 298050 -277266 -606564 -172111 875709 1724535 1728814
41393A728814o52499p03400n00558l08121Q5400N56275M31664k87879n01014L19377
$$ 1728814 1076315 372915 -127643 -435764 -350364 205911 637575 349696 -151318 168059
41383A68059J016417M68881m91965l52862N83296O97312k78355r26994n45426
$$ 168059 1184476 1653357 1161392 808530 1391826 2089138 1810783 883789 338363
41374C38363p7730k32429l23633K65116Q49678O19840j0739j89753M1186J05731
$$ 338363 260633 28204 -295429 -30313 819365 1439205 1428466 1238713 1279899 1385630
41364A385630n7260j61057k70283n21203n65364p3071N34584N96739K01765m4817
$$ 1385630 1328370 1167313 897030 375827 -189537 -262608 271976 868715 1070480 1025663
41354A025663m1416k33552o84650q26747l03936M75029Q74312P65902M83350K78326
$$ 1025663 984247 750695 66045 -760702 -1064638 -589609 284703 1050605 1533955 1812281
41344A812281R7422j57254l71140l43140j11418J9511j25598l12102k04998J32988
$$ 1812281 1909703 1752449 1381309 1038169 926751 946262 820664 508562 303564 436552
41334D36552L18455K06831P5458J64316L09277K11832j01757k97359j54627J79643
$$ 436552 755007 961838 1037296 1201612 1510889 1722721 1620964 1323605 1168978 1348621
41324A348621L83765L31969J92954J32483L9980k54936n49546l90939K39139O92067
$$ 1348621 1732386 2064355 2257309 2389792 2429772 2174836 1625290 1234351 1473490 2165557
41314B165557L80687m70889j081378r63859k94281L91602O26326L17361j23824
$$ 2165557 2546244 2075355 993977 30118 -264163 127439 753765 1071126 947302
41305I47302j31956L21889O31090L74461q5262j54584J59757L89057L08181P1061
$$ 947302 815346 1137235 1768325 2142786 2057524 1902940 2062697 2451754 2759935 2830996
41295B830996j29248j27827K20404O92579O66183n5397p20154n33976K13833O07975
$$ 2830996 2701748 2573921 2794325 3486904 4153087 4097690 3377536 2843560 3057393 3665368
41285C665368M14490J55888P7039r4214l81325l92656k7996L43932M92465M87163
$$ 3665368 4079858 4235746 4312785 4218571 3837246 3444590 3416594 3760526 4252991 4740154
41275D740154K84476j57272m22317r9472L44393O5691p48780r97060l65395J58332
$$ 4740154 5024630 4867358 4445041 4345569 4689962 4755653 4006873 3009813 2644418 2802750
41265B802750j47295o85492o13668p1272L14280M07827L93275K40087l0582p7597
$$ 2802750 2655455 1969963 1356295 1285023 1599303 2007130 2400405 2640492 2609910 2532313
41255B532313K04866L61918Q6290k79468l82470l90355m32901k13104K80494M07779
$$ 2532313 2737179 3099097 3185387 2905919 2523449 2133094 1700193 1487089 1767583 2175362
41245B175362j22072n98789l88234N6893Q5192N938L64010P37178M46465o5762
$$ 2175362 2053290 1454501 1066267 1123160 1208352 1214290 1578300 2315478 2761943 2696181
41235B696181R3465N68745K12349q33700j080085k6227R16280N01365n70009q47266
$$ 2696181 2789646 3358391 3570740 2737040 1656955 1630728 2547008 3048373 2478364 1631098
41225A631098k01246L36227K45563k0712n8025o6706k78924m83068l68942J4346
$$ 1631098 1429852 1766079 2011642 1990930 1932905 1866199 1587275 1104207 735265 749611
41215G49611L52888M29104K63136J9833j31603j33082p5055q7193j60460j22058
$$ 749611 1102499 1531603 1794739 1814572 1682969 1549887 1474832 1387639 1227179 1105121
41205A105121J35070M07664L21136j63896n30136k53211M73236Q86752N83819
$$ 1105121 1240191 1647855 1968991 1805095 1274959 1021748 1494984 2381736 2965555
41196B965555l4465l54981k32702J08275M82541P54261P37181M23483J12036L5332
$$ 2965555 2931090 2576109 2343407 2451682 2934223 3688484 4425665 4849148 4961184 4996516
41186D996516P4933Q4611J95862M94950P15185O38580N26804P44730J222889J719293
$$ 4996516 5071449 5156060 5351922 5846872 6562057 7200637 7727441 8472171 9695060 11414353
41176A1414353K311871L100968L671478L449200K448935J122410l45101j942302
$$ 11414353 13726224 16827192 20498670 23947870 26396805 27519215 27174114 25231812
41168B5231812l197582l438134k765681k067093j874012j826132j466640r65243
$$ 25231812 22034230 18596096 15830415 13763322 11889310 10063178 8596538 7631295
41160G631295p36931q12181r15762q54607o06195k91310j60611l05735l81015
$$ 7631295 6894364 6082183 5166421 4311814 3705619 3414309 3253698 2947963 2566948
41151B566948k2632M82844M96159K1515k49568l1144J41206j24630m28399l48172
$$ 2566948 2544316 3027160 3523319 3544834 3295266 3264122 3405328 3280698 2852299 2504127
41141B504127j90999l78171o28209m30912O7004L30106K77333J94513Q2291k01919
$$ 2504127 2313128 1934957 1306748 875836 942840 1272946 1550279 1744792 1827083 1625164
41131A625164l66174k1267M94330M15956k73650p27377m47613R0413K80477J89783
$$ 1625164 1258990 1237723 1732053 2148009 1874359 1146982 699369 789782 1070259 1260042
41121A260042J60866J81108J01508M8139J48063J75254q0077l53511k54973J30724
$$ 1260042 1420908 1602016 1703524 1751663 1899726 2074980 1994903 1641392 1386419 1517143
41111A517143L95788L76581J91587p4358l11560k37397K08302N23439K58731k01276
$$ 1517143 1912931 2289512 2481099 2406741 2095181 1857784 2066086 2589525 2848256 2646980
41101B646980j39212L17671L25126l13624p93638n80137j42220K9510K33393P01281
$$ 2646980 2507768 2825439 3150565 2836941 2043303 1463166 1320946 1350456 1583849 2285130
41091B285130P91455J2191q10320n69031L29823N12592j84222m94729J53903P27064
$$ 2285130 3076585 3088776 2278456 1709425 2039248 2551840 2367618 1872889 2026792 2753856
41081B753856L33403l74160l78855J14000K41457r3533l51689l87976m09998l14473
$$ 2753856 3087259 2713099 2334244 2448244 2689701 2596168 2244479 1856503 1446505 1132032
41071A132032L2976K19878r7716l53085J43308Q58544O59035l07779o51464J15635
$$ 1132032 1165008 1384886 1287170 934085 1077393 1935937 2594972 2287193 1635729 1751364
41061A751364P58255K19927p67524q45270l223O19159M72650J22347J16362K19313
$$ 1751364 2509619 2729546 1962022 1116752 1113529 1732688 2205338 2327685 2444047 2663360
41051B663360P133l68465l95071M8909M65151K95529l91260r10789p50756j98120
$$ 2663360 2670493 2302028 1906957 1955866 2421017 2716546 2325286 1414497 663741 465621
41041D65621Q4915Q782J29872O86766J073876O26350m14311j145614j039827l67255
$$ 465621 550536 559318 689190 1375956 2449832 3076182 2661871 1516257 476430 109175
41031A09175K79546N14955K93830j13207k71374q35L63012L92585J74958J21452
$$ 109175 388721 903676 1197506 1084299 812925 812090 1175102 1567687 1742645 1864097
41021A864097K16708k555n59428p28611p5062O79672N43526k29412l84420M85927
$$ 1864097 2080805 2078250 1518822 790211 715149 1394821 1938347 1708935 1324515 1810442
41011A810442J260759R01717p3006m74519j79635J6381o1409K54533J119271J731953
$$ 1810442 3071201 3972918 3899912 3425393 3245758 3262139 3200730 3455263 4574534 6306487
41001F306487J593663J238938J224005J244668Q57092L09348k7030l71997r48812
$$ 6306487 7900150 9139088 10363093 11607761 12464853 12774201 12747171 12375174 11426362
40992A1426362j317051j095810p56583q24570q88455m10308O6801k54842q61227
$$ 11426362 10109311 9013501 8256918 7432348 6543893 6133585 6200386 5945544 5084317
40983E084317o20280K08314K47289o80742j180140n83109L2884j91542m81809
$$ 5084317 4464037 4672351 4919640 4238898 3058758 2475649 2508533 2316991 1835182
40974A835182J6792O26968L52358l46101l82280R7958J23559l32562m27661m9308
$$ 1835182 1851974 2478942 2831300 2485199 2102919 2200877 2324436 1991874 1564213 1514905
40964A514905N1977k74904k88207K65510O30357K86859k34049k55478Q5851K78928
$$ 1514905 1566882 1291978 1003771 1269281 1899638 2186497 1952448 1696970 1782821 2061749
40954B061749K37151J67312R9740L359J6969J63555J28919k90776p49765p33732
$$ 2061749 2298900 2466212 2565952 2569311 2586280 2749835 2878754 2587978 1838213 1104481
40944A104481k42170K30415L16647J09818q8442j17689k2780P5299J07502J08860
$$ 1104481 862311 1092726 1409373 1519191 1430749 1313060 1290280 1365579 1473081 1581941
40934A581941J54905K13654J02351k99444p66516q01621j69581O83528R90285
$$ 1581941 1736846 1950500 2052851 1753407 986891 185270 15689 699217 1689502
40925A689502N20408j63366m39608l13362j21704P9351L69002M82387J05806m51042
$$ 1689502 2209910 2046544 1606936 1293574 1171870 1251221 1620223 2102610 2208416 1757374
40915A757374n27712o5328L42449L75081K84608K18998J5126k03344o2636K16796
$$ 1757374 1229662 1164334 1506783 1881864 2166472 2385470 2400596 2197252 2134616 2351412
40905B351412n9655p78150q80298K28Q37626Q09357M72452M90017L67231l59878
$$ 2351412 2291757 1513607 633309 633537 1471163 2280520 2752972 3242989 3610220 3250342
40895C250342p85219k070J066979R37907J2797j44073M47336K90458p86474j195406
$$ 3250342 2465123 2463053 3530032 4467939 4480736 4336663 4783999 5074457 4287983 3092577
40885C092577l74914J84187m52736j047203l97565N71752M39789l53459m31785
$$ 3092577 2717663 2901850 2449114 1401911 1004346 1576098 2015887 1662428 1230643
40876A230643K06262M58117P0309k35625k17721k89200m44147k49698J90482L29178
$$ 1230643 1436905 1895022 1965331 1729706 1511985 1222785 778638 528940 719422 1048600
40866A048600J31635O883l6035k43601l61524P44M57709L18135j97184k56808
$$ 1048600 1180235 1187118 1151083 907482 545958 546702 1004411 1322546 1125362 868554
40856H68554J84093L82474J47664M3038K12763J73795r2470l5956K50825l1976
$$ 868554 1052647 1435121 1582785 1625823 1838586 2012381 1919911 1883955 2134780 2102804
40846B102804q59597j064966j67381O92307M78313j56880n4983N55180N70516
$$ 2102804 1243207 178241 10860 703167 1181480 1024600 969617 1524797 2095313
40837B095313j18149n29759j98494K25046P8368m35316o76736l33605L87864R74453
$$ 2095313 1977164 1447405 1248911 1473957 1552325 1117009 440273 106668 494532 1468985
40827A468985R85990M90179J7590j24992k08722m64658n49400j37505L46532K68694
$$ 1468985 2454975 2945154 2962744 2837752 2629030 2164372 1614972 1477467 1823999 2092693
40817B092693j87667k74694J39807L94702R8430l17217l07916N5463L21867K56773
$$ 2092693 1905026 1630332 1770139 2164841 2263271 1946054 1638138 1693601 2015468 2272241
40807B272241J433j33714M0632L37868L26581o3049l06296k2791L57341K12245
$$ 2272241 2273674 2139960 2180592 2518460 2845041 2781992 2475696 2452905 2810246 3022491
40797C022491k61227l55757J9232L32000M42735O76237Q52423L37303o50708r10063
$$ 3022491 2761264 2405507 2424739 2756739 3199474 3875711 4728134 5065437 4414729 3504666
40787C504666o756Q66400N73813l01737m60295J52440N24266K83745K4215O3468
$$ 3504666 3497910 4364310 4938123 4636386 4176091 4328531 4852797 5136542 5160757 5224225
40777E224225K4165k42991l08570J3781K99538K39062M7855r0280l27600o28095
$$ 5224225 5248390 5005399 4696829 4710610 5010148 5249210 5297065 5206785 4879185 4251090
40767D251090n79457o7016M29332N55722N70803P64250R33295Q51830P35090P53546
$$ 4251090 3671633 3604617 4033949 4589671 5160474 5924724 6858019 7709849 8444939 9198485
40757I198485N84446J8008m50252l15793K3275j53680o49801o01450Q4329N15250
$$ 9198485 9782931 9800939 9350687 9034894 9058169 8904489 8254688 7653238 7737567 8252817
40747H252817K26175j50812o0332L2968m07998q29692l55239O89674J106915O07046
$$ 8252817 8478992 8328180 8267848 8300816 7892818 7063126 6707887 7397561 8504476 9111522
40737I111522J85814N25454J053953J069525Q71739J035138J295944J100540P65641
$$ 9111522 9297336 9822790 10876743 11946268 12818007 13853145 15149089 16249629 17015270
40728A7015270J036067J735821J972551J676401J801784K754908L720610M051921
$$ 17015270 18051337 19787158 21759709 23436110 25237894 27992802 31713412 35765333
40720C5765333M336532N354689O796521P930796Q984183J0855196J3728377J6905426
$$ 35765333 40101865 45456554 52253075 60183871 69168054 80023250 93751627 110657053
40712A10657053J9950806K3182719K6873095L0439222L2429973L0983781K4673608
$$ 110657053 130607859 153790578 180663673 211102895 243532868 274516649 299190257
40705B99190257J3702367L30271j2405054k2444008k9000482l1755641l0791473
$$ 299190257 312892624 313222895 300817841 278373833 249373351 217617710 186826237
40698A86826237k7256003k3052605j9455356j6510173j3847913j1426275r345340
$$ 186826237 159570234 136517629 117062273 100552100 86704187 75277912 65932572
40691F5932572p611101o325337n590629n100389m368312l446921k833429k615098
$$ 65932572 58321471 51996134 46405505 41305116 36936804 33489883 30656454 28041356
40683B8041356k369676j967802j729550j684345j477834j158032j186031j461481
$$ 28041356 25671680 23703878 21974328 20289983 18812149 17654117 16468086 15006605
40675A5006605j282006n80661k15204n93512r96835q01412l99175k97837k87803
$$ 15006605 13724599 13143938 12928734 12335222 11338387 10536975 10137800 9839963 9552160
40666I552160j86103l92084r14149r05181j07619L37852l26929j001597m70913
$$ 9552160 9366057 8973973 8059824 7154643 7047024 7384876 7057947 6056350 5585437
40657E585437M05452M5484j072572j075588J80759Q63954J81950n19818k48962
$$ 5585437 5990889 6036373 4963801 3888213 4068972 4932926 5114876 4595058 4346096
40648D346096Q0707m15658q60770j82086Q90247R15606M110n04399j67068J59963
$$ 4346096 4426803 4011145 3150375 2968289 3858536 4774142 4778252 4273853 4106785 4266748
40638D266748o2254k85735L6721N22364M73983q6632m60511k01911L12734L68716
$$ 4266748 4204494 3918759 3955480 4477844 4951827 4865195 4404684 4202773 4515507 4884223
40628D884223j34695n08551k30760K51161J39540n08820q62048n75602k28226
$$ 4884223 4749528 4240977 4010217 4261378 4400918 3892098 3030050 2454448 2226222
40619B226222l01642m43486j42183M25922O94341M76998M1014l08976m12162k71382
$$ 2226222 1924580 1481094 1338911 1764833 2459174 2936172 2977186 2668210 2256048 1984666
40609A984666j17048k01263m00034l30232O1860M08432M65595L17151L9374k92604
$$ 1984666 1867618 1666355 1266321 936089 997949 1406381 1871976 2189127 2228501 1935897
40599A935897l04537K45949P32121K79446p16442p98713L86120J294665O24974
$$ 1935897 1631360 1877309 2609430 2888876 2172434 1373721 1759841 3054506 3679480
40590C679480q04659j338639p77434j84371m8787K5521J65625R3109K260L33661
$$ 3679480 2874821 1536182 758748 574377 525590 551111 716736 809845 812105 1145766
40580A145766P13109L53831m23324l84406O12978J115228J60449j267623j668899
$$ 1145766 1858875 2212706 1789382 1404976 2017954 3133182 3293631 2026008 357109
40571C57109r89870k40152J26963L91295N61896L09365j81175k55035J85954M92942
$$ 357109 -632761 -872913 -745950 -354655 207241 516606 335431 80396 266350 759292
40561G59292L22611J63053M36407O82439K13194p51301j227349o99387K98546
$$ 759292 1081903 1244956 1681363 2363802 2576996 1825695 598346 -101041 197505
40552A97505R14006Q65340M30922o0916m01092m01135m0990L20212K25017l24720
$$ 197505 1111511 1976851 2407773 2346857 1945765 1544630 1503640 1823852 2048869 1724149
40542A724149q26073q42207m14506J05725M09638L87953J78791J01066K96350
$$ 1724149 898076 55869 -358637 -252912 156726 544679 723470 824536 1120886
40533A120886M25849N5372o02454p64658j15815O39728O30049p2990o23412n06698
$$ 1120886 1546735 1602107 999653 234995 119180 758908 1388957 1315967 692555 185857
40523A85857k3468K81303K33517j6176l00987m92577m30373k5091N58219R38911
$$ 185857 162389 443692 677209 661033 360046 -132531 -562904 -587995 -29776 909135
40513I09135Q49163M50761K14880L57647M96718J18550o37330j003392n34054
$$ 909135 1758298 2209059 2423939 2781586 3278304 3396854 2759524 1756132 1222078
40504A222078K65343N18874K8331n28579m28388K48291O74912K02341q06772j262978
$$ 1222078 1487421 2006295 2034626 1506047 1077659 1325950 2000862 2203203 1396431 133453
40494A33453o21679L87047O62100J42574k55783k8160L39484L43379K31139L51751
$$ 133453 -488226 -101179 560921 703495 447712 419552 759036 1102415 1333554 1685305
40484A685305M01972k6148n88456n91671k7181M42705M20461J27824j14553k38514
$$ 1685305 2087277 2061129 1472673 881002 853821 1296526 1716987 1844811 1730258 1491744
40474A491744k62951k29150l05867n55926o24367j01909P67281J184339P42624
$$ 1491744 1228793 999643 693776 137850 -486517 -588426 178855 1363194 2105818
40465B105818o0384m19110r0908M62422O27154K17092l92443o37931l18659K24717
$$ 2105818 2045434 1626324 1535416 1997838 2624992 2842084 2449641 1811710 1493051 1717768
40455A717768M90140K88058j73396n15336m53289k7754L61513L45792M0994j41214
$$ 1717768 2207908 2495966 2322570 1807234 1353945 1326191 1687704 2033496 2074490 1933276
40445A933276j18838j77794l46031k61814J41703L80251J70427q8056K3027L02403
$$ 1933276 1814438 1636644 1290613 1028799 1170502 1550753 1721180 1633124 1656151 1958554
40435A958554M08966M62569O19055N46885j963n08067l10805L68284P45629N81505
$$ 1958554 2367520 2830089 3449144 3996029 3994066 3485999 3175194 3543478 4289107 4870612
40425D870612K58976j8599l55824o34011n89368l53314k74233l21277k74856k76438
$$ 4870612 5129588 5110989 4755165 4121154 3531786 3178472 2904239 2582962 2308106 2031668
40415B031668m87550m96010Q1945O76145M44399l03350m89784m651J99097j68705
$$ 2031668 1544118 1048108 1130053 1806198 2250597 1947247 1457463 1452812 1651909 1483204
40405A483204k84479J72910L56992j56763m30552K68281J072640Q10942j38607
$$ 1483204 1198725 1371635 1728627 1571864 1141312 1409593 2482233 3293175 3154568
40396C154568m97157l1722L52833J69403j35364j57340o2516n2815n4089n0367
$$ 3154568 2657411 2625689 2978522 3147925 3012561 2855221 2792705 2739890 2685801 2635434
40386B635434j58660l10984l27537k82658l57511m14885j93022J63429K63579
$$ 2635434 2476774 2165790 1838253 1555595 1198084 783199 590177 753606 1017185
40377A017185J09907Q1358K82149L80419J43705k69627n97726o99337m90044l1846
$$ 1017185 1127092 1208450 1490599 1871018 2014723 1745096 1147370 448033 -42011 -73857
40367g3857L00132J42487k89339l43180K13978Q11511P63447J19302m21345l60611
$$ -73857 226275 368762 79423 -263757 -49779 761732 1525179 1644481 1223136 862525
40357H62525N5592K11574r0295m04897k59870K12143M81278L17095n0966l85472
$$ 862525 918117 1129691 1039396 634499 374629 586772 1068050 1385145 1334179 948707
40347I48707o23917o07340j48698M75282O27545J77599k24822p7230K65880K38877
$$ 948707 324790 -282550 -431248 44034 671579 849178 624356 547126 813006 1051883
40337A051883n6602j73027j20560j99798l05491r2259L00906L69119N8029j55552
$$ 1051883 995281 822254 701694 501896 196405 104146 405052 774171 832200 676648
40327F76648k8470J71878K13537J83389J39116l507j24977M4727L76541L50993
$$ 676648 648178 820056 1033593 1216982 1356098 1352591 1227614 1272341 1648882 1999875
40317A999875j64132o03861m52571P5631L95325K88720O217j39919m0166J81641
$$ 1999875 1835743 1231882 779311 854942 1250267 1538987 1545204 1405285 1365119 1546760
40307A546760K51934N0341j13496J59648O57837O42240j19461q43810o73248J84355
$$ 1546760 1798694 1849035 1735539 1895187 2553024 3195264 3075803 2231993 1558745 1743100
40297A743100P40326M68776k23204o90538p20837m56380q8627J85462J99546J0394
$$ 1743100 2483426 2952202 2728998 2038460 1317623 861243 772616 958078 1157624 1168018
40287A168018j16961l8329J16688K00914K45222K66064J08619k72720n29249k48072
$$ 1168018 1051057 1012728 1129416 1330330 1575552 1841616 1950235 1677515 1148266 900194
40277I00194M15907P52615L21587m30332o40139o5016O40656P70156L98286J06399
$$ 900194 1316101 2068716 2390303 1959971 1319832 1254816 1895472 2665628 3063914 3170313
40267C170313P9570o2371m97783p83826n24273n5364M6554j01986R2920N99530
$$ 3170313 3249883 3187512 2689729 1905903 1381630 1326266 1372820 1270834 1363754 1963284
40257A963284O44290n0553o58135m08112K50032L87953P4326J77415Q43728J189938
$$ 1963284 2607574 2557021 1898886 1490774 1740806 2128759 2203085 2380500 3224228 4414166
40247D414166O93496l2239k55757j37181j80715l33721k86503j66135k22627k06796
$$ 4414166 5107662 5075423 4819666 4682485 4501770 4168049 3881546 3715411 3492784 3285988
40237C285988J90202N63825K82773l93871n51457j0408L80344P9293l24129r2071
$$ 3285988 3476190 4040015 4322788 3928917 3377460 3367052 3747396 3826689 3502560 3410489
40227C410489M81198N18238j33730o95079n24668J03684M44803J95936k61331
$$ 3410489 3891687 4409925 4276195 3581116 3056448 3160132 3604935 3800871 3539540
40218C539540m19035k04950P5160J67730M4559k38439n48818n72896j02886M90914
$$ 3539540 3120505 2915555 2990715 3158445 3203004 2964565 2415747 1842851 1739965 2230879
40208B230879N38951J9587k86738Q6007N79658N13920J33518N0929J31380j59275
$$ 2230879 2769830 2789417 2502679 2588686 3168344 3682264 3815782 3866711 3998091 3838816
40198C838816o11636n15873N7678K96144L3128j485M22953N14497j50327p31915
$$ 3838816 3227180 2711307 2768985 3065129 3098257 3096772 3519725 4034222 3883895 3151980
40188C151980l86116L76653M82921r1706m34693j46575K12568J27963j41456o2316
$$ 3151980 2765864 3142517 3625438 3533732 3099039 2952464 3165032 3292995 3151539 3089223
40178C089223L68072O04074K58576l35689m46836R7821N77720L50772j76046j89496
$$ 3089223 3457295 4061369 4319945 3984256 3537420 3635241 4212961 4563733 4387687 4198191
40168D198191J74462O2501n30082n81514K25256P73741K23142n90340m41833L92572
$$ 4198191 4372653 4435154 3905072 3323558 3548814 4322555 4545697 3955357 3513524 3906096
40158C906096O79901J44326l59247l41646k01877k57263k63759p4060L3709r6864
$$ 3906096 4585997 4730323 4371076 4029430 3827553 3570290 3306531 3232471 3266180 3169316
40148C169316k45589k67251k65366k16903N7853M49311N61067K69118j20816l32084
$$ 3169316 2923727 2656476 2391110 2174207 2232060 2681371 3242438 3511556 3390740 3058656
40138C058656l62906k68165p3443R6198J43920J97038L43764L40881J5157k43660
$$ 3058656 2695750 2427585 2354142 2450340 2594260 2791298 3135062 3475943 3491100 3247440
40128C247440L5142N51627N35228q3883m90823j58778M09194M40217o0708m20567
$$ 3247440 3282582 3834209 4369437 4285554 3794731 3635953 4045147 4485364 4424656 4004089
40118D004089k15588K68971M49627J24043l19511l81286p0010J59747R2087M694
$$ 4004089 3788501 4057472 4507099 4631142 4311631 3930345 3860335 4020082 4112169 4116863
40108D116863R4046J02994j59510l80020k56560j4091J07365L99486J054347J461176
$$ 4116863 4210909 4313903 4154393 3774373 3517813 3503722 3611087 4010573 5064920 6526096
40098F526096J002598J91946N92K82904M2069p67990j017123k65715M30670J87219
$$ 6526096 7528694 7720640 7721232 8004136 8046205 7278215 6261092 5995377 6426047 6613266
40088F613266l82916l48898p495j85298o79125n88813J28315O01850M83580L50354
$$ 6613266 6230350 5881452 5873957 5688659 5009534 4420721 4549036 5150886 5634466 5984820
40078E984820N06567L88413l95879j215508j226999n47809M895N8578m4353J5278
$$ 5984820 6491387 6879800 6483921 5268413 4041414 3493605 3498500 3557078 3512725 3528003
40068C528003J36330J81083K18669K33881N9968j98446j45137K24264L18980j38874
$$ 3528003 3664333 3845416 4064085 4297966 4357934 4159488 4014351 4238615 4557595 4418721
40058D418721n04877j39731M81477M24073k11774m56036p6022R9094l23743o21331
$$ 4418721 3913844 3774113 4255590 4679663 4467889 4011853 3935831 4034925 3711182 3089851
40048C089851k63338J69448R3919q100M49255R23834N61267l07612o14393j73340
$$ 3089851 2826513 2995961 3089880 3081780 3531035 4454869 5016136 4708524 4094131 3920791
40038C920791K21068J36637o7694r0795n0814M300J54082K01834n7748k73697
$$ 3920791 4141859 4278496 4210802 4120007 4069193 4073493 4227575 4429409 4371661 4097964
40028D097964J446M37626L46734j59834l40214o5922O5075j47658k58433j22952
$$ 4097964 4099410 4537036 4883770 4723936 4383722 4317800 4382875 4235217 3976784 3853832
40018C853832j03448j91498P3799O00873O59874J04004k85403m6709K83122J63321
$$ 3853832 3750384 3558886 3632685 4233558 4893432 4997436 4712033 4665324 4948446 5111767
40008E111767j38790k05834j52499j60690n3585J91097J83880j63460l29546l5402
$$ 5111767 4972977 4767143 4614644 4453954 4400369 4591466 4775346 4611886 4282340 4246938
39998D246938K41937N2058l51620n30352m44758j66071L27533P26280N12492j18765
$$ 4246938 4488875 4540933 4189313 3658961 3214203 3048132 3375665 4101945 4614437 4495672
39988D495672k92256J61808K84567m59023j161035q07493J95845P43338N86717
$$ 4495672 4203416 4365224 4649791 4190768 3029733 2222240 2418085 3161423 3748140
39979C748140K40196o7771l65503l43029K16666P44766N40416j51613n39726m59751
$$ 3748140 3988336 3920565 3555062 3212033 3428699 4173465 4713881 4562268 4022542 3562791
39969C562791l22454k02041J21027M29504K88723j25102k49952p8767o2730j96914
$$ 3562791 3240337 3038296 3159323 3588827 3877550 3752448 3502496 3423729 3360999 3164085
39959C164085o9147K34362J79002k03351k49070J94873M13501m7551o21221n54107
$$ 3164085 3094938 3329300 3508302 3304951 3055881 3250754 3664255 3616704 2995483 2441376
39949B441376K2654L63361J44359k26773k41516R2331L21589J30313k40423k67775
$$ 2441376 2464030 2827391 2971750 2744977 2503461 2595792 2917381 3047694 2807271 2539496
39939B539496J51314M98355K79491l26970o72773l60785L78421R03178P07117
$$ 2539496 2690810 3189165 3468656 3141686 2468913 2108128 2486549 3389727 4096844
39930D096844m4228n46462k55629L21460K60845m03900p03941k50844K02725R1713
$$ 4096844 4052616 3506154 3250525 3571985 3832830 3428930 2724989 2474145 2676870 2768583
39920B768583n9046K94258O67382M31024n9406j92185k29724o05580p70716p3342
$$ 2768583 2709537 3003795 3671177 4102201 4042795 3850610 3620886 3015306 2244590 2171248
39910B171248P14482K88130r73493j299176j65668R26551P57769J6731j07613
$$ 2171248 2885730 3173860 2200367 901191 735523 1662074 2419843 2436574 2328961
39901B328961K68930L05963n0615j94145j0504K8778k69450n58920m92286q7270
$$ 2328961 2597891 2903854 2853239 2659094 2648590 2677368 2407918 1848998 1356712 1269442
39891A269442L51433M31263J4598m55818l30333L32382O83896K54171k99016j34766
$$ 1269442 1620875 2052138 2066736 1610918 1280585 1612967 2296863 2551034 2252018 2117252
39881B117252M82404N49595j68648p57285m40361L61553O71102K79991j13584
$$ 2117252 2599656 3149251 2980603 2223318 1782957 2144510 2815612 3095603 2982019
39872B982019k2984J56125j26072o14011n72843P1106N48947L30194j81857l05540
$$ 2982019 2959035 3115160 2989088 2375077 1802234 1873340 2422287 2752481 2570624 2265084
39862B265084N0212M96435O93710M16920m20228j344283j417224l55801Q42745
$$ 2265084 2315296 2811731 3505441 3922361 3502133 2157850 740626 384825 1227570
39853A227570J043116L83471j46180j60338o2629m9808Q9195K56008Q9809k25918
$$ 1227570 2270686 2654157 2507977 2347639 2285010 2235202 2324397 2580405 2670214 2444296
39843B444296j32957K38840J53327m05477n29169J21791O41185K71604m27236
$$ 2444296 2311339 2550179 2703506 2298029 1768860 1890651 2531836 2803440 2376204
39834B376204n36101j54960J7952p3918N9168M33057N39146K23598j02785j47374
$$ 2376204 1840103 1685143 1703095 1629177 1688345 2121402 2660548 2884146 2781361 2633987
39824B633987n8675k7628l5778n6781j29471j78672o7447J46655K65587K54294
$$ 2633987 2575312 2547684 2511906 2455125 2325654 2146982 2079535 2226190 2491777 2746071
39814B746071K42613K34963P0377k87422o11749o31655l02975J50006M31152M59262
$$ 2746071 2988684 3223647 3294024 3006602 2394853 1763198 1460223 1610229 2041381 2500643
39804B500643M49399N80653O30414K31642m51424p05184j80629N28006O23885
$$ 2500643 2950042 3530695 4161109 4392751 3941327 3236143 3055514 3583520 4207405
39795D207405J73228r2621P1505J08955l46139p64605m58503L50974P74729M42705
$$ 4207405 4380633 4288012 4359517 4468472 4122333 3357728 2899225 3250199 4024928 4467633
39785D467633j17913l39163k80280k10859n9948K82613N09557K94563r4807j63007
$$ 4467633 4349720 4010557 3730277 3519418 3459470 3742083 4251640 4546203 4451396 4288389
39775D288389R343k5000j86491K3751M84492M19450l19732q25469m86370N1436
$$ 4288389 4297732 4272732 4086241 4109992 4594484 5013934 4694202 3868733 3382363 3433799
39765C433799m3936m73402m18961P1378K81015P3297n0774J0439j51549n05869
$$ 3433799 3389863 2916461 2497500 2568878 2849893 2923190 2872416 2882855 2731306 2225437
39755B225437m51394J63801O76134N51635P8439j81183j33633o5678j81961m44824
$$ 2225437 1774043 1937844 2613978 3165613 3244052 3062869 2929236 2863558 2681597 2236773
39745B236773o21098m32530Q2898M44030K99114m1168q0415Q8524Q0724M8575
$$ 2236773 1615675 1183145 1266043 1710073 2009187 1968019 1887604 1976128 2056852 2105427
39735B105427M05366Q37967N74902k45921n20552J30514O24547L7917q87757q07365
$$ 2105427 2510793 3348760 3923662 3677741 3157189 3287703 3912250 3950167 3062410 2255045
39725B255045J85090O73598O010p62445l90808P87354J307229N57446m12777l53269
$$ 2255045 2440135 3113733 3119743 2357298 1966490 2753844 4061073 4618519 4205742 3852473
39715C852473M72760P30111o090o38326k43610N11894M40908l09490n44072Q4890
$$ 3852473 4325233 5055344 5049254 4410928 4167318 4679212 5120120 4810630 4266558 4351448
39705D351448O23915L96947k5477J03447M90973L35328l82615q20072m08512L84854
$$ 4351448 4975363 5372310 5346833 5450280 5941253 6276581 5893966 5073894 4665382 5050236
39695E050236N75428j81487j116127j196223l79018L93754N20922M19288N30838
$$ 5050236 5625664 5444177 4328050 3131827 2752809 3146563 3667485 4086773 4617611
39686D617611M45119k21265p60356l08240N60756M64130o53834j328477p11306
$$ 4617611 5062730 4841465 4081109 3772869 4333625 4797755 4143921 2815444 2104138
39677B104138L24167O21429K08788k16925l68790l09280j1714M17605N89877L68715
$$ 2104138 2428305 3049734 3258522 3041597 2672807 2363527 2351813 2769418 3359295 3728010
39667C728010J17243J02899J34441L0361p7810j22075k32414l24724j35036J99055
$$ 3728010 3845253 3948152 4082593 4112954 4035144 3913069 3680655 3355931 3220895 3419950
39657C419950K19603p1501j82436K3837J67087Q9947j2874k01934o25562p79248
$$ 3419950 3639553 3568052 3385616 3409453 3576540 3666487 3653613 3451679 2826117 2046869
39647B046869m0730J004230J052577R9629m41063J59L03748k79366p87574k55508
$$ 2046869 2006139 3010369 4062946 4162575 3721512 3721671 4025419 3746053 2958479 2702971
39637B702971O17655O97906J89672m9654k4698k05822m06087k26433M0360q702
$$ 2702971 3320626 4018532 4208204 4158550 4133852 3928030 3521943 3295510 3335870 3327168
39627C327168o1501K24942M67240L67484L77022O09000J85014j151387j922686
$$ 3327168 3265667 3490609 3957849 4325333 4702355 5311355 5496369 4344982 2422296
39618B422296r09082P60781J179673M44658M4669K18098p647n71005l59239N70620
$$ 2422296 1513214 2273995 3453668 3898326 3942995 4161093 4153446 3582441 3223202 3793822
39608C793822P97355j50776j063189r92401l51673K66792Q38376J105044N36188
$$ 3793822 4591177 4440401 3377212 2384811 2033138 2299930 3138306 4243350 4779538
39599D779538m53807o65990K7724L64753k73341r01281o25295M0208K89474K43500
$$ 4779538 4325731 3659741 3687465 4052218 3778877 2877596 2252301 2292509 2581983 2825483
39589B825483K60752J31261k32303l00507R0829K30857k17127m57208P1082N60977
$$ 2825483 3086235 3217496 2985193 2684686 2775515 3006372 2789245 2332037 2403119 2964096
39579B964096J37402n76344m20311L97573O65435J01879l49289j09156K99786
$$ 2964096 3101498 2525154 2104843 2502416 3167851 3269730 2920441 2811285 3111071
39570C111071K99806R5671R8195K00497Q8465j41556j27204J64499L47352J35575
$$ 3111071 3410877 3506548 3604743 3805240 3893705 3752149 3624945 3789444 4136796 4272371
39560D272371k81028m92879l65732j05574R0722J88488J38319r0625k28298R2342
$$ 4272371 3991343 3498464 3132732 3027158 3117880 3306368 3444687 3354062 3125764 3218106
39550C218106O67351P84860K57280k04220q0508J63347j786j80890J29863M10204
$$ 3218106 3885457 4670317 4927597 4723377 4642869 4806216 4804430 4623540 4753403 5163607
39540E163607n2981p10027m77367L64339M94068k53088n86617N5513N72738P1558
$$ 5163607 5110626 4400599 3923232 4287571 4781639 4528551 3941934 3997447 4570185 4641743
39530D641743p00404o55650j2796L21705K02457J15328J66848Q0891j48754k96415
$$ 4641743 3941339 3285689 3272893 3594598 3797055 3912383 4079231 4160122 4011368 3714953
39520C714953l37882l52410k71810r9840o0233k21253l05826j00391K82887O39619
$$ 3714953 3377071 3024661 2752851 2653011 2592778 2371525 2065699 1965308 2248195 2887814
39510B887814P62734L67289m76902r64344m30704M69696M87465l05562n53446
$$ 2887814 3650548 4017837 3540935 2576591 2145887 2615583 3103048 2797486 2244040
39501B244040K18235Q55504N06724q3787j6214K91801R7912k57867r0940K97927
$$ 2244040 2462275 3317779 3824503 3740716 3724502 4016303 4114215 3856348 3765408 4063335
39491D063335J87062k68911l62885J836L62211M70001K92195k14789o86502m27796
$$ 4063335 4250397 3981486 3618601 3620437 3982648 4452649 4744844 4530055 3843553 3415757
39481C415757M09201O15093k90018j077875o56085J87114K06235j59760K73259
$$ 3415757 3824958 4440051 4150033 3072158 2416073 2603187 2809422 2649662 2922921
39472B922921J131184R96560j66219r45837p15161k10076Q6894M52552P44582
$$ 2922921 4054105 5050665 4884446 3938609 3223448 3013372 3100266 3552818 4297400
39463D297400L97719k12249m7477O90085O25762m31514r56791j61998P37032N77630
$$ 4297400 4695119 4482870 4435393 5125478 5751240 5319726 4362935 4200937 4937969 5515599
39453E515599k6144q7340Q5632j13052j87460M34949R93985N27327l43649k99495
$$ 5515599 5489455 5402115 5487747 5374695 5187235 5622184 6616169 7143496 6799847 6500352
39443F500352N15283P56992O5756m98454k43628K33724J74300l20928p13435p20632
$$ 6500352 7015635 7772627 7838383 7339929 7096301 7330025 7504325 7183397 6469962 5749330
39433E749330l49928J75684M28223K27170J4359K12796M27617N6788n09489l18400
$$ 5749330 5399402 5575086 6003309 6230479 6244838 6457634 6885251 6942039 6432550 6114150
39423F114150N18371P80686K5978o22522j97809N88065M54630m94518r94701m98338
$$ 6114150 6632521 7413207 7439185 6816663 6618854 7206919 7661549 7167031 6172330 5673992
39413E673992K06508L05961R799l9801J96200K03375k42384p21778p06168j95232
$$ 5673992 5880500 6186461 6196260 6156459 6352659 6556034 6313650 5591872 4885704 4690472
39403D690472L34841N22628M39518K83393M8952k57226l35341M5130N32943N55246
$$ 4690472 5025313 5547941 5987459 6270852 6319804 6062578 5727237 5772367 6305310 6860556
39393F860556J60632o2955N3810N9383k08607k91704l5662j5329m61412n90111
$$ 6860556 7021188 6958233 7012043 7071426 6862819 6571115 6535453 6520124 6058712 5468601
39383E468601J61876R62456P13605k01825n46959k28418k40969p33863p05528
$$ 5468601 5630477 6592933 7306538 7104713 6557754 6329336 6088367 5354504 4648976
39374D648976J14752O29485K11603k20259K06296Q80939Q67253M48567L97807
$$ 4648976 4763728 5393213 5604816 5384557 5590853 6471792 7339045 7787612 8185419
39365H185419N62750L61677j381p060Q1168k14372m63431m5837M95698K18886
$$ 8185419 8748169 9109846 9108465 9101405 9182573 8968201 8504770 8458933 8954631 9173517
39355I173517m75452l99145L27262M08248l34921n58021L09907J047772O54613
$$ 9173517 8698065 8298920 8626182 9034430 8699509 8141488 8451395 9499167 10153780
39346A0153780j19676k25197k295k50444o34087l40792L48749M75120Q426k03739
$$ 10153780 10034104 9808907 9806612 9556168 8922081 8581289 8930038 9405158 9413584 9209845
39336I209845M4924K5162n70224r74918m51213O13753J167382P12678k74535r76405
$$ 9209845 9254769 9279931 8709707 7734789 7283576 7897329 9064711 9777389 9502854 8526449
39326H526449j005396n79796j53063k2436k34791o15983p83541m16627K50494
$$ 8526449 7521053 6941257 6788194 6765758 6530967 5914984 5131443 4714816 4965310
39317D965310N12473J18812k39169J13304P49238P53330J59853j60694J4567m3500
$$ 4965310 5477783 5596595 5357426 5470730 6219968 6973298 7133151 6972457 6987024 6943524
39307F943524o29686r69897m58800L39510N43917J57569j83830j62939O3731K77332
$$ 6943524 6313838 5343941 4885141 5224651 5768568 5926137 5742307 5579368 5643099 5920431
39297E920431L28070J62954j8060K0527Q8678j61530m90530l21736J90455K53656
$$ 5920431 6248501 6411455 6393395 6413922 6502600 6341070 5850540 5528804 5719259 5972915
39287E972915j94375k50095M18486Q79551M05704l72067n42601k40866n6155N0306
$$ 5972915 5778540 5528445 5946931 6826482 7232186 6860119 6317518 6076652 6020497 6070803
39277F070803L08379L50885j46166o15453l53113L42407O51283M13579N3925j95620
$$ 6070803 6379182 6730067 6583901 5968448 5615335 5957742 6609025 7022604 7076529 6880909
39267F880909k67815M152M23413L42658k62048m48516J45178M15661m31056j257973
$$ 6880909 6613094 6617246 7040659 7383317 7121269 6672753 6817931 7233592 6802536 5544563
39257E544563o37039P37073J027345J01511m80727q8659K95929J08221M5857M57078
$$ 5544563 4907524 5644597 6671942 6773453 6292726 6204067 6499996 6608217 6654074 7111152
39247G111152N45940j38997p70890n38272J83649O09695N96644L55086p2642n14420
$$ 7111152 7657092 7518095 6747205 6208933 6392582 7002277 7598921 7954007 7881365 7366945
39237G366945n47421j23201K79431L97499M44862M72993K29415j63763k02247
$$ 7366945 6819524 6696323 6975754 7373253 7818115 8291108 8520523 8356760 8154513
39228H154513J03740J46403k17097l66184P952L65446K42754n2477q8556L6019
$$ 8154513 8258253 8404656 8187559 7821375 7829327 8194773 8437527 8385050 8296494 8332513
39218H332513R8164J93313L79114M11759J75136q8618k00322k40107k12711j9929
$$ 8332513 8430677 8623990 9003104 9414863 9589999 9501381 9301059 9060952 8848241 8828312
39208H828312J91805J99186J71955L59258M45707p928o27137o48207j87314n3669
$$ 8828312 9020117 9219303 9391258 9750516 10196223 10188295 9561158 8912951 8725637 8671968
39198H671968l27514k76319K26124M28337Q5766j05515J97798M48355L55135L73005
$$ 8671968 8344454 8068135 8294259 8722596 8808362 8702847 8900645 9349000 9704135 10077140
39188A0077140N98276L96664l23049o73483k44570J91641Q8341J4969L91222N76348
$$ 10077140 10675416 11072080 10749031 10075548 9830978 10022619 10110960 10125929 10517151 11093499
39178A1093499J20997k69211l1404J43546l73191q12948k80534N78041N79066
$$ 11093499 11214496 10945285 10913881 11057427 10684236 9871288 9590754 10168795 10747861
39169A0747861n8798j96797L36372P11376N87184L68466K29444Q575j32030P2316
$$ 10747861 10689063 10492266 10828638 11540014 12127198 12495664 12725108 12733683 12601653 12673969
39159A2673969L44743K98049J54332K28024K15283j16582j92913L53167O51749
$$ 12673969 13018712 13316761 13471093 13699117 13914400 13797818 13604905 13958072 14609821
39150A4609821j05078r87648n18415R02294J484289P87383J70777L83170N35539
$$ 14609821 14504743 13517095 12998680 13900974 15385263 16172646 16343423 16726593 17262132
39141A7262132n031l68156K92829J308587J525986R34569L38778O5097j49871
$$ 17262132 17257101 16888945 17181774 18490361 20016347 20950916 21289694 21354791 21204920
39132B1204920m13776n54189n20722m23607l28294k67555k41154r4193K85424
$$ 21204920 20791144 20236955 19716233 19292626 18964332 18696777 18455623 18361430 18646854
39123A8646854O13767M93049R0227J5191M24469P91247P19285M43753L20700L34397
$$ 18646854 19260621 19753670 19843897 19859088 20283557 21074804 21794089 22237842 22558542 22892939
39113B2892939L64416M88847P42160R26905R10804Q37636Q82359J044103J265401
$$ 22892939 23257355 23746202 24488362 25415267 26326071 27163707 28046066 29090169 30355570
39104C0355570J506198J676619J751877J907899K264762K624976K827416L197920
$$ 30355570 31861768 33538387 35290264 37198163 39462925 42087901 44915317 48113237
39096D8113237M179584N617667O899628P752486Q470227R469974J1085650J3630856
$$ 48113237 52292821 57910488 64810116 72562602 81032829 90502803 101588453 115219309
39088A15219309J7115604K1017941K4813867K8424944L1443764L2233430K8822459
$$ 115219309 132334913 153352854 178166721 206591665 238035429 270268859 299091318
39081B99091318K0822629R776676k280599j3735096k3029235k8712577l0433802
$$ 299091318 319913947 329690623 327410024 313674928 290645693 261933116 231499314
39074B31499314k9181579k6218827k2408593j8624209j5743097j3753336j1732877
$$ 231499314 202317735 176098908 153690315 135066106 119323009 105569673 93836796
39067I3836796r254368p074572n938109n473833m890753m086252l399235k846371
$$ 93836796 84582428 77507856 71569747 66095914 61205161 57118909 53719674 50873303
39059E0873303k292757j920259j883939j885393j640471j375925j345116j287523
$$ 50873303 48580546 46660287 44776348 42890955 41250484 39874559 38529443 37241920
39051C7241920r21031n42004n53466p91570q94343r25370j016408q25206q6100
$$ 37241920 36320889 35778885 35225419 34433849 33539506 32614136 31597728 30772522 30686422
39042C0686422O43454N99625k0578l10673M611K63241l0093m97947n20869q5076
$$ 30686422 31329876 31929501 31908923 31598250 31602861 31866102 31836009 31338062 30817193 30732117
39032C0732117K70405J19290l83874o41421k94732K31003K04346l14348m45422
$$ 30732117 31002522 31121812 30737938 30096517 29801785 30032788 30237134 29922786 29477364
39023B9477364J38412N64721J26203m48126q9477P80861P90830k09766q77061
$$ 29477364 29615776 30180497 30306700 29858574 29769097 30549958 31340788 31131022 30253961
39014C0253961m19721L86793O38429N44613N99071N76426J79410j71932q8673
$$ 30253961 29834240 30221033 30859462 31404075 32003146 32579572 32758982 32587050 32498377
39005C2498377k9233m28894o71550k0436R31779R71744J37437m11670l10123l89375
$$ 32498377 32469144 32040250 31368700 31348264 32280043 33251787 33389224 32977554 32667431 32278056
38995C2278056r65545j132131l33343N95173P69538N91784P62580Q64017J41694
$$ 32278056 31312511 30180380 29847037 30442210 31211748 31803532 32566112 33430129 33571823
38986C3571823r21687j161101n58093j73801l15416j31918P22804J320881R10705
$$ 33571823 32650136 31489035 30930942 30757141 30441725 30309807 31032611 32353492 33264197
38977C3264197Q1295k28093n8542j9154j97600k70496k31249k59559k08942J03776
$$ 33264197 33345492 33117399 33058857 33039703 32842103 32571607 32340358 32080799 31871857 31975633
38967C1975633L97085L34248J30500J31606J17948k62641o60722m51696J52186
$$ 31975633 32372718 32706966 32837466 32969072 33087020 32824379 32163657 31711961 31864147
38958C1864147K94313j87559m69464j4693O07629N78244k3807l91081n0750O05540
$$ 31864147 32158460 31970901 31501437 31486744 32094373 32672617 32648810 32257729 32206979 32812519
38948C2812519Q04388K52492n04576o60488j05866M52191M50246J28325o7278
$$ 32812519 33616907 33869399 33364823 32704335 32598469 33050660 33500906 33629231 33561953
38939C3561953k13671m87587n12445O1827O64433M41251l63763o72689k20759
$$ 33561953 33348282 32860695 32348250 32410077 33074510 33515761 33151998 32479309 32258550
38930C2258550J21292j48275m17213j22984L33213M08176K95442L21417K09543
$$ 32258550 32379842 32231567 31814354 31691370 32024583 32432759 32728201 33049618 33259161
38921C3259161l05521p42208n51760o7144K7830j87466j11663K66592L51103j8635
$$ 33259161 32953640 32211432 31659672 31592528 31620358 31432892 31321229 31587821 31938924 31920289
38911C1920289k96388j26907J34816M6866k48997k88868L8507L57241K83352j25926
$$ 31920289 31623901 31496994 31631810 31678676 31429679 31140811 31179318 31536559 31819911 31693985
38901C1693985m64675m84705l54775k94631j72771J86995M74998K25720l45606
$$ 31693985 31229310 30744605 30389830 30095199 29922428 30109423 30584421 30810141 30464535
38892C0464535n04270j25913Q8974j58795j70470N07106J031300M16300p78382
$$ 30464535 29960265 29834352 29923326 29764531 29594061 30101167 31132467 31548767 30770385
38883C0770385j071348k24310M16433k6377o91024m04993M59935N45086m13686
$$ 30770385 29699037 29474727 29891160 29864783 29173759 28768766 29228701 29773787 29360101
38874B9360101j115110n27287O32253Q79097j0827p82306n02550K62172M66339
$$ 29360101 28244991 27717704 28349957 29229054 29218227 28435921 27933371 28195543 28661882
38865B8661882P1850j98517j33286j61262l80507l83537j02664M3403J903K09320
$$ 28661882 28733732 28535215 28401929 28240667 27860160 27476623 27373959 27417362 27419265 27628585
38855B7628585O12728M90393l26718r44617o87672p7274J17195J1373K5920n6679
$$ 27628585 28241313 28731706 28404988 27460371 26772699 26695425 26812620 26823993 26849913 26793234
38845B6793234n16068q21389l91657K69982L13283K492K12890P34214M67979o34845
$$ 26793234 26277166 25455777 25064120 25334102 25647385 25649877 25862767 26596981 27064960 26430115
38835B6430115j235215o00977K88283K73601l39290m82752K5863M38798L31855
$$ 26430115 25194900 24593923 24882206 25155807 24816517 24333765 24359628 24798426 25130281
38826B5130281Q0293J17011L28430L49681J14553j16446j76335k23958m37983
$$ 25130281 25210574 25327585 25656015 26005696 26120249 26003803 25827468 25603510 25165527
38817B5165527o28522m70595j06338n2248l57727m13351N7315M06790K8225o14953
$$ 25165527 24537005 24066410 23960072 23907824 23550097 23136746 23194061 23600851 23629076 23014123
38807B3014123o58685j42050J78014M7844q7976N1546L25438O24826Q21102M97385
$$ 23014123 22355438 22213388 22391402 22439246 22351270 22402816 22728254 23353080 24174182 24671567
38797B4671567m09297r95570m71579M10308K74206o72512q55588J11337P44191
$$ 24671567 24262270 23266700 22795121 23205429 23479635 22807123 21951535 22062872 22807063
38788B2807063R0677p87530o28948J18925L33205L8822m3439Q1892k7592j70218
$$ 22807063 22897740 22110210 21481262 21600187 21933392 21972214 21928775 22010667 21983075 21812857
38778B1812857R9756M65432L45167j4419J535K10434R18m54869m58497m2003J12438
$$ 21812857 21912613 22378045 22723212 22708793 22710328 22920762 22921680 22466811 22008314 21966311 22078749
38767B2078749j08873j53978J11347K12804p680j85884k02557l04425m24325k26759
$$ 22078749 21969876 21815898 21927245 22140049 22132369 21946485 21743928 21439503 21015178 20788419
38757B0788419J25373J00522k43481k91581M9806J90493q2498k75373j32862k9306
$$ 20788419 20913792 21014314 20770833 20479252 20529058 20719551 20637053 20361680 20228818 20199512
38747B0199512j33456m9889L45964N37971K53225n2090l4063l0693k81501l22641
$$ 20199512 20066056 20016167 20362131 20900102 21153327 21101237 21067174 21036481 20754980 20432339
38737B0432339J96502P18745N26803j55897n06270k45798J61458K42009n2642
$$ 20432339 20628841 21347586 21874389 21718492 21212222 20966424 21127882 21369891 21317249
38728B1317249m65034o08490k40948L48465N24411J24991l08990l77490l41485
$$ 21317249 20852215 20243725 20002777 20351242 20875653 21000644 20691654 20314164 19972679
38719A9972679m27687k65962L75157Q69197N21161l21360p30082m73298o2712
$$ 19972679 19544992 19279030 19654187 20523384 21044545 20723185 19993103 19519805 19457093
38710A9457093K09004M43543N18847J59790m02117o15111m33238k28399M240M72969
$$ 19457093 19666097 20109640 20628487 20788277 20386160 19771049 19337811 19109412 19113652 19586621
38700A9586621P16457J9170j148372j320569j43827Q65685M35822o14263o89051
$$ 19586621 20303078 20322248 19173876 17853307 17709480 18575165 19010987 18396724 17707673
38691A7707673J98827O52493J26604m23578k21683J99520J9698n62575o93815
$$ 17707673 17906500 18558993 18685597 18262019 18040336 18239856 18259554 17696979 17003164
38682A7003164j12662N40578N51452p9718o94604o94639j59978L20908M34651
$$ 17003164 16890502 17431080 17982532 17902814 17208210 16513571 16353593 16674501 17109152
38673A7109152M53873N78253M23055k88459q80803m30647P31527J177226L14971
$$ 17109152 17563025 18141278 18564333 18275874 17395071 16964424 17695951 18873177 19188148
38664A9188148p25851o84679J27836M90529Q7719k68494j2353M81414O38125L98450
$$ 19188148 18462297 17777618 17905454 18395983 18483702 18215208 18202855 18684269 19322394 19720844
38654A9720844J6678l15247m53323l19235p9667N425m3181j5900O9128L4781m4079
$$ 19720844 19737522 19422275 18968952 18649717 18570050 18575475 18532294 18516394 18585522 18620303 18576224
38643A8576224K5144Q1492j50565l95362j04334N39457O98803J76326k23197Q73
$$ 18576224 18601368 18682860 18532295 18136933 18032599 18572056 19270859 19447185 19223988 19224861
38633A9224861K64344P732k78353L0390M77860K67802k90784k41928L66913N03833
$$ 19224861 19489205 19496937 19218584 19248974 19726834 19994636 19703852 19461924 19828837 20332670
38623B0332670j50197o76747l81004K08929K65581j72399m76770l46693O890K43113
$$ 20332670 20182473 19505726 19124722 19333651 19599232 19426833 18950063 18603370 18610260 18853373
38613A8853373J55658j55723k61121Q7400M32673J53563m74412n12037J95923
$$ 18853373 19009031 18853308 18592187 18679587 19112260 19265823 18791411 18279374 18475297
38604A8475297O64419K45054l71777k35417M66477Q15339M84770p3805m41374
$$ 18475297 19139716 19384770 19012993 18777576 19244053 20059392 20544162 20470357 20028983
38595B0028983n52902m25203j40332N6786O9628J16109K31839L2065n61402q62933
$$ 20028983 19476081 19050878 18910546 18967332 19036960 19153069 19384908 19416973 18855571 17992638
38585A7992638l51981L92091M75781M7571m0158L17550L93621k5046k54018R2499
$$ 17992638 17640657 18032748 18508529 18556100 18515942 18833492 19227113 19202067 18948049 19040548
38575A9040548M46308K30897k77447n00661l86330k01590L5784M10278O97322
$$ 19040548 19486856 19717753 19440306 18939645 18553315 18351725 18387509 18797787 19495109
38566A9495109N81047J54646j40473k2202L80857P13022P02786L66840k2952k15041
$$ 19495109 20076156 20230802 20090329 20068127 20448984 21162006 21864792 22231632 22208680 21993639
38556B1993639j81399L498L02512N68048M98882N1228l08043j16445M84708J012679
$$ 21993639 21812240 21815738 22118250 22686298 23185180 23236408 22928365 22811920 23296628 24309307
38546B4309307J281589J387059J353364J315225J742572K832305L951685M450190
$$ 24309307 25590896 26977955 28331319 29646544 31389116 34221421 38173106 42623296
38538D2623296M764751N760569P086627P274018N586862K747008l22317l309240
$$ 42623296 47388047 53148616 60235243 67509261 73096123 75843131 75520814 72211574
38530G2211574n761284o816457o388197n569985n103353m426258l060212j875306
$$ 72211574 66450290 59633833 53245636 47675651 42572298 38146040 35085828 33210522
38522C3210522j824173k281730k006229j165688r39733j404591j356684l42026
$$ 33210522 31386349 29104619 27098390 25932702 24992969 23588378 22231694 21889668
38514B1889668N44378L12629n72759j047935q21410l24601P5679K45174R0539
$$ 21889668 22434046 22746675 22173916 21125981 20304571 19979970 20055649 20300823 20391362
38505B0391362k89112n02084k82716J51531L89481L06533R0790m8564n4999m362
$$ 20391362 20102250 19600166 19317450 19468981 19858462 20164995 20255785 20207221 20152222 20147860
38495B0147860J8268N3088J97204L44604K22075j34802k30446K40734Q46789R30011
$$ 20147860 20166128 20219216 20416420 20761024 20983099 20848297 20617851 20858585 21705374 22635385
38485B2635385M67886j7703k27996k60160j52719J62966M79242M48683J77355
$$ 22635385 23103271 23085568 22857572 22597412 22444693 22607659 23086901 23535584 23712939
38476B3712939J69034N56189Q59050O89077K83460J04977K08700K62218N5963
$$ 23712939 23881973 24438162 25297212 25986289 26269749 26374726 26583426 26845644 26901607
38467B6901607j94784p8411M73413R39127P42589P1580k34045J94300P06581N65116
$$ 26901607 26706823 26628412 27101825 28040952 28783541 28855121 28621076 28815376 29521957 30087073
38457C0087073m3609m20477l51038j03726J85734M61883M13263r2166n17870l33888
$$ 30087073 30043464 29622987 29271949 29168223 29353957 29815840 30229103 30136937 29619067 29285179
38447B9285179J23248K39760J83054M11242N23800j55725j067883r37991J21873
$$ 29285179 29408427 29648187 29831241 30242483 30766283 30610558 29542675 28604684 28726557
38438B8726557N53460k47704r93240o13996J31335J15470l24353j97277M17121
$$ 28726557 29280017 29032313 28039073 27425077 27556412 27671882 27347529 27150252 27567373
38429B7567373O99893N12277L03701O8348m68821r38814o93124N3211L87007m0885
$$ 27567373 28267266 28779543 29083244 29151592 28682771 27743957 27050833 27104044 27491051 27450166
38419B7450166o88932r80459q00378k66084L32687N05052R7745l21519k25240
$$ 27450166 26761234 25780775 24980397 24714313 25047000 25552052 25649797 25328278 25103038
38410B5103038L2789j30535l86704J2332P78412P67695k32892r92418n53765M25322
$$ 25103038 25135827 25005292 24618588 24630920 25409332 26177027 25944135 24951717 24397952 24823274
38400B4823274O75109K8869n72152m48395J25317N39879O20010N96119O15422
$$ 24823274 25498383 25527252 24955100 24506705 24632022 25171901 25791911 26388030 27003452
38391B7003452N86159M91267N58250Q75104J030651N71007k20450n47378k33991
$$ 27003452 27589611 28080878 28639128 29514232 30544883 31115890 30895440 30348062 30114071
38382C0114071j7959m12070r25752r11212n57954l79924k76865O3585K88586j10191
$$ 30114071 30096112 29684042 28758290 27847078 27289124 26909200 26632335 26695920 26984506 26874315
38372B6874315o94539n54160K07179N35439M9170m58702l58009M374J73142K77036
$$ 26874315 26179776 25625616 25832795 26368234 26417404 25958702 25600693 25605067 25778209 26055245
38362B6055245L68587J8563p72729j098656m00134M68661L48756n27431r37416
$$ 26055245 26423832 26442395 25669666 24571010 24170876 24639537 24988293 24460862 23523446
38353B3523446m87466J6831N45j17527J11731L26221M1793m20897l96133N3133
$$ 23523446 23035980 23052811 23053356 22935829 23047560 23373781 23415574 22994677 22598544 22651677
38343B2651677K47826J9112j0946M99104R17704N45443k39970m81322r7358K6312
$$ 22651677 22899503 22918615 22907669 23406773 24324477 24869920 24629950 24148628 24051270 24077582
38333B4077582m77843p93988k21142O48028Q02350L02872j0483N4264n5730m06055
$$ 24077582 23599739 22805751 22584609 23232637 24034987 24337859 24327376 24381640 24325910 23919855
38323B3919855l34703L46543Q86867P39111L42141K63432L01946O4582j97248
$$ 23919855 23585152 23931695 24818562 25557673 25899814 26163246 26465192 26529774 26332526
38314B6332526p5581J29404j54637p38080q78946m23862K7171J14714J34721L07790
$$ 26332526 26256945 26386349 26231712 25493632 24614686 24190824 24217995 24332709 24467430 24775220
38304B4775220L48075Q8030p4033J89510N19398M28964J27994J54181L93692K14221
$$ 24775220 25123295 25211325 25137292 25326802 25846200 26275164 26403158 26557339 26951031 27165252
38294B7165252m12935p11328k92738J79915L1836l42086j60045M26382N89942
$$ 27165252 26752317 26040989 25748251 25928166 25960002 25617916 25457871 25884253 26474195
38285B6474195J98785m2632J56862K80078Q0945O3907M45495N80310N9108m64346
$$ 26474195 26672980 26630348 26787210 27067288 27148233 27212140 27657635 28237945 28297053 27832707
38275B7832707l23242L5454j16233m82412l26775J53127K10606l3103J83132P62610
$$ 27832707 27509465 27544919 27428686 26946274 26619499 26772626 26983232 26950129 27133261 27895871
38265B7895871P86212J18250k94115J5103L61682J95593p4560o4309j76270p13547
$$ 27895871 28682083 28800333 28506218 28521321 28883003 29078596 29004036 28939727 28763457 28049910
38255B8049910j110828p86944q6765K89814K14423o6007m28570o37846k70242
$$ 28049910 26939082 26152138 26065373 26355187 26569610 26503603 26075033 25437187 25166945
38246B5166945N48389R87721O74954K98875M30744N68605J71441j96599J73082
$$ 25166945 25715334 26703055 27378009 27676884 28107628 28676233 28847674 28651075 28824157
38237B8824157P29744M79234k79511m00624J60046K50478n66853j332157j217592
$$ 28824157 29553901 30033135 29753624 29353000 29513046 29763524 29196671 27864514 26646922
38228B6646922o05461k15637j13674o9962j05851j82777n276M08901N41630J69918
$$ 26646922 26041461 25825824 25712150 25642188 25536337 25353560 25348284 25757185 26298815 26468733
38218B6468733k01994j06674K24184L70676L67700L76362K13659k50246o34099
$$ 26468733 26266739 26160065 26384249 26754925 27122625 27498987 27712646 27462400 26828301
38209B6828301n58590l01916l63179o25298n83617k61517k08266n40345o57832
$$ 26828301 26269711 25967795 25604616 24979318 24395701 24134184 23925918 23385573 22727741
38200B2727741j85188L57550K88884j74128j90359M40856R29883O42094J6838
$$ 22727741 22542553 22900103 23188987 23014859 22824500 23265356 24195239 24837333 24854171
38191B4854171j75177o2361l61936r93613j007757j59569M44852p5291r83087
$$ 24854171 24678994 24616633 24254697 23261084 22253327 22093758 22538610 22463319 21480232
38182B1480232j019702k68878J83363O1933J00740N04102N38770n8521m70657
$$ 21480232 20460530 20191652 20375015 20436948 20537688 21041790 21580560 21522039 21051382
38173B1051382j20328L97559L16694k04981o05824p60746o77480j48509N78820
$$ 21051382 20931054 21328613 21645307 21440326 20834502 20073756 19396276 19247767 19826587
38164A9826587N96163l21002r30497j71298J043217R76147l71505j266247p52933
$$ 19826587 20422750 20101748 19171251 18999953 20043170 21019317 20647812 19381565 18628632
38155A8628632K33299N15525J76450q6944q9229j2922J26032K99665K95013J25706
$$ 18628632 18861931 19377456 19553906 19466962 19377733 19364811 19490843 19790508 20085521 20211227
38145B0211227J02829K24654J07274k33849k71199O0507J22069k61610l08631
$$ 20211227 20314056 20538710 20645984 20412135 20140936 20201443 20323512 20061902 19753271
38136A9753271M08547J060214P98404Q0413k21171k68218o33440q63439j06131
$$ 19753271 20161818 21222032 22020436 22100849 21879678 21611460 20978020 20114581 20008450
38127B0008450J134085J387146M02548m70451l27398J96122K78067R5990N7017
$$ 20008450 21142535 22529681 22932229 22461778 22134380 22330502 22608569 22704559 22761576
38118B2761576m3647l55632l94773R2931M85020K68088p6480K7819K01119j24988
$$ 22761576 22717929 22362297 21967524 22060455 22545475 22813563 22737083 22764902 22966021 22841033
38108B2841033n44281l39875J81251J61519k98143k84469L50606P15173L41980
$$ 22841033 22296752 21956877 22138128 22299647 22001504 21717035 22067641 22782814 23124794
38099B3124794r5926J21876P65850J162186J090563P88390N05236L85000M84741
$$ 23124794 23028868 23150744 23916594 25078780 26169343 26957733 27462969 27847969 28332710
38090B8332710O89902Q18777Q48493Q09849N88912J87245l1003J45905K48085
$$ 28332710 29022612 29841389 30689882 31499731 32088643 32275888 32244885 32390790 32638875
38081C2638875k23349q15221o59328O1479K00986n98374j286454j000641l19373
$$ 32638875 32415526 31600305 30940977 31002456 31203442 30605068 29318614 28317973 27998600
38072B7998600k34857o72690q89727p62720p25433p54499l91415K82207N57014
$$ 27998600 27763743 27091053 26201326 25438606 24713173 23958674 23567259 23849466 24406480
38063B4406480J32222m37487n61374l43965k19633k91675l98386n48279q56975
$$ 24406480 24538702 24101215 23539841 23195876 22976243 22684568 22286182 21737903 20880928
38054B0880928j137030r79776l74488R2083n2377m67421m30855J07629M36641
$$ 20880928 19743898 18764122 18389634 18481717 18429340 17961919 17531064 17638693 18075334
38045A8075334J59905k28869j73861J14966J70889Q1807J22626M1766m44317q06051
$$ 18075334 18235239 18006370 17832509 17947475 18118364 18200171 18322797 18364563 17920246 17114195
38035A7114195l53989M64887N38820j70035n51917j60378J78460n3497j89643
$$ 17114195 16760206 17225093 17763913 17593878 17041961 16881583 17060043 17006546 16816903
38026A6816903K37003M59195k02798r84536p90018N9758L75717q9808n36571n05327
$$ 16816903 17053906 17513101 17310303 16325767 15535749 15595507 15971224 15881416 15344845 14839518
38016A4839518k66422J3712M48188P95528N86811l5677l87832k21656N1665J38061
$$ 14839518 14573096 14586808 15034996 15830524 16417335 16381658 15993826 15772170 15823835 15961896
38006A5961896J76600K36325J58773j2541l8843J2344j56839m48626m16309l5182
$$ 15961896 16138496 16374821 16533594 16521053 16482210 16494554 16337715 15889089 15472780 15437598
37996A5437598J64348q5577l69664k43143J05361J43923k79229p39391p01581
$$ 15437598 15601946 15516369 15146705 14903562 15008923 15152846 14873617 14134226 13432645
37987A3432645j12878M79348N09158Q6020j62348K5158K53051K10490J33548J98147
$$ 13432645 13319767 13799115 14308273 14394293 14231945 14257103 14510154 14720644 14854192 15052339
37977A5052339N7056m98617r49762p42383j39036K32704K60858J76698j0738k36038
$$ 15052339 15109395 14610778 13661016 12918633 12779597 13012301 13273159 13449857 13439119 13203081
37967A3203081o9271N31587P16075r0052j042302r63108j04984L46489J33928
$$ 13203081 13133810 13665397 14381472 14291420 13249118 12286010 12181026 12527515 12661443
37958A2661443j5740R2897j1220k02445J41460P28603N66801k22202l64272M34597
$$ 12661443 12645703 12738600 12727380 12524935 12666395 13394998 13961799 13739597 13375325 13809922
37948A3809922R04090L20500l57757k40842Q9224q8554k51971K24159O90556L21767
$$ 13809922 14714012 15034512 14676755 14435913 14525137 14436583 14184612 14408771 15099327 15421094
37938A5421094k87486j8808Q68833J092564K94753n51843n77216R1384Q02077
$$ 15421094 15133608 15114800 15983633 17076197 17370950 16819107 16241891 16333275 17135352
$$ [...]
##END NTUPLES=NMR SPECTRUM
##END=
