##TITLE=31Pdec_SR104_3
 , 124 sc
 17.2.2022
##JCAMPDX= 6.0         $$ Bruker NMR JCAMP-DX V2.0
##DATA TYPE= NMR SPECTRUM
##DATA CLASS= NTUPLES
##ORIGIN= UXNMR, Bruker Analytische Messtechnik GmbH
##OWNER= root
$$ XWIN-NMR		Version 3.5
$$ Thu Feb 17 12:46:08 2022 Russian Standard Time (UT+4h)  she@DPX200
##.OBSERVE FREQUENCY= 81.013821
##.OBSERVE NUCLEUS= ^31P
##.ACQUISITION MODE= SIMULTANEOUS
##.ACQUISITION SCHEME= undefined
##.AVERAGES= 124
##.DIGITISER RES= 16
##SPECTROMETER/DATA SYSTEM= spect
##.PULSE SEQUENCE= zgpg30
##.SOLVENT NAME= CDCl3
##.SHIFT REFERENCE= (INTERNAL, CDCl3, 0, 248.564)
##AUDIT TRAIL= $$ (NUMBER, WHEN, WHO, WHERE, WHAT)
$$ ##TITLE= Audit trail, XWIN-NMR		Version 3.5
$$ ##JCAMPDX= 5.01
$$ ##ORIGIN= Bruker BioSpin GmbH
$$ ##OWNER= she
$$ F:/spectra/data/she/nmr/P31/1/pdata/1/auditp.txt
$$ ##AUDIT TRAIL=  $$ (NUMBER, WHEN, WHO, WHERE, WHAT)
(   1,<2022-02-17 12:44:54.06 +0400>,<she>,<DPX200>,
      <created by zg, POWCHK disabled, PULCHK disabled
       configuration hash MD5:
       00 E9 B6 7A A2 85 ED C7 34 08 36 98 17 FE 4E 26
       data hash MD5: 32K
       44 7E 71 46 7A A9 63 20 41 E3 07 CD 85 0E F3 33>)
(   2,<2022-02-17 12:44:56.43 +0400>,<she>,<DPX200>,
      <Start of raw data processing
       efp BC_mod = 2 LB = 1 FT_mod = 6 PKNL = 1 PHC0 = -9193.78 PHC1 = 108.0745 SI = 64K 
       data hash MD5: 64K
       D2 0A 59 A7 81 78 7B 2A 16 85 A6 E3 C8 11 70 43>)
(   3,<2022-02-17 12:45:14.21 +0400>,<she>,<DPX200>,
      <pk PHC0 = 8.040641 PHC1 = 0 
       data hash MD5: 64K
       0D 39 03 FE EC E5 5C BE B2 12 3C 4A D5 82 FB 3C>)
(   4,<2022-02-17 12:45:38.67 +0400>,<she>,<DPX200>,
      <pk PHC0 = -0.2000042 PHC1 = 0 
       data hash MD5: 64K
       A2 BA 18 29 A6 1B 65 87 4F DA 13 4D FE 4E 9A 92>)
$$ ##END=
$$ 
$$ hash MD5
$$ 78 82 CD 52 06 C6 7C 96 73 B7 22 02 AA 2C 54 6A
##$RELAX= 
##$RELAX= 
##$RELAX= 
##$RELAX= 
##$RELAX= 
##$RELAX= 
##$RELAX= 
##$RELAX= 
$$ Bruker specific parameters
$$ --------------------------
##$DU= <F:/spectra>
##$EXPNO= 1
##$NAME= <P31>
##$PROCNO= 1
##$TYPE= <nmr>
##$USER= <she>
##$AMP= (0..31)
100 100 100 100 100 100 100 100 100 100 100 100 100 100 100 100 100 100 
100 100 100 100 100 100 100 100 100 100 100 100 100 100 
##$AQSEQ= 0
##$AQ_mod= 1
##$AUNM= <au_zg>
##$AUTOPOS= <>
##$BF1= 81.014009
##$BF2= 200.13
##$BF3= 200.13
##$BF4= 200.13
##$BF5= 200.13
##$BF6= 200.13
##$BF7= 200.13
##$BF8= 200.13
##$BYTORDA= 1
##$CFDGTYP= 0
##$CFRGTYP= 5
##$CHEMSTR= <none>
##$CNST= (0..31)
1 1 145 1 1 1 1 1 1 1 1 1 1 1 1 1 1 1 1 1 1 1 1 1 1 1 1 1 1 1 1 1 
##$CPDPRG= <waltz16>
##$CPDPRG1= <>
##$CPDPRG2= <waltz16>
##$CPDPRG3= <>
##$CPDPRG4= <mlev>
##$CPDPRG5= <mlev>
##$CPDPRG6= <mlev>
##$CPDPRG7= <mlev>
##$CPDPRG8= <mlev>
##$CPDPRGB= <>
##$CPDPRGT= <>
##$D= (0..31)
0 1 0 0 0 0 0 0 0 0 0 0.03 2e-05 3e-06 0 0 0 0 0 0 0 0 0 0 0 0 0 0 0 0 
0 0 
##$DATE= 1645087493
##$DBL= (0..7)
120 120 120 11 120 120 24 19 
##$DBP= (0..7)
150 150 150 150 150 150 150 150 
##$DBP07= 0
##$DBPNAM0= <>
##$DBPNAM1= <>
$$ [...]
##$SUBNAM2= <"">
##$SUBNAM3= <"">
##$SUBNAM4= <"">
##$SUBNAM5= <"">
##$SUBNAM6= <"">
##$SUBNAM7= <"">
##$SUBNAM8= <"">
##$SUBNAM9= <"">
##$SW= 501.771253377433
##$SWIBOX= (0..15)
0 1 3 0 0 0 0 0 0 0 0 0 0 0 0 0 
##$SW_h= 40650.406504065
##$TD= 32768
##$TD0= 1
##$TE= 0
##$TE2= 300
##$TE3= 300
##$TEG= 300
##$TL= (0..7)
0 120 53 12 22 120 120 120 
##$TP= (0..7)
150 150 150 150 150 150 150 150 
##$TP07= 0
##$TPNAME0= <>
##$TPNAME1= <>
##$TPNAME2= <>
##$TPNAME3= <>
##$TPNAME4= <>
##$TPNAME5= <>
##$TPNAME6= <>
##$TPNAME7= <>
##$TPOAL= (0..7)
0.5 0.5 0.5 0.5 0.5 0.5 0.5 0.5 
##$TPOFFS= (0..7)
0 0 0 0 0 0 0 0 
##$TUNHIN= 0
##$TUNHOUT= 0
##$TUNXOUT= 0
##$USERA1= <user>
##$USERA2= <user>
##$USERA3= <user>
##$USERA4= <user>
##$USERA5= <user>
##$V9= 5
##$VALIST= <valist>
##$VCLIST= <CCCCCCCCCCCCCCC>
##$VD= 0
##$VDLIST= <DDDDDDDDDDDDDDD>
##$VPLIST= <PPPPPPPPPPPPPPP>
##$VTLIST= <TTTTTTTTTTTTTTT>
##$WBST= 1024
##$WBSW= 4
##$XGAIN= (0..3)
0 0 0 0 
##$XL= 0
##$YL= 0
##$YMAX_a= 71303
##$YMIN_a= -111223
##$ZGOPTNS= <>
##$ZL1= 120
##$ZL2= 120
##$ZL3= 120
##$ZL4= 120
##$ABSF1= 0
##$ABSF2= 0
##$ABSG= 0
##$ABSL= 0
##$ALPHA= 0
##$AQORDER= 0
##$ASSFAC= 0
##$ASSFACI= 0
##$ASSFACX= 0
##$ASSWID= 0
##$AUNMP= <proc_1d>
##$AZFE= 0.1
##$AZFW= 0.5
##$BCFW= 0
##$BC_mod= 2
##$BYTORDP= 0
##$COROFFS= 0
##$CY= -3
##$DATMOD= 1
##$DC= 0
##$DFILT= <>
##$DTYPP= 0
##$F1P= 0
##$F2P= 0
##$FCOR= 1
##$FTSIZE= 65536
##$FT_mod= 6
##$GAMMA= 0
##$GB= 0
##$INTBC= 1
##$INTSCL= 5.30512e-09
##$ISEN= 30
##$LB= 1
##$LEV0= 0
##$LPBIN= 0
##$MAXI= 10000
##$MC2= 0
##$MEAN= 0
##$ME_mod= 0
##$MI= 50
##$NCOEF= 0
##$NC_proc= -5
##$NLEV= 6
##$NOISF1= 182.463
##$NOISF2= 159.3651
##$NSP= 0
##$NTH_PI= 0
##$NZP= 0
##$OFFSET= 248.5645
##$PC= 4
##$PHC0= -9185.939
##$PHC1= 108.0745
##$PH_mod= 1
##$PKNL= yes
##$PPARMOD= 0
##$PSCAL= 0
##$PSIGN= 0
##$REVERSE= no
##$SF= 81.014009
##$SI= 65536
##$SIGF1= 159.3651
##$SIGF2= -187.1042
##$SINO= 113.3802
##$SIOLD= 16384
##$SREGLST= <1H.CDCl3>
##$SSB= 0
##$STSI= 65536
##$STSR= 0
##$SW_p= 40650.406504065
##$SYMM= 0
##$S_DEV= 0
##$TDeff= 32768
##$TDoff= 0
##$TI= <>
##$TILT= no
##$TM1= 0
##$TM2= 0
##$TOPLEV= 0
##$USERP1= <user>
##$USERP2= <user>
##$USERP3= <user>
##$USERP4= <user>
##$USERP5= <user>
##$WDW= 1
##$XDIM= 65536
##$YMAX_p= 405931502
##$YMIN_p= -6494330
$$ End of Bruker specific parameters
$$ ---------------------------------
##NTUPLES= NMR SPECTRUM
##VAR_NAME=  FREQUENCY,     SPECTRUM/REAL,   SPECTRUM/IMAG
##SYMBOL=    X,             R,               I
##VAR_TYPE=  INDEPENDENT,   DEPENDENT,       DEPENDENT
##VAR_FORM=  AFFN,          ASDF,            ASDF
##VAR_DIM=   65536,         65536,           65536
##UNITS=     HZ,            ARBITRARY UNITS, ARBITRARY UNITS
##FACTOR=    0.620285442955139, 1,           1
##FIRST=     20137.2065510759, 0,            0
##LAST=      -20513.1999529892, 0,           0
##MIN=       -20513.1999529892, -6494330,    0
##MAX=       20137.2065510759, 405931502,    0
$$ Real data points
##PAGE= N=1
##DATA TABLE= (X++(R..R)), XYDATA
$$ [...]
41701b805495P6941m82083j261940j113480j61124M28607K43033J92229R64840
41692c918472J710254J074595p18385j805062j002673O43693J319592Q10283L87954
41683a498221O51591P79098J43023n84383n92522j89060j2132K01393R28646J474651
41673A302084O64176j076165j686599j05386K036075K247770K53061j723909j734388
41664A76719k77888P58113O58074M18000Q17768J118809L71067q28393j070109
41655B142160l01447J08743l61241m86848O04790J693073J091261p31912j656949
41646B101630q48162K82158L10523l24194l94793J75076M89949K68428J02145
41637B162760J95988n8081r01743j518859j185755m28098j43178q1194N86730
$$ y = [-2805495, -2728554, -3210637, -4472577, -5586057, -5747181, -5318574, -5075541, -4883312, -3918472, -2208218, -1133623, -1852008, -3657070, -4659743, -4016050, -2696458, -1886175, -1498221, -846630, -67532, 75491, -508892, -1101414, -1290474, -1302606, -1101213, -172567, 1302084, 1966260, 890095, -796504, -901890, 1134185, 3381955, 3635016, 1911107, 176719, -101169, 656944, 1315018, 1733018, 2550786, 3669595, 4040662, 3212269, 2142160, 1840713, 1949456, 1588215, 1101367, 1706157, 3399230, 4490491, 3758579, 2101630, 1253468, 1535626, 1846149, 1521955, 1127162, 1302238, 1792187, 2060615, 2162760, 2358748, 2300667, 1398924, -119935, -1305690, -1733788, -1876966, -1958160, -1371430]
41628a371430J392616Q41962j021446j951218m88665J731928K192621R55660K6580
41619B308608n896l46523j152110r17697O31097J457684L12704j138172r53345
41610A96350K5977k04295j362293j366233K57905J648523J355441O3991p22694
41601a07328l96565O47853J576075J566053N05465o91610j073353p31741l07742
41592I87107J9848K40776m1224p62565p97417M04448J367774N10631j148253j262327
41582d81202K59930J246022P57753J26811J89391M2182o97277q56701j7426M53005
41572A022488n9675j37469Q98204J293329q0718j226005j04605J677886J276748
41563D560183o93677j207848J89384R80365J94116k15913P87517J414661L74149
$$ y = [-1371430, 21186, 863148, -158298, -2109516, -2598181, -866253, 1326368, 2282028, 2308608, 2302712, 1956189, 804079, -113618, 517479, 1975163, 2287867, 1149695, 196350, 222327, 18032, -1344261, -2710494, -2452589, -804066, 551375, 615366, -107328, -503893, 143960, 1720035, 3286088, 3791553, 3099943, 2026590, 1294849, 987107, 1006955, 1247731, 1206507, 443942, -353475, 50973, 1418747, 1929378, 781125, -481202, -221272, 1024750, 1782503, 1909314, 2098705, 2140887, 1443610, 586909, 569483, 1022488, 962813, 825344, 1723548, 3016877, 2936159, 1710154, 1605549, 3283435, 4560183, 3866506, 2658658, 2848042, 3828407, 4022523, 3806610, 4594127, 6008788, 6382937]
41554F382937p10017p2272J242449J298107M22019K28163P43747P96444M82208
41545A0813785R64993K125743K553486J954060J627248K201594K687452K423158
41537B7351519K352590L393352M798725N307074N046345N110792N818570O543700
41529F5722667O930255P128862O924163N712519L542348J349822j20671j062027
41521I6127938k114143l618249n381759o675299o623769n347638m499794n514618
41513E6352669p287136p068516m192529j350802j094789k510422k981847k129064
41505B7737564j813120k657024k982403j703655k17346k94500j517345k109090
41497A4443081j443856m86097j73296m37660p37201p76608o03075l99673k75118
$$ y = [6382937, 5672920, 5600648, 6843097, 8141204, 8563223, 8791386, 9535133, 10331577, 10813785, 11778778, 13904521, 16458007, 18412067, 20039315, 22240909, 24928361, 27351519, 29704109, 33097461, 37896186, 43203260, 48249605, 53360397, 59178967, 65722667, 72652922, 79781784, 86705947, 92418466, 95960814, 97310636, 97189965, 96127938, 94013795, 90395546, 85013787, 78338488, 71714719, 66367081, 61867287, 56352669, 49065533, 41997017, 37804488, 36453686, 35358897, 32848475, 29866628, 27737564, 25924444, 23267420, 20285017, 18581362, 18364016, 18069516, 16552171, 14443081, 12999225, 12513128, 12339832, 11902172, 11164971, 10388363, 9785288, 9385615, 9110497]
41488I110497j67840l4827n2169l56472p22066q82047r57837j060327q06327N47
41478D071132N74532J09759p07703m78816O65092J122710L27596m67606l93403
41469D823293k03014n05434n25106J99464N42068k72304r26996k3957J363252
41460D471266J196656l04554j118639o25940j46704l59170l60613L15774O73647
41451C741723j3298r06976q71020j150P89790R38560M89465j68791m95353k67196
41441C235754M3625q4333l43222j15203L51890K83733k10807j90537N62887J118293
41431D652080P62746j15873p30218o89579j3773Q46648J022705J34683q79659
41422D989760p93511J71396P08204L91285K8787R3576J97011K57421P43512J438913
$$ y = [9110497, 8942657, 8907830, 8855661, 8499189, 7777123, 6895076, 5937239, 4876912, 4070585, 4071132, 4645664, 4755423, 4047720, 3568904, 4233996, 5356706, 5684302, 5216696, 4823293, 4620279, 4114845, 3589739, 3789203, 4331271, 4058967, 3131971, 3108014, 4471266, 5667922, 5363368, 4244729, 3618789, 3472085, 3112915, 2752302, 3068076, 3741723, 3728425, 2821449, 1950429, 1949279, 2739069, 3677629, 4167094, 3998303, 3502950, 3235754, 3279379, 3195046, 2851824, 2736621, 3088511, 3372244, 3161437, 2970900, 3533787, 4652080, 5414826, 5298953, 4568735, 3879156, 3865383, 4712031, 5734736, 5869419, 4989760, 4196249, 4367645, 5075849, 5467134, 5495921, 5589497, 5786508, 6043929, 6787441, 8226354]
41412H226354J377946M65926j49160J97785Q44864J113774J141027R52027J68664
41403A4339207p46319m80975J050424K095981J550490O51238R55947J866733J645120
41394B2927846M6210j509815j918942j377966p30761o99325j399178k019058j527834
41385A1791177j43745P15815L84172k50713m47558p48575j526462j822336q91775
41376G060000L05873N15796p379m30302q82105j562618j560939l70154N70637
41367C638809q3944j042108k80625J300594R59280j369295k631027j242095O83738
41358f6673Q06751j61426k51519N36817P08592q2635o57553k21785O49890R20081
41348B180540K39730p78966j115016l67466O66849Q38715O2332o75038o59099
$$ y = [8226354, 9604300, 10070226, 9921066, 10118851, 10963715, 12077489, 13218516, 14170543, 14339207, 13592888, 13111913, 14162337, 16258318, 17808808, 18460046, 19415993, 21282726, 22927846, 22974056, 21464241, 19545299, 18167333, 17436572, 16737247, 15338069, 13319011, 11791177, 11647432, 12363247, 12747419, 12496706, 12049148, 11300573, 9774111, 7951775, 7060000, 7365873, 7881669, 7874290, 7443988, 6561883, 4999265, 3438326, 3068172, 3638809, 3554865, 2512757, 2232132, 3532726, 4492006, 3122711, 491684, -750411, -66673, 740078, 578652, 327133, 863950, 1572542, 1489907, 832354, 610569, 1260459, 2180540, 2420270, 1641304, 526288, 158822, 825671, 1664386, 1726718, 1051680, 392581]
41339C92581q8694N58281R29933O07122m80885j390108j024465J74228O00899
41330B78892j63072o90938O3054J193089J338318O29249J01955P127j85372n96550
41320A975752p52676l82125K56788O49299L04477p62865j561430r05743Q64902
41311c13621J845391R69103m34828m94383N61430R34722K1270q60147o23118O2441
41301A668260k218p50079j114660o18077J26108M18573K99801J59045K8016k66125
41291e1356m85218j42227O32714R88761M50155l71291n97946j97425K26062L28223
41281G80452J25203l72742r25784q74571J3166R11042J029069Q40936J108579
41272B635350J242667J82874j403317j679207n03814K35977l56937q52702p9618
$$ y = [392581, 303887, 862168, 1792101, 2399223, 1918338, 528230, -496235, -322007, 278892, 115820, -575118, -512064, 681025, 2019343, 2648592, 2750547, 2757674, 2572302, 1975752, 1223076, 840951, 1097739, 1747038, 2051515, 1288650, -272780, -1178523, -313621, 1531770, 2500873, 2066045, 1571662, 2133092, 3067814, 3089084, 2228937, 1605819, 1668260, 1666042, 915963, -198697, -816774, -690666, -272093, 27708, 186753, 214769, -51356, -536574, -678801, -46087, 942674, 1392829, 1021538, 423592, 226167, 452229, 780452, 905655, 532913, -392871, -1267442, -1254276, -343234, 685835, 1526771, 2635350, 3878017, 4060891, 2657574, 978367, 474553, 710530, 353593, -499109, -578727]
41263e78727Q81993O34213k37497l91639L3335R1828j00531R4152K55595l55903
41253C26819j092405p48677K98941N63372j46462n30949m74O01580O53608N83763
41243E09116P13340O47671K27404r6460j91853m38644o96328k45917Q31754J350358
41233B610441O48705m11771o54732m0845N91691O33120J70751j81888J82024J006979
41223D554475J072800k51592j691858j503578j4571P63637R2110o47786m29158
41214A944479p1868m48663q82886m84524K72290M99419K71557l9906o21363j281892
41204h43357r62900M97819J440042P68390q8165N03396J411236N13275j496391
41195A743345j930585m46283M25334n29775j351508k58220J618975K276163J627813
$$ y = [-578727, 303266, 937479, 699982, 308343, 341678, 433506, 332975, 427127, 682722, 326819, -765586, -1514263, -1215322, -651950, -798412, -1329361, -1329835, -728255, -74647, 509116, 1222456, 1870127, 2097531, 2001071, 1809218, 1370574, 674246, 428329, 1260083, 2610441, 3259146, 2847375, 2192643, 2151798, 2743489, 3376609, 3547360, 3365472, 3547496, 4554475, 5627275, 5375683, 3683825, 2180247, 2165676, 2929313, 3021423, 2373637, 1944479, 1872611, 1423948, 541062, 56538, 328828, 828247, 1099804, 1059898, 438535, -843357, -1806257, -1308438, 131604, 899994, 811829, 1315225, 2726461, 3239736, 1743345, -187240, -633523, -208189, -737964, -2089472, -2347692, -728717, 1547446, 3175259]
41186C175259P22179j85609j142783j401707m87506N85280O51862J31998P4244
41177B123217L20543N4632n68581q08039p30177q09016p46069j14092M61658K81110
41167e34814L6935N87422R96540n6134j434548p45154J589821K346229L53234
41158C139531j520464p52911J039729R56584n48896p58407O68034J249534j30473
41149C342261j437142p64954Q01469J051554n5751o44761J55006J164881J140886
41140D753449M99411L94626Q80386J008434N31821L69421J026711J628571J373496
41131A2466326J057045J842492L098360L139818J964864J315123J673578J304257
41123B7861863p36966k640997k498038j291733j245940k353480k791275k091369
$$ y = [3175259, 3897438, 3711829, 2569046, 1167339, 679833, 1265113, 1916975, 2048973, 2123217, 2443760, 2498392, 1929811, 1121772, 391595, -417421, -1163490, -1277582, -815924, -534814, -497879, 89543, 1086083, 1029949, -404599, -1149753, 440068, 2786297, 3139531, 1619067, 866156, 1905885, 2862469, 2313573, 1555166, 2223200, 3472734, 3342261, 1905119, 1140165, 1941634, 2993188, 2937437, 2292676, 2447682, 3612563, 4753449, 5252860, 5647486, 6527872, 7536306, 8068127, 8437548, 9464259, 11092830, 12466326, 13523371, 15365863, 18464223, 21604041, 23568905, 24884028, 26557606, 27861863, 27124897, 24483900, 21985862, 20694129, 19448189, 17094709, 14303434, 12212065]
41115A2212065j537208j603038j312834m03358o051n71109r35311k52205O62498
41106F253449P41450J34809n13714j076745j433864j043616J15016J055198R94260
41097E226243K88586l98649r75357j409145j306162o47588m7939K77389P89406
41088A796784J340202Q98094o13259j522108o08571J023995J530796P75716j08398
41079D513251o21427q78052n81906L22292O96040l16713j450194q92355P20255
41070A511191J061429k14999r34826K9215J008903L94005q26812q86561l5849
41061A105696K31499k80180m86610m3590L07731K44744K56349M57428K77652l88957
41051A681762p75262l86976K68323N21269M05572K34209k4092l63911l11054L72675
$$ y = [12212065, 10674857, 9071819, 7758985, 7355627, 7349576, 6778467, 5843156, 5590951, 6253449, 6994899, 7129708, 6615994, 5539249, 4105385, 3061769, 3176785, 4231983, 5226243, 5514829, 5116180, 4140823, 2731678, 1425516, 777928, 729989, 1007378, 1796784, 3136986, 4035080, 3421821, 1899713, 1291142, 2315137, 3845933, 4621649, 4513251, 3891824, 3013772, 2431866, 2754158, 3450198, 3133485, 1683291, 790936, 1511191, 2572620, 2357621, 1422795, 1452010, 2460913, 2854918, 2028106, 1141545, 1105696, 1337195, 1057015, 570405, 526815, 834546, 1079290, 1335639, 1793067, 2070719, 1681762, 906500, 519524, 787847, 1309116, 1714688, 1948897, 1924805, 1560894, 1249840, 1622515]
41041A622515R38284M99217n15015p59117K5807M89137k87167j217166p12598
41032H3897Q74023J617108O98204n82009p54063j5493M49907J41991m44775o58006
41022A410784k94284K83852L87344j97554o36868o5052Q41798N52539p84722j103503
41012C94334M42220J777410Q36229j206878j623834j42641R62534M30662n73974
41003A296062p43254k92109J05916L38754L05470j62369m45992K72433J264264
40994A939175Q59641p48415j319218j0884J117516L86396p66626k37377J230933
40985B451141J343007j3263q48505m23048m6399m56528o87598j09852L43161j19095
40975A433021p15435m25105L15596L27787n23170j182311p73969M89040J601839
$$ y = [1622515, 2560799, 3060016, 2545001, 1785884, 1811691, 2300828, 2013661, 796495, 83897, 957920, 2575028, 3273232, 2691223, 1937160, 1921667, 2371574, 2513565, 2068790, 1410784, 1116500, 1400352, 1787696, 1590142, 953274, 888222, 1730020, 2282559, 1497837, 394334, 836554, 2613964, 3450193, 2243315, 619481, 476840, 1439374, 1870036, 1296062, 552808, 260699, 366615, 705369, 1010839, 848470, 402478, 674911, 1939175, 2798816, 2050401, 731183, 720299, 1837815, 2224211, 1457585, 1220208, 2451141, 3794148, 3780885, 2932380, 2509332, 2462933, 2006405, 1318807, 1208955, 1552116, 1433021, 717586, 292481, 608077, 935864, 412694, -769617, -1543586, -1054546, 547293]
40966E47293J642506N52104p59791j271385q27861l6917O03748R87411J023835
40957B460943P01816M70285P88462J255355R92630J9417n93819j66270Q26943
40948F755762J674319K181148K125786J018679q74300k164906j923032r66108
40940G827348o33752q76817o74452O6074L11692m30348j410757j785333j481865
40931I11790p12397L90952J305013J251016L45330k27418J69089O24261R3755
40922D151391r19415j153581n53557j90381l95333l40788K87223N34389k29084
40913A190864j038500o42169O19141J321909R69802L90480K12047L8332n72941
40904B488965j179881j044639j92578N91880O61698J53766k04563N3599M26947
$$ y = [547293, 2189799, 2741903, 1982112, 710727, -117134, -154051, 449697, 1437108, 2460943, 3162759, 3633044, 4421506, 5676861, 6669491, 6688908, 6095089, 5928819, 6755762, 8430081, 10611229, 12737015, 13755694, 12881394, 10716488, 8793456, 7827348, 7193596, 6316779, 5642327, 5708401, 6020093, 5589745, 4178988, 2393655, 911790, 199393, 590345, 1895358, 3146374, 3491704, 3264286, 3433375, 4057636, 4151391, 3231976, 2078395, 1524838, 1334457, 939124, 598336, 885559, 1419948, 1190864, 152364, -489805, 129336, 1451245, 2421047, 2811527, 3023574, 3061906, 2488965, 1309084, 264445, 71867, 663747, 1325445, 1479211, 1274648, 1328247, 1755194]
40895A755194m5667j253394j624259j49640J721312J637530k79101j365463k33247
40886A63265J226298Q68928m08260l66027P94410Q71150n01893j141628O9916
40877A576159J292728O30547j003118j485481n72761L10356M58896L58747K75681
40868A841754j9588l01192p4396L19340M4280p46537r73019l02267L97757N14132
40858G00264M76724P12339Q48608M93383l4297k91835l32482k82570L934M34493
40848B728561N55150L97472O39659J350118J451858K68614j180335j482599q41069
40839C887429n62454q72859o28798O47221J705509J163928n98623j849806j520005
40830A371542k95966L13630k30995q61057k63297J255248J919340P72931r68957
$$ y = [1755194, 1709527, 456133, -1168126, -1317766, 403546, 2041076, 1761975, 396512, 163265, 1389563, 2258491, 1850231, 1484204, 2278614, 3149764, 2647871, 1506243, 1576159, 2868887, 3499434, 2496316, 1010835, 438074, 748430, 1207326, 1566073, 1841754, 1822166, 1520974, 1446578, 1765918, 1810198, 1063661, 90642, -211625, 186132, 700264, 1176988, 1889327, 2737935, 3231318, 3197021, 2905186, 2572704, 2290134, 2294068, 2728561, 3283711, 3681183, 4320842, 5670960, 7122818, 7391432, 6211097, 4728498, 3887429, 3324975, 2452116, 1823318, 2470539, 4176048, 5339976, 4741353, 2891547, 1371542, 1075576, 1389206, 1158211, 297154, 33857, 1289105, 3208445, 3981376, 3012419]
40821C012419j558309j000386o12976p67615n14929M81811J103609M48966p52916
40812a60326j152801m41403O61697J404425J346739L61845r83227j580461j022003
40803a565515k00479R196N3569P52913J591057J250174k25789j137613m20702
40794A06811Q30028Q45749m84003j599588j307226m3135R49279J077203P01031
40785A076149L44205J21234k5166M761K21759K54270k12052p92756p56834r8496
40775A37074L28536K574n00708l57482L56440R04839R28135O32457J79912m20022
40765B191755q61808o91889r7207L4148p56169j625461j208065O51230K317044
40756d6422J965535k00225j891788j369461L31345P30290o94274j724467m94211
$$ y = [3012419, 1454110, 453724, -159252, -926867, -1441796, -959985, 143624, 592590, -160326, -1313127, -1754530, -1092833, 311592, 1658331, 2020176, 1036949, -543512, -1565515, -1765994, -1756798, -1703229, -950316, 640741, 1890915, 1665126, 527513, 106811, 936839, 1782588, 1298585, -301003, -1608229, -1651364, -702085, 375118, 1076149, 1420354, 1541588, 1516422, 1521183, 1742942, 1997212, 1785160, 992404, 235570, 137074, 465610, 468184, -32524, -390006, -33566, 871273, 1799408, 2431865, 2611777, 2191755, 1329947, 638058, 540851, 574999, -181170, -1806631, -3014696, -2363466, -46422, 1919113, 1718888, -172900, -1542361, -1211016, -480726, -1175000, -2899467, -3393678]
40747c393678J899251K930820J918349M20646j81091o4041N9615J9820j09614
40738C500077l89283o66266n66688j36720J52546K12534M26544P82543P69032
40729D084319L87365L29833P34374P43950m6859o45489q6381R33131R82830O1196
40719G478269l95489L36151J218275R39619l03013j064565l96497J074666J822816
40710A0710232J080312k80081p72063k14380l0368j200829k570040k175563j0440
40701D536780J772204J661762N89742K37026O26376O01645J6536j35992K86384
40692A0192463J08367j078244j831782r41780N39885P98074L4563p553R74554
40683H788547J331808L26153m37658M99655K115129K552625J979698K027895K997979
$$ y = [-3393678, -1494427, 1436393, 3354742, 3775388, 3594297, 3530256, 3589871, 3609691, 3500077, 3110794, 2444528, 1877840, 1741120, 1893666, 2106200, 2532744, 3315287, 4084319, 4471684, 4801517, 5535891, 6279841, 6232982, 5587493, 5501112, 6434243, 7417073, 7478269, 7082780, 7418931, 8637206, 9576825, 9273812, 8209247, 7812750, 8887416, 10710232, 11790544, 11510463, 10738400, 10524020, 10493652, 9292823, 6722783, 4547220, 4536780, 6308984, 7970746, 8560488, 8797514, 9423890, 10025535, 10042071, 9906079, 10192463, 10300830, 9222586, 7390804, 6449024, 6988909, 7786983, 7821546, 7813993, 8788547, 10120355, 10446508, 10008850, 10508505, 12623634, 15176259, 17155957, 19183852, 22181831]
40674B2181831L503886K855119K078537K210094L002409L897993N079072O785744
40666E1594685Q493501R615916J0468381J1805121J3790076J6096637J8795843
40659A40660160K2461512K7210575L1917599L4701880L4439713L1700672K7642908
40652C50735019K1877846J2472135j002334j5224101k5427069k9849586l0624007
40645B82957903l0372607k9514291k7265367k3687817j9822388j6734070j5022006
40638A20539357j4373324j3276905j0421580o825490n088155n829071o573348
40631E8151484n315917l422211l231194m276311m211314k625874j414767j543001
40623C2110895j866765j532872j378976k110567k802191k307482j013579j91091
$$ y = [22181831, 25685717, 28540836, 30619373, 32829467, 35831876, 39729869, 44808941, 51594685, 60088186, 69704102, 80172483, 91977604, 105767680, 121864317, 140660160, 163121672, 190332247, 222249846, 256951726, 291391439, 323092111, 350735019, 372612865, 385085000, 384082666, 368858565, 343431496, 313581910, 282957903, 252585296, 223071005, 195805638, 172117821, 152295433, 135561363, 120539357, 106166033, 92889128, 82467548, 75642058, 70553903, 64724832, 58151484, 52835567, 49413356, 46182162, 41905851, 37694537, 35068663, 33653896, 32110895, 30244130, 28711258, 27332282, 25221715, 22419524, 20112042, 19098463, 18907372]
40615A8907372l59669j056920j611222j562099q72428j63202j81901p29365p90529
40606A1580037o4634M16502k71451j546932k019020j190985Q9729O75414K50937
40597G919597m35054l40201O73813J499289J038155l64310j368758j385800j009867
40588F226864p09589j68717P14103J213973Q26587J32763r4504o360j77952n43848
40578G413320o19727l97931k54397k16481l2813J91037R6890k26228k12869M33414
40568F174215J314895J693667J110900j85671j269018j288660m57594N9165m17321
40559F734578j126719q52101M05851J341540R24467m15048j335305j078425k52865
40550D345973r3626r39166j678099j076986M97668J350274N95599o83342q42507
$$ y = [18907372, 18547703, 17490783, 15879561, 14317462, 13445034, 13281832, 13099931, 12370566, 11580037, 11515403, 11931905, 11660454, 10113522, 8094502, 6903517, 6993246, 7668660, 7919597, 7484543, 7144342, 7818155, 9317444, 10355599, 9991289, 8622531, 7236731, 6226864, 5517275, 5348558, 6062661, 7276634, 8103221, 8235984, 8141480, 8135120, 7957168, 7413320, 6793593, 6395662, 6141265, 5924784, 5891971, 6083008, 6179898, 5953670, 5740801, 6174215, 7489110, 9182777, 10293677, 10108006, 8838988, 7550328, 7092734, 7151899, 6734578, 5607859, 4755758, 5161609, 6503149, 7427616, 7012568, 5677263, 4598838, 4345973, 4252347, 3313181, 1635082, 558096, 1055764, 2406038, 3001637, 2318295, 1475788]
40541A475788L34813J610788J822196Q39693o76244j818247j857498p36292P40293
40532A735290J486759J003892k85900j328208j148521J76295J209027N57107j199235
40523B206506j901135n97187J098323J245587J61741m44532j13235J40089j61446
40514A634711l76155k01721j43299k19431L27249J454548J787252N20312j160979
40505C622487j548517o19783J79464m7403p34925q45567j14334P80573J004279
40496A676274M75956n1581J940K20146q6939o01252l79517M74764O75590l09382
40486B095999j289914j012913J37663R38012J039659R25506P48261K64719l75516
40477C471476o96950o07555l60577n0062K39972J50753l85916o81799j75421N69981
$$ y = [1475788, 1810601, 3421389, 5243585, 6083278, 5407034, 3588787, 1731289, 994997, 1735290, 3222049, 4225941, 3940041, 2611833, 1463312, 1639607, 2848634, 3405741, 2206506, 305371, -291816, 806507, 2052094, 2213835, 1769303, 1656068, 1796157, 1634711, 1258556, 1056835, 913536, 694105, 1021354, 2475902, 4263154, 4783466, 3622487, 2073970, 1454187, 1633651, 1586248, 851323, 5756, -108578, 671995, 1676274, 2152230, 2100649, 2102589, 2322735, 2235796, 1634544, 1255027, 1729791, 2405381, 2095999, 806085, -206828, -69165, 868847, 1908506, 2834012, 3582273, 3846992, 3471476, 2774526, 2166971, 1806394, 1756332, 1996304, 2147057, 1761141, 1079342, 903921, 1473902]
40467A473902N95387l6682m57861l74320k55707k82830j10946K94998M96680L34787
40457A677408N8848l00540q78784j298002r04885K10431J186928J435752J030766
40448B217922J94387p67420j181175o45203J52984K78846P010K12625N76720M8608
40438A095304r21633o14025J031358J806400N29919j026659q93853K04261M66314
40429A677386p015M1205M19781k6112r38810q33051J88539L89284o78505j333772
40419a101070m79522P11181P48521m7454m59033k52566J029J76343N23166P93692
40409F14287M46423l98688r26841n92500K73019Q47235O62164J10141N9111P78357
40399A872708J422170R84161l65333j412762j336733m88372K72490N05722L76134
$$ y = [1473902, 2069289, 2032607, 1574746, 1200426, 944719, 661889, 550943, 845941, 1342621, 1677408, 1736256, 1435716, 556932, -741070, -1645955, -1435524, -248596, 1187156, 2217922, 2412309, 1644889, 463714, -181489, -28505, 250341, 257351, 469976, 1046696, 1095304, 173671, -440354, 591004, 2397404, 2927323, 1900664, 1006811, 1211072, 1677386, 1670371, 1711576, 2131357, 2105245, 1166435, 333384, 521923, 911207, 232702, -1101070, -1580592, -869411, -120890, -168344, -627377, -879943, -878914, -702571, -179405, 614287, 1060710, 662022, -264819, -857319, -584300, 262935, 925099, 1035240, 1094351, 1872708, 3294878, 4279039, 3913706, 2500944, 1164211, 675839, 948329, 1454051, 1830185]
40390A830185L02815M65248M71568j89448j113550j067584K44908J297455P24972
40381B966569n14444n20120M67268L98261j044640j525231L44514K482765K106175
40372E161117k90817j689254p18750Q18957P36293p39593j608727p19012J004440
40363A954654J806229J110546j2310l74044j60604l50880j006408j135139l41325
40354A490719M44596L33062l00150n41002k03340K15517L01876l1424n76950p92183
40344C40721l07553L48266L26336j13883J19700R78516J032197j62178j061606
40335A500516n81140Q9083l47334q25942K78926K003077J954010J32615j021509
40326C182302m86543K2460p58231j534806p81684P30130J278291P16144J01105
$$ y = [1830185, 2133000, 2598248, 3069816, 2880368, 1766818, 699234, 944142, 2241597, 2966569, 2452125, 1932005, 2399273, 2797534, 1752894, 227663, 572177, 3054942, 5161117, 4870300, 3181046, 2462296, 3281253, 4017546, 3277953, 1669226, 950214, 1954654, 3760883, 4871429, 4859119, 4485075, 4324471, 3973591, 2967183, 1832044, 1490719, 1935315, 2268377, 1968227, 1427225, 1223885, 1439402, 1741278, 1709854, 1132904, 340721, 33168, 381434, 707770, 593887, 713587, 1692103, 2724300, 2562122, 1500516, 919376, 1008459, 661125, -164817, 114109, 2117186, 4071196, 4203811, 3182302, 2695759, 2718219, 1959988, 425182, -356502, 373628, 1651919, 2368063, 2469168]
40317B469168k16851n80061p70632l25388K31145p5672r66763j102862j75588
40308a513504M60048k20845j308674j189187K22691J416910J277025K70465m85822
40299a070893n94356l78487p1339L21243N78638L93214m5633k13529o0857L589
40289a138410M9025O71635J706858J854306M39137j213351j348625k95189R229
40280G34615j002961j590321l79729J386115J528614N7045r36031l50569N51693
40271a529L70606k74482K118R02564R12654p8434m78167L17452P70457k43698
40261B199541j364592q30780O01509Q31192k37611p33254N2604Q32232P66726
40252B117567N37091N45699K08366l32979K7345J066492R65553o03537j493907
$$ y = [2469168, 2252317, 1672256, 901624, 576236, 807381, 731709, -235054, -1337916, -1513504, -1053456, -1274301, -2582975, -3772162, -3549471, -2132561, -855536, -585071, -1070893, -1665249, -2043736, -2115075, -1793832, -1215194, -821980, -867613, -1081142, -1141999, -1138410, -1089385, -417750, 1289108, 3143414, 3582551, 2369200, 1020575, 725386, 734615, -268346, -1858667, -2238396, -852281, 676333, 733378, -202653, -553222, -1529, 369077, 94595, 96713, 999277, 1911931, 1833497, 1355330, 1672782, 2443239, 2199541, 834949, 4169, 605678, 1436870, 1199259, 466005, 518609, 1350841, 2117567, 2654658, 3200357, 3408723, 3075744, 3103089, 4169581, 5135134, 4531597, 3037690]
40243C037690n69150L16118l53031j003888l987J001643p1051j594480o86760
40234G3104J535149J352028j391362k787041r27012J514083J786197N97553k73388
40225A479311p38624j069411n22152Q81687J482490N65759l06543n9720R3291
40216A806088p09139r77601L66898J521316O24828r06230o84635O17541O35388
40207B294454m51188l76682J016854J370590j98545j672137j379327j44819P18516
40198A177716J350316K094983K133548Q10174q61326j374870p27560j53822l00179
40189D148980n86656k72127M81456P80653J15789q27970q06255L78242J434490
40180D846602J209148J86204l49287j18202J21268l0585k65081m38295p13385
$$ y = [3037690, 2468540, 2784658, 2431627, 1427739, 1423752, 2425395, 2354344, 759864, 73104, 1608253, 2960281, 1568919, -1218122, -2145134, -631051, 1155146, 1752699, 1479311, 740687, -328724, -850876, 30811, 1513301, 2079060, 1772517, 1712797, 1806088, 1096949, 119348, 486246, 2007562, 2632390, 1726160, 1041525, 1659066, 2294454, 1843266, 1466584, 2483438, 3854028, 3655483, 1983346, 604019, 459200, 1177716, 2528032, 4623015, 6756563, 7566737, 6705411, 5330541, 4602981, 4449159, 4148980, 3562324, 3290197, 3771653, 4552306, 4668095, 3840125, 3033870, 3412112, 4846602, 6055750, 6241954, 5892667, 5774465, 5895733, 5865148, 5600067, 5161772, 4448387]
40171D448387q50892l92227L67665N67776Q1638k92959j07162K03193K81956M13167
40161D720542P50308Q46632M44946K6197M1086J75924o1569m76926m93853o5539
40151E907748K52954Q3829l10315m14739j05590K37866K39009l2548k79921m41374
40141E136919n45276k84852N55927J251007P01944p83141j400301k99153R86608
40132E319682P25007l84169l85297P55288J113040p9851j241613q92416L48069
40123E277740J008568O80756j66630j113880j595710q47092Q62248J806057Q13331
40114F725388r37905j376878l27718N05347J66817l69001K3262Q63620Q68583
40105F141515j37850r82637p34127J08493L33547l32152q18816k05624Q50653
$$ y = [4448387, 3597495, 3205268, 3572933, 4140709, 4222347, 3929388, 3822226, 4025419, 4307375, 4720542, 5470850, 6317482, 6762428, 6788625, 6829711, 7005635, 6944066, 6467140, 5973287, 5907748, 6160702, 6244531, 5934216, 5519477, 5413887, 5651753, 5890762, 5858214, 5578293, 5136919, 4591643, 4306791, 4862718, 6113725, 6815669, 6032528, 4632227, 4333074, 5319682, 6044689, 5660520, 5275223, 6030511, 7143551, 7063700, 5822087, 4929671, 5277740, 6286308, 6967064, 6800434, 5686554, 4090844, 3243752, 4106000, 5912057, 6725388, 5787483, 4410605, 4082887, 4588234, 4755051, 4386050, 4409312, 5272932, 6141515, 6003665, 5021028, 4286901, 4395394, 4728941, 4396789, 3577973, 3372349, 4223002]
40096D223002R04753j83199r37781l94854M92377L91566l26508k92066N47303
40087D424593Q14991k9709p83199l80527N34062P10830L5835o99114j012778q28017
40077B786967n5660R03316R05847m48393j605787q03856J252359K116573J025842
40068F077208k08924j33079M39127L37529M3581L83811P15672J42032n93597l04422
40058F898938L93643N0784r78415j036688n6735L27313l09409m84898M09505Q75450
40048F089488j15407j262483r96762J57272P13398M78222K48273K47738K28484
40039E788223L14141N25209K67849n53460q28593P8672Q96444K07411j174434
40030E521462j321379j23174P39108M79456P636J3222M4691j66704q1731L98224
$$ y = [4223002, 5127755, 4944556, 4006775, 3611921, 4104298, 4495864, 4169356, 3877290, 4424593, 5239584, 5209875, 4426676, 4046149, 4580211, 5291041, 5326876, 4627762, 3614984, 2786967, 2731307, 3634623, 4540470, 4092077, 2486290, 1682434, 2934793, 5051366, 6077208, 5868284, 5735205, 6174332, 6511861, 6555442, 6939253, 7654925, 7796957, 7203360, 6898938, 7292581, 7343365, 6364950, 5328262, 5271527, 5598840, 5289431, 4804533, 5214038, 6089488, 5974081, 4711598, 3714836, 3872108, 4585506, 5063728, 5312001, 5559739, 5788223, 6102364, 6627573, 6895422, 6341962, 5513369, 5592041, 6488485, 6695896, 5521462, 4200083, 4076909, 4816017, 5295473, 5303109, 5316331, 5361022, 5194318, 5112587, 5510811]
40020E510811M35144l33218j024002q21645r3983M32790P07059Q83580O71242
40011F367778l8081n53799k81694K25157J1668p64082j025351m64158j5906k75232
40001C186300l94438N41328J670975J284594l92991r84337O49558K330458J478094
39992I369541j014572k037772q82083M8256o08122j128688L5500J548378J552744
39983F883182O19637J84327j50163j249462j874310l77161J922229K100436O0980
39974H119695j346908p33088J95367p7341o89718m92285L2367J61703L02830P25170
39964F197792N93297m78993j323766q78854K19329P46855N23387M5704m26994
39955E217757o08969j00856O87676O54832k82853q48089m49256j44032p11359
$$ y = [5510811, 5945955, 5612737, 4588735, 3767090, 3673107, 4105897, 4812956, 5696536, 6367778, 6329697, 5775898, 5494204, 5719361, 5731029, 4966947, 3941596, 3477438, 3461532, 3186300, 2791862, 3333190, 5004165, 6288759, 5895768, 4911431, 5560989, 7891447, 9369541, 8354969, 6317197, 5435114, 5483370, 4875248, 3746560, 3782060, 5330438, 6883182, 7502819, 7687146, 7536983, 6287521, 4413211, 4036050, 5958279, 8058715, 8119695, 6772787, 6039699, 6235066, 6157725, 5468007, 4975722, 5008089, 5169792, 5472622, 6197792, 6791089, 6312096, 4988330, 4109476, 4328805, 5075660, 5599047, 5644751, 5217757, 4608788, 4507932, 5195608, 5850440, 5567587, 4719498, 4270242, 4126210, 3414851]
39946C414851j252363p88096J45696O72581J008109J478753J426337M58499m32988
39937F131379m14005k58765p79506j076128r7628J176543J062035j81894r61895
39928D600136q63116o00671j81373P47600J263418J93907j459190j445597L46349
39919B601463J662006J242756K32296j21701l9K65166Q57858J200873J43011j735825
39909F347864k141442m44514J079849O84975l21985j56148M23176j47367j186856
39900D137552j016148m4630P9751l86278J97520J547225J592221J21706n68666
39891E660253N60196J508316M64045j425764k067128j381344n76302L5233O94833
39882C472338Q84578K14182l04371K91605R92928L06625r90733q23502P09586
$$ y = [3414851, 2162488, 1374392, 1520088, 2192669, 3200778, 4679531, 6105868, 6564367, 6131379, 5717374, 5458609, 4679103, 3602975, 3505347, 4681890, 5743925, 5562031, 4600136, 3737020, 3136349, 2954976, 3702576, 4965994, 5159901, 3700711, 2255114, 2601463, 4263469, 5506225, 5738521, 5616820, 5616781, 5881947, 6739805, 7940678, 8083689, 6347864, 4206422, 3761908, 4841757, 5526732, 5204747, 5048599, 5471775, 5324408, 4137552, 3121404, 3076774, 3156525, 2770247, 2967767, 4514992, 6107213, 6228919, 5660253, 6220449, 7728765, 8192810, 6767046, 4699918, 3318574, 2742272, 2777505, 3472338, 4356916, 4571098, 4266727, 4558332, 5551260, 5857885, 4867152, 4043650, 4753236]
39873D753236J219892k89915j879308j626517k17205N68379M46462L76310P38008
39864D089342J044247R03385L34110m45935r50047o98268p451J96037k76172n83990
39854C605258k67553J36896L15500P01092J168514P07291p02518j478131q83326
39845C303023m11604j170516j646086k31347J567303J217302n65866p88920R16378
39836B189667J706167K88542r88633r6482J429433J123812n88393j408879p37314
39827B917920o6566l49139q17744m78450N01066J201119J074742L96337j97919
39818D181366m65987o43629o90919r1624J011718J274305j05351j713711j509851
39809A246317K80773J540903J294148M69832k46335j087458j519638l93065J495253
$$ y = [4753236, 5973128, 5683213, 3803905, 2177388, 1960183, 2528562, 2975024, 3351334, 4089342, 5133589, 6036974, 6371084, 5925149, 4975102, 4276834, 4269383, 4465420, 4189248, 3605258, 3337705, 3474601, 3790101, 4491193, 5659707, 6366998, 5664480, 4186349, 3303023, 2891419, 1720903, 74817, -156530, 1410773, 2628075, 2062209, 1273289, 2189667, 3895834, 4184376, 3195743, 3099261, 4528694, 5652506, 5064113, 3655234, 2917920, 2851354, 2502215, 1684471, 1206021, 1707087, 2908206, 3982948, 4379285, 4181366, 3715379, 3071750, 2380831, 2289207, 3300925, 4575230, 4469879, 2756168, 1246317, 1527090, 3067993, 4362141, 4831973, 4585638, 3498180, 1978542, 1585477, 3080730]
39800C080730J541791p33065k327763j001163J346480J613116m5881j087557n43280
39791A843408L69127P22484O30191P2676q93819j174179R8039J646533J387264
39782D701724m81670j633451q57331O42751J323003J000705K20027n81148q96602
39773C438008l64291N27425Q96142O69859M06434J46458l85126p12428j79512
39764D442969N30328L8208j424263j967506p35931Q46969J185236N46699J36708
39755C599417K14630K03828L8926K98675J075727J511812P98123o08833j220889
39746E911416k83109J010951Q65741n69793j198674j4204J239261N98387j109479
39737F450497j476245n4788J174184P30226o78811j560067j285343r6778J280519
$$ y = [3080730, 4622521, 3889456, 1561693, 560530, 1907010, 3520126, 3474245, 2386688, 1843408, 2212535, 2935019, 3565210, 3637886, 2744067, 1569888, 1667927, 3314460, 4701724, 4220054, 2586603, 1729272, 2372023, 3695026, 4695731, 4915758, 4334610, 3438008, 3073717, 3601142, 4497284, 5167143, 5573577, 5720035, 5334909, 4622481, 4442969, 4973297, 5011505, 3587242, 1619736, 883805, 1730774, 2916010, 3462709, 3599417, 3814047, 4017875, 4056801, 4355476, 5431203, 6943015, 7741138, 7132305, 5911416, 5628307, 6639258, 7504999, 6935206, 5736532, 5722328, 6961589, 7559976, 6450497, 4974252, 4919464, 6093648, 6823874, 6145063, 4584996, 3299653, 3202875, 4483394]
39728D483394J793105R46635k93919n39208P9324J82051o44859j286742r46799
39719C772982j60700L95002P53532Q28196P7077j274575j842963q27843O94217
39710B414925J101636K63069n57205m51190J84040L72980j85735p45527m60307
39701A936686L97701P18911K30628k5564M83256N91914o98685k128469j675915
39692a69537L82566J768213J339100R5529q41773j290189r77413M20929J839220
39683B566645J529735j87395r77874n0041N80875m71469j530791o13829J243353
39674B089209J579107K25145p45364j87492R08930J206075N45490l12924n33800
39665D774376P5917O50851J01408j195701j504744j72866J235346J179080K36245
$$ y = [4483394, 6276499, 7223134, 6929215, 6390007, 6469331, 6651382, 6006523, 4719781, 3772982, 3612282, 4007284, 4760816, 5589012, 5666089, 4391514, 2548551, 1720708, 2414925, 3516561, 3779630, 3222425, 2771235, 2955275, 3328255, 3142520, 2396993, 1936686, 2334387, 3053298, 3283926, 3258362, 3741618, 4333532, 3634847, 1506378, -169537, 213029, 1981242, 3320342, 3415871, 2574098, 1283909, 306496, 727425, 2566645, 4096380, 3908985, 2931111, 2881070, 3461945, 2990476, 1459685, 845856, 2089209, 3668316, 3893461, 3148097, 2960605, 3869535, 5075610, 5621100, 5308176, 4774376, 4850293, 5501144, 5602552, 4406851, 2902107, 2729241, 3964587, 5143667, 5379912]
39656E379912k61313l84404q10359j008185j38607J006571R93149K14462L01837
39647E293063J230505J160935n15545j951237j440171K70453J218733P40836j88552
39638E819020n13497j91288Q9420j42299n44602m34783J25581K76764k78923o51719
39628C553674j78506M17517L12791J26974P16398J182107K9680j980661k340599
39619A839375m36695J442382J453034N16938J70019K1797r12641j807135j116447
39610A170627O41318J363916N16827k02513L05897R25466M17083m12226m2470
39601D683925J167910J350672j08481j664669j801349r00731k42593q4955K33498
39592B633227P98864R11936L57008j53065r4303J17011p8224m69378m89329j07511
$$ y = [5379912, 5118599, 4734195, 3923836, 2915651, 2777044, 3783615, 4776764, 4991226, 5293063, 6523568, 7684503, 7168958, 5217721, 3777550, 4048003, 5266736, 6007572, 5819020, 5305523, 5114235, 5203655, 5061356, 4516754, 4081971, 4207552, 4484316, 4205393, 3553674, 3375168, 3792685, 4105476, 4232450, 4948848, 6130955, 6160635, 4179974, 1839375, 1402680, 2845062, 4298096, 4815034, 4985053, 5006850, 4094209, 2287074, 1170627, 1811945, 3175861, 3692688, 3490175, 3796072, 4721538, 5138621, 4726395, 4683925, 5851835, 7202507, 7094026, 5429357, 3628008, 2727277, 2484684, 2399729, 2633227, 3432091, 4344027, 4701035, 4547970, 4453667, 4570678, 4492454, 4023076, 3533747, 3426236]
39582C426236K18754K38490J23791J33376L40857N78428N38950J46733j83594
39573E562021m7953K32097L827n70155n72176K18702Q29102N12267k10043n58541
39563E399148o91774j064821j350317r85810k41067K21193L58705M12937J50938
39554B209132n07902p32834P9258R49319N73819m85782n74387L18245N54146k65298
39544B117716n37106N27712J364181N32860r66604j364287p40283k90784m5084
39535E98321P64242J665428J289692l01539j389994r77253N1602N04004L39831
39526B544334P9240j32173k87911k38353j55873m76499r48010o34392N98599J539230
39516A888192J277289N10731L42389N99169M27782j10067l04839k16823m59256
$$ y = [3426236, 3644990, 3883480, 4007271, 4140647, 4481504, 5059932, 5598882, 5745615, 5562021, 5514068, 5746165, 5749992, 5179837, 4607661, 4826363, 5655465, 6167732, 5957689, 5399148, 4707374, 3642553, 2292236, 1306426, 1065359, 1286552, 1645257, 2058194, 2209132, 1701230, 968396, 1047654, 1996973, 2570792, 2085010, 1510623, 1828868, 2383014, 2117716, 1580610, 2108322, 3472503, 4005363, 3038759, 1674472, 934189, 643405, 598321, 1362563, 3027991, 4317683, 4016144, 2626150, 1648897, 1700499, 2204503, 2544334, 2623574, 2491401, 2203490, 1965137, 1809264, 1332765, 384755, -249637, 348962, 1888192, 3165481, 3676212, 4018601, 4617770, 5045552, 4935485, 4630646, 4413823, 3954567]
39507C954567p84641l40485O24678Q05417q0308o98086j60841O82519Q16225O01064
39497E420109O75515N10705n15475j474784r58719O34473J470964Q14770k78097
39488F299461q24376r99975j069534o21280M73945J331141J009146l19576j561230
39479C717722j684749m86427J090566J549930M69860p38065o16506K35586K04546
39470C742463n98627n55895M86657P40234m02189j094602j19605R44901L92847
39461C536184o74510k80153J015627J114042j39655j002242q54730o80326o89195
39452A345042N3514J395507J803981Q38884j10304j64578j10887n27773o66149
39443C857237j21681J53343l87992p19327n1379O63646L90690j47647K11498J025875
$$ y = [3954567, 3169926, 2829441, 3454119, 4259536, 4179228, 3481142, 3320301, 4002820, 4819045, 5420109, 6095624, 6606329, 6090854, 4616070, 3657351, 4291824, 5762788, 6577558, 6299461, 5475085, 4475110, 3405576, 2784296, 3258241, 4589382, 5598528, 5278952, 3717722, 2032973, 1546546, 2637112, 4187042, 4656902, 3918837, 3302331, 3537917, 3742463, 3143836, 2587941, 3074598, 3814832, 3412643, 2318041, 2198436, 3143337, 3536184, 2861674, 2581521, 3597148, 4711190, 4571535, 3569293, 2714563, 2034237, 1345042, 1398556, 2794063, 4598044, 5436928, 5326624, 5162046, 5051159, 4523386, 3857237, 3735556, 3888899, 3500907, 2781580, 2730201, 3393847, 3784537, 3636890, 3848388, 4874263]
39433D874263J107908N28295J33290j91000j032317j746641j082387O26710J613367
39424D831488J128953J88101l34474p64885j304180j150651J46947J524937J604271
39415E870507M50620o68570q55943k62908M44292P13306M30012K6471N2945M32120
39405F632852N39464K25478J41482O42883J036471N80786l04644o34075k74860
39396H585837Q8125J12771l3222m57458j343122j941902j087981Q55466J846319
39387F624833P67987r02497j088081J26406J016039Q14822K59257j07171m94140
39378G017455p28983k67480L78306j7604j071300p38426J346752K461902N36499
39369H917121k329437k539877k03936J199511J40941j046415l04721R98145P29523
$$ y = [4874263, 5982171, 6510466, 6643756, 6452756, 5420439, 3673798, 2591411, 3218121, 4831488, 5960441, 6148542, 5814068, 5049183, 3745003, 2594352, 2741299, 4266236, 5870507, 6321127, 5652557, 4796614, 4533706, 4977998, 5691304, 6121316, 6147787, 6200732, 6632852, 7172316, 7397794, 7539276, 8182159, 9218630, 9799416, 9494772, 8860697, 8585837, 8673962, 8786733, 8753511, 8296053, 6952931, 5011029, 3923048, 4778514, 6624833, 7392820, 6490323, 5402242, 5528648, 6544687, 7359509, 7618766, 7511595, 7017455, 6288472, 6020992, 6399298, 6381694, 5310394, 4571968, 5918720, 8380622, 8917121, 6587684, 4047807, 3843871, 5043382, 5184323, 4137908, 3833187, 4831332, 5560855]
39360E560855m86070o91076k9909j81374j079318q56924Q24122J815730O85013
39351E561049j036282j071655M48891J516112J156411L09762O35K3189k14936
39342F693176n56813m65519r570J99465q0950m12682l40866M6697M00217N89407
39332F062562N95265K36684m72769q60757k21733R63825J256032J82257q40334
39323F901032l55067R57152J145572j98834j407629j244380m91799k72715j05628
39314D927704J030955K515226K597243R49858p71773j167305o28406j76781Q4284
39305I361005N53983R90288P88479Q0270k96424Q6996P18694P84612L2522r83083
39295A2117342j366021p41616K37108N19940r4555p33323o22205J1966M52516
$$ y = [5560855, 5074785, 4383709, 4353800, 4172426, 3093108, 2236184, 3060306, 4876036, 5561049, 4524767, 3453112, 3902003, 5418115, 6574526, 6884288, 6884923, 6908112, 6693176, 6136363, 5670844, 5661274, 5860739, 5779789, 5367107, 5026241, 5072938, 5473155, 6062562, 6657827, 6894511, 6421742, 5560985, 5339252, 6303077, 7559109, 7741366, 6901032, 6545965, 7503117, 8648689, 8449855, 7042226, 5797846, 5306047, 5033332, 4927704, 5958659, 8473885, 11071128, 12020986, 11249213, 10081908, 9453502, 9276721, 9361005, 9914988, 10905276, 11693755, 11774025, 11477601, 11564597, 12283291, 13067903, 13100425, 12117342, 10751321, 10009705, 10246813, 10766753, 10672198, 9938875, 9316670, 9328636, 9781152]
39286I781152L31608l69719j469999k228825j617986K28932J513864Q05246q84819
39277F089454j301505j0768J128938P09037m07122o12517J76346O69017N9122
39268F500002j039138j356953l20709J230017J690546M43432j186912j401277
39260D559008k02918P58014O04971K06312L46327L56297m86703j375750j096326
39251C669232K9205P06486P14959R33290J460570J222030j85235j489878j310018
39242E750641K4373R42359N52442n14926j061913o59487P9465L74747K13489K24360
39232E925550O50729Q64510K43691p73930j101477m46906K65301J72144l45779
39223E453833l01944L38124N23944k29479q46425j39926J214220J387228J35409
$$ y = [9781152, 10112760, 9743041, 8273042, 6044217, 4426231, 4655163, 6169027, 6974273, 6089454, 4787949, 4777181, 5906119, 6615156, 6208034, 5595517, 5771863, 6440880, 6500002, 5460864, 4103911, 3783202, 5013219, 6703765, 7147197, 5960285, 4559008, 4356090, 5114104, 5719075, 5925387, 6271714, 6628011, 6141308, 4765558, 3669232, 3698437, 4404923, 5119882, 6053172, 7513742, 8735772, 8550537, 7060659, 5750641, 5775014, 6717373, 7269815, 6754889, 5692976, 5033489, 5112954, 5487701, 5701190, 5925550, 6576279, 7440789, 7684480, 6910550, 5809073, 5362167, 5627468, 5799612, 5453833, 5151889, 5490013, 6013957, 5784478, 4938053, 4798127, 6012347, 7399575, 7534984]
39214G534984o54402J33791R15298j41516j913353j732730M80550J951781J176950
39205G751353j35429j58096L35623q3980p61990k59769Q74295R00954j91008p22578
39195G549375p4436N77715L95462j3923Q2R4633j61914m80818m82024k97491j48688
39184F957973K1447K60417M91911P15143Q18257M45996l04439n23157K44406Q83845
39174A0011799J18341j368347j717239o07141M80198P08776P60386R70177N79484
39165I936434m30297p04773J74014N68703n48110j490774l86182J506252J429251
39156A0054518n58909j541330j61267J459211J144428j65967k79241P48754J015823
39147A1716020l8192r68383q72822o07416q08655m98533J037604K336056J542945
$$ y = [7534984, 6880582, 7014373, 7929671, 7788155, 5874802, 4142072, 4622622, 6574403, 7751353, 7615924, 7457828, 7793451, 7709471, 6947481, 6687712, 7562007, 8462961, 8271953, 7549375, 7474939, 8052654, 8448116, 8434193, 8434275, 8528908, 8366994, 7886176, 7404152, 7106661, 6957973, 6979420, 7239837, 7731748, 8446891, 9265148, 9711144, 9406705, 8883548, 9127954, 10011799, 10130140, 8761793, 7044554, 6437413, 6917611, 7626387, 8386773, 9356950, 9936434, 9506137, 8801364, 8975378, 9544081, 8995971, 7505197, 7119015, 8625267, 10054518, 9495609, 7954279, 7793012, 9252223, 10396651, 10230684, 9951443, 10700197, 11716020, 11677828, 10709445, 9836623, 9229207, 8420552, 7922019, 8959623, 11295679, 12838624]
39138A2838624n61899j346723q4146J094521M98361q00433r78043j29221N21890
39129A1052931P87984J190962J356549N47612o83450j089629o97916n66685q06799
39120A1091559n37819K70440O81491O15725R87563J731897J546630J75738q35919
39111A5727305m88372K08817R6061l24230r3389M94990O53117N00409N00610M44387
39101A7719705J19647L9596L93494L45254l71294l60058J304265K946516K350307
39092B4487432K31353o61937L21752R61229j35165j445509j160865Q2972N36569
39083B3217831j5605n08014n73605p21654j027959j026366o97764m29972j45049
39074A8071843M96418J160728J166930O81250N05448O78691M79200n9907Q342
$$ y = [12838624, 12276725, 10930002, 10845856, 11940377, 12438738, 11638305, 10660262, 10531041, 11052931, 11840915, 13031877, 14388426, 14936038, 14252588, 13162959, 12465043, 11898358, 11091559, 10553740, 10824180, 11505671, 12121396, 13108959, 14840856, 16387486, 16563224, 15727305, 15238933, 15447750, 15543811, 15219581, 15126192, 15621182, 16274299, 16774708, 17275318, 17719705, 17839352, 17878948, 18272442, 18617696, 18246402, 17886344, 19190609, 22137125, 24487432, 24718785, 24056848, 24378600, 25339829, 25204664, 23759155, 22598290, 22681262, 23217831, 23202226, 22694212, 22120607, 21398953, 20370994, 19344628, 18646864, 18216892, 18071843, 18568261, 19728989, 20895919, 21577169, 22082617, 22761308, 23240508, 23180601, 23188943]
39065B3188943Q01023J150011O05261M07517J351048K124442J368160J41552L13396
39056C1451353J420887J546816P94655J088108K468327K668386J167860N84088
39048D3190480K470449M566119M420012L306010L824346N556573O217453N825550
39040G9376992O476868Q646218J0844171J2683865J5304213J8734312K1701575
39033A73768214K4268052K7836617L2070349L4485135L3716613L0633680K5602145
39026C82380805J7429030O121667n790245j5914144k3809227k9221188l1076090
39019C00120608k9638741k7288505k5515876k3251289j9668821j6301219j4490654
39012A43965503j2994810j0379613p834566p129340p371799o419861m395002l286727
$$ y = [23188943, 23989966, 25139977, 25745238, 26152755, 27503803, 29628245, 30996405, 31137957, 31451353, 32872240, 34419056, 35213711, 36301819, 38770146, 41438532, 42606392, 43190480, 45660929, 50227048, 54647060, 57953070, 61777416, 67333989, 73551442, 79376992, 85853860, 94500078, 105344249, 118028114, 133332327, 152066639, 173768214, 198036266, 225872883, 257943232, 292428367, 326144980, 356778660, 382380805, 399809835, 405931502, 400141257, 384227113, 360417886, 331196698, 300120608, 270481867, 243193362, 217677486, 194426197, 174757376, 158456157, 143965503, 130970693, 120591080, 112756514, 105627174, 98255375, 91835514, 87440512, 84153785]
39004H4153785l787081m690606m879851m124836k585990j068793q78014j989374
38996F0149240k554879j651635q96182j567401k073593o86597J058901O76700
38988E2454554j034903j372733k85200l3598r15586r79907O7047K62535q71047
38979D7291162j299026K1726J508959J692493J028148K39415o90101j219305m34153
38970D8139318Q29640N74093j033528j599172m36299M00167l7347O5178J570530
38961D8472580K245054N16137j457795j109764M61307O04733n18576p16215L35783
38952D8833244R75292O59269M18446M95605N4264p19528n06875P83999J475790
38943E2469506N68029p72838r59848j98273m2073j103575j985363r07636J736622
$$ y = [84153785, 80366704, 75676098, 70796247, 66671411, 64085421, 63016628, 62138614, 60149240, 57594361, 55942726, 55046544, 53479143, 51405550, 50718953, 51777854, 52454554, 51419651, 50046918, 49761718, 49728120, 48812534, 47832627, 47899674, 48162209, 47291162, 45992136, 46013862, 47522821, 49215314, 50243462, 50482877, 49792776, 48573471, 48139318, 48968958, 49543051, 48509523, 46910351, 46474052, 46874219, 46836872, 46902050, 48472580, 50717634, 51233771, 49775976, 48666212, 49127519, 49732252, 49213676, 48497461, 48833244, 49808536, 50467805, 50886251, 51381856, 51436120, 50716592, 50209717, 50993716, 52469506, 53037535, 52264697, 51304849, 51106576, 51064503, 49960928, 47975565, 47067929, 48804551]
38934D8804551L279909J954118n94069j379867j71578N40685l43773j015055j51266
38925E0923655P90589K96423n00161J8551R64782N99136m45651k60857R59442
38916E3345909J311401M08573l61321n13591q70693j342011q00069N75865J178206
38907E2932269O15463K50151N78605L69550p64654j231539j64955P91337Q8352
38898E3464579j016999l94635J434682J974096N75691o00952J53096J668211J726615
38889E8984384J83986j065717q53251r6628p8819n21540l30627M38514P02789
38880E7363091K77826J91161P32934P11263n15195j640972j290610j77419J20404
38871E5772483k99449p4124R52122J484728R42287J82076j22347l14684o18877
$$ y = [48804551, 52084460, 54038578, 53444509, 52064642, 51893064, 52433749, 52089976, 51074921, 50923655, 51714244, 52010667, 51510506, 51529057, 52493839, 53092975, 52647324, 52386467, 53345909, 54657310, 55065883, 54704562, 54190971, 53320278, 51978267, 51178198, 51754063, 52932269, 53547732, 53797883, 54376488, 54746038, 53981384, 52749845, 52584890, 53376227, 53464579, 52447580, 52052945, 53487627, 55461723, 56037414, 55436462, 55589558, 57257769, 58984384, 59168370, 58102653, 57249402, 57152774, 57073955, 56552415, 56221788, 56660302, 57363091, 57640917, 57832078, 58565012, 59276275, 58761080, 57120108, 55829498, 55652079, 55772483, 55473034, 55398910, 56351032, 57835760, 58778047, 58960123, 58837776, 58523092, 57904215]
38862E7904215n20291J98297Q42699P25558j2004p07947p15600K02863J292882
38853E9210672J089566o80251k124800j556037j16320o2967j017952n78344J359578
38844E5523145K005635K60398j226568k90364J242362O74468j168679j559026
38836E5461371l63379K04242m13827m67199P17205J477986O18365p06834q64043
38827E5663887J8547O25047K83767n08881q24927k11161P57811R11716q5049j129560
38817E5501197j113458l51651K12039M17177M31054j77248j436639j932683n94216
38808E0955572J176674J216874j17726o94278j79742j46345p01441j49329J447870
38799E2808129J644755k45283j545650n19468P33346K5101j050023m5004J725491
$$ y = [57904215, 57383924, 57582221, 58424920, 59150478, 59138474, 58430527, 57714927, 57917790, 59210672, 60300238, 59619987, 57495187, 55939150, 55822830, 55759863, 54741911, 54163567, 55523145, 57528780, 57789178, 56562610, 56272246, 57514608, 58189076, 57020397, 55461371, 55097992, 55302234, 54888407, 54421208, 55138413, 56616399, 57234764, 56527930, 55663887, 55682434, 56307481, 56591248, 56082367, 55257440, 55046279, 55804090, 56715806, 56630757, 55501197, 54387739, 54036088, 54248127, 54665304, 55096358, 54919110, 53482471, 51549788, 50955572, 52132246, 53349120, 53231394, 52537116, 52357374, 52211029, 51509588, 51360259, 52808129, 54452884, 54207601, 52661951, 52142483, 52875829, 52900930, 51850907, 51805903, 53531394]
38790E3531394J096030j676038l181427j972051p2397O81590P53599Q71794O12209
38781E0644703j12644l35734K57509O12417N1236p23487r25181o44318j66190
38772D8658311L57528M22142k44365o80407J03542J139418P26822n55315n45970
38763D9381706P08688P76765r34074j904156p23934M91372k13971j380312r44358
38754D5257726J79214R6331n49198q2092Q17470M23306n69972j89865J040356
38745D6423276Q49908o88221j224588k66975J62555n97314o98390N80671J256116
38736D5797038J18003j049223m94629O66477O16244k15634m87639n21487j230609
38727D3198541j755979o32343J373537J939027N34936r30395r41164p6830M78585
$$ y = [53531394, 54627424, 52951386, 49769959, 47797908, 47725511, 48407101, 49160700, 50032494, 50644703, 50532059, 50196325, 50453834, 51066251, 51117487, 50394000, 49468819, 48824501, 48658311, 49015839, 49437981, 49193616, 48513209, 48616751, 49756169, 50482991, 49927676, 49381706, 50090394, 50867159, 49933085, 48028929, 47304995, 47796367, 47582396, 46202084, 45257726, 45436940, 45533271, 44984073, 44901981, 45719451, 46142757, 45572785, 45382920, 46423276, 47273184, 46584963, 45360375, 45093400, 45255955, 44658641, 43960251, 44540922, 45797038, 45915041, 44865818, 44371189, 45037666, 45653910, 45438276, 44950637, 44429150, 43198541, 41442562, 40810219, 42183756, 44122783, 44657719, 43727324, 42786160, 42709330, 43187915]
38718D3187915N66349M91641J6508j096150k099152j797011j30560J391330J281985
38709D1812855p6005p77528J63197J399844J044482o51907j636526r64205R2577
38700D0406784K37612j6363L67477J019922Q14068k31360r82539q34338k33518
38691D0547745L00976O94544Q35093M29749m56953j275653j544648j178213l21324
38682C8031316P14010J373123J168878K16440p47856r90848m40914J99004Q4077
38673C9607230q01536j457150j047858q0830K51807k05997m10184J98988Q51450
38664C6905920P00824J9772m05231l01091J76345P50659P70126l75542j961361
38655C6280421k179736n83080Q89664N17807p17008q05159J51715M67299j08095
$$ y = [43187915, 43754264, 44245905, 44262413, 43166263, 41067111, 39270100, 39139540, 40530870, 41812855, 41736850, 40959322, 41122519, 42522363, 43566845, 42914938, 41278412, 40314207, 40406784, 40644396, 40628033, 40995510, 42015432, 42829500, 42598140, 41615601, 40781263, 40547745, 40848721, 41543265, 42378358, 42808107, 42351154, 41075501, 39530853, 38352640, 38031316, 38745326, 40118449, 41287327, 41503767, 40755911, 39765063, 39324149, 39523153, 39607230, 38805694, 37348544, 36300686, 36219856, 36471663, 36265666, 35855482, 36054470, 36905920, 37606744, 37626516, 37221285, 36920194, 37096539, 37847198, 38617324, 38241782, 36280421, 34100685, 33517605, 34407269, 34925076, 34208068, 33402909, 33554624, 34021923, 33913828]
38646C3913828k00041M58826N08603l76384o21682M91075J302590M13176r42815
38637C4947176r15880j4662P314p35501o01774M78259O63286o81857j705528q40282
38627C0600551Q63418J411366O00571k81259n58002m98762j45337O55443J264337
38618C3912326P71076m10916q19245q4473M82916q3714j015245j145756n61210
38609C1045759P11M85001J146233J501846Q92444k22222o65501j48730M81600
38600C4517141N24442N4099o42589j303748j363998l83060J015203J521313P21029
38591C4659832m53113j044395j045920p98200k67198N80222J299949J405045R44637
38582C5280859L37629q8026k49047l01645m93095p18271m57761L51301P86499
$$ y = [33913828, 33713787, 34172613, 34681216, 34304832, 33683150, 34174225, 35476815, 35889991, 34947176, 34031296, 34016634, 34023948, 33288447, 32686673, 33164932, 33828218, 33146361, 31440833, 30600551, 31463969, 32875335, 33475906, 33194647, 32636645, 32137883, 31992546, 32647989, 33912326, 34683402, 34272486, 33453241, 33368768, 33851684, 33767970, 32752725, 31606969, 31045759, 31046470, 31531471, 32677704, 34179550, 35071994, 34849772, 34184271, 34035541, 34517141, 35041583, 35095682, 34453093, 33149345, 31785347, 31402287, 32417490, 33938803, 34659832, 34206719, 33162324, 32116404, 31318204, 31051006, 31631228, 32931177, 34336222, 35280859, 35618488, 35530462, 35281415, 34979770, 34486675, 33768404, 33310643, 33661944, 34448443]
38573C4448443J14522q64585p82399J77681M97959k67163q44745m30204N6425
38564C2105934k58053n89413J28172J288404J400010K53831r09855j091751m12259
38555C1915020M59195R10046N97120k42696q27824o89152k67654k33663n41833
38546C1078559o10499j31493O75077J303585J234355M06739m28173m38139Q0874
38537C3170885M3203o96758j011700l11416M70444L92302p5277l5550L46478L12570
38527C2605181k38330q17688j031510n74866O12156J595368R96504q93887j827671
38518C0425257n17072J420642J748911O04361l48888n81500o50806m22282N76325
38509C2254948J561020J282575J35547l74827j1073J92217M4879L45925R85285
$$ y = [34448443, 34562965, 33698380, 32915981, 33093662, 33591621, 33324458, 32479713, 32049509, 32105934, 31847881, 31258468, 31386640, 32675044, 34075054, 34328885, 33419030, 32327279, 31915020, 32374215, 33284261, 33881381, 33638685, 32810861, 32121709, 31854055, 31620392, 31078559, 30468060, 30336567, 31011644, 32315229, 33549584, 33956323, 33528150, 33090011, 33170885, 33214088, 32517330, 31505630, 31194214, 31664658, 32056960, 31981683, 31946133, 32292611, 32605181, 32366851, 31549163, 30517653, 29942787, 30554943, 32150311, 33146815, 32252928, 30425257, 29908185, 31328827, 33077738, 33682099, 33333211, 32751711, 32100905, 31678623, 32254948, 33815968, 35098543, 35234090, 34859263, 34848190, 35040407, 35085286, 35431211, 36416496]
38500C6416496R17515J93218R5272R49333J618638J557214J605513K263573K833656
38491D8450428K840950K822112L217636L873681M930786O647231Q077091P689223
38483H8549138N683746L813842K456697L1141l872040p085428p883699p289599
38475G4403798o799217n860093l646132j578105j561107k796814k876998j467526
38467D7817806m74179p44922r87092k73358M66276J69519p34136j239305j134412
38458D2866197p19032r5278N54275P33759L59557J38378N72925J052023O48197
38449D6111001m14112q67347j35613O90186K09436j207012j587273J2828J902515
38440D4714609J778706j16326j266308l73743R99891R65630j4960k69367L62313
$$ y = [36416496, 37334011, 37527229, 37622501, 38571834, 40190472, 41747686, 43353199, 45616772, 48450428, 51291378, 54113490, 57331126, 61204807, 66135593, 72782824, 80859915, 88549138, 94232884, 98046726, 100503423, 100534564, 96662524, 89577096, 81693397, 74403798, 67604581, 61744488, 58098356, 56520251, 54959144, 52162330, 49285332, 47817806, 47343627, 46598705, 45611613, 45338255, 45804531, 45974050, 45239914, 44000609, 42866197, 42147165, 42051887, 42606162, 43339921, 43699478, 43837856, 44410781, 45462804, 46111001, 45696889, 44829542, 44693929, 45384115, 45593551, 44386539, 42799266, 42812094, 44714609, 46493315, 46376989, 45110681, 44736938, 45736829, 46702459, 46687499, 46418132, 46780445]
38431D6780445O27339J76568K8561O85968J354963J399280J205844J057893M22378
38422E3739239q06260j433902m70409J178988J711711P47280m80117j010244j004001
38413E2172285p07554O3778R87779J054288R6331n56220O2686R49350O02221o29851
38403E4095093j159980p02764n25099j180948j699514j398627r31778q98760q13598
38394D4784025k47286K08947k9200n48065o85529l30975M77289J558255J860219
38385D7047680L96832j576882j460771O94489J631082j09037j466030K97898K772157
38376D8227418K064647p50676j316920Q94971K008386L88379r58862J38425J506025
38367E2201793O86772j059486j349726n11101k21969m20819o6077N53867M61967
$$ y = [46780445, 47407784, 47584352, 47612913, 48298881, 49653844, 51053124, 52258968, 53316861, 53739239, 52932979, 51499077, 51028668, 52207656, 53919367, 54666647, 54186530, 53176286, 52172285, 51464731, 51528509, 52516288, 53570576, 53666907, 53110687, 53173373, 54122723, 54724944, 54095093, 52935113, 52232349, 51707250, 50526302, 48826788, 47428161, 46496383, 45597623, 44784025, 44536739, 44745686, 44716486, 44168421, 43482892, 43151917, 43629206, 45187461, 47047680, 47444512, 45867630, 44406859, 45101348, 46732430, 46623393, 45157363, 45455261, 48227418, 50292065, 49541389, 48224469, 49119440, 51127826, 51516205, 50557343, 50695768, 52201793, 52888565, 51829079, 50479353, 49968252, 49746283, 49325464, 49259387, 49813254, 50275221]
38358E0275221k04491p29815j037704j086667m21006N30426L63725r15599j336939
38349D5437151j28129P37321j58883j114521k11259J339147J329967K64661J17713
38340D7613168P55948M71269q46735j764827j827973j599924r42655L64598J095576
38331D3318445J17678j296595j156697M8473M00970o8599Q6074N54880j99490
38322D1805139j625793j571733n7295O60099k3810l23412L91438N66548l32166
38313C9489015p58640j50233J9521o82779n98252O98138J103086l24459j330487
38304C7464910j33721J573606J560347N57161L29130M12160m47978j320368n12974
38295C9482273J154785J353368j00271j128627o19152M47454R41919P69538J98797
$$ y = [50275221, 50070730, 49340915, 48303211, 47216544, 46795538, 47325964, 47689689, 46774090, 45437151, 45309022, 46046343, 45887460, 44772939, 44561680, 45900827, 47230794, 47495455, 47613168, 48369116, 48840385, 47993650, 46228823, 44400850, 42800926, 41858271, 42222869, 43318445, 43436123, 42139528, 40982831, 41031304, 41432274, 41363675, 41449749, 42004629, 41805139, 40179346, 38607613, 38550318, 39210417, 39186607, 38863195, 39254633, 39821181, 39489015, 38730375, 38580142, 38599663, 37916884, 37318632, 38016770, 39119856, 38795397, 37464910, 37331189, 38904795, 40465142, 41022303, 41351433, 41763593, 41315615, 39995247, 39482273, 40637058, 41990426, 41890155, 40761528, 40142376, 40589830, 41531749, 42301287, 42500084]
38286D2500084m28731m91761J06455L55510l87302j042754l89193P92791R01623
38277D1916722J81540K41063J284980J861683J308075N00602J3018o30182j484807
38268D5192694j649303p96748Q8429J17587l72652n44874o8261Q40969J591336
38259D4399177J399946J84659q35742m65614P04897J071849L96072l7186L70585
38250D7188643P98592P33760P03741P57729q904j523719k036405o40199R50830
38241D6924068P36673n69612p05990O78730J741493J481171J056721J571571K233072
38232E5147897J741383L68256n92728q28837j150537j771610j771615p22637K36568
38223E0656140r5671j042851q50384P06276J873099J475947O20914R18839K054305
$$ y = [42500084, 42071353, 41579592, 41686047, 42041557, 41654255, 40611501, 40222308, 41015099, 41916722, 42098262, 42339325, 43624305, 45485988, 46794063, 47294665, 47307683, 46677501, 45192694, 43543391, 42746643, 42835072, 42952659, 42580007, 42035133, 41966872, 42807841, 44399177, 45799123, 45983782, 45148040, 44682426, 45387323, 46459172, 46855244, 46818058, 47188643, 47987235, 48720995, 49424736, 50182465, 50173561, 48649842, 46613437, 45973238, 46924068, 47660741, 47091129, 46385139, 47063869, 48805362, 50286533, 51343254, 52914825, 55147897, 56889280, 57257536, 56664808, 55835971, 54685434, 52913824, 51142209, 50419572, 50656140, 50560469, 49517618, 48667234, 49373510, 51246609, 52722556, 53343470, 54262309, 56316614]
38214E6316614K417960J486426J00882j230560k629283l476863k603782l97493
38206D9983901R42186J89066j232601j427611o27495k63319m86854k75111N71506
38197D7373668J215180J369511J557852J750205J172835k72480j612517k100311
38189E0453943j834116r32210O46245K126757K118172M60042j243847j661529
38181E0133457j283076j193918j377230j229060q48806o81848n57238j61643J52155
38172D2952793R6125L12461J321457K287984K218665J736955K001579K377377
38164E5305396J215877j182639k628515k375999k086581k703161k742515j115146
38156D1686717N07103J64368j167949j153552J96450Q68691L18516M8791P55330
$$ y = [56316614, 58734574, 60221000, 60321882, 59091322, 56462039, 52985176, 50381394, 49983901, 50926087, 51115153, 49882552, 48454941, 47827446, 47564127, 47077273, 46802162, 47373668, 48588848, 49958359, 51516211, 53266416, 54439251, 54166771, 52554254, 50453943, 48619827, 47687617, 48333862, 50460619, 52578791, 53038833, 51794986, 50133457, 48850381, 47656463, 46279233, 45050173, 44201367, 43519519, 42962281, 42800638, 42952793, 43048918, 43361379, 44682836, 46970820, 49189485, 50926440, 52928019, 55305396, 56521273, 55338634, 52710119, 50334120, 48247539, 45544378, 42801863, 41686717, 42193820, 42358188, 41190239, 40036687, 40233137, 41101828, 41420344, 41469135, 42224465]
38147D2224465J326042J102612R07612J065195M53338j348905k720343k209387
38139D0800629p59960k63700r04652j416623j191792o22859R3093R66398J366856
38130C8067390O71948l60377l32283O34991R47523r393r53480p95332k35729l56424
38120C7278834p72846m04311O47974J254355R27645K20364l46715o99806o55882
38111C7449612k7405O36048M49873m26390p95178j47420O07622O33044L59196
38102C8739002M29642M36159j80741p27729j78990Q73738P86831n28040j176124
38093C8473748n7020J374458J203827j50333o62709L04274J282217J049826K75626
38084D3093914J71759N82751M90260r1725L802J163934K063932J398310j71268
$$ y = [42224465, 43550507, 44653119, 45560731, 46625926, 47079264, 45730359, 43010016, 40800629, 40040669, 39776969, 38872317, 37455694, 36263902, 35641043, 35734136, 36700534, 38067390, 38739338, 38378961, 38046678, 38681669, 39629192, 39619799, 38666319, 37870987, 37635258, 37278834, 36505988, 36101677, 36749651, 38004006, 38931651, 39152015, 38805300, 38105494, 37449612, 37422207, 38058255, 38508128, 38081738, 37286560, 37139140, 37746762, 38379806, 38739002, 39168644, 39604803, 39424062, 38696333, 38517343, 39391081, 40177912, 39649872, 38473748, 38416728, 39791186, 40995013, 40844680, 40181971, 40486245, 41768462, 42818288, 43093914, 43265673, 43848424, 44338684, 44246959, 44250761, 45414695, 47478627, 48876937, 48705669]
38075D8705669q42584j72585M47288j5744q09636q20940l44137l80856r40336
38066D4826139j268714j263864j338793j223937l86673N00465J68027j022910
38058C8989740j226984J8846Q98087J86525p71633l60668N96096L21602p79369
38049C7872242o79027R32246K012622J178417m19118r27465k29153L33980p0993
38040D0003751r09603j155746m99771L91005P08749M47354K28062K72217J76627
38031C9662645j66917k84490j18475l17572r21453q89664J17222O85696k58733
38022C7508259j407743r08442N91691R02014j30468m46735O30557J128745l34834
38013C7533044k180251k156023m67972R34296J150153Q38715N34530k5337r16690
$$ y = [48705669, 47863085, 47690500, 48137788, 48122044, 47312408, 46491468, 46147331, 45766475, 44826139, 43557425, 42293561, 40954768, 39730831, 39344158, 39844623, 40012650, 38989740, 37762756, 37781602, 38679689, 38866214, 38094581, 37733913, 38330009, 38651611, 37872242, 37193215, 38125461, 40138083, 41316500, 40897382, 39969917, 39740764, 40074744, 40003751, 39094148, 37938402, 37438631, 37829636, 38538385, 38985739, 39213801, 39486018, 39662645, 39495728, 39211238, 39092763, 38775191, 37853738, 36964074, 37081296, 37766992, 37508259, 36100516, 35192074, 35783765, 36685779, 36555311, 36108576, 36739133, 37867878, 37533044, 35352793, 33196770, 32728798, 33663094, 34813247, 35651962, 36186492, 36161155, 35244465]
38004C5244465j493397j163195j93440M91217K16396p17487j265285p70821K74970
37995C0623423R02118Q27293N01985L06708K85079L83608L55360j61651q34803
37986C3189120n99261O56573J263737R222j668101j549799j8920O55469j4718
37977C1923322l95471j9530k71072j251247j057996O31660J311619k43110j498064
37968B9130111j92278J687590R99829j358907j789629M47520K390272J933663
37960C3248171K56849o62111m93491J12415P27374R92037O10678o4109m14358
37951C4313455m83587n40015j57001R66191J771771J023476o23741j376078q39492
37942C4054979j21281K96524Q89396J441094J091506J66276J0221P33588J004696
$$ y = [35244465, 33751068, 32587873, 32394433, 32885650, 33102046, 32384559, 31119274, 30348453, 30623423, 31525541, 32352834, 32854819, 33161527, 33446606, 33830214, 34185574, 34023923, 33189120, 32589859, 33246432, 34510169, 34519391, 32851290, 31301491, 31282571, 31938040, 31923322, 31527851, 31508321, 31237249, 29986002, 28928006, 29559666, 30871285, 30628175, 29130111, 28937833, 30625423, 31625252, 30266345, 28476716, 28924236, 31314508, 33248171, 33505020, 32842909, 32349418, 32461833, 33189207, 34181244, 34791922, 34727813, 34313455, 33829868, 33289853, 33132852, 34099043, 35870814, 36894290, 36270549, 34894471, 34054979, 33933698, 34230222, 35119618, 36560712, 37652218, 37818494, 37828715, 38562303, 39566999]
37933C9566999L95183K2364M39703Q02911O72756P50659J182753J027160J64596
37924D5025084j41196N49821R71055M53667J91372R92009J632398R23045k58355
37915E0338900n73146l24258k93039M6281J269308K227254J561326L5192o06660
37906E3681158k65340k3133Q6492O61879R58208k39865k021349k077682j98497
37897E0561871J249625P76334m34067q26591n63991l94733k31448j980m20954
37888D9714066j663368k482246j917827q89366q00878j389849j338689m73048
37880C8758795O9298k99281q34055o95016n0697L44138J12842m49312p75053o38694
37870C5542965m55285p78860j412825j456247n27575N42867P33020J57266k10662
$$ y = [39566999, 39962182, 39984546, 40424249, 41227160, 41899916, 42650575, 43833328, 44860488, 45025084, 44883888, 45433709, 46404764, 46858431, 47049803, 48041812, 49674210, 50597255, 50338900, 49765754, 49441496, 49148457, 49194738, 50464046, 52691300, 54252626, 54287818, 53681158, 53415818, 53392685, 53479177, 54141056, 55099264, 54859399, 52838050, 50760368, 50561871, 51811496, 52587830, 52153763, 51327172, 50763181, 50368448, 50137000, 50135020, 49714066, 48050698, 45568452, 43650625, 42761259, 41960381, 40570532, 39231843, 38758795, 38828093, 38528812, 37694757, 36999741, 36949044, 37293182, 37406024, 36956712, 36181659, 35542965, 35087680, 34308820, 32895995, 31439748, 30912173, 31455040, 32188060, 32345326, 32134664]
37861C2134664J10748O49718P70585L84807j21290k76140J03496O02749M46815
37852C4806152n42640j439356j220126j73875L59194k56402j138875j184600o19586
37843B8589886o09507j481189k053211j115666Q03722J814286R22241p02559j219984
37834B4948019m15223L24224J32182l21284j93808K32232K81810N9534L5427J03763
37824B5186876l5875r8452K18817L82581j88920r27114r11385m65474n30544p50109
37814B1880401N7693J498908J690580K79355o49914K81395J540819J084301n69883
37805B7093655j397381q28402J77214J096740J946494K080972R22450m73146n67029
37796C0051567J84155O0286q48355o46276J013448K053096J256622Q3869k1065
$$ y = [32134664, 32245412, 32895130, 33665715, 34050522, 33929232, 33653092, 33756588, 34359337, 34806152, 34263512, 32824156, 31604030, 31430155, 31789349, 31532947, 30394072, 29209472, 28589886, 27980379, 26499190, 24445979, 23330313, 24134035, 25948321, 26870562, 26168003, 24948019, 24532796, 24857020, 24989202, 24667918, 24474110, 24706342, 24988152, 25047686, 25083113, 25186876, 25151001, 25052549, 25271366, 25653947, 25465027, 24537913, 23626528, 23161054, 22630510, 21880401, 21938094, 23437002, 25127582, 25406937, 24757023, 25038418, 26579237, 27663538, 27093655, 25696274, 24867872, 25045086, 26141826, 28088320, 30169292, 31091742, 30618596, 30051567, 30235722, 30296008, 29447653, 28801377, 29814825, 31867921, 33124543, 33208412, 33187347]
37787C3187347Q0122p00160j277012k62756J212514J018578m93484j054438j65741
37778C1544970L17663n31834j313091r31252m59282j106487k024713j704477m05673
37769B3385824M32350M74231N44607P74651L61159p35880j377624r92897m67678
37760B2398743n97559p52219o0964R06035Q85124o9372o28943k11811L05519J87444
37750B2361997l2270L45482Q97843P62094P916n35290m71904j11638J90332K90275
37740B3704837Q0465l06121l17674L76528J231228J365688O23122l21892o68700
37731B5767481j8095J275316J941510Q46377j191863j740524O9442J897054J260678
37722C0107376q41598j468983j42506Q50631L99815J6492P45857J295423M89843
$$ y = [33187347, 33267469, 32567309, 31290297, 31027541, 32240055, 33258633, 32765149, 31710711, 31544970, 31862633, 31330799, 30017708, 29086456, 28627174, 27520687, 25495974, 23791497, 23385824, 23818174, 24292405, 24837012, 25611663, 25972822, 25236942, 23859318, 22866421, 22398743, 21801184, 21048965, 20988001, 21894036, 22779160, 22709788, 22080845, 21869034, 22174553, 22361997, 22329727, 22675209, 23573052, 24335146, 24343062, 23807772, 23335868, 23224230, 23414562, 23704837, 23785302, 23479181, 23161507, 23538035, 24769263, 26134951, 26758073, 26436181, 25767481, 25749386, 27024702, 28966212, 29812589, 28620726, 26880202, 26949644, 28846698, 30107376, 29265778, 27796795, 27654289, 28504920, 28904735, 28921227, 29667084, 30962507, 31452350]
37713C1452350o08326n82695M9954K4448n63347q38782p12755n11962r3836M52906
37703B8067955L27182n76191r68028j23403P30367L61889m49917m22272K4293
37694B6971875j24464l73285K40458J033554P96275J62021M96882J090547Q1592
37685C0375455k046320k613487p32110J312146J388766J55123n45286k05737M37973
37676B7526523P68900O46356K30683j1005K13936M23368N516p04481r48810q07525
37666B7343461p64153m87227M59905J144573L25355j250356j585544m26018N30648
37657B5290644M76589L42711N53238K60794o29570r57013n17804n04240r98088
37648B3317261n35705Q21799P50168j439165k908755j490647O96565N46401j155477
$$ y = [31452350, 30844024, 30261329, 30311283, 30335731, 29772384, 28933602, 28220847, 27708885, 27615049, 28067955, 28395137, 27818946, 26850918, 26727515, 27457882, 27819771, 27369854, 26947582, 26971875, 26847411, 26474126, 26714584, 27748138, 28544413, 28706434, 29203316, 30293863, 30375455, 28329135, 25715648, 24983538, 26295684, 27684450, 27839573, 27294287, 27088550, 27526523, 28295423, 28941779, 29172462, 29161457, 29375393, 29798761, 29804277, 29099796, 28150986, 27343461, 26579308, 26092081, 26551986, 27696559, 28021914, 26771558, 25186014, 24759996, 25290644, 25767233, 26109944, 26663182, 26923976, 26294406, 25337393, 24819589, 24315349, 23317261, 22781556, 23603355, 24353523, 22914358, 20005603, 18514956, 19211521, 19757922, 18602445]
37639A8602445j343752K15051R01055k03836j112006n02112M63855N70644K77211
37630A7868555R0528n97521j868946k302203j037196N61116P78714Q4144K16443
37621A3793634J331182J734149N33218r00981p93151O36290J566573R96511k16087
37612A8681338q03575o30882l12007p7815J64531J72495k62533n91508j73694
37603A6166350N18360M52982l10644p52815o57781q11350j228048q08829O24855
37594A3193080J555288R87666J3919l3652K95481k35599j241764j296570k92894
37585A2944955M06004N7992n63755m75004L06069R82477Q01026k66051j247690
37576A2946023r91541L05274J074463M91497l06933m9666O31290L74175n12949
$$ y = [18602445, 17258693, 17473744, 18374799, 18170963, 17058957, 16556845, 17020700, 17591344, 17868555, 17959083, 17361562, 15492616, 13190413, 12153217, 12714333, 13493047, 13577191, 13793634, 15124816, 16858965, 17392183, 16491202, 15698051, 16334341, 17900914, 18897425, 18681338, 17877763, 17246881, 16934874, 16857059, 17021590, 17194085, 16931552, 16340044, 16166350, 16684710, 17137692, 16827048, 16074233, 15416452, 14605102, 13377054, 12568225, 13193080, 14748368, 15736034, 15749953, 15716301, 16011782, 15776183, 14534419, 13237849, 12944955, 13350959, 13408951, 12845196, 12370192, 12676261, 13658738, 14459764, 14193713, 12946023, 11954482, 12259756, 13334219, 13825716, 13518783, 13469117, 14100407, 14474582, 13961633]
37567A3961633n90784J66074L04121n26828q61651P8100Q95310J68934j179161
37558A2415748j159623K88724J181166M14816o44738k49430J073718J256834j91383
37549A4385832j322086n53959J000055J247169K19834k59600L48941N63608m69981
37540A5159813j516024j323654n43362l44890m16285J96554J149841J245273L68132
37531A3975398l79988l21232J18022L06866J30507j74608k98197l7747M12722
37522A3731743N63271K43888k48657o92129j009361q09044J96490J243357J177767
37513A4397325K42125j92207J07358p810o16634k17965J371787J958303L77528
37504A7419810j261363p82475O39865P21828o8182K17322J226247R91161l88902
$$ y = [13961633, 13370849, 13536923, 13841044, 13314216, 12452565, 12530665, 13425975, 13594909, 12415748, 11256125, 11544849, 12726015, 13140831, 12496093, 12246663, 13320381, 14577215, 14385832, 13063746, 12509787, 13509842, 14757011, 14976845, 14717245, 15066186, 15629794, 15159813, 13643789, 12320135, 11776773, 11431883, 11015598, 11212152, 12361993, 13607266, 13975398, 13595410, 13274178, 13392200, 13699066, 13829573, 13654965, 13356768, 13319021, 13731743, 14295014, 14538902, 14290245, 13598116, 12588755, 11779711, 11976201, 13219558, 14397325, 14639450, 14447243, 14554601, 14546791, 13930157, 13712192, 15083979, 17042282, 17419810, 16158447, 15375972, 16015837, 16737665, 16669483, 16886805, 18113052, 19104213, 18715311]
37495A8715311r49314m10159m13716j208469j142786J44708Q89171K51583l53707
37486A5522622J58876R05951Q89608M90892K51664l0002k71051Q0794O38091L26523
37476A8963968m50151K2141J736741K316743M82955j862282k351751j214512k22452
37467A7421400p7618l04887n74712p74475o06686j25335J00554r998J43637N92090
37457A5783970O05273J97465L21162R77648Q08224o02702j697468j261079k12146
37448A4920347N1592l47711n82717n76393m96969r2548M09690J03970q66432r26584
37438A1596245M05113J271455K23223j380711j436771j66579P13760O94467M48595
37429A2368797J32301l73483l66663O57269J611084J228277J51100j85442J4820
$$ y = [18715311, 17765997, 17355838, 16942122, 15733653, 14590867, 14735575, 15624746, 15876329, 15522622, 15681498, 16587449, 17477057, 17967949, 18219613, 18189611, 17918560, 17999354, 18637445, 18963968, 18513817, 18535958, 20272699, 22589442, 23072397, 21210115, 18858364, 17643852, 17421400, 17343782, 17038895, 16464183, 15689708, 15083022, 14957687, 15058241, 15048243, 15191880, 15783970, 16389243, 16586708, 16907870, 17885518, 18693742, 18091040, 16393572, 15132493, 14920347, 14971939, 14624228, 14041511, 13465118, 12968149, 12875601, 13285291, 13389261, 12522829, 11596245, 12001358, 13272813, 13496036, 12115325, 10678554, 10511975, 11225735, 11920202, 12368797, 12501098, 12127615, 11760952, 12418221, 14029305, 15257582, 15408682, 15223240, 15238060]
37420A5238060m12609j134933p83811L96721O35645m72791j236804n01815P63405
37411A2491068J192745Q72099O27041N25372J8181r12091j454550q64907M82904
37402A2977862J157957K44177j238713j396003r2124P57705O2889q04390l09120
37393A1360240Q06755R29134J87298j43995O9582M1808j24221J98056M92852k00534
37383A3616975j243389j048666L65671J410778J433237J209733R49002k7883j295959
37374A5369499j230093L38466J336267L62411j248248j452375k55336Q14398R72181
37365A5007170O25897J92086l24860p77438p90159k80242L86000P80852P85532
37356A5604838O09814M46298J19370o00687j246354q81931M90465J513825J178098
$$ y = [15238060, 14825451, 13690518, 12906707, 13303428, 13939073, 13466282, 12229478, 11727663, 12491068, 13683813, 14555912, 15182953, 15708325, 15726506, 14814415, 13359865, 12494958, 12977862, 14135819, 14379996, 13141283, 11745280, 11653156, 12410861, 12473750, 11669360, 11360240, 12166995, 13096129, 13283427, 13139432, 13209014, 13250822, 13126601, 13324657, 13817509, 13616975, 12373586, 11324920, 11690591, 13101369, 14534606, 15744339, 16693341, 16665458, 15369499, 14139406, 14477872, 15814139, 16176550, 14928302, 13475927, 13220591, 14034989, 15007170, 15633067, 15825153, 15500293, 14722855, 13932696, 13652454, 14038454, 14819306, 15604838, 16214652, 16660950, 16780320, 16179633, 14933279, 14051348, 14541813, 16055638, 17233736]
37347A7233736K10181j05564K71987N97882Q26861J293221J534148R55435K33711
37338B3051598M78092J310326J396567O51250K13944L57910J85539n53933j059195
37329B6032098r94625p76887l41309O18654J225759K76351j345332j350554M60529
37320B3804684J731076J232297N62639J112278J766607J176970J84421J35256
37312C1706228N04763R8864p81395j199497j358863j768740j857789j218965j015464
37303B3109142k137819l045835j706529J065743K539919J910566Q76200N27735
37295B3139122P4972r67011j572788j067808m57529q27651j647119j708624r23183
37286A4042381k34417k30073n74389o12118j20606M44682L95687l07652q12482
$$ y = [17233736, 17443917, 17338353, 17610340, 18208222, 19035083, 20328304, 21862452, 22817887, 23051598, 23529690, 24840016, 26236583, 26887833, 27101777, 27459687, 27645226, 27091293, 26032098, 25037473, 24260586, 23919277, 24537931, 25763690, 26040041, 24694709, 23344155, 23804684, 25535760, 26768057, 27330696, 28442974, 30209581, 31386551, 31570972, 31706228, 32210991, 32309855, 31528460, 30328963, 28970100, 27201360, 25343571, 24124606, 23109142, 20971323, 17925488, 16218959, 17284702, 19824621, 21735187, 22611387, 23139122, 23214094, 22247083, 20674295, 19606487, 19148958, 18321307, 16674188, 14965564, 14042381, 13807964, 13577891, 13003502, 12391384, 12270778, 12715460, 13111147, 12803495, 11991013]
37277A1991013m20216L75843N21974j02198n68596k66523L52716N26007N6224
37268A2466244p21661j338663j404884q54691j12818K95161L10110K27372J35034
37259I001204j39684n96786r52263r10453l10632P51648J661799J580647N15583
37250A0601063l49233j05044N01845R0498j180277j630599m35890J130655J386003
37241A0009021L26296p00845q51428m82523k18622j19287Q0070M23951P06076
37232I172709P25939L80338k90305r28412r39226j16835Q71440J082173M74473
37223A0432294j8405J51623L34435j98705q89454n96370N76908J250372O77412
37214A1720110l39622p64401o04695l85339k05132J9921M4596k67425m87396k40878
$$ y = [11991013, 11570797, 11946640, 12468614, 12366416, 11797820, 11531297, 11884013, 12410020, 12466244, 11744583, 10405920, 9001036, 8146345, 8033527, 8328688, 8638798, 8866170, 9001204, 8861520, 8264734, 7312471, 6402018, 6091386, 6843034, 8504833, 10085480, 10601063, 10251830, 10146786, 10648631, 10739129, 9558852, 7928253, 7492363, 8623018, 10009021, 10335317, 9634472, 8783044, 8300521, 8081899, 7962612, 8042682, 8466633, 9172709, 9898648, 10278986, 9988681, 9060269, 8121043, 8004208, 8875648, 9957821, 10432294, 10413889, 10565512, 10899947, 10701242, 9811788, 9215418, 9792326, 11042698, 11720110, 11380488, 10616087, 10011392, 9626053, 9420921, 9440842, 9485438, 9218013, 8730617, 8489739]
37204H489739J42594J77331K292M8921L15230M92528M28523L0055p60884j408641
37194G957688r10459P75066K100022J705254L21466k12122N02881J091414N77659
37185A3908869l57215o07909j19924L87569M77470K54354R814P556L15128O03854
37175A4879566M30506j04443l52501N239M55586L62190j15729k53308K02171O94421
37165A6203698O61303K45688r9628l49201o96939q41978l13605M43753L66684
37156A5619775m18770k96441J388603K769856J869664l52083j315609n97810m0516
37147A8626669k72021P6240J155896R28784j164143k372552o71952J706596J506606
37138A9520123n90397j354218j84521M99732l54287j050133n05122O4042k95376
$$ y = [8489739, 8632333, 8809664, 8811956, 8860877, 9176107, 9668635, 10097158, 10127213, 9366329, 7957688, 7047229, 7822295, 9922317, 11627571, 11949037, 11736915, 12239796, 13331210, 13908869, 13551654, 12943745, 12823821, 13211390, 13688860, 13943214, 13953028, 13960584, 14275712, 14879566, 15310072, 15205629, 14853128, 14858367, 15313953, 15676143, 15560414, 15307106, 15509277, 16203698, 16865001, 17110689, 17011061, 16661860, 15964921, 15122943, 14809338, 15253091, 15619775, 15201005, 14904564, 16293167, 19063023, 20932687, 20580604, 19264995, 18667185, 18626669, 18354648, 18430888, 19586784, 20515568, 19351425, 16978873, 16306921, 18013517, 19520123, 18929726, 17575508, 17390987, 17890719, 17536432, 16486299, 15981177, 16045219, 15749843]
37129A5749843o35557j97087Q1763n37245j058071n25328K23093K4568o57531
37120A2468448o81743j04786K60857L29247M60854L78634l39450j165137j227285
37111A0379639o89020m11590m83851k03632M95025O60658l03130j618823j986956
37102E838320j136270o2993K74041R4201K67395Q50206Q79362j21836j230828
37093E651598j366203p36334j69005L16455J061854J462555O66668o46881q88968
37084E351739l3416K88629n04957r96383k23582P12597N89708N0902K84140R40187
37074F459564Q63440N8944m84223l75930m3397J50888K6420o05017j327690j047307
37064C675692M36824J568335R74886m39889p75068L3570K82321p48777j707890
$$ y = [15749843, 15114286, 14917199, 14998962, 14461717, 13403646, 12878318, 13101411, 13125979, 12468448, 11786705, 11681919, 11942776, 12272023, 12732877, 13111511, 12772061, 11606924, 10379639, 9690619, 9279029, 8795178, 8591546, 9086571, 9747229, 9444099, 7825276, 5838320, 4702050, 4639057, 4913098, 5007299, 5274694, 6124900, 7004262, 6882426, 5651598, 4285395, 3549061, 3380056, 3696511, 4758365, 6220920, 6887588, 6240707, 5351739, 5318323, 5606952, 5101995, 4105612, 3882030, 4594627, 5184335, 5235237, 5519377, 6459564, 7323004, 7381948, 6897725, 6521795, 6478398, 6629286, 6655706, 6050689, 4722999, 3675692, 4112516, 5680851, 6655737, 6215848, 5440780, 5474350, 5756671, 5007894, 3300004]
37055C300004j143662O07986J936600J668862J03771j191832q13110P69948J460459
37046F699026K06003j367074j155735L54461Q98046j18298r70441n42801J42419
37037D145606j1037m26639k78992j56343q60929j584573q92132R19441J917535
37028B771937J032765o22796j187875j17092J423505J836137O58349r39129j310704
37019C545097j62790J072208R78308j45593q72322n88109m6072o191j82001O5984
37009C658519N91298O43745o814o97059p15586j50546L20174K83669l5721k31731
36999C659948k65754l71096n34575l88411K39749Q83493Q50681P5833p23247q43627
36989B582994l07205L57530P31151O45044P1466o43260p21245J76820J143902
$$ y = [3300004, 2156342, 2764328, 4700928, 6369790, 6473561, 5281729, 4468619, 5238567, 6699026, 6905029, 5537955, 4382220, 4736681, 5634727, 5516429, 4545988, 4003187, 4145606, 4134569, 3707930, 3428938, 3272595, 2411666, 827093, -65039, 854402, 2771937, 3804702, 3181906, 1994031, 1876939, 3300444, 5136581, 5794930, 4855801, 3545097, 3382307, 4454515, 5432823, 5287230, 4414908, 3826799, 3780727, 3774536, 3592535, 3658519, 4249817, 4893562, 4886748, 4189689, 3474103, 3323557, 3643731, 3927400, 3891679, 3659948, 3394194, 3023098, 2488523, 2100112, 2339861, 3223354, 4074035, 4149868, 3426621, 2582994, 2275789, 2633319, 3364470, 4009514, 4080980, 3437720, 2716475, 2893295, 4037197]
36980D037197R36330k28658p61001O9307J029119P34295m03111j027803q56780
36971C528895o28292n70076k54102K67878M70690L94358M68268M23840l00770
36962C800689j134173q33545M76166J232279P13447j19227m58188p05306j066516
36953A905626p48207N06153J542819J479416R14442M97108k10124j298417j556528
36944C032288m35104N45070P1283p10684k09398P18946K89999q84328p63439M59279
36934B113912O64029l20225k81432J363887K163782N30300j545446j475783J90198
36925C403222J019198L11647n71091p00292m86929l56841r7648L61480O21713
36916C504459M69717J67687j9776j22707k60068m34985n12482l06116J44479M16080
$$ y = [4037197, 4973527, 4744869, 3983868, 4053175, 5082294, 5816589, 5413478, 4385675, 3528895, 2900603, 2330527, 2076425, 2344303, 2814993, 3209351, 3677619, 4101459, 3800689, 2666516, 1832971, 2309137, 3541416, 4254863, 4135636, 3677448, 2972142, 1905626, 1157419, 1663572, 3206391, 4685807, 5600249, 6097357, 5887233, 4588816, 3032288, 2597184, 3142254, 3213537, 2502853, 2293455, 3012401, 3302400, 2418072, 1654633, 2113912, 2777941, 2457716, 2176284, 3540171, 5703953, 6234253, 4688807, 3213024, 3403222, 4422420, 4734067, 4162976, 3462684, 2975755, 2618914, 2521266, 2882746, 3504459, 3974176, 4141863, 4122087, 3999380, 3739312, 3304327, 2791845, 2485729, 2630208, 3046288]
36906C046288J73556k65885l26835m7939N9495p4822r5008q1141m13323p21571
36896A252815j57117R73884J133510k11540j454214r42720P09705J602298J212789
36887D119410P35174R26392R71260o4813j579787k040928r81048L61326O30988
36878C077974K6349k44127J48465L51130L1441M3771O70692O02775r34338k248511
36868A525621j388715N03663N53346j308209j974158K6335K143603J728475k9736
36859A780225k34054J279504K054121P96080j146534j932952j189185K08278J097012
36850B712495Q08830j45751m43260L04054Q27549J18912q36445n67785M26033
36841C204632M32309o53911j096508j4175J344652J500725O21956j39186k83001
$$ y = [3046288, 3219844, 2953959, 2627124, 2579185, 2638680, 2563858, 2468850, 2387709, 1974386, 1252815, 1095698, 2069582, 3203092, 2991552, 1537338, 594618, 1304323, 2906621, 4119410, 4854584, 5780976, 6752236, 6687423, 5107636, 3066708, 2085660, 2446986, 3077974, 3104323, 2860196, 3008661, 3359791, 3391232, 3435003, 4105695, 4708470, 3774132, 1525621, 136906, 640569, 1193915, -114294, -2088452, -2062117, 81486, 1809961, 1780225, 1546171, 2825675, 4879796, 5675876, 4529342, 2596390, 1407205, 1615483, 2712495, 3521325, 3375574, 2932314, 3236368, 4063917, 4182829, 3346384, 2778599, 3204632, 3636941, 2983030, 1886522, 1872347, 3216999, 4717724, 5339680, 5200494, 4917493]
36832D917493k80671p17502j532107j961343j290261J54678J136368R86369L87950
36823A800974J74292J36932j47302j91254M74342J007149M14926n39461l48706
36814B781892O40256O34294n44386r65348K43748J307085N20219j125855j504975
36805A986930l42027Q87718J240427R97065N59747N5554j45980K70796P72894
36796F283124M87143m73948j099525r43858o07257n92034n64249j38840L34609
36787B685165L26249j1536j04495K00734N67601P55621P68282N25999o1988o82591
36777D969041q19002m79460j81077m5738M01487J155334J240015P7048j254729
36768E062919j182648K13857J320397J170554L79017j79829m15513m33454q2010
$$ y = [4917493, 4636822, 3919320, 2387213, 425870, -864391, -709713, 426655, 1413024, 1800974, 1975266, 2112198, 1964896, 1773642, 2247984, 3255133, 3670059, 3130598, 2781892, 3422148, 4056442, 3512056, 2546708, 2790456, 4097541, 4617760, 3491905, 1986930, 1644903, 2532621, 3773048, 4770113, 5329860, 5385414, 5239434, 5510230, 6283124, 6770267, 6296319, 5196794, 4252936, 3645679, 3053645, 2489396, 2350556, 2685165, 3011414, 2999878, 2895383, 3096117, 3663718, 4419339, 5187621, 5713620, 5651632, 4969041, 4150039, 3670579, 3489502, 3443764, 3845251, 5000585, 6240600, 6317648, 5062919, 3880271, 4094128, 5414525, 6585079, 6964096, 6784267, 6368754, 5935300, 5853290]
36759E853290L92555K78504m37147q00740l49385J76008J76760J31434M22848
36750E844127M13013l12893q83625m76356K77507M14869J70087R4684k71976j296942
36740C972495j835173p52536R37134J419386Q72070P58791R22868n9623j765695
36731D469717j929806o5554J487998J067556o5493j74456L22810J77182m17727
36722D872227n34739k82422l02616m01817p7970L15385J79303j72516p5144L19536
36712C839227M19827K08903P357k18454m94733m06292J43365L91518j58209p02643
36702C029866k55722P02433Q07848j87219j031971o47299N67521J274304O74510
36693D934271o36390j244081m98984O29209P60668m2323m74928K9622O16073M89589
$$ y = [5853290, 6245845, 6524349, 6087202, 5286462, 4937077, 5113085, 5289845, 5421279, 5844127, 6257140, 5944247, 5060622, 4584266, 4861773, 5276642, 5446729, 5541413, 5269437, 3972495, 2137322, 1384786, 2321920, 3741306, 4613376, 5372167, 6295035, 6235412, 4469717, 2539911, 2474357, 3962355, 5029911, 4964418, 4789962, 5112772, 5289954, 4872227, 4337488, 4055066, 3752450, 3350633, 3272663, 3588048, 3767351, 3594835, 3519691, 3839227, 4259054, 4467957, 4475314, 4256860, 3762127, 3355835, 3499200, 3890718, 3732509, 3029866, 2774144, 3476577, 4284425, 4097206, 3065235, 2417936, 2985457, 4259761, 4934271, 4297881, 3053800, 2554816, 3184025, 3944693, 3902370, 3427442, 3457064, 4073137, 4562726]
36683D562726o7600n23197q06697p62692n2129R05202J075852M01237n4311l7531
36673D640860n85143j807041k013413l11108J627217J954675J273322J097069
36665E876438J161736L89377o77552p94006m83118j056045j766923p23630J488339
36656C414616K002347K5386j706733r22822J030369J514991K96564q20559q76804
36647C957355n11400l58257k07149K06613N69799M14610k28879p60780n88372
36638B493540J43169N99423L40452J0881L62373R53297P27440k74584q43417l64644
36628D147930L47842L18904l17287p58456o53135l52829l69743p88933j040070
36619E34223m06843R12661J627985Q39582o54023j289600o82875J97659N29587
$$ y = [4562726, 4495126, 3971929, 3165232, 2402540, 2350411, 3255613, 4331465, 4732702, 4678391, 4640860, 4055717, 2248676, 235263, -75845, 1551372, 3506047, 4779369, 5876438, 7038174, 7427551, 6749999, 5955993, 5472875, 4416830, 2649907, 1926277, 3414616, 5416963, 5442349, 3735616, 2812794, 3843163, 5358154, 5654718, 4834159, 3957355, 3445955, 3087698, 2880549, 3087162, 3656961, 4071571, 3842692, 3081912, 2493540, 2636709, 3236132, 3576584, 3587465, 3949838, 4903135, 5630575, 5355991, 4512574, 4147930, 4495772, 4814676, 4497389, 3738933, 3085798, 2732969, 2363226, 1574293, 534223, 127380, 1040041, 2668026, 3507608, 2853585, 1563985, 881110, 1078769, 1608356]
36610A608356L73982Q9485o3276J38221N03141K86390o74121j181338k56212J025701
36600A850329Q67306l94818o70054N83921J479351O70959p00744r74228k70351
36591B441671K82596L37261J93379j05695m62534l26704M47198J031264O79038
36582D517474l09248j215794j680997j412207k06711J155193J264332R5641n94505
36573A613178K00938J152652P29363l91515n94264M0743J49922n11619q61916
36564A527482m09817K13365N59542Q13178R43677O40054J13576j13010j68083
36555D119964n45646r83719p53913j6886K71125j26198m13014j14992L01647L88058
36545B126426L27577L15254J70705j45870l52213l76058l99138l01007J87789
$$ y = [1608356, 1982338, 2071823, 2008547, 2146768, 2649909, 2936299, 2262178, 1080840, 824628, 1850329, 2717635, 2322817, 1652763, 2236684, 3716035, 4386994, 3686250, 2712022, 2441671, 2724267, 3061528, 3254907, 3149212, 2686678, 2359974, 2807172, 3838436, 4517474, 4208226, 2992432, 1311435, -100772, -307483, 847710, 2112042, 2207683, 1613178, 1814116, 2966768, 3696131, 3304616, 2710352, 2751095, 2901017, 2389398, 1527482, 1117665, 1331030, 1890572, 2703750, 3647427, 4287481, 4401057, 4288047, 4119964, 3574318, 2590599, 1836686, 1819800, 2090925, 1964727, 1551713, 1436721, 1738368, 2126426, 2454003, 2769257, 2939962, 2794092, 2441879, 2065821, 1666683, 1365676, 1553465]
36536A553465P44106P27839K72941J49480M00118J99712o15186j044246n20242
36527A867987J16593M8821j63531K50108O43476o0204j259687j223972K22868
36518D42459J234279O89983j47466K20099J032043N39856r89589j518378m32816
36509A070470N37421J92874k84839M06171J255950O26333p90455r47700J49612
36500B215837M25159p87382j630672p84701N10156O46066Q4426J67721Q38654
36491A685264J038961M60016l75758r92102r28810J60040J402072J001660j102910
36482B348433k323587q41442J463902J631749l5356q31135n6925L96314k51422
36473A500531m47519N98052J351570O13999n24499o74481j99917J6072J68351
$$ y = [1553465, 2297571, 3025410, 3298351, 3447831, 3847949, 4047661, 3432475, 2388229, 1867987, 1984580, 2033401, 1869870, 2119978, 2763454, 2703250, 1443563, 219591, 442459, 1676738, 2366721, 2219255, 2439354, 3471397, 4011253, 3021664, 1503286, 1070470, 1607891, 1800765, 1515926, 1922097, 3178047, 3804380, 3013925, 2066225, 2215837, 2640996, 1853614, 222942, -561759, -51603, 594463, 678889, 846610, 1685264, 2724225, 3184241, 2808483, 1816381, 887571, 1047611, 2449683, 3451343, 2348433, 24846, -816596, 647306, 2279055, 2243699, 1412564, 1355639, 1751953, 1500531, 1053012, 1651064, 3002634, 3616633, 3092134, 2417653, 2217736, 2233808, 2402159]
36464B402159N45315M65136l88978q95634j94425P05551M61817m78916p41526
36455A880499j19224O03602J112509J428807J062652k20479j372635j229478k26347
36446B919906L42174K11952k2320l09239q66200j105463m80285J31939l11109
36437E11355q80519Q0625J850658J926474l8178j450998p16708N23561L78261
36428B184531l64858j34723M86482J4839j006910p97387N56994J163559L91434
36419B493961l23325m6033K88315k03804p37185k36643Q06560J019589J05603
36410C167038q32031p12350L42698J153358O54167q11740j494239j95008J859987
36401C131880K150852J13466j939687j812105j98257N97007j79718j224913j355597
$$ y = [2402159, 2947474, 3412610, 3023632, 2127998, 1933573, 2639124, 3100941, 2622025, 1880499, 1761275, 2364877, 3477386, 4906193, 5968845, 5748366, 4375731, 3146253, 2919906, 3262080, 3474032, 3451712, 3142473, 2276273, 1170810, 690525, 822464, 511355, -369164, -288539, 1562119, 3488593, 3450415, 1999417, 1282709, 1806270, 2184531, 1819673, 1684950, 2171432, 2186271, 1179361, 381974, 938968, 2102527, 2493961, 2170636, 2124603, 2412918, 2209114, 1471929, 1235286, 2041846, 3061435, 3167038, 2335007, 1622657, 1965355, 3118713, 3772880, 2961140, 1466901, 1271893, 3131880, 5282732, 5396198, 3456511, 1644406, 1446149, 2043156, 1863438, 638525, -717072]
36392g17072p19617J13410Q82417J195212O05367l53497k86658J152939K319672
36383D192173J504894p00457k044187j473478k67000k2182n19213m39520L67857
36374E98887O18821k31765q39450N9926J447689J302683k54903r49504J68477
$$ y = [-717072, -1436689, -1323279, -440862, 754350, 1359717, 1006220, 719562, 1872501, 4192173, 5697067, 4996610, 2952423, 1478945, 1211945, 1189763, 670550, 231030, 598887, 1217708, 985943, 146493, 206419, 1654108, 2956791, 2701888, 1752384, 1920861]
$$ [...]
##END NTUPLES=NMR SPECTRUM
##END=
