##TITLE=31Pdec_SR104_2
 , 124 sc
 17.2.2022
##JCAMPDX= 6.0         $$ Bruker NMR JCAMP-DX V2.0
##DATA TYPE= NMR SPECTRUM
##DATA CLASS= NTUPLES
##ORIGIN= UXNMR, Bruker Analytische Messtechnik GmbH
##OWNER= root
$$ XWIN-NMR		Version 3.5
$$ Thu Feb 17 12:17:38 2022 Russian Standard Time (UT+4h)  she@DPX200
##.OBSERVE FREQUENCY= 81.013821
##.OBSERVE NUCLEUS= ^31P
##.ACQUISITION MODE= SIMULTANEOUS
##.ACQUISITION SCHEME= undefined
##.AVERAGES= 124
##.DIGITISER RES= 16
##SPECTROMETER/DATA SYSTEM= spect
##.PULSE SEQUENCE= zgpg30
##.SOLVENT NAME= CDCl3
##.SHIFT REFERENCE= (INTERNAL, CDCl3, 0, 248.564)
##AUDIT TRAIL= $$ (NUMBER, WHEN, WHO, WHERE, WHAT)
$$ ##TITLE= Audit trail, XWIN-NMR		Version 3.5
$$ ##JCAMPDX= 5.01
$$ ##ORIGIN= Bruker BioSpin GmbH
$$ ##OWNER= she
$$ F:/spectra/data/she/nmr/P31/1/pdata/1/auditp.txt
$$ ##AUDIT TRAIL=  $$ (NUMBER, WHEN, WHO, WHERE, WHAT)
(   1,<2022-02-17 12:14:53.28 +0400>,<she>,<DPX200>,
      <continue with go, POWCHK disabled, PULCHK disabled
       configuration hash MD5:
       00 E9 B6 7A A2 85 ED C7 34 08 36 98 17 FE 4E 26
       data hash MD5: 32K
       C4 9D 8B F9 15 14 BC CE B7 01 08 10 D9 85 4B F6>)
(   2,<2022-02-17 12:16:35.45 +0400>,<she>,<DPX200>,
      <Start of raw data processing
       efp BC_mod = 2 LB = 1 FT_mod = 6 PKNL = 1 PHC0 = -9190.479 PHC1 = 104.0745 SI = 64K 
       data hash MD5: 64K
       FD 9E 28 3E 77 82 D4 07 F8 D2 96 57 82 8C 78 1F>)
(   3,<2022-02-17 12:16:56.26 +0400>,<she>,<DPX200>,
      <pk PHC0 = -3.301725 PHC1 = 4.000001 
       data hash MD5: 64K
       55 67 88 2C CB 20 F9 5D C2 92 2F 7A FB 28 89 2E>)
(   4,<2022-02-17 12:17:00.43 +0400>,<she>,<DPX200>,
      <abs ABSG = 5 
       data hash MD5: 64K
       5A 96 5B A1 CD B6 83 D8 8C 99 F9 9C FF 2F B9 08>)
$$ ##END=
$$ 
$$ hash MD5
$$ 11 26 94 45 DF 73 BD 62 4F ED B1 AD 8E 5F 1F B0
##$RELAX= 
##$RELAX= 
##$RELAX= 
##$RELAX= 
##$RELAX= 
##$RELAX= 
##$RELAX= 
##$RELAX= 
$$ Bruker specific parameters
$$ --------------------------
##$DU= <F:/spectra>
##$EXPNO= 1
##$NAME= <P31>
##$PROCNO= 1
##$TYPE= <nmr>
##$USER= <she>
##$AMP= (0..31)
100 100 100 100 100 100 100 100 100 100 100 100 100 100 100 100 100 100 
100 100 100 100 100 100 100 100 100 100 100 100 100 100 
##$AQSEQ= 0
##$AQ_mod= 1
##$AUNM= <au_zg>
##$AUTOPOS= <>
##$BF1= 81.014009
##$BF2= 200.13
##$BF3= 200.13
##$BF4= 200.13
##$BF5= 200.13
##$BF6= 200.13
##$BF7= 200.13
##$BF8= 200.13
##$BYTORDA= 1
##$CFDGTYP= 0
##$CFRGTYP= 5
##$CHEMSTR= <none>
##$CNST= (0..31)
1 1 145 1 1 1 1 1 1 1 1 1 1 1 1 1 1 1 1 1 1 1 1 1 1 1 1 1 1 1 1 1 
##$CPDPRG= <waltz16>
##$CPDPRG1= <>
##$CPDPRG2= <waltz16>
##$CPDPRG3= <>
##$CPDPRG4= <mlev>
##$CPDPRG5= <mlev>
##$CPDPRG6= <mlev>
##$CPDPRG7= <mlev>
##$CPDPRG8= <mlev>
##$CPDPRGB= <>
##$CPDPRGT= <>
##$D= (0..31)
0 1 0 0 0 0 0 0 0 0 0 0.03 2e-05 3e-06 0 0 0 0 0 0 0 0 0 0 0 0 0 0 0 0 
0 0 
##$DATE= 1645085522
##$DBL= (0..7)
120 120 120 11 120 120 24 19 
##$DBP= (0..7)
150 150 150 150 150 150 150 150 
##$DBP07= 0
##$DBPNAM0= <>
##$DBPNAM1= <>
##$DBPNAM2= <>
$$ [...]
##$SUBNAM3= <"">
##$SUBNAM4= <"">
##$SUBNAM5= <"">
##$SUBNAM6= <"">
##$SUBNAM7= <"">
##$SUBNAM8= <"">
##$SUBNAM9= <"">
##$SW= 501.771253377433
##$SWIBOX= (0..15)
0 1 3 0 0 0 0 0 0 0 0 0 0 0 0 0 
##$SW_h= 40650.406504065
##$TD= 32768
##$TD0= 1
##$TE= 0
##$TE2= 300
##$TE3= 300
##$TEG= 300
##$TL= (0..7)
0 120 53 12 22 120 120 120 
##$TP= (0..7)
150 150 150 150 150 150 150 150 
##$TP07= 0
##$TPNAME0= <>
##$TPNAME1= <>
##$TPNAME2= <>
##$TPNAME3= <>
##$TPNAME4= <>
##$TPNAME5= <>
##$TPNAME6= <>
##$TPNAME7= <>
##$TPOAL= (0..7)
0.5 0.5 0.5 0.5 0.5 0.5 0.5 0.5 
##$TPOFFS= (0..7)
0 0 0 0 0 0 0 0 
##$TUNHIN= 0
##$TUNHOUT= 0
##$TUNXOUT= 0
##$USERA1= <user>
##$USERA2= <user>
##$USERA3= <user>
##$USERA4= <user>
##$USERA5= <user>
##$V9= 5
##$VALIST= <valist>
##$VCLIST= <CCCCCCCCCCCCCCC>
##$VD= 0
##$VDLIST= <DDDDDDDDDDDDDDD>
##$VPLIST= <PPPPPPPPPPPPPPP>
##$VTLIST= <TTTTTTTTTTTTTTT>
##$WBST= 1024
##$WBSW= 4
##$XGAIN= (0..3)
0 0 0 0 
##$XL= 0
##$YL= 0
##$YMAX_a= 63373
##$YMIN_a= -92560
##$ZGOPTNS= <>
##$ZL1= 120
##$ZL2= 120
##$ZL3= 120
##$ZL4= 120
##$ABSF1= 248.5645
##$ABSF2= -253.2056
##$ABSG= 5
##$ABSL= 3
##$ALPHA= 0
##$AQORDER= 0
##$ASSFAC= 0
##$ASSFACI= 0
##$ASSFACX= 0
##$ASSWID= 0
##$AUNMP= <proc_1d>
##$AZFE= 0.1
##$AZFW= 0.5
##$BCFW= 0
##$BC_mod= 2
##$BYTORDP= 0
##$COROFFS= 0
##$CY= -3
##$DATMOD= 1
##$DC= 0
##$DFILT= <>
##$DTYPP= 0
##$F1P= 0
##$F2P= 0
##$FCOR= 1
##$FTSIZE= 65536
##$FT_mod= 6
##$GAMMA= 0
##$GB= 0
##$INTBC= 1
##$INTSCL= 5.30512e-09
##$ISEN= 30
##$LB= 1
##$LEV0= 0
##$LPBIN= 0
##$MAXI= 10000
##$MC2= 0
##$MEAN= 0
##$ME_mod= 0
##$MI= 50
##$NCOEF= 0
##$NC_proc= -6
##$NLEV= 6
##$NOISF1= 182.463
##$NOISF2= 159.3651
##$NSP= 0
##$NTH_PI= 0
##$NZP= 0
##$OFFSET= 248.5645
##$PC= 4
##$PHC0= -9193.78
##$PHC1= 108.0745
##$PH_mod= 1
##$PKNL= yes
##$PPARMOD= 0
##$PSCAL= 0
##$PSIGN= 0
##$REVERSE= no
##$SF= 81.014009
##$SI= 65536
##$SIGF1= 159.3651
##$SIGF2= -187.1042
##$SINO= 113.3802
##$SIOLD= 16384
##$SREGLST= <1H.CDCl3>
##$SSB= 0
##$STSI= 65536
##$STSR= 0
##$SW_p= 40650.406504065
##$SYMM= 0
##$S_DEV= 0
##$TDeff= 32768
##$TDoff= 0
##$TI= <>
##$TILT= no
##$TM1= 0
##$TM2= 0
##$TOPLEV= 0
##$USERP1= <user>
##$USERP2= <user>
##$USERP3= <user>
##$USERP4= <user>
##$USERP5= <user>
##$WDW= 1
##$XDIM= 65536
##$YMAX_p= 296923709
##$YMIN_p= -32562758
$$ End of Bruker specific parameters
$$ ---------------------------------
##NTUPLES= NMR SPECTRUM
##VAR_NAME=  FREQUENCY,     SPECTRUM/REAL,   SPECTRUM/IMAG
##SYMBOL=    X,             R,               I
##VAR_TYPE=  INDEPENDENT,   DEPENDENT,       DEPENDENT
##VAR_FORM=  AFFN,          ASDF,            ASDF
##VAR_DIM=   65536,         65536,           65536
##UNITS=     HZ,            ARBITRARY UNITS, ARBITRARY UNITS
##FACTOR=    0.620285442955139, 1,           1
##FIRST=     20137.2065510759, 0,            0
##LAST=      -20513.1999529892, 0,           0
##MIN=       -20513.1999529892, -32562758,   0
##MAX=       20137.2065510759, 296923709,    0
$$ Real data points
##PAGE= N=1
##DATA TABLE= (X++(R..R)), XYDATA
$$ [...]
45083a950013j208196L54824K568727K214895J06730p34801m42853j085701j779447
$$ -1950013 -3158209 -2803385 -234658 1980237 2086967 1352166 909313 -176388 -1955835
45074a955835k92345J681909O33813j958833j192437K649596L715697J91449k490669
$$ -1955835 -2248180 -566271 67542 -1891291 -3083728 -434132 3281565 3473014 982345
45065I82345o62578J901948J165364l42083J049994K945304J177370k337728k529871
$$ 982345 319767 2221715 3387079 3044996 4094990 7040294 8217664 5879936 3350065
45056C350065K71744J103686j338701l190777k182471n20581k89792n47661j11506
$$ 3350065 3621809 4725495 3386794 196017 -1986454 -2507035 -2796827 -3344488 -3455994
45047c455994M14824L67150j39185j345920k912661k296486K166961O875731O231836
$$ -3455994 -3041170 -2674020 -2813205 -4159125 -7071786 -9368272 -7201311 -325580 5906256
45038E906256P70341k863208j335591J065795q5884k542375j873680J115629K192082
$$ 5906256 6676597 3813389 2477798 3543593 3457709 915334 -958346 157283 2349365
45029B349365N96078n78915J24157R19697N46095J3173Q6148p4383r32713j428617
$$ 2349365 2945443 2366528 2490685 3410382 3956477 3969650 4055798 3981415 3048702 1620085
45019A620085p19167M57697R13770M66169j98904l79149N6043L62814m77313k150586
$$ 1620085 900918 1358615 2272385 2738554 2539650 2160501 2216544 2579358 2102045 -48541
45009d8541k666707p71972J907916K673651J370075M00832J012019J518545J20228
$$ -48541 -2715248 -3487220 -1579304 1094347 2464422 2865254 3877273 5395818 5516046
45000E516046k111469k593472q41794Q63758M83388j349888k449357j849424o33522
$$ 5516046 3404577 811105 -30689 833069 1316457 -33431 -2482788 -4332212 -4965734
44991d965734k11560n69267m99145Q28085K805047L792595K645144Q4102j727599
$$ -4965734 -5177294 -5746561 -6245706 -5417621 -2612574 1180021 3825165 3909267 2181668
44982B181668j542561n77371p17535j602496j229190N27864J369376L93454j54057
$$ 2181668 639107 61736 -655799 -2258295 -3487485 -2959621 -1590245 -1196791 -1350848
44973a350848J267613K449531R52359j525490j806791o04944j037128k739719
$$ -1350848 -83235 2366296 3318655 1793165 -13626 -618570 -1655698 -4395417
44965d395417k302353M02548J493089k04459q96714J501221L362061J336254j924689
$$ -4395417 -6697770 -6295222 -4802133 -5006592 -5903306 -4402085 -1040024 296230 -1628459
44956a628459k152125j15880P09802M24493J541244L258355K211362j527272m009194
$$ -1628459 -3780584 -3896464 -3186662 -2762169 -1220925 2037430 4248792 2721520 -1287674
44947a287674l182347r84485N66914J417911J306008l70060j851663l28718K986280
$$ -1287674 -4470021 -5454506 -4887592 -3469681 -2163673 -2533733 -4385396 -4714114 -1727834
44938a727834L318931m64633l343213j346681K578986L247888O39102j285428
$$ -1727834 1591097 1126464 -2216749 -3563430 -984444 2263444 2902546 1617118
44930A617118r34570n6730L84498J112420J660581M85628j706042k227559p30165
$$ 1617118 682548 625818 1010316 2122736 3783317 4268945 2562903 335344 -394821
44921c94821K4751j178327j861660k12980J474249N18550j394559q02955J582465
$$ -394821 -370070 -1548397 -3410057 -3623037 -2148788 -1630238 -3024797 -3827752 -2245287
44912b245287J744579r00005k063896O42897L538303K325042j376470k781178
$$ -2245287 -500708 -1400713 -3464609 -2821712 716591 3041633 1665163 -1116015
44904a116015j243619l40715j378984j610469L64303J955740J225096K00920Q94106
$$ -1116015 -2359634 -2700349 -4079333 -5689802 -5325499 -3369759 -2144663 -1943743 -1049637
44895a049637J453593k60604k085178p39473K240086K401054n27749k191096n99245
$$ -1049637 403956 143352 -1941826 -2681299 -441213 1959841 1432092 -759004 -1358249
44886a358249J058534O4535j482618n13721J895026K357842L45941j446519j135589
$$ -1358249 -299715 -235180 -1717798 -2231519 -336493 2021349 2367290 920771 -214818
44877b14818L51885J113073L94807j073012j801994q97050N99165N05836j473283
$$ -214818 137067 1250140 1644947 571935 -1230059 -2127109 -1527944 -1022108 -2495391
44868b495391k653465p23690K749545M046256K079613n54120j396746r52929q97968
$$ -2495391 -5148856 -5872546 -3123001 923255 3002868 2448748 1052002 99073 -798895
44859g98895j190590n26360J107080J979026Q96163j176959k343073k007050j194989
$$ -798895 -1989485 -2515845 -1408765 570261 1466424 289465 -2053608 -4060658 -5255647
44850e255647q81727q04105j97185R13525J765554J938699J690372J195666J92382
$$ -5255647 -6137374 -6941479 -7138664 -6225139 -4459585 -2520886 -830514 365152 557534
44841E57534j186841j771056l98401K277566L794592K400061p12986k583838k001003
$$ 557534 -629307 -2400363 -2798764 -521198 3273394 5673455 4960469 2376631 375628
44832C75628p43183p07750j110644q4386J853279K284043Q33536k2228R37803
$$ 375628 -367555 -1075305 -2185949 -2270335 -417056 1866987 2700523 2678295 3616098
44823C616098J366742q71428l688666l351301K0466K548551J971899K9033r61654
$$ 3616098 4982840 4111412 422746 -2928555 -2908089 -359538 1612361 1641394 679740
44814F79740j132478j456780j364831J46885K257444K991480J732953k16611j423667
$$ 679740 -452738 -1909518 -3274349 -3127464 -870020 2121460 3854413 3637802 2214135
44805B214135j698344j641963j479207o88840J116853K988779K953904L19526
$$ 2214135 515791 -1126172 -2605379 -3294219 -2177366 811413 3765317 4084843
44797D084843k719187l045180l77665K180738J931446j96713j196168j6378J283335
$$ 4084843 1365656 -1679524 -2057189 123549 2054995 1858282 662114 645736 1929071
44788A929071M98442j694857k530160p54231J548763J467500r23740k572790j457437
$$ 1929071 2427513 732656 -1797504 -2551735 -1002972 464528 -459212 -3032002 -4489439
44779d489439R10058J896852J281302P57453Q23400K78512j240438k223023j404375
$$ -4489439 -3579381 -1682529 -401227 356226 1179626 1458138 217700 -2005323 -3409698
44770c409698M70349J674066J321593k41451j879073k133406l50979K112083K817981
$$ -3409698 -2939349 -1265283 56310 -185141 -2064214 -4197620 -4548599 -2436516 381465
44761C81465J075544r96917j023622O76286J631390M37684j513321j824525q6084
$$ 381465 1457009 460092 -563530 112756 1744146 2181830 668509 -1156016 -1242100
44752a242100J582218J148447p57499j648719l64692J582374K052680O42404j375452
$$ -1242100 340118 1488565 731066 -917653 -1282345 300029 2352709 2995113 1619661
44743A619661k432488j593522O80392K268997J394121o36105p08836J297724J771833
$$ 1619661 -812827 -2406349 -1725957 543040 1937161 1301056 592220 1889944 3661777
44734C661777q69279k844236n81870L079305K654306j593837m000638j988505
$$ 3661777 2792498 -51738 -633608 2445697 5100003 3506166 -494472 -2482977
44726b482977P44987M92632j393830j583526L66352K260989K260277L28520j682606
$$ -2482977 -1737990 -1245358 -2639188 -4222714 -3856362 -1595373 664904 993424 -689182
44717f89182j250756J518945K674321l38265l526603j372808L770180L978599
$$ -689182 -1939938 -420993 2253328 1915063 -1611540 -2984348 785832 4764431
44709D764431j712426m874814q89670L413996R68081l836294k680087K656303
$$ 4764431 3052005 -1822809 -2712479 701517 1669598 -2166696 -4846783 -2190480
44701b190480L400134j642563m606931j665219J797547J183269m38634Q48343
$$ -2190480 1209654 -432909 -5039840 -6705059 -4907512 -3724243 -4162877 -3314534
44693c314534K849049J833346q22009j390254J79338J317189J368980J207121
$$ -3314534 -465485 1367861 545852 -844402 -665064 652125 2021105 3228226
44685C228226M22702j439100k552726j199058R04341R56978m82370p84979M8981
$$ 3228226 3650928 2211828 -340898 -1539956 -635615 321363 -161007 -945986 -897005
44676h97005k91469j801764j751229N53699K200258J226085k99201K78029K036732
$$ -897005 -1188474 -2990238 -4741467 -4187768 -1987510 -761425 -1060626 -782597 1254135
44667A254135K219394N94408n98849m24473l11195j103595j450400k26450J203283
$$ 1254135 3473529 4067937 3469088 3044615 2733420 1629825 179425 -47025 1156258
44658A156258P63217j244683k519326j873765l95840N18588P63898P46115L83448
$$ 1156258 1919475 674792 -1844534 -3718299 -4114139 -3595551 -2831653 -2085538 -1702090
44649a702090l35692p95384n59680J2384N58453J208448J643645Q38430j192714
$$ -1702090 -2037782 -2833166 -3392846 -3380462 -2822009 -1613561 30084 868514 -324200
44640c24200k500520j488923P37581J872933J528771J061306Q70417R1154j082642
$$ -324200 -2824720 -4313643 -3576062 -1703129 -174358 886948 1757365 1848519 765877
44631G65877j135101J55456R91359L49514m77804k98450o2962r10495j852866
$$ 765877 -369224 -213768 777591 1127105 649301 350851 287889 -622606 -2475472
44622b475472j376799n4463O07415Q50947J740811K407229J209902o37954r5291
$$ -2475472 -3852271 -3906734 -3299319 -2448372 -707561 1699668 2909570 2271616 2176325
44613B176325K482595K898069m59813l464176k368068K95319J7002k108743j461124
$$ 2176325 4658920 7556989 7097176 3633000 1264932 1560251 1577253 -531490 -1992614
44604a992614J712811K200564j293564l481774j063045J885674R20755j487978
$$ -1992614 -279803 1920761 627197 -2854577 -3917622 -2031948 -1111193 -2599171
44596b599171q40227J350663P10644j548871m93713L267635L631740r01027m243397
$$ -2599171 -3439398 -2088735 -1378091 -2926962 -3420675 -153040 3478700 2577673 -1665724
44587a665724k174567J471043J554808o79951j045368M65234P98330n23329j441961
$$ -1665724 -3840291 -2369248 -814440 -1494391 -2539759 -2074525 -1276195 -1799524 -3241485
44578c241485j377421j155406k17889K235484M252954L120059j8230j169018O74234
$$ -3241485 -4618906 -5774312 -5992201 -3756717 496237 3616296 3598066 2429048 3103282
44569C103282K046222J54556l291376m703104l084712m11828J282556J714935
$$ 3103282 5149504 5304060 2012684 -2690420 -5775132 -6186960 -4904404 -3189469
44561c189469J514238Q33506m01616j262624l24421J853643K410285J49506j811826
$$ -3189469 -1675231 -841725 -1243341 -2505965 -2830386 -976743 1433542 1583048 -228778
44552b28778k97987K404906J539560k162470k962516N33870K593564l93764l890629
$$ -228778 -526765 1878141 3417701 1255231 -1707285 -1173415 1420149 1026385 -2864244
44543b864244k796014L48002N39783p18555J277470N066894M736320o3687l379823
$$ -2864244 -5660258 -5312256 -4772473 -5491028 -4213558 853336 5589656 5525969 2146146
44534B146146k492911j054197j466289j033709J754303L218165M53561l334794
$$ 2146146 -346765 -1400962 -2867251 -3900960 -2146657 1071508 1525069 -1809725
44526a809725l428050k22593K366609K609160J696892O46232m10756r29069m34259
$$ -1809725 -5237775 -5460368 -3093759 -484599 1212293 1858525 1447769 518700 84441
44517H4441L26343L81842o229l9716L41955P93735J224272J410690Q89325k87113
$$ 84441 410784 792626 786397 746681 1088636 1882371 3106643 4517333 5406658 5119545
44507E119545j507716k311795k236992o66021J647520J977169j019896m222230
$$ 5119545 3611829 1300034 -936958 -1602979 44541 2021710 1001814 -3220416
44499c220416l431627O07571L134784K308819J153037J779548K026920n6056k133653
$$ -3220416 -6652043 -6044472 -2909688 -600869 552168 2331716 4358636 4302580 2168927
44490B168927j080248J862068K596451k46921l713549m247059j585232J112856
$$ 2168927 1088679 2950747 5547198 5300277 1586728 -2660331 -4245563 -3132707
44482c132707P87791j728910k409353M84879L417481K443614q35802j862943k28925
$$ -3132707 -2344916 -4073826 -6483179 -5998300 -2580819 -137205 -973007 -2835950 -3064875
44473c064875N16867n04807n16368R43135Q60317j094687j099445J877774L379209
$$ -3064875 -2548008 -3052815 -3569183 -2626048 -1765731 -2860418 -3959863 -2082089 1297120
44464A297120P98762j984333j138048R53158N27694j015957m77121R98407N08852
$$ 1297120 2095882 111549 -1026499 -73341 454353 -561604 -1038725 -40318 468534
44455D68534q43816k13203J335892Q08593r51148p80297R28734J046822o42043
$$ 468534 -375282 -588485 747407 1556000 604852 -175445 753289 1800111 1158068
44446A158068j602620j517452k117479k645712o07817K971956L996437J517527
$$ 1158068 -444552 -1962004 -4079483 -6725195 -7333012 -4361056 -364619 1152908
44438A152908r61405j084836l17736j23081M65708K011404K759096J171379j910958
$$ 1152908 191503 -893333 -1211069 -1334150 -868442 1142962 3902058 5073437 3162479
44429C162479m521127n087931k805746J176075L412563J830361q55487o14296
$$ 3162479 -1358648 -6446579 -9252325 -8076250 -4663687 -2833326 -3688813 -4303109
44421d303109J756967J967432o52499k088779l34948J599850R72125o38820p03297
$$ -4303109 -2546142 -578710 -1231209 -3319988 -3654936 -2055086 -1082961 -1721781 -2425078
44412b425078M00541J209398J814393K368640J587698r70381l272436l413649
$$ -2425078 -2024537 -815139 999254 3367894 4955592 3985211 712775 -2700874
44404b700874j936551j05353J853812L304290K543479n13299l256105l772241
$$ -2700874 -4637425 -4742778 -2888966 415324 2958803 2445504 -810601 -4582842
44396d582842l008272j903226O80321M683410O456930L225946j968324l606113
$$ -4582842 -7591114 -9494340 -8814019 -4130609 2326321 5552267 3583943 -22170
44388b2170r71681J535700R63722r06000j282959k73924J71594p95912k258380
$$ -22170 -993851 541849 1505571 599571 -683388 -957312 -785718 -1581630 -3840010
44379c840010k695377j211085J487726L192203K347374J24896r07094j79672L78032
$$ -3840010 -6535387 -7746472 -6258746 -3066543 -719169 -594273 -1501367 -1681039 -1303007
44370a303007m54391j288994m93306J009111R82278p34487j874568r12255R40412
$$ -1303007 -1757398 -3046392 -3539698 -2530587 -1548309 -2282796 -4157364 -5069619 -4129207
44361d129207J577863P07438k90893m61321j2300O77894J472965J872906J268592
$$ -4129207 -2551344 -1843906 -2134799 -2596120 -2608420 -1930526 -457561 1415345 2683937
44352B683937P1290n93209o30308j081351j991988j769558K99551K360161K285014
$$ 2683937 2755227 2162018 1531710 450359 -1541629 -3311187 -3011636 -651475 1633539
44343A633539N60701o94802o82800j82624L80959J165487J562875O36821r78250
$$ 1633539 2194240 1499438 816638 634014 1014973 2180460 3743335 4380156 3401906
44334C401906j396149j11263J130112O49186j032189j938212r06057J191504K186499
$$ 3401906 2005757 1894494 3024606 3673792 2641603 703391 -202666 988838 3175337
44325C175337P33626k020994l403844k226004k4633J180425J174081P75173K12920
$$ 3175337 3908963 1887969 -1515875 -3741879 -3766512 -2586087 -1412006 -636833 -423913
44316d23913m11426l56828M93618P83522k59257j151525l62305J097683J371060
$$ -423913 -835339 -1192167 -698549 84973 -174284 -1325809 -1688114 -590431 780629
44307G80629P54082O29694N98743o19910k320421k620941j482491l03050O76403
$$ 780629 1534711 2164405 2763148 2143238 -177183 -2798124 -4280615 -4583665 -3907262
44298c907262J843025K161255P55374n71688J48608J288267L97384p23543J110022
$$ -3907262 -2064237 97018 852392 280704 429312 1717579 2114963 1391420 2501442
44289B501442L600798J451463m117343n618909q88482L032414J053853k181248
$$ 2501442 6102240 7553703 3436360 -2182549 -3071031 -38617 1015236 -1166012
44281a166012r04361J924247M58931l213364k453439K323595L975924J58109l394322
$$ -1166012 -2070373 -146126 312805 -2900559 -5353998 -3030403 945521 1103630 -2290692
44272b290692k335222M66656J015582L19085J055383K430536K091912L69753p36338
$$ -2290692 -4625914 -4159258 -3143676 -2824591 -1769208 661328 2753240 3122993 2386655
44263B386655r28497j126357j010535L42220K155132K444919N42534k227699l939306
$$ 2386655 1458158 331801 -678734 -336514 1818618 4263537 4806071 2578372 -1360934
44254a360934l245333j51406L241484L864748J097966j822819j609396N67766
$$ -1360934 -4606267 -4757673 -1516189 2348559 3446525 1623706 14310 582076
44246E82076P01624k001102l548211r19516L125209L583115J51047k603068j856848
$$ 582076 1283700 -717402 -4265613 -5185129 -2059920 1523195 1674242 -928826 -2785674
44237b785674J08134K76960n89382j74001J097524J101817o2798m73383K5084
$$ -2785674 -2677540 -2400580 -2989962 -3163963 -2066439 -964622 -1027420 -1500803 -1475719
44228a475719j38345r34150p17094M31880O63018q2420M9949R45161M33937j015996
$$ -1475719 -1614064 -2548214 -3265308 -2833428 -2170410 -2252830 -2202881 -1257720 -823783 -1839779
44218a839779l022L580115M748634R10193l307217k864456k9091q6749k432606
$$ -1839779 -1842801 1737314 6485948 7396141 4088924 1224468 1195377 1108628 -1323978
44209a323978k172874J074757K692088J223010L90234J703532J389168k528706
$$ -1323978 -3496852 -2422095 269993 1493003 1883237 3586769 4975937 2447231
44201B447231n530132l038089K334089M415253J866190j337917k242364j555892
$$ 2447231 -3082901 -6120990 -3786901 628352 2494542 1156625 -1085739 -2641631
44193b641631n93237N40635J401958R67368l70333r74652o58936q75437j643010
$$ -2641631 -3234868 -2694233 -1292275 -324907 -695240 -1669892 -2328828 -3204265 -4847275
44184d847275r03847J799324L505020J777965j397322k244825n30001O59504n957
$$ -4847275 -5751122 -3951798 -446778 1331187 -66135 -2310960 -2840961 -2181457 -2187414
44175b187414n04758M84260J158115r7656j599018r92006Q49873J320739L23084
$$ -2187414 -2692172 -2207912 -1049797 -1147453 -2746471 -3738477 -2888604 -1567865 -1244781
44166a244781P2703J141603J640431N51185p61650r66943m68274l9805K53035
$$ -1244781 -1172078 -30475 1609956 2161141 1399491 432548 -35726 -75531 177504
44157A77504J93343o03922j382064r36928K5560l95406j748759j265678J532351
$$ 177504 370847 -233075 -1615139 -2552067 -2526507 -2921913 -4670672 -5936350 -4403999
44148d403999L324975J833614p09869j217346k71946k29812r70176p67238P1776
$$ -4403999 -1079024 754590 44721 -1172625 -1444571 -1674383 -2644559 -3411797 -3340021
44139c340021j79380j118884m85461J998635L698996K478750p38619l181175k889693
$$ -3340021 -3519401 -4638285 -5123746 -3125111 573885 3052635 2314016 -867159 -3756852
44130c756852k60938K244235K416933Q45584J9665M68622m2869k281080l234911
$$ -3756852 -4017790 -1773555 643378 1488962 1508627 1977249 1934380 -346700 -3581611
44121c581611n01713L286967L665834N67660j965661j563652J29941O89861k14641
$$ -3581611 -4083324 -796357 2869477 3437137 1471476 -92176 37765 727626 512985
44112E12985j285008j029919R99293L036058K288951j163736l509195k288048
$$ 512985 -772023 -1801942 -802649 2233409 4522360 3358624 -150571 -2438619
44104b438619l1306j9083j001820P485J995452J741501k74836q92447j20588n54756
$$ -2438619 -2469925 -2489008 -3490828 -3483343 -1487891 253610 -21226 -913673 -1034261 -1589017
44094a589017j613157k55725K545797K341933r23931k000168R09481K805919J58352
$$ -1589017 -3202174 -3457899 -912102 1429831 505900 -1494268 -584787 2221132 2379484
44085B379484l339011k954064J33228K042879K057043J286709n89864l158669
$$ 2379484 -959527 -3913591 -3780363 -1737484 319559 1606268 1016404 -2142265
44077b142265l411639k11760K630913J787866l83588k66770Q87034J58380r87183
$$ -2142265 -5553904 -5765664 -3134751 -1346885 -1730473 -1997243 -1110209 -951829 -1939012
44068a939012M28539K480857J040043k618028l258204k34539J592451j16604k026449
$$ -1939012 -1510473 970384 2010427 -607601 -3865805 -4100344 -2507893 -2624497 -4650946
44059d650946j215050P00970J309665J036003J084081J110853O53881J76675l84480
$$ -4650946 -5865996 -5165026 -3855361 -2819358 -1735277 -624424 29457 206132 -178348
44050a78348j507821k016721j62788K735065L109529L57158k165588k186740j007176
$$ -178348 -1686169 -3702890 -3865678 -1130613 1978916 2336074 170486 -2016254 -3023430
44041c023430k2117J293294K475986J285101j980780l250971n25648K522255J909896
$$ -3023430 -3045547 -1752253 723733 2008834 28054 -3222917 -3748565 -1226310 683586
44032F83586q20168j629827j36113J149148J573424K169195K194159J33268k514002
$$ 683586 -136582 -1766409 -1902522 -753374 820050 2989245 5183404 5316672 2802670
44023B802670k538829q5946J303850O7503j416126j001056K27915L67642m45489
$$ 2802670 263841 177895 1481745 1549248 133122 -867934 -640019 -272377 -717866
44014g17866j029427j117175j016811p06464k49991J1678K41796R18477J648825
$$ -717866 -1747293 -2864468 -3881279 -4587743 -4837734 -4826056 -4584260 -3665783 -2016958
44005b016958J597162J162062J422920J806889N92384j775305k507463p24485
$$ -2016958 -419796 742266 2165186 3972075 4564459 2789154 281691 -442794
43997d42794Q08360l4352j307216l56790J599118J510162l33249q68746M92208
$$ -442794 365566 331214 -976002 -1332792 266326 1776488 1443239 574493 1066701
43988A066701R96404n90784j833356o98025J227911J516705N35223R6724K89916
$$ 1066701 2063105 1472321 -361035 -1059060 168851 1685556 2220779 2317503 2607419
43979B607419M1803m28782j82994J89948o76049k284598k732197j757619j016638
$$ 2607419 2649222 2220440 2037446 2227394 1551345 -733253 -3465450 -5223069 -6239707
43970f239707j049136m02312J381550K262728P94100j107648o19570J790270K935789
$$ -6239707 -7288843 -7691155 -6309605 -4046877 -3252777 -4360425 -4979995 -3189725 -253936
43961b53936J439379n65368p90401J02429N1985j037450j287473J45022J844806
$$ -253936 1185443 620075 -170326 -67897 -15912 -1053362 -2340835 -2195813 -351007
43952c51007K351699K027860J684117O97386j674601l803132k974866L96155K264132
$$ -351007 2000692 4028552 5712669 6410055 4735454 932322 -2042544 -1646389 617743
43943F17743J22034l245607l334349J1508K688219K026468l11715j477966j003071
$$ 617743 739777 -2505830 -5840179 -5828671 -3140452 -1113984 -1425699 -2903665 -3906736
43934c906736k09152K4179l46622j038369j326745n68617M83699L35322o39750
$$ -3906736 -4115888 -4091709 -4438331 -5476700 -6803445 -7372062 -6888363 -6553041 -7192791
43925g192791k26806J860526K647609M51851j568750K25597L577170K728921k728197
$$ -7192791 -7419597 -5559071 -2911462 -2459611 -4028361 -3802764 -225594 2503327 -224870
43916b24870o104919k674959L473971N097850J661954q84562P00377K800674J245682
$$ -224870 -6329789 -9004748 -5530777 -432927 1229027 344465 1044842 3845516 5091198
43907E091198k247097k927797o0544K418372J714801n86954j685596j285050p59854
$$ 5091198 2844101 -83696 -144240 2274132 3988933 3401979 1716383 431333 -328521
43898c28521n23617p2334M08751K50843l78839p93060j024604j448383j605014
$$ -328521 -852138 -924472 -515721 -264878 -643717 -1436777 -2461381 -3909764 -5514778
43889e514778q34105K54861N00279J77691N78223J615385J733553N56932k75431
$$ -5514778 -6348883 -6094022 -5593743 -5416052 -4837829 -3222444 -1488891 -931959 -1207390
43880a207390L09429J109771N93810p99758j450147o58037R53437K240480K086889
$$ -1207390 -897961 211810 805620 5862 -1444285 -2102322 -1148885 1091595 3178484
43871C178484K44261j767976j894825k88838P65115L68181L22955J622364K068059
$$ 3178484 3422745 1654769 -240056 -528894 236221 604402 927357 2549721 4617780
43862D617780k17152k907195k347147P49890K030889j24157k414982j729537N35624
$$ 4617780 4400628 1493433 -853714 -103824 1927065 1802908 -612074 -2341611 -1805987
43853a805987J030032p02790k070325j255102O73619J543288Q16421n8315K17605
$$ -1805987 -775955 -1478745 -3549070 -4804172 -4130553 -2587265 -1770844 -1829159 -1611554
43844a611554J012178Q10755k89467n40157O21736J380996K82534j464959k023231
$$ -1611554 -599376 211379 -78088 -618245 3491 1384487 1667021 202062 -1821169
43835a821169j722842j770699j591397n5158J737720J868547J042996J381408
$$ -1821169 -3544011 -5314710 -6906107 -6961265 -5223545 -3354998 -2312002 -930594
43827i30594K290682J275926j159399j624861M09620J393145k11182j129204Q24204
$$ -930594 1360088 2636014 1476615 -148246 261374 1654519 1443337 314133 1138337
43818A138337K371129R1365l414316l333730j89551J453577M41313m7070J212783
$$ 1138337 3509466 3600831 186515 -3147215 -3336766 -1883189 -1441876 -1488946 -276163
43809b76163J455266p37297k535084j367907J008399J369006l19085j439085o03538
$$ -276163 1179103 441806 -2093278 -3461185 -2452786 -1083780 -1402865 -2841950 -3445488
43800c445488R40576J215731k73313j888162j308135J517585L334196J291373
$$ -3445488 -2504912 -1289181 -1562494 -3450656 -4758791 -3241206 92990 1384363
43792A384363k623801l463936J6366L558568L405951J028010k02556j72181p90900
$$ 1384363 -1239438 -4703374 -4687008 -1128440 2277511 3305521 3102965 2930784 2139884
43783B139884j677004q55765J068901J202393r69057k505941j457365M98278J146644
$$ 2139884 462880 -392885 676016 1878409 909352 -1596589 -3053954 -2555676 -1409032
43774a409032R35242J232978J409450P8831j796730j606186J058638L266201K195483
$$ -1409032 -473790 759188 2168638 2247469 450739 -1155447 -96809 3169392 5364875
43765E364875j428000m111657l278867L09762L507625L833936J666082n65779
$$ 5364875 3936875 -174782 -3453649 -3143887 363738 4197674 5863756 5297977
43757E297977j285323j261817j746354k035410m45285K404250L307961N77524
$$ 5297977 4012654 2750837 1004483 -1030927 -1476212 928038 4235999 4813523
43749D813523l128514l911189j698715N2542m06393q22689J033155L397557K879031
$$ 4813523 1685009 -2226180 -3924895 -3872353 -4278746 -5101435 -4068280 -670723 2208308
43740B208308l77486k567295j325784J370609K240330Q34714p29271j046114p53581
$$ 2208308 1830822 -736473 -2062257 -691648 1548682 2383396 1654125 608011 -145570
43731a45570q10926r12388k13000J043332J436914J08790j818920k226216o16245
$$ -145570 -956496 -1868884 -2081884 -1038552 398362 507152 -1311768 -3537984 -4154229
43722d154229R71270M49576j424499j888443J31784K554574K845949R51638j245037
$$ -4154229 -3182959 -2733383 -4157882 -6046325 -5914541 -3359967 -514018 437620 -807417
43713h07417k307135k039741p53365R71117K120503J932302O73930q13268j873593
$$ -807417 -3114552 -5154293 -5907658 -4936541 -2816038 -883736 -209806 -1023074 -2896667
43704b896667j838708j31422K317516K907789M59879k329462j883242J083516
$$ -2896667 -4735375 -4866797 -2549281 358508 818387 -1511075 -3394317 -2310801
43696b310801K219477j02837k197716n84026K672681L075456M27292j179199K52890
$$ -2310801 -91324 -194161 -2391877 -2975903 -303222 2772234 3199526 2020327 2273217
43687B273217J930905R87321j234428j722142m99360n6466j007876j172115P05771
$$ 2273217 4204122 5191443 3957015 2234873 1735513 1679047 671171 -500944 204827
43678B04827K707674K444901M61971o90217q8554N52224l70464k005668k273184
$$ 204827 2912501 5357402 5819373 5129156 5040602 5592826 5222362 3216694 943510
43669I43510o92103J028190J167281m8927j064121j110682j001708j632994k318565
$$ 943510 251407 1279597 2446878 2397951 1333830 223148 -778560 -2411554 -4730119
43660d730119j467702J022739L017798K547506L48935j111090q71714k75899l44240
$$ -4730119 -6197821 -5175082 -2157284 390222 739157 -371933 -1243647 -1519546 -1863786
43651a863786j50731J091137J921489N73862j816457k269602k25373J527647Q38174
$$ -1863786 -2014517 -923380 998109 1571971 -244486 -2514088 -2739461 -1211814 -373640
43642c73640r92168j603506r70739n91764n44962M15384K234914L146878K139033
$$ -373640 -1365808 -2969314 -3940053 -4531817 -5076779 -4661395 -2426481 720397 2859430
43633B859430J87391j363358k184721k237318j163889O83269J823733J379527
$$ 2859430 3046821 1683463 -501258 -2738576 -3902465 -3219196 -1395463 -15936
43625a5936L26078r6410l04448j259832k208136j512940M13669J258393M45999
$$ -15936 310142 213732 -90716 -1350548 -3558684 -5071624 -4657955 -3399562 -2953563
43616b953563L20544K265152L766380J831687j968088l039192k12345K608976
$$ -2953563 -2633019 -367867 3398513 5230200 3262112 222920 10575 2619551
43608B619551K151594K8154o11945p901m25224j564491q74753J874357L606936
$$ 2619551 4771145 4799299 4187354 4179453 3754229 2189738 1314985 3189342 6796278
43599F796278K161504j030338l307548l678301k507569m02054J431636J506787
$$ 6796278 8957782 7927444 4619896 941595 -1565974 -1968028 -536392 970395
43591I70395J0321j024091n41393J39827j78771o09414k11543N341q00377j000227
$$ 970395 980716 -43375 -584768 -444941 -623712 -1233126 -1444669 -1439328 -2239705 -3239932
43581c239932R65327L070336J992360j558029l226336j178535J369655J085346
$$ -3239932 -2274605 795731 2788091 1230062 -1996274 -3174809 -1805154 -719808
43573g19808q43614j147324M28675J187865r6661j499533j120563J48142L12220
$$ -719808 -1563422 -2710746 -2282071 -1094206 -1190867 -2690400 -3810963 -3662821 -3350601
43564c350601n39643n55241O77018J293320L09287l08809J376591L563748K816866
$$ -3350601 -3890244 -4445485 -3768467 -2475147 -2165860 -2474669 -1098078 2465670 5282536
43555E282536m39329j867142M37185K834101J428512k276224l838844k045247
$$ 5282536 4843207 2976065 3413250 6247351 7675863 5399639 1560795 -484452
43547d84452M93677J609010J283828p5617j953814k757216j463789J56895j19478
$$ -484452 9225 1618235 2902063 2826446 872632 -1884584 -3348373 -3191478 -3310956
43538c310956j014638M33261L472212M138657J531406p31327n11192k75172k132265
$$ -3310956 -4325594 -3892333 -420121 3718536 5249942 4518615 4007423 3732251 1599986
43529A599986l764643k327760P39900K147706J641861J172166J038604J88673
$$ 1599986 -2164657 -4492417 -3752517 -1604811 37050 1209216 2247820 2436493
43521B436493r51991j077410n04845k97508J51183J792161L028401J323228k510946
$$ 2436493 1484502 407092 -97753 -395261 -244078 1548083 4576484 5899712 3388766
43512C388766m636649l148050k27027J120519L74514r47849j240348J72482K465722
$$ 3388766 -1247883 -4395933 -4622960 -3502441 -3127927 -4075776 -5316124 -5143642 -2677920
43503b677920L492836J940091o37299j486011l98118P0898j439960k864412j636096
$$ -2677920 814916 2755007 2117708 631697 233579 304477 -1135483 -3999895 -5635991
43494e635991J472166L093340J592392q09462r57575R94338J777120k69488k554078
$$ -5635991 -4163825 -1070485 521907 -287555 -1245130 -250792 1526328 1256840 -1297238
43485a297238k010195R1506J40334j749620j748615J007293K328174k27130k867472
$$ -1297238 -3307433 -3215927 -3075593 -4825213 -6573828 -5566535 -3238361 -3465491 -6332963
43476f332963j547286J349407J205894p40823M75218M514464N305629N08633m368386
$$ -6332963 -7880249 -6530842 -5324948 -6065771 -5590553 -1076089 4229540 4738173 369787
43467C69787l641638J144436M313442L397684N36208j350783j250004j02151J69307
$$ 369787 -3271851 -2127415 2186027 5583711 6119919 4769136 3519132 3416981 3586288
43458C586288j434095l328920k923503j92270K123838K198496Q79406n25568j682283
$$ 3586288 2152193 -1176727 -4100230 -4292500 -2168662 29834 909240 383672 -1298611
43449a298611j941861m88786J329330Q27223j616364k129739R21191L892346K941797
$$ -1298611 -3240472 -3729258 -2399928 -1572705 -3189069 -5318808 -4397617 -505271 2436526
43440B436526n62234k505347j737142l68983P0472q5987k65934k34024K38501
$$ 2436526 1874292 -631055 -2368197 -2737180 -2666708 -2752695 -3018629 -3252653 -3014152
43431c014152P12581K40911o43206o0496J718637J652971j065279k551865j8580
$$ -3014152 -2301571 -2060660 -2703866 -2764362 -1045725 607246 -458033 -3009898 -3028478
43422c028478L043882J917443j500825j431766K305569L648128k17144m454276
$$ -3028478 15404 1932847 432022 -999744 1305825 4953953 4736809 282533
43414B82533l868024L9400K330760J578905K04400l5362K75100J54785m67209
$$ 282533 -3585491 -3546091 -1215331 363574 567974 532612 807712 962497 495288
43405D95288j070912r05216M15759J951588K042476M96969j033240j416993j274587
$$ 495288 -575624 -1480840 -1065081 886507 2928983 3425952 2392712 975719 -298868
43396b98868j180772m72817R83795J577088J26519j951618k320431p75376Q18036
$$ -298868 -1479640 -1952457 -968662 608426 734945 -1216673 -3537104 -4312480 -3494444
43387c494444J065727K99318l16865l1698Q14375R58152k69887j516984q39607
$$ -3494444 -2428717 -2129399 -2446264 -2477962 -1663587 -705435 -975322 -2492306 -3331913
43378c331913J163371J572848o17518k609764j715309P95990J908780J328003
$$ -3331913 -2168542 -595694 -1213212 -3822976 -5538285 -4742295 -2833515 -1505512
43370a505512J108690J823022J941976P87339m89145j045605j280718j426160
$$ -1505512 -396822 1426200 3368176 4155515 3666370 2620765 1340047 -86113
43362h6113j217263j089046j643146j858103j91530K273601K502728R5876j670423
$$ -86113 -1303376 -2392422 -4035568 -5893671 -6085201 -3811600 -1308872 -1212996 -2883419
43353b883419p51906O36988M8903r12666M85005K873020K408428j049177l344959
$$ -2883419 -3635325 -2998337 -2949434 -3862100 -3377095 -504075 1904353 855176 -2489783
43344b489783k044779N31157J478770J276038J575179J707089K37992j569417
$$ -2489783 -4534562 -4003405 -2524635 -1248597 326582 2033671 2271663 702246
43336G02246j019895J657662L097940J466467j043649j527149l19911R6960r39529
$$ 702246 -317649 1340013 4437953 5904420 4860771 3333622 3013711 3110671 2171142
43327B171142j539283n04799O44022n7465j919162k355409m91551J556834J525071
$$ 2171142 631859 127060 771082 713617 -1205545 -3560954 -4052505 -2495671 -970600
43318i70600j12525j102380m90784N24002O00708r8514n27276j83278M63915N70954
$$ -970600 -1083125 -2185505 -2676289 -2152287 -1551579 -1650093 -2177369 -2360647 -1896732 -1325778
43308a325778j58317r21131n38178Q50712J551227O65267k68619M30438J510957
$$ -1325778 -1484095 -2405226 -2943404 -2092692 -541465 123802 -144817 285621 1796578
43299A796578M49160k072131k450476K78867K427223J099447j293261q81395J552508
$$ 1796578 2245738 173607 -2276869 -1998002 429221 1528668 235407 -645988 906520
43290I06520K004059l72927k245851j424126M14874J045900O31696K00538j73244
$$ 906520 2910579 2537652 291801 -1132325 -717451 328449 960145 1160683 987439
43281I87439l41616M68532J762737J445171j029827l080490k366633q6274J036796
$$ 987439 645823 1114355 2877092 4322263 3292436 211946 -2154687 -2240961 -1204165
43272a204165O12308K22590L05341q9127q53845o15687P66454J579528Q20960
$$ -1204165 -591857 -369267 -63926 -153053 -1006898 -1622585 -856131 723397 1544357
43263A544357k59983j58829N39692N8453j849424l293164k539786j01303K007955
$$ 1544357 1284374 1125545 1665237 1723690 -125734 -3418898 -5958684 -6059987 -4052032
43254d052032K616065K146435J195845k96083j847088j859036K19780K179144
$$ -4052032 -1435967 710468 1906313 1610230 -236858 -2095894 -1876114 303030
43246C03030J578200n69432j168046Q698r9827k421499l376147k68259L783264
$$ 303030 1881230 1311798 143752 152450 52623 -2368876 -5745023 -6013282 -2230018
43237b230018L784987J33797j963650m6108K429816J498655j768678l116227q39434
$$ -2230018 1554969 1688766 -274884 -320992 2108824 3607479 1838801 -1277426 -2116860
43228b116860K366431K911905L51372k389602k501155n73172L58941q57009j735564
$$ -2116860 249571 3161476 3512848 1123246 -1377909 -1951081 -1592140 -2449149 -4184713
43219d184713m4999K232716J527879j539759k529920J61815K672965J555059r57814
$$ -4184713 -4229712 -1996996 -469117 -2008876 -4538796 -4376981 -1704016 -148957 -1106771
43210a106771o49677J994900K775445N28971j346606o46413L44350q66811k644962
$$ -1106771 -1756448 238452 3013897 3542868 2196262 1549849 1894199 1027388 -1617574
43201a617574j992873M78738J569536M10848q14084p20080j79595K64638J324206
$$ -1617574 -3610447 -3131709 -1562173 -1151325 -1965409 -2685489 -2865084 -2600446 -1276240
43192a276240K521651J927810k68860j003478P80373J532774j530833n072518
$$ -1276240 1245411 3173221 2904361 1900883 2681256 4214030 2683197 -2389321
43184b389321l837154J295499M225351K345266n22096q01087O779n94110j325383
$$ -2389321 -6226475 -4930976 -705625 1639641 1117545 316458 323237 -270873 -1596256
43175a596256J03190K251813J828578j033821k828216j588770R87104K305297
$$ -1596256 -1493066 758747 2587325 1553504 -1274712 -2863482 -1876378 428919
43167D28919J598759k53750j929025k382036j441363J35301J558955K458831K290926
$$ 428919 2027678 1773928 -155097 -2537133 -3978496 -3843195 -2284240 174591 2465517
43158B465517O22209j444239j808442l01296P20973r3179j026489m00168M84442
$$ 2465517 3087726 1643487 -164955 -466251 254722 161543 -864946 -1265114 -780672
43149g80672j76816j283430p31208Q54143J321507O83874M73433N23255k25338
$$ -780672 -957488 -2240918 -2972126 -2117983 -796476 -112602 360831 884086 658748
43140F58748o64537R02601K686002J190169k739314m100495j044543K258721J948332
$$ 658748 -5789 896812 3582814 4772983 2033669 -2066826 -3111369 -852648 1095684
43131A095684j94815m23759J060214J156630j007849l109160l019494r12412J552156
$$ 1095684 900869 477110 1537324 2693954 1686105 -1423055 -4442549 -5354961 -3802805
43122c802805K606648J568822j68789k18042J698362K912242J342988j411464
$$ -3802805 -1196157 372665 203876 -14166 1684196 4596438 5939426 4527962
43114D527962k197230n92116Q39555K60768j269365j690404p17849J28841j22437
$$ 4527962 2330732 1738616 2578171 2838939 1569574 -120830 -838679 -709838 -832275
43105h32275m28746P65869K905655L453549J174290j967393l244109k335255p62563
$$ -832275 -1261021 -495152 2410503 5864052 7038342 5070949 1826840 -508415 -1270978
43096a270978M85315R91676M9257j849080k060243O69505L010412J181277k653503
$$ -1270978 -785663 206013 255270 -1593810 -3654053 -2984548 25864 1207141 -1446362
43087a446362k811586J140697L388311Q31658k409881j977409L01471O31589l17100
$$ -1446362 -4257948 -3117251 271060 1102718 -1307163 -3284572 -2983101 -2351512 -2668612
43078b668612L51532K114252K213482N62300o40122p71105o89711j95372J064337
$$ -2668612 -2317080 -202828 2010654 2572954 1932832 1161727 472016 276644 1340981
43069A340981J618849L73017q36803j79800O15526o27277j972957m35568K187652
$$ 1340981 2959830 3332847 2496044 2316244 2931770 2304493 331536 -104032 2083620
43060B083620J760496j040944j700964L68448J051957q77384j530368R65308K870413
$$ 2083620 3844116 2803172 1102208 1470656 2522613 1645229 114861 1080169 3950582
43051C950582J156694j580923j895384q81100j046285j448438j23532J461314
$$ 3950582 5107276 3526353 1630969 749869 -296416 -1744854 -1868386 -407072
43043d07072P58440j013864o81355J418017J897591j98014k122890j803832k97113
$$ -407072 351368 -662496 -1343851 74166 1971757 1773743 -349147 -2152979 -2450092
43034b450092O37577P54595L97182m55871j334832j084897O34271K686718L718419
$$ -2450092 -1812515 -1057920 -660738 -1116609 -2451441 -3536338 -2902067 -215349 3503070
43025C503070L233349J438359q61884k205455j608189n6646L09701j017539k020855
$$ 3503070 6736419 8174778 7312894 5107439 3499250 3442604 3752305 2734766 713911
43016G13911q28248J484936J913842o49416l626370l566043l35656K660617K706774
$$ 713911 -114337 1370599 3284441 2635025 -991345 -4557388 -4893044 -2232427 474347
43007D74347Q75561j13606J63917o895j055617j392725l85748M15972J2307l03245
$$ 474347 1349908 1236302 1400219 1393324 337707 -1055018 -1440766 -1024794 -1012487 -1315732
42997a315732O46000J691720J283881J04389k97522k37127j021056k153913j795968
$$ -1315732 -669732 1021988 2305869 2410258 2112736 1875609 854553 -1299360 -3095328
42988c095328J94966J830716J778983P72357n6630n66636q01083k73943J043709
$$ -3095328 -2900362 -1069646 709337 1481694 1425064 858428 57345 -216598 827111
42979H27111J949832J169958r82733k671259k352214m62697R04399L69512r51213
$$ 827111 2776943 3946901 2964168 292909 -2059305 -2522002 -1617603 -1248091 -2199304
42970b199304r35678M32775J049997J87690r7285J600987L240562K215322n04036
$$ -2199304 -3134982 -2702207 -1652210 -1464520 -1561805 39182 3279744 5495066 4991030
42961D991030j881155j461073j332420j841321r09667J777392L350691K018238
$$ 4991030 3109875 1648802 316382 -1524939 -2434606 -657214 2693477 4711715
42953D711715j25460m87642K13666j97406j580047k093579j335221l78384M72926
$$ 4711715 4586255 4098613 4312279 4114873 2534826 441247 -893974 -1272358 -799432
42944g99432J525815J859345K13163k318337k946651j002046J103966J456581
$$ -799432 726383 2585728 2798891 480554 -2466097 -3468143 -2364177 -907596
42936i07596J074748J567026K239288J432042m06036j191157m83959j43570j162589
$$ -907596 167152 1734178 3973466 5405508 4999472 3808315 3324356 3180786 2018197
42927B018197j766664j04498K415467K588564L6219j895344p82630J300137P90354
$$ 2018197 251533 147035 2562502 5151066 5187285 3291941 2509311 3809448 4599802
42918D599802k007726l230299j029088J886480K245619M35730r46736j007590
$$ 4599802 2592076 -638223 -1667311 219169 2464788 2900518 1953782 946192
42910I46192q56376j012128q10568j81506n9377p99759j596515j627541o85154
$$ 946192 89816 -922312 -1732880 -1914386 -1973763 -2773522 -4370037 -5997578 -6682732
42901f682732J139293L146633L735859J994978n53518j464621n73284J19627k63762
$$ -6682732 -5543439 -2396806 1339053 3334031 2780513 1315892 742608 862235 598473
42892E98473n03197N0416K66011l88040o11133K59043P84803P8210l07397P88921
$$ 598473 95276 145692 411703 23663 -587470 -328427 456376 534586 227189 1016110
42882A016110J587810L69272q87440O49865L362470K786396j508529m675525l272688
$$ 1016110 2603920 2973192 2085752 2735617 6098087 8884483 7375954 2700429 -572259
42873e72259L13484J819556N48361j250236k056263j709961j38649J999746K605956
$$ -572259 -258775 1560781 2109142 858906 -1197357 -2907318 -3045967 -1046221 1559735
42864A559735N78647j819158j502557R53873J921169p6486k263377j628943R33444
$$ 1559735 2138382 319224 -1183333 -229460 1691709 1615223 -648154 -2277097 -1343653
42855a343653K016036K08732k315318k647755n31933J623460J793374N86081j30895
$$ -1343653 672383 881115 -1434203 -4081958 -4613891 -2990431 -1197057 -610976 -741871
42846g41871j56376r03944k286551j854138J453587M534764L649531j98777k329555
$$ -741871 -898247 -1802191 -4088742 -5942880 -4489293 45471 3695002 3496225 1166670
42837A166670p62825J504343J322037n17005j612968j754809j991762j838602
$$ 1166670 403845 1908188 3230225 2713220 1100252 -654557 -2646319 -4484921
42829d484921k54734J664758J838156N64309J0422N14926K91068q87686q13639
$$ -4484921 -4739655 -3074897 -1236741 -672432 -662010 -147084 143984 -743702 -1557341
42820a557341J224819K550031J028268j482817j958960n86040L65553N60339J351041
$$ -1557341 -332522 2217509 3245777 1762960 -196000 -782040 -416487 143852 1494893
42811A494893K314555J461254j009957k419072j726947r01156j149797r16203
$$ 1494893 3809448 5270702 4260745 1841673 114726 -786430 -1936227 -2852430
42803b852430P10622J656653M35530o02669J105692L404454K058669k489848n088347
$$ -2852430 -2141808 -485155 -49625 -652294 453398 3857852 5916521 3426673 -1661674
42794a661674k910105J140518L059517K493451J256604l5518j524344k208527
$$ -1661674 -4571779 -3431261 -371744 2121707 3378311 3342793 1818449 -390078
42786c90078r95066J170588K134956J115931p66217k018816j918557p94437J00229
$$ -390078 -1385144 -214556 1920400 3036331 2270114 251298 -1667259 -2461696 -2361467
42777b361467j62823o06096N80897K787252K893377j29774k742929j361567K347755
$$ -2361467 -2524290 -3130386 -2549489 237763 3131140 3001366 258437 -1103130 1244625
42768A244625L711519J576707p74567r97834m27766p16730j024755k17473O69640
$$ 1244625 4956144 6532851 5758284 4760450 4332684 3615954 2591199 2373726 3043366
42759C043366K47081o73519m27038P31551J145693L33819p04029j272763j415756
$$ 3043366 3290447 2616928 2189890 2921441 4067134 4400953 3696924 2424161 1008405
42750A008405q56190P49292K328085J816481j111881l814631l340816m6010K506666
$$ 1008405 152215 901507 3229592 5046073 3934192 119561 -3221255 -3267265 -760599
42741g60599J632191j246116k405161o13093J389113R14265p53359l94271K085089
$$ -760599 871592 -374524 -2779685 -3392778 -2003665 -1089400 -1842759 -2237030 -151941
42732a51941L380147J859473m334K68675J204218o163k655992l393221j323054
$$ -151941 3228206 5087679 5083345 5352020 6556238 6550075 3894083 500862 -822192
42723h22192Q23102Q79196j23885l47931J64559M31028L24929O8311o29999j610934
$$ -822192 910 880106 756221 408290 572849 1003877 1328806 1397117 767118 -843816
42713h43816j698534m07459R32331J068740O98080J029742J651601J485901Q19852
$$ -843816 -2542350 -2949809 -2017478 -948738 -250658 779084 2430685 3916586 4736438
42704D736438N39059K94541n24915r11938K66204J627542R20551j089009j512478
$$ 4736438 5275497 5570038 5045123 4133185 4399389 6026931 6947482 5858473 4345995
42695D345995j29989K17662j367742k251971j089751l33357j561834k021730P53762
$$ 4345995 4216006 4433668 3065926 813955 -275796 -609153 -2170987 -4192717 -3438955
42686c438955L923876L148454o20285k603206j254198O16765J197525J540079
$$ -3438955 484921 3633375 3013090 409884 -844314 -227549 969976 2510055
42678B510055J854192M82995k265203l248130j154172J233601J204909k93276
$$ 2510055 4364247 4847242 2582039 -666091 -1820263 -586662 618247 324971
42670C24971r99917o41483j4740Q95262J922720J800301P7449j644624j857576
$$ 324971 -674946 -1316429 -1331169 -435907 1486813 3287114 3364563 1719939 -137637
42661a37637r52656J46462J201443J584257M13503j117021l76709K250598K751127
$$ -137637 -1090293 -943831 257612 1841869 2255372 1138351 761642 3012240 5763367
42652E763367n49060l715820k852850N5135O52640r33551j077713J039089K535125
$$ 5763367 5214307 1498487 -1354363 -1299228 -646588 -1580139 -2657852 -1618763 916362
42643I16362J742551J47773n80080l27078O56135J926171K096174N05670r08955
$$ 916362 2658913 2806686 2226606 1899528 2555663 4481834 6578008 7083678 6174723
42634F174723r0538J563504J106747j192337k319070j332106l05423n81512j397559
$$ 6174723 6084185 7647689 8754436 7562099 5243029 3910923 3605500 3023988 1626429
42625A626429k203008l042001k685825J03102L325152L436106O83882r61089J91438
$$ 1626429 -576579 -3618580 -6304405 -6201303 -2876151 559955 1243837 282748 474186
42616D74186J513820J049298N33613J616553K569141J152062j690942l149206
$$ 474186 1988006 3037304 3570917 5187470 7756611 8908673 7217731 4068525
42608D068525j923947R78317L301819K903242q6515k481843j673212N39680P58980
$$ 4068525 2144578 3122895 6424714 9327956 9241441 6759598 5086386 5626066 6385046
42599F385046l61083L87861K270784J260957k313467l104423L97957K727726K63414
$$ 6385046 6023963 6411824 8682608 9943565 7630098 4525675 4923632 7651358 7914772
42590G914772k919655k165457L94309O09417m65503J98687J251245q8788k000708
$$ 7914772 4995117 2829660 3223969 3833386 3367883 3566570 4817815 4729027 2728319
42581B728319j133276R70900O87834p85794K52896K691443K304139m93916j432633
$$ 2728319 1595043 2565943 3253777 2467983 2720879 5412322 7716461 7222545 5789912
42572E789912j85275l45071j799621n84511K836627K782729k007076n158898k423776
$$ 5789912 5604637 5259566 3459945 2875434 5712061 8494790 6487714 1328816 -1094960
42563a094960J745755J611223j260216j751897N62893K136544J726128J125257
$$ -1094960 650795 2262018 1001802 -750095 -187202 1949342 3675470 4800727
42555D800727J163000J041755P83066J113095J564200J157219K30572l20050n76629
$$ 4800727 5963727 7005482 7788548 8901643 10465843 11623062 11853634 11533584 10956955
42546A0956955p56586k71895P61665Q24427m13046p87858Q87355K125555L54979
$$ 10956955 10200369 9928474 10690139 11514566 11101520 10313662 11201017 13326572 13681551
42537A3681551k479990k300281R45222K992568J313917j635621k235282m32438
$$ 13681551 11201561 8901280 9846502 12839070 14152987 12517366 10282084 9849646
42529I849646R57672M65013l22184N76112K354953K218649n44574k903655j963607
$$ 9849646 10807318 11272331 10950147 11526259 13881212 16099861 15555287 12651632 10688025
42520A0688025P22003J200323r66762j995593K40375K883271K504353J80847m94426
$$ 10688025 11410028 12610351 11643589 9647996 9888371 12771642 15275995 15456842 14962416
42511A4962416J176955K424544J277178r73806j798023m86259J194242R90113
$$ 14962416 16139371 18563915 19841093 18867287 17069264 16583005 17777247 18767360
42503A8767360j143491k659541j572625O72828J287009M61464P79680K376863
$$ 18767360 17623869 14964328 13391703 14064531 15351540 15813004 16592684 18969547
42495A8969547K348771q3352j748388p05017O65845L31046M28495K854899M637199
$$ 18969547 21318318 21234966 19486578 18781561 19447406 19778452 20206947 23061846 27699045
42486B7699045K288207j922019l046983r22706N46193J97159M16540J862095K674501
$$ 27699045 29987252 28065233 25018250 24095544 24641737 24838896 25255436 27117531 29792032
42477B9792032K772501L790948M752290L137139M72708J031631M220701M641329
$$ 29792032 32564533 36355481 41107771 44244910 44717618 45749249 49969950 54611279
42469E4611279J372796L12287M211094P346860M960154J682894L977565R083903
$$ 54611279 55984075 56296362 60507456 67854316 72814470 74497364 78474929 87558832
42461H7558832R442526N294350M350604R379140J4224916J3837242J1366147J2109972
$$ 87558832 97001358 102295708 106646312 116025452 130250368 144087610 155453757 167563729
42453A67563729J5578802J7496376J6418533J4601620J3986274J4224592J3892246
$$ 167563729 183142531 200638907 217057440 231659060 245645334 259869926 273762172
42446B73762172J1828842P904677L428018o5331k796831o149077r985167j2671568
$$ 273762172 285591014 293495691 296923709 296858378 294061547 287912470 277927303 265255735
42438B65255735j4179503j6499824j9827557k1096998j8337666j4223277j2737165
$$ 265255735 251076232 234576408 214748851 193651853 175314187 161090910 148353745
42431A48353745j3854388j4217009j2182122r528951q324910q348513p999479
$$ 148353745 134499357 120282348 108100226 98571275 90246365 81897852 73898373
42424G3898373o350894m026565k753127l636483n273813m750415j679323K84839
$$ 73898373 67547479 63520914 60767787 57131304 51857491 47107076 45427753 45712592
42416D5712592j982719o236872p348370m084859l68612M12978p69631j395964
$$ 45712592 43729873 37493001 30144631 26059772 25691160 26104138 25334507 23938543
42408B3938543j054103n39832K45998J176771M89439k770645n912202n133788
$$ 23938543 22884440 22344608 22590606 23767377 24256816 21486171 15573969 10440181
42400A0440181q18996K415071J628261q69493j226929N89081J360367k92132j953916
$$ 10440181 9621185 12036256 13664517 12795024 11568095 12157176 13517543 13225411 11271495
42391A1271495j138742J070516J676173j5569j765070j776689p17284J54344R27060
$$ 11271495 10132753 11203269 12879442 12863873 11098803 9322114 8604830 8759174 9686234
42382I686234J802425J544625p83999l410127l485933r86715J225590J419625
$$ 9686234 11488659 13033284 12249285 8839158 5353225 4366510 5592100 7011725
42374G011725P96997O96469M56440n98530j269993n60949J22642p82815j892641
$$ 7011725 7808722 8505191 8961631 8363101 7093108 6532159 6654801 5871986 3979345
42365C979345q24969J495630J711231o40278j989126j31281K221574J483386j415717
$$ 3979345 3154376 4650006 6361237 5720959 3731833 3600552 5822126 7305512 5889795
42356E889795k541860p29720J189031Q45030p52975j476037r70146j03967P12769
$$ 5889795 3347935 2618215 3807246 4652276 3899301 2423264 1453118 1349151 2061920
42347B061920J262322R64698O4038J01895J513900K007070m02447l653620l819699
$$ 2061920 3324242 4288940 4352978 4454873 5968773 7975843 7573396 3919776 100077
42338A00077q02079J401073O96433l67996M89876J200859p82545l341147k575075
$$ 100077 -702002 699071 1395504 1027508 1517384 2718243 1935698 -1405449 -3980524
42329c980524O89693J864830j99378j587538K12351K558635K355017P75894M83113
$$ -3980524 -3290831 -1426001 -1625379 -3212917 -3000566 -441931 1913086 2688980 3172093
42320C172093J009077K73050j214326j212760J45911N12211o36437j207517j24300
$$ 3172093 4181170 4454220 3239894 2027134 2173045 2685256 2048819 841302 717002
42311G17002J023351Q50089L20690O24439P39614r63668l578305m127323j405310
$$ 717002 1740353 2590442 2911132 3535571 4275185 3311517 -266788 -4394111 -5799421
42302e799421K052503K744406M02421j636357m80617K784483M457152K666962
$$ -5799421 -3746918 -1002512 -600091 -2236448 -2717065 67418 4524570 7191532
42294G191532o73483k456193j820699m56016j79660r57018j281448k64655R48178
$$ 7191532 6518049 4061856 2241157 1785141 1605481 648463 -632985 -897640 50538
42285E0538N20321j225141j725089L6558J384404k33805k737754j999358J654450
$$ 50538 570859 -654282 -2379371 -2342813 -958409 -1192214 -3929968 -5929326 -4274876
42276d274876L466107J287698j466899j372514M42962J528522K141888K985697
$$ -4274876 -808769 478929 -987970 -2360484 -1917522 -389000 1752888 4738585
42268D738585K291201r52903l483349j828285J878046K580316l17838k688969
$$ 4738585 7029786 6076883 2593534 765249 2643295 5223611 4905773 2216804
42260B216804k211618p10075O5626O67505J301777R13589l6493N36823K421824
$$ 2216804 5186 -704889 -639263 28242 1330019 2243608 2207115 2743938 5165762
42251E165762K458727n69147l436917k895987j52689J268875L78437p65397m24724
$$ 5165762 7624489 7055342 3618425 722438 569749 1838624 2217061 1451664 1026940
42242A026940Q03109J180386K4015j467853j562217j64601J084129J196409R25248
$$ 1026940 1830049 3010435 3034450 1566597 4380 -160221 923908 2120317 3045565
42233C045565P18463l13870j870647j488555J366470K964224O48985k119415p75829
$$ 3045565 3764028 3450158 1579511 90956 1457426 4421650 5070635 2951220 2175391
42224B175391K525721K009800k077983l720020j042245J165988J56383p12130
$$ 2175391 4701112 6710912 4632929 912909 -129336 1036652 1193035 480905
42216D80905Q41704J613353o45211k515190r67414J315001J234946P09077J828521
$$ 480905 1322609 2935962 2290751 -224439 -1191853 123148 1358094 2067171 3895692
42207C895692J740790j789339m439552j750639K439154J577439k472274k211128
$$ 3895692 5636482 3847143 -592409 -2343048 96106 1673545 -798729 -3009857
42199c009857K964060N615853K116615k369969k701968o25318P1522m14345j70618
$$ -3009857 -45797 5570056 7686671 5316702 2614734 1989416 2060938 1646593 1475975
42190A475975L68678l3113q05015j086371j361263j698958q96676J025253K066248
$$ 1475975 1844653 1811540 1006525 -79846 -1441109 -3140067 -4036743 -3011490 -945242
42181i45242J447912Q95169J295977J001611p76217j804094l55622J609658J381188
$$ -945242 502670 1397839 2693816 3695427 2919210 1115116 759494 2369152 3750340
42172C750340l65829j043416k76251J90505j64067o7754Q82449J276954J98214
$$ 3750340 3384511 2341095 2064844 2255349 2091282 2023528 2905977 4182931 4381145
42163D381145j063557n84395J472575K653642J089266j882822k920575p49749
$$ 4381145 3317588 2733193 4205768 6859410 7948676 6065854 3145279 2395530
42155B395530K056489K188487m48950k987748l018693o22502K245449L236694
$$ 2395530 4452019 6640506 6191556 3203808 185115 -437387 1808062 5044756
42147E044756J316175j865301l287381k224591j021040j088038o52518J373736
$$ 5044756 6360931 4495630 1208249 -1016342 -2037382 -3125420 -3777938 -2404202
42139b404202K271778j26490k547628o07628L619983M070884K54038j851578N69531
$$ -2404202 -132424 -258914 -2806542 -3414170 205813 4276697 4530735 2679157 3248688
42130C248688K833731O01011l346958l872781r59628J605002K119765J641646
$$ 3248688 6082419 6683430 3336472 -536309 -1495937 109065 2228830 3870476
42122C870476P74438o29493j768151j748276j214421j034456n98901P16396J869479
$$ 3870476 4644914 4015421 2247270 498994 -715427 -1749883 -2348784 -1632388 237091
42113B37091J768403J052502N96066k0507r17358q82097K12705K73843j499685
$$ 237091 2005494 3057996 3654062 3633555 2716197 1834100 2046805 2320648 820963
42104H20963k388767k17840K569971K191598p96598k554824j570808J47040P82687
$$ 820963 -1567804 -1785644 784327 2975925 2179327 -375497 -1946305 -1799265 -1016578
42095a016578M81295j93480q09418m39344J115758K118732J206300j59140j23095
$$ -1016578 -535283 -728763 -1538181 -1977525 -861767 1256965 2463265 2304125 2181030
42086B181030Q4213j610744l675122k805819L67436J788839L56677o23298P76390
$$ 2181030 2265243 654499 -3020623 -5826442 -5459006 -3670167 -3313490 -3936788 -3160398
42077c160398K231658J712438Q58051J463283K043532P58462r29464n88573J065469
$$ -3160398 -928740 783698 1641749 3105032 5148564 5907026 4977562 4388989 5454458
42068E454458J311107n28297k653586l473392k670790o10011J401740J403833
$$ 5454458 6765565 6237268 3583682 110290 -2560500 -3170511 -1768771 -364938
42060c64938o60129j878406q9905K549019K393326k31541j572836j82299J305822
$$ -364938 -1025067 -2903473 -2993378 -444359 1948967 1717426 144590 -37709 1268113
42051A268113P28478n31026m38528M85818Q10741Q21269J195381P96493j487826
$$ 1268113 1996591 1465565 1027037 1512855 2323596 3144865 4340246 5136739 3648913
42042C648913l767048l022860K07879J962547L17980j892645j204624J705197
$$ 3648913 -118135 -3140995 -2933116 -970569 -652589 -2545234 -3749858 -2044661
42034b044661L315296K096696m8349q34531k94771j22480j357238l109454l310328
$$ -2044661 1270635 3367331 3318982 2484451 2189680 2067200 709962 -2399492 -5709820
42025e709820r75677K123142K993269J207425k18656R64444K684798J554710j608534
$$ -5709820 -6685497 -4562355 -1569086 -361661 -580317 384127 3068925 4623635 3015101
42016C015101k575017j36762J905345O62692j365376n66743J647279R90497k477805
$$ 3015101 440084 303322 2208667 2871359 1505983 939240 2586519 3577016 1099211
42007A099211l734010k08479M028407L777201j88625k561872q83210J682596J248262
$$ 1099211 -2634799 -2843278 1185129 4962330 4773705 2211833 1328623 3011219 4259481
41998D259481j705141l491723j992424J307250L447286K834512J57973k391737
$$ 4259481 2554340 -937383 -2929807 -1622557 1824729 4659241 4817214 2425477
41990B425477k770359r11217R49495O36838j197942j754401J86951K497587K484719
$$ 2425477 -344882 -1256099 -306604 330234 -867708 -2622109 -2435158 62429 2547148
41981B547148L67760j239970p28851Q67964J476074K54980j772205k803417k023513
$$ 2547148 2914908 1674938 946087 1814051 3290125 3545105 1772900 -1030517 -3054030
41972c054030m79837K18019L7731L08558J231065J318195Q1172p58784k15428
$$ -3054030 -3533867 -3315848 -3278117 -2969559 -1738494 -420299 -339127 -1097911 -1313339
41963a313339o6260j675614k788456o54025L069554M290394K643067J542085K103844
$$ -1313339 -1379599 -3055213 -5843669 -6497694 -3428140 862254 3505321 5047406 7151250
41954G151250J552983j265459l274895k170293j08795K66814k259Q38135J266409
$$ 7151250 8704233 7438774 4163879 1993586 1884791 2151605 2149346 2987481 4253890
41945D253890o50517k818227j913019Q58529J324382r23975j911308K50095K565512
$$ 4253890 3603373 785146 -1127873 -269344 1055038 131063 -1780245 -1530150 1035362
41936A035362K135392K05410p57029r76922j781081k349113j118972P46557N04155
$$ 1035362 3170754 3376164 2619135 1642213 -138868 -2487981 -3606953 -2860396 -2356241
41927b356241j614844k029697R07549L777487K505119j540385k902131M74564
$$ -2356241 -3971085 -6000782 -5093233 -1315746 1189373 -351012 -3253143 -2778579
41919b778579M256037L709092O449k100590j095876K47086q7061r46245j016002
$$ -2778579 1477458 5186550 5192999 3092409 1996533 2243619 2156558 1210313 194311
41910A94311q07592o31134L55292J801011J782431J91284m90786N40082O54781
$$ 194311 -613281 -1244415 -889123 911888 2694319 2885603 2394817 2934899 3589680
41901C589680j470595k856468j087978J141083M09401j358584j73726K691579
$$ 3589680 2119085 -737383 -1825361 -684278 -274877 -1633461 -1807187 884392
41893H84392K434392r61881k252464M76009K610991N84487k476267j998763J031754
$$ 884392 3318784 2356903 104439 580448 3191439 3775926 1299659 -699104 332650
41884C32650K293981Q61835l39870L29197J227566M97096j543079l389287l891530
$$ 332650 2626631 3488466 3148596 3477793 4705359 5202455 3659376 270089 -3621441
41875c621441k559707J48979K528291K843361J328751J04324N82793J602902R28457
$$ -3621441 -6181148 -6032169 -3503878 -660517 668234 772558 1355351 2958253 3886710
41866C886710j539136l052772j293290K255604L666769J445457j660324k528239
$$ 3886710 2347574 -705198 -1998488 257116 3923885 5369342 3709018 1180779
41858A180779j477839o03170n7383J366505K908124K243811o27530k752499k250820
$$ 1180779 -297060 -900230 -957613 408892 3317016 5560827 4933297 2180798 -70022
41849g0022n71796K45727L19480O07843Q21604L51904j33888K09728O28079k38214
$$ -70022 -641818 -396091 -76611 531232 1352836 1704740 1570852 1780580 2408659 2170445
41839B170445k033523k817228j512091P35890J822059Q95620p81165j208256K8497
$$ 2170445 136922 -2680306 -4192397 -3456507 -1634448 -738828 -1519993 -2728249 -2699752
41830b699752J265201J043357M2643l74363n86776j703275k684454j212439K191521
$$ -2699752 -1434551 -391194 -348551 -722914 -1309690 -3012965 -5697419 -6909858 -4718337
41821d718337L840662K003844l23203J17564J869009J194495j853985l267200
$$ -4718337 -877675 1126169 802966 920530 2789539 3984034 2130049 -1137151
41813a137151j003763K067386K302700P0120j356059m10054J156254J055094o32680
$$ -1137151 -2140914 -73528 2229172 2299292 943233 533179 1689433 2744527 2111847
41804B111847j842155j115872Q19794K037615J598410M03707k07247k42494p65135
$$ 2111847 269692 -846180 -26386 2011229 3609639 4013346 3806099 3563605 2798470
41795B798470j884649k092251l61146J854412K078556J35446j531694j256726
$$ 2798470 913821 -1178430 -1539576 314836 2393392 2528838 997144 -259582
41787b59582k09338q4267m16488Q0234Q57472N13648m21865k88211N57210K33639
$$ -259582 -468920 -553187 -969675 -889441 -31969 481679 59814 -228397 328813 562452
41777E62452j099932j320178k82671j70201j073570k09505K720145L599375K42348
$$ 562452 -537480 -1857658 -2140329 -2310530 -3384100 -3593605 -873460 2725915 2968263
41768B968263l232605k329757Q13491J169758r18517q88306J840043K844611K75870
$$ 2968263 -264342 -2594099 -1780608 -610850 -1529367 -2417673 -577630 2266981 2542851
41759B542851k132617j268240P86029P47732q52718j335634j79802P94170K70111
$$ 2542851 410234 -858006 -71977 675755 -176963 -1512597 -1692399 -898229 -628118
41750f28118j175982j839838n22817J779835K275564m9497k222314j046103J931017
$$ -628118 -1804100 -3643938 -4166755 -2386920 -111356 -160853 -2383167 -3429270 -1498253
41741a498253K497151K35181j061838M02608K007476J465868J4385o05889p18569
$$ -1498253 998898 1234079 172241 574849 2582325 4048193 4062578 3456689 2738120
41732B738120o39910N04683K164607J929407m82124k134545j576730j016026j718762
$$ 2738120 2098210 2602893 4767500 6696907 6214783 4080238 2503508 1487482 -231280
41723b31280j257749J693878L678526J454861k355444k894614j84846J628702
$$ -231280 -1489029 204849 3883375 5338236 2982792 88178 -96668 1532034
41715A532034P05492q80185j165520l13453J033191K346821K395497M23728k050737
$$ 1532034 2237526 1357341 191821 -121632 911559 3258380 5653877 6077605 4026868
41706D026868k740277j523151j43570L20035Q4909l09094j51957J079183K308304
$$ 4026868 1286591 -236560 -380130 -60095 24814 -284280 -436237 642946 2951250
41697B951250J546009p68927j515167L74397J842757O60684q41616j80864N04110
$$ 2951250 4497259 3728332 2213165 2587562 4430319 5091003 4249387 4068523 4572633
41688D572633j582423l980405k347152J967982L387073N84328j977378j306049
$$ 4572633 2990210 -990195 -3337347 -1369365 2017708 2602036 624658 -681391
41680f81391M49737O65971N5628J84639P82831J153068J423176J241213j74858
$$ -681391 -231654 434317 489945 674584 1457415 2610483 4033659 5274872 5100014
41671E100014j921226j957937l09539R26311R97330R87012Q41690n72353k114674
$$ 5100014 3178788 1220851 911312 1837623 2834953 3821965 4663655 4091302 1976628
41662A976628j048649K013482K936915L21789k106308j362059N09328O21293k1806
$$ 1976628 927979 2941461 5878376 6200165 4093857 2731798 3241126 3862419 3840613
41653C840613O65078J469110K48958j608800j251106N67741O09783j335986k120960
$$ 3840613 4505691 5974801 6223759 4614959 3363853 3931594 4541377 3205391 1084431
41644A084431n31629Q91302K61282p84013l28379M08952o36691k341774j580883
$$ 1084431 552802 1444104 1705386 921373 592994 1001946 365255 -1976519 -3557402
41635c557402J849564M259535K951114p4255j089787J14672M97368j197772k652100
$$ -3557402 -1707838 2551697 5502811 5428556 4338769 4453441 4950809 3753037 1100937
41626A100937j962455n59046l98894o78751K07899J356272R50652j84070O1942
$$ 1100937 -861518 -1420564 -1819458 -2498209 -2290310 -934038 16614 -167456 -105514
41617a05514J002521P3377k310709k665597M7889K470177J908228J34177K8505
$$ -105514 897007 970384 -1340325 -4005922 -3958033 -1487856 420372 554549 583054
41608E83054J093496R40209n23245j148892m0071J313725J333707K50347m61661
$$ 583054 1676550 2616759 2093514 944622 904551 2218276 3551983 3802330 3340669
41599C340669K08056J642129J984664K34101k077596k368013l32525J558973J353863
$$ 3340669 3548725 5190854 7175518 7409619 5332023 2964010 2631485 4190458 5544321
41590E544321k8190n31107K52750J135350J239551O78050j90679j149300j764099
$$ 5544321 5516131 4985024 5237774 6373124 7612675 8290725 8100046 6950746 5186647
41581E186647j256346Q27895L537178M428725J794130k555891m302034j672709
$$ 5186647 3930301 4758196 8295374 12724099 14518229 11962338 7660304 5987595
41573E987595K048037K838711J100639l8333J6728o36044j923883j604028K04906
$$ 5987595 8035632 10874343 11974982 11936649 11953377 11317333 9393450 7789422 7994328
41564G994328N49344j243590k081107l92646J120269L62580l75079J323503L315270
$$ 7994328 8543672 7300082 5218975 4826329 5946598 6309178 5934099 7257602 10572872
41555A0572872K374718j72391o03142J052205J480948o5221q80687Q2175M82618
$$ 10572872 12947590 12775199 12172057 13224262 14705210 14639989 13759302 13841477 14324095
41546A4324095r41083j930327n98330J254697J127771p3678K96909K118564K635894
$$ 14324095 13383012 11452685 10854355 12109052 13236823 13163145 13460054 15578618 18214512
41537A8214512R26826n38287L60321K325760K902548K214709K242943L088449
$$ 18214512 19141338 18603051 18963372 21289132 24191680 26406389 28649332 31737781
41529C1737781K559776p0752k233318j308557J865402M204218M015289K118443
$$ 31737781 34297557 34226805 31993487 30684930 32550332 36754550 40769839 42888282
41521D2888282L06762n6235J219645K765325L002510K542339L507131N680400
$$ 42888282 43195044 43138809 44358454 47123779 50126289 52668628 56175759 61856159
41513F1856159O037331L770233K524123M743833P052598N338412J584050N38082
$$ 61856159 67893490 71663723 74187846 78931679 85984277 91322689 92906739 93444821
41505I3444821J840477J462387m62291m6590K456291K390423q70076k564290j380860
$$ 93444821 95285298 96747685 96285394 96238804 98695095 101085518 100215442 97651152 96270292
41496I6270292k078911o261872q091765l804936J260197Q10741k971140m354126
$$ 96270292 94191381 87929509 79837744 76032808 77293005 78103746 75132606 70778480
41488G0778480l404285l555713l969928j825176N87153j312731n971822p271186
$$ 70778480 67374195 63818482 59848554 58023378 58610531 57297800 51325978 44054792
41480D4054792l883773n24570p5421o50650p27186j365984k607043k743108j867659
$$ 44054792 40171019 39646449 39571028 38920378 38193192 36827208 34220165 31477057 29609398
41471B9609398j695845j786679n02423O79185r64673l547595k510055J380844
$$ 29609398 27913553 26126874 25624451 26303636 25338963 21791368 19281313 20662157
41463B0662157K393759q10028k914374j025724P78861q38807k623338r56849J518003
$$ 20662157 23055916 22245888 19331514 18305790 19084651 18245844 15622506 14665657 16183660
41454A6183660O80348j916702k107734j63892N83209j67190k15314J44817j167405
$$ 16183660 16864008 14947306 12839572 12675680 13258889 13091699 12876385 13021202 11853797
41445A1853797l153672k534186O06265K456657J363033P4835R57196K435700J997741
$$ 11853797 8700125 6165939 6772204 9228861 10591894 10666729 11623925 14059625 16057366
41436A6057366Q7530j151497j314608j650471k288947j745636M46230K229336
$$ 16057366 16144896 14993399 13678791 12028320 9739373 7993737 8439967 10669303
41428A0669303J377425j302182k666162j311458O67495Q62943j88884n98187m26087
$$ 10669303 12046728 10744546 8078384 6766926 7434421 8297364 8108480 7510293 7084206
41419G084206q57264j095903O36881L144687K888999n52542l063846j645971J506124
$$ 7084206 6226942 5131039 5767920 8912607 11801606 11249064 8185218 6539247 8045371
41410H045371K675328J717589R00917P83820K60930n63558n03974K39582K42623
$$ 8045371 10720699 12438288 13339205 14123025 14383955 13820397 13316423 13556005 13798628
41401A3798628o95731j300153r01911o4660O89495J200659R62501k88466j411050
$$ 13798628 13102897 11802744 10900833 10836173 11525668 12726327 13688828 13400362 11989312
41392A1989312r21882P08230J403880M61917l22175P22403K519828K468710m382
$$ 11989312 11067430 11775660 13179540 13641457 13319282 14041685 16561513 19030223 19025841
41383A9025841k287901j597332J401952L068181J133892k482418m042818k268720
$$ 19025841 16737940 15140608 16542560 19610741 20744633 18262215 14219397 11950677
41375A1950677R56821L379370M178793L404792J596894J11028K6662M51195l80505
$$ 11950677 12907498 16286868 20465661 23870453 25467347 25578375 25605037 26056232 25675727
41366B5675727k135185k504601p13506J263888J754596J449511J295698N11615
$$ 25675727 23540542 21035941 20322435 21586323 23340919 24790430 26086128 26597743
41358B6597743j613552l639426l613334j786633j06209L25783R4371L23346J412765
$$ 26597743 24984191 21344765 17731431 15944798 15838589 16164372 16258743 16582089 17994854
41349A7994854K355165J247475k343883n703444n567410k454881j7305J74327
$$ 17994854 20350019 21597494 19253611 13550167 7982757 5527876 5510571 5684898
41341E684898J89596J361083J932656P95506J5628J078346J825245K33650j646848
$$ 5684898 5874494 7235577 9168233 9963739 9979367 11057713 12882958 13116608 11469760
41332A1469760j119225L27602l61966k414630k818027j730263j624632k072778
$$ 11469760 10350535 10678137 10316171 7901541 5083514 3353251 1728619 -344159
41324c44159l99258K715558L390334Q90892r95393r0664J218237P57824r2462
$$ -344159 -743417 1972141 5362475 6253367 5257974 5167310 6385547 7143371 7050909
41315G050909M435m27240k070541k252484N39005K806081Q53431k912862l133413
$$ 7050909 7055344 6628104 4557563 2305079 2844084 5650165 6503596 3590734 457321
41306D57321L29413K249526J12808k408968j560234R05178R80610j364714k561764
$$ 457321 786734 3036260 3149068 740100 -820134 85044 1065654 -299060 -2860824
41297b860824r49088J345812K143657J963537J973118J556357j39268j787354
$$ -2860824 -3809912 -2464100 -320443 1643094 3616212 5172569 5033301 3245947
41289C245947j458617P9616K49717j150545j403686O98121K566032J575960j086677
$$ 3245947 1787330 1866946 2116663 966118 -437568 260553 2826585 4402545 3315868
41280C315868k408168j671677l85280N29822J144747J226666Q50189J225139K543431
$$ 3315868 907700 -763977 -1149257 -619435 525312 1751978 2602167 3827306 6370737
41271F370737K350727r40901m195959l081036J140148K776072M5802k438498j032015
$$ 6370737 8721464 7780563 3584604 503568 1643716 4419788 4465590 2027092 995077
41262I95077J653677J568831m71426r75750L27159P44616n72806j688971j274744
$$ 995077 2648754 4217585 3746159 2770409 3097568 3842184 3269378 1580407 305663
41253C05663m4017R98273J394892O02590j295397k489408j189562J565644K760744
$$ 305663 261646 1259919 2654811 3257401 1962004 -527404 -1716966 -151322 2609422
41244B609422J142551j509720k841911k180767m49384P82081M00589p88218k88706
$$ 2609422 3751973 2242253 -599658 -2780425 -3229809 -2447728 -2047139 -2835357 -3124063
41235c124063K807449N593782M620342Q23606j562242r72640k21156j444992k658251
$$ -3124063 -316614 5277168 9897510 10721116 9158874 8186234 7965078 6520086 3861835
41226C861835j380654R49645J113916q15381j660292m3944J743228J364973l35486
$$ 3861835 2481181 3430826 4544742 3729361 2069069 2025125 3768353 5133326 4797840
41217D797840r77141q9654N97335j68576j492800j581306M7821K056904K781706
$$ 4797840 3820699 3731045 4328380 4159804 2667004 1085698 1133519 3190423 5972129
41208E972129J845376K56450p46158p08982r2977K52963j00907n87799j93232
$$ 5972129 7817505 8073955 7327797 6618815 6525838 6778801 6677894 6090095 5896863
41199E896863R73153J221618n85859k810346k484073P51661L753241L691480J292244
$$ 5896863 6870016 8091634 7505775 4695429 2211356 2963017 6716258 10407738 11699982
41190A1699982q14539j486673j227605l27233R30997J080535q82919k964608k158627
$$ 11699982 10885443 9398770 8171165 7843932 8774929 9855464 8972545 6007937 3849310
41181C849310P48296J527132j214344l348333j080633L249012M430955J681506
$$ 3849310 4597606 6124738 4910394 1562061 481428 3730440 8161395 9842901
41173I842901j018460j189319o47915j541005k913585k655421n87586J832271
$$ 9842901 8824441 7635122 6987207 5446202 2532617 -122804 -710390 1121881
41165A121881L277651K941463O73519k210895l555133k673408q82941O67899J990246
$$ 1121881 4399532 7340995 8014514 5803619 2248486 -424922 -1307863 -639964 1350282
41156A350282K604872J288173j261906j918110O56316L266033K225856j294696
$$ 1350282 3955154 5243327 3981421 2063311 2719627 5985660 8211516 6916820
41148F916820k876816j052897J152852R97302m87219p71205M30188J199786L49421
$$ 6916820 4040004 2987107 4139959 5137261 4650042 3878837 4309025 5508811 5858232
41139E858232r73060q03374R38215J981055O04792j659870j888763o2335J015116
$$ 5858232 4885172 4081798 5020013 7001068 7605860 5945990 4057227 3994892 5010008
41130E010008M95486Q12600K648702K481269j511178m627650j743499M048708
$$ 5010008 5505494 6318094 8966796 11448065 9936887 5309237 3565738 7614446
41122G614446M942293j00515l753464j210261L433470M159716J179254j326185
$$ 7614446 12556739 12456224 8702760 7492499 10925969 15085685 16264939 14938754
41114A4938754j558259m79208J089436K191013J090975j789560k726426K01620
$$ 14938754 13380495 12901287 13990723 16181736 17272711 15483151 12756725 12958345
41106A2958345L323293K397186q81600j690026L90992J489305K28223o23519M29540
$$ 12958345 16281638 18678824 17797224 16107198 16498190 17987495 18215718 17592199 18021739
41097A8021739J172752j33229j943812k396415k036652j926953j513450q3245
$$ 18021739 19194491 19061262 17117450 14721035 12684383 10757430 9243980 9160735
41089I160735J464413J765564P05304q03674j649017r85222P02558J241577o12832
$$ 9160735 10625148 12390712 13096016 12292342 10643325 9658103 10360661 11602238 10989406
41080A0989406k613584j639331J346361K182293k46884k243627j010676J388137
$$ 10989406 8375822 6736491 8082852 10265145 10018261 7774634 6763958 8152095
41072H152095J784704M95226l83317o47291j107424j125304j5606P01262n45191
$$ 8152095 9936799 10432025 10048708 9401417 8293993 7168689 7153083 7854345 7309154
41063G309154k200216j581795Q04829J944723Q47154m59459l74256M44731Q80481
$$ 7309154 5108938 3527143 4331972 6276695 7123849 6664390 6290134 6734865 7615346
41054G615346P68785K90623k23524K8681J089654J196946q78823l049885k187046
$$ 7615346 8384131 8674754 8451230 8479911 9569565 10766511 9887688 6837803 4650757
41045D650757J054142K727724J170910j078469j639603j295945j341366j088171
$$ 4650757 5704899 8432623 9603533 8525064 6885461 5589516 4248150 3159979
41037C159979J5007N14582m64965j060999L84654K191318J884384K43347j84736
$$ 3159979 3174986 3689568 3224603 2163604 2548258 4739576 6623960 6867307 6682571
41028F682571N47590R0729k028527l553132k869935p09551J614668L322181L456051
$$ 6682571 7230161 7320890 5292363 1739231 -1130704 -1840255 -225587 3096594 6552645
41019F552645J484618j055576j768951o54843k4408q54544j550568q72599K89793
$$ 6552645 8037263 6981687 5212736 4557893 4533485 3678941 2128373 1255774 1545567
41010A545567Q51020R67974P37833k01829r42803J73931K224036J925482j117550
$$ 1545567 2396587 3364561 4102394 3900565 2957762 3131693 5355729 7281211 6163661
41001F163661k676046L770L468626K950549n56826k376027j509870j050301j958382
$$ 6163661 3487615 3491385 6960011 9910560 9353734 6977707 5467837 4417536 2459154
40992B459154j622897P70032K247802J031241n87918l88962L43819r6947n39561
$$ 2459154 836257 1606289 3854091 4885332 4297414 3908452 4252271 4155324 3615763
40983C615763M84440J551530Q34948l85911P481Q96571l26440k961104l594182
$$ 3615763 4100203 5651733 6486681 6100770 6108251 7004822 6678382 3717278 123096
40974A23096j267858J282760J842178J161947N79415r970o99520m65654R91811
$$ 123096 -1144762 137998 1980176 3142123 3721538 3711568 3012048 2546394 3538205
40965C538205K019272J155143o25974j168937P5625J592663J694531J58877j689484
$$ 3538205 5557477 6712620 6086646 4917709 4993334 6585997 8280528 8439405 6749921
40956F749921k194962j092233j7414n50397j865772j601137O93992K493824J554998
$$ 6749921 4554959 3462726 3445312 2894915 1029143 -571994 121998 2615822 4170820
40947D170820r77916k011564m37428J640250J590790o69100k563587j625490J682230
$$ 4170820 3192904 1181340 743912 2384162 3974952 3305852 742265 -883225 799005
40938G99005M123951L087656l78497k678935j779785P63658K101311J330136j87727
$$ 799005 4922956 8010612 7632115 4953180 3173395 3937053 6038364 7368500 7180773
40929G180773r33844q01100p87292j588869k506330k008383J40850J891754J249706
$$ 7180773 6246929 5445829 4658537 3069668 563338 -1445045 -1304195 587559 1837265
40920A837265p57001j210745M94615J719182O12307j120445r95778N71791J372785
$$ 1837265 1080264 -130481 364134 2083316 2695623 1575178 579400 1151191 2523976
40911B523976Q00453l5206n89695j024300p93985N68713J747562J121487l79841
$$ 2523976 3324429 3289223 2699528 1675228 881243 1449956 3197518 4319005 3939164
40902C939164m60723O82938O30352q98660j248924O08336K082316J311534K73200
$$ 3939164 3478441 4161379 4791731 3893071 2644147 3252483 5334799 6646333 6919533
40893F919533R31612J222199j453186m798046m163548J77988K875833J185207
$$ 6919533 7851145 9073344 7620158 2822112 -1341436 -1163448 1712385 2897592
40885B897592j470605j250664O30468R15780j77745j08093R54168K77063k309607
$$ 2897592 1426987 176323 806791 1722571 1544826 1436733 2390901 2667964 358357
40876C58357l179671j70557L666024L802742K48179k625158j918402M61920J051410
$$ 358357 -2821314 -2991871 674153 4476895 4725074 2099916 181514 643434 1694844
40867A694844m42828j415049n82267K93949n06538j738142j021127J365023K627712
$$ 1694844 1252016 -163033 -745300 -451351 -957889 -2696031 -3717158 -2352135 275577
40858B75577J419541l63436m89189O18945J091351N31345L6749l885l12901j004306
$$ 275577 1695118 1331682 842493 1461438 2552789 3084134 3120883 3116998 2804097 1799791
40848A799791j150984m67127p078m36766p02792M76040K322393K454307p8057
$$ 1799791 648807 181680 174602 -262164 -964956 -488916 1833477 4287784 4209727
40839D209727l025341l102124M2222K940418K249128r99533k613798p95608J537457
$$ 4209727 1184386 -1917738 -1875516 1064902 3314030 2314497 -299301 -1094909 442548
40830D42548J132550q82123j041594Q73814J517892n66411k399065j017083J972899
$$ 442548 1575098 692975 -348619 525195 2043087 1476676 -922389 -1939472 33427
40821C3427K648879K57099k047530j667929L68490J356158N19808l34507N58486
$$ 33427 2682306 2939405 891875 -776054 -407564 948594 1468402 1133895 1692381
40812A692381K440257K778448N81699j974723k314529j099765j099327k524765
$$ 1692381 4132638 6911086 7492785 5518062 3203533 2103768 1004441 -1520324
40804a520324k269064J034495L975845K862128p36660k112097m7171K130700J966046
$$ -1520324 -3789388 -2754893 1220952 4083080 3346420 1234323 1187152 3317852 5283898
40795E283898P96587M45002L01188n28459q30634N14398J734289L38530k718489
$$ 5283898 6080485 6525487 6826675 6298216 5467582 5981980 7716269 8054799 5336310
40786E336310l764762j406312J522473J791989j93675j473604n79449J026523
$$ 5336310 1571548 165236 1687709 3479698 3286023 1812419 1232970 2259493
40778B259493J333812K00136j057220j464220r75451O2668R94902Q26529o23159
$$ 2259493 3593305 3793441 2736221 1272001 296550 359218 1354120 2180649 1557490
40769A557490j733540q14337J087691J099414j112238k221227p0475K626062J982709
$$ 1557490 -176050 -990387 97304 1196718 84480 -2136747 -2207222 418840 2401549
40760B401549j274914k932936j403236P46364J370313J333386J687217J503976
$$ 2401549 1126635 -1806301 -3209537 -2463173 -1092860 240526 1927743 3431719
40752C431719J03892j097105p35974L97802R10035P62170M60322M7374j9012J026299
$$ 3431719 3535611 2438506 1702532 2100334 3010369 3772539 4232861 4280235 4261223 5287522
40742E287522K215517J294117j486974k766078j045814P06354j33698j534321
$$ 5287522 7503039 8797156 7310182 4544104 3498290 4204644 4070946 2536625
40734B536625o28523J004338J52835k051276j885627M06632R93249q54274j653588
$$ 2536625 1908102 2912440 3065275 1013999 -871628 -464996 528253 -326021 -1979609
40725a979609N2443J391382N58721j84436R00672J679095K06159j439753o69286
$$ -1979609 -1927166 -535784 22937 -161499 739173 2418268 2624427 1184674 515388
40716E15388J082750Q14192j086528j792709o44098M00646K18182k94192j46388
$$ 515388 1598138 2412330 1325802 -466907 -1111005 -710359 -492177 -786369 -932757
40707i32757P25897J959612K639952J473716j261778k965090j742758Q40710J986285
$$ -932757 -206860 1752752 4392704 5866420 4604642 1639552 -103206 737504 2723789
40698B723789J490826J065850Q75406m11919k445228k899457q22989J875903K904505
$$ 2723789 4214615 5280465 6155871 5743952 3298724 399267 -423722 1452181 4356686
40689D356686J999223M54014n45742q67713j436100k926524l962633k079427K280952
$$ 4356686 6355909 6809923 6264181 5396468 3960368 1033844 -2928789 -5008216 -2727264
40680b727264M791956K642220j016813j359366R38318J145714j621368l116327
$$ -2727264 2064692 4706912 3690099 2330733 3269051 4414765 2793397 -322930
40672c22930j264956N63618k75930j167359P35436K986371J738759j617467k453310
$$ -322930 -1587886 -1024268 -1300198 -2467557 -1732121 1254250 2993009 1375542 -1077768
40663a077768m933K101539J765140M99005l95464j532261k538650j341514K021987
$$ -1077768 -1082701 1018838 2783978 3282983 2887519 1355258 -1183392 -2524906 -502919
40654e02919M027977K198003j260059k444707p33946J240780J370523j06436j760849
$$ -502919 3525058 5723061 4463002 2018295 1284349 2525129 3895652 3789216 2028367
40645B028367k241966r11432J329899K295614R33036r92759j087008K38458L54206
$$ 2028367 -213599 -1125031 204868 2500482 3433518 2440759 1353751 1592209 1946415
40636A946415j496922k751359j130034J941501L161080J751154J40715K97956
$$ 1946415 449493 -2301866 -3431900 -1490399 1670681 3421835 3562550 3860506
40628C860506J270102J167214N6195o03777n13757o76619j184341q27172N67072
$$ 3860506 5130608 6297822 6354017 5750240 5236483 4559864 3375523 2548351 3115423
40619C115423J225792Q035j568328j425134Q927O63877J09532j20286O11489J021766
$$ 3115423 4341215 4349250 2780922 1355788 1364715 2028592 2138124 2017838 2629327 3651093
40609C651093K84506m81532j03341P53743P62610r6716q97210j207961j086494
$$ 3651093 3935599 3454067 3350726 4104469 4867079 4770363 3873153 2665192 1578698
40600A578698m51722M18307N64454k47581n82096P37283K405374K134086R6974
$$ 1578698 1126976 1545283 2109737 1862156 1280060 2017343 4422717 6556803 6653777
40591F653777j108043j92070J073482O40703r32002j613876p75311M40050R48271
$$ 6653777 5545734 5353664 6427146 7067849 6135847 4521971 3746660 4186710 5134981
40582E134981O23879l12285j588988k525352k318299r65955N97802J420509J266294
$$ 5134981 5758860 5446575 3857587 1332235 -986064 -1952019 -1354217 66292 1332586
40573A332586N26048j87550l94696r0018K45331K18185K6292J37712N98972R62817
$$ 1332586 1858634 1671084 1276388 1186370 1431701 1649886 1676178 1813890 2412862 3375679
40563C375679Q47586L44580j01082j36440Q3227L3795l32594j80826J005749K016929
$$ 3375679 4223265 4567845 4466763 4330323 4413550 4447345 4114751 3933925 4939674 6956603
40553F956603J026256j567846k995857j794969l8910j89602j106342K06638L438076
$$ 6956603 7982859 6415013 3419156 1624187 1585277 1395675 289333 495971 3934047
40544C934047M702285K123383j241380j785444l37359k61627k031689k774789
$$ 3934047 8636332 10759715 9518335 7732891 7395532 7133905 5102216 2327427
40536B327427j103445N68797k53294k215916j954582R74058L234017K241058k73907
$$ 2327427 1223982 1792779 1539485 -676431 -2631013 -1656955 1577062 3818120 3544213
40527C544213p53622J128065K159743N13891j565592j501321n36791j351131k942504
$$ 3544213 2790591 3918656 6078399 6592290 5026698 3525377 2988586 1637455 -1305049
40518a305049j716228K318514M546812K384273q23473j036016N69624L72359j444137
$$ -1305049 -3021277 -702763 3844049 6228322 5404849 4368833 4938457 5310816 3866679
40509C866679j666207J47253J080925J6520p91453l4156N43962k70910q11586
$$ 3866679 2200472 2347725 3428650 3445170 2653717 2619561 3163523 2892613 2081027
40500B081027L31557J553434Q05354j140321k129197j716420q70507o585P92511
$$ 2081027 2412584 3966018 4771372 3631051 1501854 -214566 -1085073 -1091658 -299147
40491b99147Q22043j38089p92342o9522J111352J348608Q78262N62982L8436j191703
$$ -299147 522896 384807 -407535 -477057 634295 1982903 2861165 3424147 3462583 2270880
40481B270880j954331r19516Q75103J237814L7075r01799o64954O2822P73976
$$ 2270880 316549 -602967 272136 1509950 1547025 645226 -19728 43094 817070
40472H17070J469730J513592L02991j099277j080756L2421P15628R65866J708846
$$ 817070 2286800 3800392 4103383 3004106 1923350 1955771 2671399 3637265 5346111
40463E346111J983096O904k845245k829907M78938K958620J952247j07943l26012
$$ 5346111 7329207 7336111 4490866 1660959 2139897 5098517 7050764 6942821 6616809
40454F616809j3727j483707l170942k124682N10073R86417q89049j563475J95816
$$ 6616809 6603082 5119375 1948433 -176249 333824 1320241 431192 -1132283 -936467
40445i36467J404489J48463j174528J2129K196747K345399O31185l25821K00559
$$ -936467 468022 616485 -558043 -545914 1650833 3996232 4627417 4301596 4502155
40436D502155L84842o29757j162985K43218K278725K412981K73403j767328j529993
$$ 4502155 4886997 4257240 3094255 3337473 5616198 8029179 8302582 6535254 5005261
40427E005261K32782P78218j001761k853989j939013J180166K829729R02740k215286
$$ 5005261 5238043 6016261 5014500 2160511 221498 1401664 4231393 5134133 2918847
40418B918847k621197J08066K545868J879334r19545k849831k369894k24054K022446
$$ 2918847 297650 405716 2951584 4830918 3911373 1061542 -1308352 -1532406 490040
40409D90040K944348J617040j223114k709818n80250L299293M281395Q44446k915543
$$ 490040 3434388 5051428 3828314 1118496 538246 3837539 8118934 8963380 6047837
40400F047837k503966J018469K894729J385016o10497o02238J77838l61417j788508
$$ 6047837 3543871 4562340 7457069 8842085 8231588 7629350 7807188 7445771 5657263
40391E657263k392970j811619o78462P29216J923088J878628Q10629N36004J453876
$$ 5657263 3264293 1452674 774212 1503428 3426516 5305144 6115773 6651777 8105653
40382H105653J284348j067381k802333j430196N50109p46574l820622l536579
$$ 8105653 9390001 8322620 5520287 4090091 4640200 3893626 73004 -3463575
40374c463575O71646L548205J957181q23089p53085J320910K346222J791570P14570
$$ -3463575 -2791929 756276 2713457 1890368 1137283 2458193 4804415 6595985 7310555
40365G310555q72411k603842k372136M50587K736186J805580l21219l40022R17504
$$ 7310555 6438144 3834302 1462166 1912753 4648939 6454519 6133300 5793278 6710782
40356F710782N29877r43566o11522J153685J179582p92824j722609q16781o11094
$$ 6710782 7240659 6297093 5685571 6839256 8018838 7226014 5503405 4686624 4075530
40347D075530j726197j425867J071630K516108J062516m71409N18561K127909
$$ 4075530 2349333 923466 1995096 4511204 5573720 5102311 5620872 7748781
40339G748781J643703J43659r9932Q8790j092108k354324j411488N57795O08017
$$ 7748781 9392484 9536143 9436211 9525001 8432893 6078569 4667081 5224876 5832893
40330E832893r49686j231658J94406R71636M61310N93508J713044J372602j386480
$$ 5832893 4883207 3651549 3845955 4817591 5278901 5872409 7585453 8958055 7571575
40321G571575l641550k369607J374691L815974K857119j28215k234531j981814
$$ 7571575 3930025 1560418 2935109 6751083 9608202 9479987 7245456 5263642
40313E263642n49574o5038o51993l32586J494249K409461O09333j723522j468341
$$ 5263642 4714068 4649030 3997037 3664451 5158700 7568161 8177494 6453972 4985631
40304D985631M65104O61317j146207j830391k08958J353068J307643J062016J596719
$$ 4985631 5450735 6112052 4965845 3135454 2926496 4279564 5587207 6649223 8245942
40295H245942J514465J2975j371928j577515j557778j561819j76494K181341K416546
$$ 8245942 9760407 9773382 8401454 6823939 5266161 3704342 3527848 5709189 8125735
40286H125735k45683j991741j45645K222543J091191k059241k893086j107075
$$ 8125735 7880052 5888311 5742666 7965209 9056400 6997159 4104073 2996998
40278B996998j7574o27373q02269J57680N47537m5858j1786R36627J182677L98742
$$ 2996998 2979424 2352051 1549782 1707462 2254999 2209141 2197355 3133982 4316659 4715401
40268D715401O6504M25723J14158p53942m66321P89822P76020o01209n57267J706830
$$ 4715401 4781905 5207628 5321786 4567844 4101523 4891345 5667365 5066156 4508889 6215719
40258F215719K973258R60424j805242j761414M31777J399106K91905n17931M95396
$$ 6215719 9188977 10149401 8344159 6582745 7014522 8413628 8705533 8187602 8682998
40249H682998J818162J232079j110278k680751j464712J368415K354514l2049
$$ 8682998 10501160 11733239 10622961 7942210 6477498 7845913 10200427 10168378
40241A0168378l021230l028902n88237O94448l28679j078072O9001J302088R50272
$$ 10168378 7147148 4118246 3530009 4224457 3895778 2817706 2886707 4188795 5139067
40232E139067K69093N97842O39667p81816j672776K52407L241368L367040N1390
$$ 5139067 5408160 6006002 6645669 5863853 4191077 4443484 7684852 11051892 11103282
40223A1103282l188504l401839j224273Q87817J482731Q16870P5372J91219P87347
$$ 11103282 7914778 4512939 3288666 4176483 5659214 6476084 6551456 6742675 7530022
40214G530022N84409o38392j342265k70182J738748K817133K020622l78821l189056
$$ 7530022 8114431 7476039 6133774 5863592 7602340 10419473 12440095 12061274 8872218
40205H872218m263041k061194J695942L024300P29285j774612j384047N48156
$$ 8872218 4609177 2547983 4243925 7268225 7997510 6222898 4838851 5387007
40197E387007J316203J294071J922875J787785r15531l641825k244916K025427
$$ 5387007 6703210 7997281 9920156 11707941 10792410 7150585 4905669 6931096
40189F931096L427422K36742k640451j243437J808061K030639j72278j047097
$$ 6931096 10358518 10595260 7954809 6711372 8519433 10550072 10377794 9330697
40181I330697M09225J572633O87010q56415j048968N6810J027943J236380J307817
$$ 9330697 9739922 11312555 11999565 11143150 10094182 10150992 11178935 12415315 13723132
40172A3723132J577704J109637q80671l087910l198817j207024K94912P5803K12054
$$ 13723132 15300836 16410473 15529802 12441892 9243075 8036051 8330963 8406766 8618820
40163H618820K253402L866783K251253r85316j983087m31594P04562M82995P35387
$$ 8618820 10872222 14739005 16990258 16004942 14021855 13590261 14294823 14777818 15513205
40154A5513205J730485J562904K66991O8077P67548m74895l499289m125749p77692
$$ 15513205 17243690 18806594 19073585 19141662 19909210 19434315 15935026 11809277 11031585
40145A1031585K523769K314292M05434m05353q41629j852255j227037K089558
$$ 11031585 13555354 15869646 16275080 15869727 15028098 13175843 11948806 14038364
40137A4038364M163068J564468k496474k895697o84141m71176j840730k66910
$$ 14038364 18201432 19765900 17269426 14373729 13689588 13218412 11377682 11110772
40129A1110772L978355M929421K74608m525674m045245r6982J930583N32195j332933
$$ 11110772 15089127 20018548 20293156 15767482 11722237 11625255 13555838 14088033 12755100
40120A2755100j157189L82114J023750j80541j547125n61963K423304L684714
$$ 12755100 11597911 11980025 13003775 12823234 11276109 10714146 13137450 16822164
40112A6822164J096073k112528j587960J548220K359335k55619k210952j021707
$$ 16822164 17918237 15805709 14217749 15765969 18125304 17869685 15658733 14637026
40104A4637026P53343M25814o97887m91293J02911q47406k646819k995136j161659
$$ 14637026 15390369 15816183 15118296 14627003 14729914 13882508 11235689 8240553 7078894
40095G078894J561225L272127K490272m56846k656097j589862Q81247O98659j863716
$$ 7078894 8640119 11912246 14402518 13945672 11289575 9699713 10580960 11279619 9415903
40086I415903k099838J368941L627328J134812k231697j068366L177377M760434
$$ 9415903 7316065 8685006 12312334 13447146 11215449 10147083 13324460 18084894
40078A8084894K280700m77397j244603j654598k791185k889193p31918J870320
$$ 18084894 20365594 19888197 18643594 16988996 14197811 11308618 10576700 12447020
40070A2447020K476635R70473q14883j169192J27374J584198J362723m37182j735898
$$ 12447020 14923655 15894128 15079245 13910053 14037427 15621625 16984348 16547166 14811268
40061A4811268j462590r87176j382204j330367L31966K031376J822251N16313
$$ 14811268 13348678 12361502 10979298 9648931 9980897 12012273 13834524 14350837
40053A4350837j11724m17789j375815j836679m99653J082146Q80483R7875Q27373
$$ 14350837 14239113 13821324 12445509 10608830 10109177 11191323 12071806 12169681 12997054
40044A2997054J802814P27549q46341J06841K166335J487307j052374r23750J841523
$$ 12997054 14799868 15527417 14681076 14787917 16954252 18441559 17389185 16465435 18306958
40035A8306958K224535r34597k605696l55338J370676p38232k948625j282923
$$ 18306958 20531493 19596896 16991200 16635862 18006538 17268306 14319681 13036758
40027A3036758J333873L78435k256730j795882J062046J777319m47m01249J469573
$$ 13036758 14370631 14749066 12492336 10696454 11758500 13535819 13535372 13134123 14603696
40018A4603696K268106N36440j184464j223454j225751k414682l126837j651267
$$ 14603696 16871802 17408242 16223778 15000324 13774573 11359891 8233054 6581787
40010F581787J184751L460145M033544K400755j015855l909166l748486j076158
$$ 6581787 7766538 11226683 15260227 17660982 16645127 12735961 8987475 7911317
40002G911317R31978P42195J44618R30014K032997J313457j184097l086572k351988
$$ 7911317 8843295 9585490 9730108 10660122 12693119 14006576 12822479 9735907 7383919
39993G383919N43940K944024K634598K99574j293915p93477L31180M48791J4227
$$ 7383919 7927859 10871883 13506481 13806055 12512140 11718663 12049843 12498634 12512861
39984A2512861n9301k85813j036299r79683O55004K014388J352831J21184M63682
$$ 12512861 12453560 12167747 11131448 10151765 10806769 12821157 14173988 14295172 14758854
39975A4758854J306776K90404j820876k387868j495535j355238j874049r98784
$$ 14758854 16065630 16356034 14535158 12147290 10651755 9296517 7422468 6423684
39967F423684R23021J455456O61308R22336J996934J005127j931454k892459l88292
$$ 6423684 7346705 8802161 9463469 10385805 12382739 13387866 11456412 8563953 8175661
39958H175661K186101K062024P46806K62439l4505p15562m26168R27371J048781
$$ 8175661 10361762 12423786 13170592 13433031 13398526 12682964 12256796 13184167 14232948
39949A4232948m34546o16445J352897K033006l14252k123760m88845J792946J293510
$$ 14232948 13798402 13181957 14534854 16567860 16253608 14129848 13641003 15433949 16727459
39940A6727459k67681m1565L11639j589570l208321j339089J215078r9762l205750
$$ 16727459 16459778 16418213 16729852 15140282 11931961 10592872 11807950 11708188 8502438
39931H502438k537345J114590J702905j553874k658026J117875M946360M288932
$$ 8502438 5965093 7079683 8782588 7228714 4570688 5688563 10634923 14923855
39923A4923855P83491k047256l402166l140520l86577L187302L517116K11886
$$ 14923855 15707346 13660090 10257924 7117404 6730827 9918129 13435245 13647131
39915A3647131k123729j100200j51530j961669l371421q98128K977143L616585
$$ 13647131 11523402 10423202 10271672 8310003 4938582 4040454 7017597 10634182
39907A0634182J040524j402167k367070k363587q78667K111268L934403K589519
$$ 10634182 11674706 10272539 7905469 5541882 4663215 6774483 10708886 13298405
39899A3298405L43495J57186P49698o18311k665614k179250P1448N65731q08816
$$ 13298405 13641900 13799086 14548784 13930473 11264859 9085609 9157057 9722788 8913972
39890H913972q85878Q77600J549908l2541j657383j782156j124913L599J866112
$$ 8913972 8028094 8905694 10455602 10423061 8765678 6983522 5858609 5862208 7728320
39881G728320K735724O31682k200477j501896J773678K043491j775143l900305
$$ 7728320 10464044 11095726 8895249 7393353 9167031 11210522 9435379 5535074
39873E535074j129739J632881l10839l236417j151651L927507M946545R13012
$$ 5535074 4405335 6038216 5727377 2490960 1339309 5266816 10213361 11126373
39865A1126373k224038j391984p4266r38719j249896J386266L818025K062026
$$ 11126373 8902335 7510351 7436085 6497366 5247470 6633736 10451761 12513787
39857A2513787k022796l202647m53342K025705J166639j108945j348057O13358
$$ 12513787 10490991 7288344 6835002 8860707 10027346 8918401 7570344 8183702
39849H183702K015350J197629n49768j186972n74463m0294m2272L23766J386995
$$ 8183702 10199052 11396681 10846913 9659941 9085478 9045184 9002912 9326678 10713673
39840A0713673J939989R86227p33733j952822k465492k332228q96893J609034
$$ 10713673 12653662 13639889 12906156 10953334 8487842 6155614 5258721 6867755
39832F867755K845057J255683q42096j97340J953100J307276k387954m163023
$$ 6867755 9712812 10968495 10126399 9929059 11882159 13189435 10801481 6638458
$$ [...]
##END NTUPLES=NMR SPECTRUM
##END=
