##TITLE=31Pdec_SR104_1
 , 124 sc
 17.2.2022
##JCAMPDX= 6.0         $$ Bruker NMR JCAMP-DX V2.0
##DATA TYPE= NMR SPECTRUM
##DATA CLASS= NTUPLES
##ORIGIN= UXNMR, Bruker Analytische Messtechnik GmbH
##OWNER= root
$$ XWIN-NMR		Version 3.5
$$ Thu Feb 17 11:17:57 2022 Russian Standard Time (UT+4h)  she@DPX200
##.OBSERVE FREQUENCY= 81.013821
##.OBSERVE NUCLEUS= ^31P
##.ACQUISITION MODE= SIMULTANEOUS
##.ACQUISITION SCHEME= undefined
##.AVERAGES= 124
##.DIGITISER RES= 16
##SPECTROMETER/DATA SYSTEM= spect
##.PULSE SEQUENCE= zgpg30
##.SOLVENT NAME= Acetone
##.SHIFT REFERENCE= (INTERNAL, Acetone, 0, 248.564)
##AUDIT TRAIL= $$ (NUMBER, WHEN, WHO, WHERE, WHAT)
$$ ##TITLE= Audit trail, XWIN-NMR		Version 3.5
$$ ##JCAMPDX= 5.01
$$ ##ORIGIN= Bruker BioSpin GmbH
$$ ##OWNER= she
$$ F:/spectra/data/she/nmr/P31/1/pdata/1/auditp.txt
$$ ##AUDIT TRAIL=  $$ (NUMBER, WHEN, WHO, WHERE, WHAT)
(   1,<2022-02-17 11:16:48.75 +0400>,<she>,<DPX200>,
      <continue with go, POWCHK disabled, PULCHK disabled
       configuration hash MD5:
       00 E9 B6 7A A2 85 ED C7 34 08 36 98 17 FE 4E 26
       data hash MD5: 32K
       C1 A5 57 D8 AE D4 37 01 8E E6 9C 03 61 AC DE 2A>)
(   2,<2022-02-17 11:16:51.43 +0400>,<she>,<DPX200>,
      <Start of raw data processing
       efp BC_mod = 2 LB = 1 FT_mod = 6 PKNL = 1 PHC0 = -9242.208 PHC1 = 230.8745 SI = 64K 
       data hash MD5: 64K
       FA 06 F3 02 30 4A 05 97 E7 AD 2B 90 07 8E 60 16>)
(   3,<2022-02-17 11:17:14.46 +0400>,<she>,<DPX200>,
      <pk PHC0 = 51.72924 PHC1 = -126.8 
       data hash MD5: 64K
       59 14 82 FB 51 44 9C 8F AA D3 61 C5 C1 0B 50 C9>)
(   4,<2022-02-17 11:17:18.29 +0400>,<she>,<DPX200>,
      <abs ABSG = 5 
       data hash MD5: 64K
       75 0A 1E 9C 1D 73 81 22 F1 5B 32 57 6C 00 EC FE>)
$$ ##END=
$$ 
$$ hash MD5
$$ 97 72 68 32 A0 C1 A5 EA 3B DB 5B AF 35 A5 81 53
##$RELAX= 
##$RELAX= 
##$RELAX= 
##$RELAX= 
##$RELAX= 
##$RELAX= 
##$RELAX= 
##$RELAX= 
$$ Bruker specific parameters
$$ --------------------------
##$DU= <F:/spectra>
##$EXPNO= 1
##$NAME= <P31>
##$PROCNO= 1
##$TYPE= <nmr>
##$USER= <she>
##$AMP= (0..31)
100 100 100 100 100 100 100 100 100 100 100 100 100 100 100 100 100 100 
100 100 100 100 100 100 100 100 100 100 100 100 100 100 
##$AQSEQ= 0
##$AQ_mod= 1
##$AUNM= <au_zg>
##$AUTOPOS= <>
##$BF1= 81.014009
##$BF2= 200.13
##$BF3= 200.13
##$BF4= 200.13
##$BF5= 200.13
##$BF6= 200.13
##$BF7= 200.13
##$BF8= 200.13
##$BYTORDA= 1
##$CFDGTYP= 0
##$CFRGTYP= 5
##$CHEMSTR= <none>
##$CNST= (0..31)
1 1 145 1 1 1 1 1 1 1 1 1 1 1 1 1 1 1 1 1 1 1 1 1 1 1 1 1 1 1 1 1 
##$CPDPRG= <waltz16>
##$CPDPRG1= <>
##$CPDPRG2= <waltz16>
##$CPDPRG3= <>
##$CPDPRG4= <mlev>
##$CPDPRG5= <mlev>
##$CPDPRG6= <mlev>
##$CPDPRG7= <mlev>
##$CPDPRG8= <mlev>
##$CPDPRGB= <>
##$CPDPRGT= <>
##$D= (0..31)
0 1 0 0 0 0 0 0 0 0 0 0.03 2e-05 3e-06 0 0 0 0 0 0 0 0 0 0 0 0 0 0 0 0 
0 0 
##$DATE= 1645082030
##$DBL= (0..7)
120 120 120 11 120 120 24 19 
##$DBP= (0..7)
150 150 150 150 150 150 150 150 
##$DBP07= 0
##$DBPNAM0= <>
##$DBPNAM1= <>
##$DBPNAM2= <>
$$ [...]
##$SUBNAM3= <"">
##$SUBNAM4= <"">
##$SUBNAM5= <"">
##$SUBNAM6= <"">
##$SUBNAM7= <"">
##$SUBNAM8= <"">
##$SUBNAM9= <"">
##$SW= 501.771253377433
##$SWIBOX= (0..15)
0 1 3 0 0 0 0 0 0 0 0 0 0 0 0 0 
##$SW_h= 40650.406504065
##$TD= 32768
##$TD0= 1
##$TE= 0
##$TE2= 300
##$TE3= 300
##$TEG= 300
##$TL= (0..7)
0 120 53 12 22 120 120 120 
##$TP= (0..7)
150 150 150 150 150 150 150 150 
##$TP07= 0
##$TPNAME0= <>
##$TPNAME1= <>
##$TPNAME2= <>
##$TPNAME3= <>
##$TPNAME4= <>
##$TPNAME5= <>
##$TPNAME6= <>
##$TPNAME7= <>
##$TPOAL= (0..7)
0.5 0.5 0.5 0.5 0.5 0.5 0.5 0.5 
##$TPOFFS= (0..7)
0 0 0 0 0 0 0 0 
##$TUNHIN= 0
##$TUNHOUT= 0
##$TUNXOUT= 0
##$USERA1= <user>
##$USERA2= <user>
##$USERA3= <user>
##$USERA4= <user>
##$USERA5= <user>
##$V9= 5
##$VALIST= <valist>
##$VCLIST= <CCCCCCCCCCCCCCC>
##$VD= 0
##$VDLIST= <DDDDDDDDDDDDDDD>
##$VPLIST= <PPPPPPPPPPPPPPP>
##$VTLIST= <TTTTTTTTTTTTTTT>
##$WBST= 1024
##$WBSW= 4
##$XGAIN= (0..3)
0 0 0 0 
##$XL= 0
##$YL= 0
##$YMAX_a= 66057
##$YMIN_a= -92683
##$ZGOPTNS= <>
##$ZL1= 120
##$ZL2= 120
##$ZL3= 120
##$ZL4= 120
##$ABSF1= 248.5645
##$ABSF2= -253.2056
##$ABSG= 5
##$ABSL= 3
##$ALPHA= 0
##$AQORDER= 0
##$ASSFAC= 0
##$ASSFACI= 0
##$ASSFACX= 0
##$ASSWID= 0
##$AUNMP= <proc_1d>
##$AZFE= 0.1
##$AZFW= 0.5
##$BCFW= 0
##$BC_mod= 2
##$BYTORDP= 0
##$COROFFS= 0
##$CY= -3
##$DATMOD= 1
##$DC= 0
##$DFILT= <>
##$DTYPP= 0
##$F1P= 0
##$F2P= 0
##$FCOR= 1
##$FTSIZE= 65536
##$FT_mod= 6
##$GAMMA= 0
##$GB= 0
##$INTBC= 1
##$INTSCL= 5.30512e-09
##$ISEN= 30
##$LB= 1
##$LEV0= 0
##$LPBIN= 0
##$MAXI= 10000
##$MC2= 0
##$MEAN= 0
##$ME_mod= 0
##$MI= 50
##$NCOEF= 0
##$NC_proc= -7
##$NLEV= 6
##$NOISF1= 182.463
##$NOISF2= 159.3651
##$NSP= 0
##$NTH_PI= 0
##$NZP= 0
##$OFFSET= 248.5645
##$PC= 4
##$PHC0= -9190.479
##$PHC1= 104.0745
##$PH_mod= 1
##$PKNL= yes
##$PPARMOD= 0
##$PSCAL= 0
##$PSIGN= 0
##$REVERSE= no
##$SF= 81.014009
##$SI= 65536
##$SIGF1= 159.3651
##$SIGF2= -187.1042
##$SINO= 113.3802
##$SIOLD= 16384
##$SREGLST= <1H.CDCl3>
##$SSB= 0
##$STSI= 65536
##$STSR= 0
##$SW_p= 40650.406504065
##$SYMM= 0
##$S_DEV= 0
##$TDeff= 32768
##$TDoff= 0
##$TI= <>
##$TILT= no
##$TM1= 0
##$TM2= 0
##$TOPLEV= 0
##$USERP1= <user>
##$USERP2= <user>
##$USERP3= <user>
##$USERP4= <user>
##$USERP5= <user>
##$WDW= 1
##$XDIM= 65536
##$YMAX_p= 521025279
##$YMIN_p= -303856113
$$ End of Bruker specific parameters
$$ ---------------------------------
##NTUPLES= NMR SPECTRUM
##VAR_NAME=  FREQUENCY,     SPECTRUM/REAL,   SPECTRUM/IMAG
##SYMBOL=    X,             R,               I
##VAR_TYPE=  INDEPENDENT,   DEPENDENT,       DEPENDENT
##VAR_FORM=  AFFN,          ASDF,            ASDF
##VAR_DIM=   65536,         65536,           65536
##UNITS=     HZ,            ARBITRARY UNITS, ARBITRARY UNITS
##FACTOR=    0.620285442955139, 1,           1
##FIRST=     20137.2065510759, 0,            0
##LAST=      -20513.1999529892, 0,           0
##MIN=       -20513.1999529892, -303856113,  0
##MAX=       20137.2065510759, 521025279,    0
$$ Real data points
##PAGE= N=1
##DATA TABLE= (X++(R..R)), XYDATA
$$ [...]
44983B533952m918822l311493R75193M200903M522454J810126k766443n738532
$$ 2533952 -2384870 -5696363 -4721170 -520267 4002187 5812313 3045870 -2692662
44975b692662l957983M45674K077554M18800N43260L939270N206293J335131k517849
$$ -2692662 -6650645 -6204971 -4127417 -3708617 -3165357 773913 5980206 7315337 4797488
44966D797488j685038j10470l129331p426913o229911q71680J457555l82763m59571
$$ 4797488 3112450 3001980 -127351 -7554264 -13784175 -14655855 -13198300 -13581063 -14040634
44957a4040634L554778O773104N512184K453378J168836R86130j17076j565774
$$ -14040634 -10485856 -3712752 1799432 4252810 5421646 6407776 6290700 4724926
44949D724926j515063M62344L195035M434364J930138l405380o578657m271223
$$ 4724926 3209863 3672207 6867242 11301606 13231744 9826364 3247707 -1023516
44941a023516r3522K98585k180348j985594J328788K192320j295287l743638j167509
$$ -1023516 -1117038 -818453 -2998801 -4984395 -3655607 -1463287 -2758574 -6502212 -7669721
44932g669721K773462K911590R1378j501273p89764L98996J117726J229452o8192
$$ -7669721 -4896259 -1984669 -1893291 -3394564 -4184328 -3785332 -2667606 -1438154 -1506346
44923a506346k326281k607257N97685M083286L766330L37109j943944r16350J845814
$$ -1506346 -3832627 -6439884 -5842199 -1758913 2007417 2344526 400582 -515768 1330046
44914A330046M029179M308505J739627l501587q420364q714509l274073L761978
$$ 1330046 5359225 9667730 11407357 7905770 -514594 -9229103 -12503176 -8741198
44906h741198O497517L101914k046219k813976J602878N364115L250572k322492
$$ -8741198 -2243681 858233 -1187986 -4001962 -2399084 2965031 6215603 3893111
44898C893111m520619j434018J851176R76279k192464l528131k240975J2452K313301
$$ 3893111 -627508 -2061526 -210350 765929 -1426535 -4954666 -7195641 -7183189 -4869888
44889d869888L833611K886594j49855j616910J01162P21563l699745q674400n734539
$$ -4869888 -1036277 1850317 1700462 83552 184714 906277 -2793468 -11467868 -17202407
44880a7202407M703623J1395077O238619m668949q674727k553150M697002M747122
$$ -17202407 -12498784 -1103707 5134912 465963 -8208764 -10761914 -6064912 -1317790
44872a317790o254j851323J020872L560354K511332M31347K0417m48990k948184
$$ -1317790 -1324044 -3175367 -2154495 1405859 3917191 4348538 4368955 3919965 971781
44863I71781m941035l185322M52988J926134J781311L375301N555933L811267
$$ 971781 -3969254 -7154576 -6701588 -4775454 -2994143 381158 5937091 9748358
44855I748358j111149k982971j82272J404962j347095l291320p08613R86388l419175
$$ 9748358 8637209 5654238 5471966 6876928 5529833 2238513 1529900 2516288 -902887
44846i02887q112638m199833N355596R058508L807178j698468j087009J903523
$$ -902887 -9015525 -13215358 -7859762 1198746 5005924 3307456 2220447 4123970
44838D123970K121175N14601q08172l163363o254617n405306P76164N735550L779188
$$ 4123970 6245145 6759746 5951574 2788211 -3466406 -8871712 -8095548 -2359998 1419190
44829A419190j251907k082276J321788L481744K568413J269419O23423p03711
$$ 1419190 167283 -1914993 -593205 2888539 5456952 6726371 7349794 6646083
44821F646083k202420k199325j749753k708912l159209j00855M438474N577494
$$ 6646083 4443663 2244338 494585 -2214327 -5373536 -5474391 -1035917 4541577
44813D541577L027646P70731J70032o28334j275933Q1619J185118j715682n482766
$$ 4541577 7569223 8339954 8509986 7881652 6605719 6687338 7872456 6156774 674008
44804F74008k945478M411107O080774j637806q916618p080465j138280l7359k185967
$$ 674008 -2271470 2139637 8220411 6582605 -2334013 -9414478 -10552758 -10590117 -12776084
44795a2776084m69557L873218L595952q87507j363720M318542Q191491M407952
$$ -12776084 -13245641 -9372423 -5776471 -6663978 -8027698 -3709156 4482335 8890287
44787H890287k461703m856862j983793J507765K404329J203257P6641O53715K233714
$$ 8890287 6428584 1571722 -412071 1095694 3500023 4703280 4779921 5433636 7667350
44778G667350J906960j608712n211433n309515k823959n32611K245703O779856
$$ 7667350 9574310 7965598 2754165 -2555350 -5379309 -5911920 -3666217 3113639
44770C113639Q863107L293738n849341p985505j004754M904953K082131l832060
$$ 3113639 11976746 15270484 9421143 1435638 430884 5335837 7417968 3585908
44762C585908l574490J764588L747292l00399m618283m181930m23313K499616
$$ 3585908 11418 1776006 5523298 5222899 604616 -3577314 -4000627 -1501011
44754a501011K781553J358387k06285j206236j830635j870760k35167K738246
$$ -1501011 1280542 2638929 2432644 1226408 -604227 -2474987 -2710154 28092
44746B8092L871191J206184j799040p11787K194080Q33068m134845n230780l65910
$$ 28092 3899283 5105467 3306427 2594640 4788720 5621788 1486943 -3743837 -4109747
44737d109747L171323P12282k009795J091477N863952M844678p39922l983663
$$ -4109747 -938424 -226142 -2235937 -1144460 4719492 9564170 8824248 4840585
44729D840585l399797k939270l524155k396975L47017J500215N16115j13155L16953
$$ 4840585 1440788 -1498482 -5022637 -7419612 -7072595 -5572380 -5056265 -5169420 -4852467
44720d852467K80159m91680j095133j554592j485269P43524M231098M728047J287602
$$ -4852467 -4572308 -5063988 -6159121 -7713713 -9198982 -8455458 -4224360 503687 1791289
44711A791289j128945J2717Q8206l423456m331041J551243O449130J932416o043157
$$ 1791289 662344 675061 763267 -2660189 -6991230 -5439987 1009143 2941559 -3101598
44702c101598n688382J690777M667213M44707l313606l484959l808128l050076
$$ -3101598 -8789980 -7099203 -2431990 -1987283 -5300889 -8785848 -12593976 -15644052
44694a5644052L833776J2066306J0410534L98150l813147J706534M599258j657833
$$ -15644052 -11810276 256030 10666564 11064714 7251567 8958101 13557359 11899526
44686A1899526o765003k825867J925748q34354m701353j918761J801863q62974
$$ 11899526 5134523 2308656 4234404 3400050 -1301303 -3220064 -1418201 -2281175
44678b281175m105693l10504M502301J631682l259295j13889O345750M444176
$$ -2281175 -6386868 -6697372 -2195071 -563389 -3822684 -3936573 2409177 6853353
44670F853353l327405m608081J058967K320957l463590o589392k475460K495413
$$ 6853353 3525948 -1082133 -23166 2297791 -1165799 -7755191 -10230651 -7735238
44662g735238M019942M768458M774118M97040m808314l250419L093843L303266
$$ -7735238 -3715296 1053162 5827280 6324320 1516006 -1734413 1359430 4662696
44654D662696m000429p384748j626418M093011K558675m78143J172639L133292
$$ 4662696 662267 -6722481 -8348899 -4255888 -1697213 -2175356 -1002717 2130575
44646B130575N03298k074426L12113K885976j3518m262221l543745m80342p20703
$$ 2130575 2633873 559447 871560 3757536 3744018 -518203 -4061948 -4542290 -5262993
44637e262993k227808n6252L576635L530107J408064J569625J707989k666224
$$ -5262993 -7490801 -7547053 -3970418 -440311 967753 2537378 4245367 1579143
44629A579143p616865n140160L357237P934313M475803p54738j730869J99744
$$ 1579143 -6037722 -11177882 -7820645 113668 4589471 3834733 2103864 2303608
44621B303608J331978Q58741p90182l263412m430745k086273J576643J985504
$$ 2303608 3635586 4494327 3704145 440733 -3990012 -6076285 -4499642 -2514138
44613b514138p19227j644243J119827M033836M501199M222624M272940K280578
$$ -2514138 -3233365 -4877608 -3757781 276055 4777254 8999878 13272818 15553396
44605A5553396k412301n426375l153019J397809K664943K55487j554212r13488
$$ 15553396 13141095 7714720 4561701 5959510 8624453 8879940 7325728 6412240
44597F412240o97527l072296n251207l054312K689139O009601K771439m005169
$$ 6412240 5714713 2642417 -2608790 -5663102 -2973963 3035638 5807077 1801908
44589A801908p548101n253038r53179P24170l47072j143483K42992L304359O159080
$$ 1801908 -5746193 -10999231 -11952410 -11228240 -11575312 -12718795 -12475803 -9171444 -3012364
44580c012364O317117K457442k774852m117135k50921L387023J512028l503374
$$ -3012364 3304753 5762195 2987343 -1129792 -1380713 2006310 3518338 14964
44572A4964n073409j768434J567535J604343L54325M07772J093683J248718J782561
$$ 14964 -5058445 -6826879 -5259344 -3655001 -3300676 -2892904 -1799221 -550503 1232058
44563A232058L048052K984930O05138j481334r59368K63230n97119k031063o31317
$$ 1232058 4280110 7265040 7870178 6388844 5429476 5692706 5095587 3064524 2433207
44554B433207K380093J833256l426622p598001n241203J485434N774555M461084
$$ 2433207 4813300 6646556 3219934 -4378067 -9619270 -8133836 -2359281 2101803
44546B101803L41492k693986l488914k508527j48254K433537L021147Q41980j698862
$$ 2101803 2443295 -250691 -3739605 -6248132 -6396386 -3962849 -941702 -99722 -1798584
44537a798584j503298J331547L337201J525620l002078n479202k216115M338696
$$ -1798584 -3301882 -1970335 1366866 2892486 -109592 -5588794 -7804909 -3466213
44529c466213O679307Q13198p238270p554656P16139P604614N740618p1185j280821
$$ -3466213 3213094 4026292 -3211978 -10766634 -10050495 -2445881 3294737 3223552 1942731
44520A942731J599377J906926p66526m18019L353861L081100l728981q459346
$$ 1942731 3542108 5449034 4682508 4264489 7618350 10699450 6970469 -1488877
44512a488877l995993L570148L765064k271546l850804K477548P584501L655101
$$ -1488877 -5484870 -1914722 1850342 -421204 -4272008 -1794460 5790041 9445142
44504I445142m197784n586076K81740M064326r807o114433n359866J635644N746340
$$ 9445142 5247358 -338718 -56978 4007348 3997541 -2116892 -7476758 -5841114 -94774
44495i4774K053285l877048m427340p9895K899857J853375l85894j540948k216751
$$ -94774 1958511 -1918537 -6345877 -6425772 -3525915 -1672540 -2058434 -3599382 -5816133
44486e816133k196438J5851K772290J670794l427548o440180l101143K835505
$$ -5816133 -8012571 -7996720 -5224430 -3553636 -6981184 -13421364 -16522507 -13687002
44478a3687002M744579J622760j799186j489621J956726M533506K634831k732718
$$ -13687002 -8942423 -7319663 -9118849 -10608470 -8651744 -4118238 -1483407 -4216125
44470d216125n458874j054626O302011P985993K566603k555210k458934p28151
$$ -4216125 -9674999 -10729625 -4427614 3558379 6124982 3569772 1110838 382687
44462C82687j256787j511167J082251K958479R91795q52600J356166L365075n8919
$$ 382687 -874100 -2385267 -1303016 1655463 2647258 1794658 3150824 6515899 6456980
44453F456980m800336l686164R01029J094158k571495k564159J711953L184148
$$ 6456980 1656644 -2029520 -1128491 -34333 -2605828 -5169987 -3458034 -273886
44445b73886M96182j9467K502279Q77918n770054p622317l57696N927302K442285
$$ -273886 222296 202829 2705108 3583026 -2187028 -9809345 -10167041 -4239739 -1797454
44436a797454l923773k429302L651034L300283l542597o667967k703457J122141
$$ -1797454 -5721227 -8150529 -4499495 -1199212 -4741809 -11409776 -14113233 -12991092
44428a2991092O02024J77721K522741L112566l99374k329025J668948O388974
$$ -12991092 -12389068 -12211347 -9688606 -6576040 -6975414 -9304439 -7635491 -1246517
44420a246517M883267o79752k992879q96959O01658l38157m54167J407296K206982
$$ -1246517 3636750 2956998 -35881 -932840 -331182 -669339 -1123506 283790 2490772
44411B490772J164635J717340M373924L798555k629128q588020p083238j218960
$$ 2490772 3655407 5372747 9746671 13545226 10916098 2328078 -4755160 -5974120
44403e974120L47611l259491m244606J140569O844824O520508K067346j130256
$$ -5974120 -5626509 -8886000 -13130606 -11990037 -5145213 1375295 3442641 2312385
44395B312385k017968k474519k488360j398645o02859q67637j13035K410398L480024
$$ 2312385 294417 -2180102 -4668462 -6067107 -6669966 -7537603 -7650638 -5240240 -1760216
44386a760216J356174m94526L49772L81566k783721m146811K82232M322404O06649
$$ -1760216 -404042 -898568 -548796 -167230 -2950951 -7097762 -6815530 -2493126 -1886477
44377a886477n720226l987148M045715O457086R26791k000677K398563N577181
$$ -1886477 -7606703 -11593851 -7548136 -1091050 -164259 -2164936 233627 5810808
44369E810808J955394j330213J460742L530076j616808p176781m542341J141983
$$ 5810808 7766202 6435989 7896731 11426807 9809999 2633218 -1909123 -767140
44361g67140j57789n636166m618450K824485O253433K435512q42629N93311J191259
$$ -767140 -924929 -6561095 -11179545 -8355060 -2101627 333885 -508744 84567 1275826
44352A275826k753395n869628k734419L516667O220713L552110j443118m847065
$$ 1275826 -1477569 -7347197 -10081616 -6564949 -344236 3207874 1764756 -3082309
44344c082309l769015J619541O482332N713708O97986k379233j007418J555655
$$ -3082309 -6851324 -5231783 1250549 6964257 7662243 5283010 4275592 5831247
44336E831247K495263K322986J318614j296943m041553m328541l098144k827356
$$ 5831247 8326510 10649496 11968110 10671167 6629614 2301073 -797071 -3624427
44328c624427j713012L144311P524617M162882m205038o292739L56869M492877
$$ -3624427 -5337439 -2193128 5331489 9494371 5289333 -1003406 -646537 3846340
44320C846340r39182o993865l262196N222290O528296N32521k982090r38901O07381
$$ 3846340 2907158 -4086707 -7348903 -2126613 4401683 4934204 1952114 1013213 1620594
44311A620594q24398r18587J157917J95311m702257o782117k568128K035086J300090
$$ 1620594 796196 -122391 1035526 1230837 -3471420 -10253537 -12821665 -10786579 -9486489
44302i486489j484128j93066M334564O426997M109272M06641j675919j417559
$$ -9486489 -10970617 -11163683 -6829119 -402122 3707150 4113791 2437872 1020313
44294A020313N80635K441921J923602l36507j018102K68775o65132n342922q014400
$$ 1020313 1600948 4042869 5966471 5629964 4611862 4880637 4215505 -1127417 -9141817
44285i141817l435443M161302O294354K424371j60931J868959L719835J515174
$$ -9141817 -12577260 -8415958 -2121604 302767 141836 2010795 5730630 7245804
44277G245804j575296j531791o2403o73239k385510k010226J37087J175513M76565
$$ 7245804 5670508 4138717 4076314 3403075 1017565 -992661 -855574 319939 796504
44268G96504k44543l14152m22239q06280j601340l227724m234208j687410L284180
$$ 796504 551961 237809 -184430 -990710 -2592050 -5819774 -10053982 -11741392 -8457212
44259h457212M174242j848666p213478l117696O803494J0217012L372503m097855
$$ -8457212 -4282970 -6131636 -13345114 -16462810 -9659316 557696 3930199 -167656
44251a67656l820278L41093M89927l180974m800991k607573L50059K505313M540002
$$ -167656 -3987934 -3646841 -3156914 -6337888 -11138879 -13746452 -13396393 -10891080 -6351078
44242f351078N345214K914119j097423k475017l01808K092066K151006O47939
$$ -6351078 -1005864 1908255 810832 -1664185 -1965993 126073 2277079 2925018
44234B925018r29949k234419k685207j144368J847113L418514J283457l321823
$$ 2925018 1995069 -239350 -2924557 -4068925 -2221812 1196702 2480159 -841664
44226h41664o285024m478345O47375L967833K523728m96418k06851K544212K582874
$$ -841664 -7126688 -11605033 -10957658 -6989825 -4466097 -4962515 -5169366 -2625154 -42280
44217d2280p39388j939851J430928M212268J978216j821719k150989n88330j045760
$$ -42280 -781668 -2721519 -1290591 2921677 4899893 3078174 927185 338855 -706905
44208g06905j882254L84364L098311J381174k362011j480672L563293N663030
$$ -706905 -2589159 -2204795 893516 2274690 -87321 -1567993 1995300 7658330
44200G658330K783988L74130J110511J061770j710242l121830r78242O18081j256000
$$ 7658330 10442318 10816448 11926959 12988729 11278487 8156657 7178415 7796496 6540496
44191F540496l132900j706033L68596l02615k102960k311236j940036k335326
$$ 6540496 3407596 1701563 2070159 1767544 -335416 -2646652 -4586688 -6922014
44183f922014j500653J778429M303731L222887N58377q25503j594642k537994
$$ -6922014 -8422667 -6644238 -2340507 882380 1440757 615254 -979388 -3517382
44175c517382j551122J650010K729195m10033k920951p70037J861943l29663l955210
$$ -3517382 -5068504 -3418494 -689299 -1099332 -4020283 -4790320 -2928377 -3258040 -7213250
44166g213250k289890K987733M323456P14182j447887M09503J874994O95389O54552
$$ -7213250 -9503140 -6515407 -2191951 -1477769 -2925656 -2516153 -641159 54230 708782
44157G08782L662618N224413J603482m010118o438580n479530m226172l584143
$$ 708782 4371400 9595813 11199295 7189177 750597 -4728933 -8955105 -12539248
44149a2539248k047181R19557M042006N776813N185111K387885r28266k585111
$$ -12539248 -14586429 -13666872 -9624866 -3848053 1337058 3724943 2796677 211566
44141B11566j993733k68589J401316K299192J936473P57629l3911p12591k963811
$$ 211566 -1782167 -2050756 -649440 1649752 3586225 4343854 4309943 3597352 633541
44132F33541n765860m739741J008410N225488K904299j156655P78914O414584
$$ 633541 -5132319 -9872060 -8863650 -3638162 -733863 -1890518 -1111604 5302980
44124E302980O081358j951885q195671n984120k3164K666804K271532J781659
$$ 5302980 11384338 9432453 1236782 -4747338 -4770502 -2103698 167834 1949493
44116A949493L35043k852550l714695O84374N684215N240483J175072m77132N07055
$$ 1949493 2284536 -568014 -4282709 -3598335 2085880 7326363 8501435 8024303 8531358
44107H531358n42889l828655m200848n2302L439192J792398k755722m794748k312522
$$ 8531358 7988469 4159814 -41034 -93336 3345856 5138254 2382532 -2412216 -4724738
44098d724738J787375L048504M1360l417275k058124L424914N810067J140890
$$ -4724738 -2937363 111141 152501 -3264774 -5322898 -1897984 3912083 5052973
44090E052973m674572l988114J275420L201384N02691p47635J363429J436618
$$ 5052973 378401 -3609713 -2334293 867091 1369782 622147 1985576 3422194
44082C422194k793747n516253k428514K160964K933397J767478K390099K646919
$$ 3422194 628447 -4887806 -7316320 -5155356 -2221959 -454481 1935618 4582537
44074D582537o38253l605097m94708N694269O229814k76469n825963m884707r82584
$$ 4582537 3944284 339187 -155521 5538748 11768562 11492093 5666130 781423 -201161
44065b01161M97381l22129o56843j49130K19089N61420O75813n83054k391298
$$ -201161 296220 -25909 -682752 -831882 -612793 -51373 624440 41386 -2349912
44056b349912j882749R18815J906731q29553l434383k142383J051060K340772
$$ -2349912 -4232661 -3313846 -1407115 -2236668 -5671051 -7813434 -6762374 -4421602
44048d421602K220708L103315L780450J587127j801320k399924r29465k031058
$$ -4421602 -2200894 902421 4682871 6269998 4468678 2068754 1139289 -891769
44040h91769o074589p381799k577349L845340N293347J501537j904110q80602
$$ -891769 -6966358 -14348157 -16925506 -13080166 -7786819 -6285282 -8189392 -9069994
44032i069994K615903L667874M51444l434494k987422K028779O252015M845066
$$ -9069994 -6454091 -2786217 -2334773 -5769267 -8756689 -6727910 -475895 4369171
44024D369171r85063n834387n975017j966970K789998M373485J277907k983783
$$ 4369171 3384108 -2450279 -8425296 -10392266 -7602268 -3228783 -1950876 -4934659
44016d934659k759397J989806M352861L08243m415387k769719K384268L015996
$$ -4934659 -7694056 -5704250 -1351389 -1043146 -5458533 -8228252 -5843984 -2827988
44008b827988r68605k496649l1743P25792j354740k29240N026707O262193Q2583
$$ -2827988 -3796593 -6293242 -6324985 -5599193 -6953933 -7183173 -2156466 4105727 4188310
43999D188310m654330q87438M259886J030938o304131o121916J550083N150124
$$ 4188310 -466020 -1353458 2906428 3937366 -2366765 -8488681 -6938598 -1788474
43991a788474l07111o716570n994123j63199M403658N226664L183504k28591k336849
$$ -1788474 -2095585 -8812155 -14806278 -14969477 -10565819 -5339155 -2155651 -2384242 -4721091
43982d721091q29477K234390K364555m58676j808158m13460J93443j080371o36520
$$ -4721091 -5550568 -3316178 -951623 -1410299 -3218457 -3631917 -3438474 -4518845 -5155365
43973e155365K319627K816732j318852m182428n85741M922202M495019r20627
$$ -5155365 -2835738 -19006 -1337858 -5520286 -6106027 -1183825 3311194 2390567
43965B390567l286962J3100K731358r9832m882788n333699j287664K266264K554587
$$ 2390567 -896395 -883295 1848063 1748231 -3134557 -8468256 -9755920 -7489656 -4935069
43956d935069J410518J027591J073427P95933R54136J847358J633321r63866l737227
$$ -4935069 -3524551 -2496960 -1423533 -627600 326536 2173894 3807215 2843349 -893878
43947h93878l563924r42632J088987J814964K844813L592402J554453k087363
$$ -893878 -4457802 -5400434 -4311447 -2496483 348330 3940732 5495185 3407822
43939C407822k533147P95944K043510j869978n238646j966119M581254O501522
$$ 3407822 874675 1670619 3714129 1844151 -3394495 -5360614 -779360 5722162
43931E722162K863893o54200j524850k466794m521875n049461l055439n17774
$$ 5722162 8586055 7931855 6407005 3940211 -581664 -5631125 -8686564 -9204338
43923i204338J998174N363570P413184M642848r78344l229036q73072O83323j308606
$$ -9204338 -7206164 -1842594 5570590 10213438 9235094 6006058 5132986 5816309 4507703
43914D507703k599823J71328L355237K175709j857946l693733j802739R70427
$$ 4507703 1907880 2079208 5434445 7610154 5752208 2058475 255736 1226163
43906A226163J376444j699877o382783q076952l395077M943886R958937P948921
$$ 1226163 2602607 902730 -5480053 -13557005 -16952082 -12008196 -2049259 5899662
43898E899662J456673m874269p533394m283405L262696P587232K572860o638228
$$ 5899662 7356335 2482066 -5051328 -9334733 -6072037 1515195 4088055 -2550173
43890b550173q570468j390830M556995K671952r40277P75188M338697L233052
$$ -2550173 -11120641 -12511471 -7954476 -5282524 -6222801 -5447613 -1108916 2124136
43882B124136o30820j378542L86670Q4351j900499j828595j29153J38517k72075
$$ 2124136 1493316 114774 501444 585795 -1314704 -3143299 -3272452 -3133935 -3406010
43873c406010J061096K148517k92557l836581l507238r3520J606929J125380J770176
$$ -3406010 -2344914 -196397 -488954 -4325535 -7832773 -7926293 -6319364 -5193984 -3423808
43864c423808L134272J642180j949932k915124o46616L90924j552905l031681
$$ -3423808 -289536 1352644 -597288 -3512412 -4159028 -3768104 -5321009 -8352690
43856h352690j655630P36841K056119K212926J081160j008006j098320K738401
$$ -8352690 -10008320 -9271479 -7215360 -5002434 -3921274 -4929280 -6027600 -3289199
43848c289199O199167L414957l385537n814484j566597K626394J993505J27744
$$ -3289199 2909968 6324925 2939388 -2875096 -4441693 -1815299 178206 305950
43840C05950J146275K476890L68005k820533k495250N12674J637817m3117j048961
$$ 305950 1452225 3929115 4297120 1476587 -1018663 -505989 1131828 1088711 39750
43831C9750N38382K396330J764337p34740k144629r60895R95646O17322k771046
$$ 39750 578132 2974462 4738799 4004059 1859430 898535 1894181 2511503 -259543
43822b59543o348413o646753k670565L719150Q836174Q692709K527986m430628
$$ -259543 -6607956 -13254709 -15925274 -12206124 -3369950 5322759 7850745 3420117
43814C420117n467879j061309J444961j138419l153846k94337K434735l67143
$$ 3420117 -2047762 -3109071 -1664110 -2802529 -5956375 -6250712 -3815977 -4183120
43806d183120l974234j126550M620738M097454j652348k770302K625593N443072
$$ -4183120 -8157354 -9283904 -4663166 -565712 -2218060 -4988362 -2362769 3080303
43798C080303J294861k804088j281366J487963P81366l89790Q93809O26113l830814
$$ 3080303 4375164 1571076 289710 1777673 2559039 2169249 3063058 3689171 -141643
43789a41643o545606k204410M035315M290026K68590o78927K261175L653232J565631
$$ -141643 -6687249 -8891659 -4856344 -566318 -297728 -976655 1284520 4937752 6503383
43780F503383q48633j835262k274105j851076L9264J159009l85039j897288l66093
$$ 6503383 5654750 3819488 1545383 -305693 -266429 892580 507541 -1389747 -1755840
43771a755840J706080O00898j479257l57220J830054J44190l356920k103797L352773
$$ -1755840 -49760 551138 -928119 -1285339 544715 688905 -2668015 -4771812 -1419039
43762a419039N312614J329946k347683j781609r09384k600948k619634K148818
$$ -1419039 3893575 5223521 2875838 1094229 184845 -2416103 -5035737 -2886919
43754b886919O574076M975059M75616n19192Q54738j421947o890013q234087k699662
$$ -2886919 3687157 8662216 9137832 8618640 9473378 8051431 1161418 -7072669 -9772331
43745i772331L467464M188248J104164j233183k472099m095306l862628J165116
$$ -9772331 -6304867 -2116619 -1012455 -2245638 -4717737 -8813043 -12675671 -11510555
43737a1510555P518938P837023J467872l483417j543052K151451J50557n268772
$$ -11510555 -3991617 3845406 5313278 1829861 286809 2438260 2588817 -2679955
43729b679955n420900J078251N866291L428658j255841j372728J557561J731942
$$ -2679955 -8100855 -7022604 -1156313 2272345 1016504 -356224 1201337 2933279
43721B933279r64135j728434L42942R40793j780252m116255l007629n01716M48829
$$ 2933279 1969144 240710 583652 1524445 -255807 -4372062 -7379691 -7881407 -7432578
43712g432578Q37302L004128N689526N326474J377090k761043m219258l423290
$$ -7432578 -6595276 -3591148 2098378 7424852 8801942 6040899 1821641 -1601649
43704a601649j803632P58390M418579O909240N271933J09442m154862m206244
$$ -1601649 -3405281 -2646891 1771688 8680928 13952861 14062303 9907441 5701197
43696E701197j429471M88769N9248j290913j744275p91371O47907O44144j774992
$$ 5701197 4271726 4760495 4819743 3528830 1784555 993184 1641091 2285235 510243
43687E10243m026597j903200L896341O551302K155124l410690k258178L450001
$$ 510243 -3516354 -5419554 -1523213 5028089 7183213 3772523 1514345 4964346
43679D964346M685734k03094l373723j025531N54971l105509n780789j011750
$$ 4964346 9650080 9446986 6073263 5047732 5602703 2497194 -3283595 -4295345
43671d295345N577924M081936l571879n742448J440143Q529956O713252q47070
$$ -4295345 1282579 5364515 1792636 -3949812 -2509669 6020287 12733539 11886469
43663A1886469n440595m500914j994724q76274k83888Q85486J608776O27411j215053
$$ 11886469 6445874 1944960 -49764 -926038 -1209926 -324440 1284336 1911747 696694
43654F96694j561874N84503K879407J549772l737293p955296n726616J876668
$$ 696694 -865180 -280677 2598730 4148502 411209 -7544087 -13270703 -11394035
43646a1394035P743985O672312J103006k399357j140924J287988O58879k040012
$$ -11394035 -3650050 3022262 4125268 1725911 584987 1872975 2531854 491842
43638D91842k373415Q23514L541375K337410j023912k973837l447379m185024
$$ 491842 -1881573 -1058059 2483316 4820726 3796814 822977 -2624402 -6809426
43630f809426l891411m0581N268426O676117L308206j2583m13213n43621k588354
$$ -6809426 -10700837 -10741418 -5472992 1203125 4511331 4498748 4085535 3541914 953560
43621I53560l945265j882419J755387L543706K682553j7733l442844m632511q02787
$$ 953560 -2991705 -4874124 -3118737 424969 3107522 3089789 -353055 -4985566 -5788353
43612e788353M849703M945248j570233o782654n207321j024861O67514K176460
$$ -5788353 -938650 4006598 2436365 -4346289 -9553610 -10578471 -9910957 -7734497
43604g734497O088694P297832J185273o081664n610470R1136J672860j517781
$$ -7734497 -1645803 5652029 6837302 755638 -4854832 -4763696 -3090836 -4608617
43596d608617j865493K098366L625746O50695o92284K178645L370328r59546n896853
$$ -4608617 -6474110 -4375744 -749998 -99303 -791587 1387058 4757386 3797840 -2099013
43587b099013n749145j644909K382442M527892L602767j220332o273332n431840
$$ -2099013 -7848158 -9493067 -7110625 -2582733 1020034 -200298 -6473630 -11905470
43579a1905470R55286N480130M429841K227146K396001J726569k364353n702865
$$ -11905470 -10950184 -5470054 -1040213 1186933 3582934 5309503 2945150 -2757715
43571b757715l858196O89144K789930J605231n40017j960279j301821J836895
$$ -2757715 -6615911 -5926767 -3136837 -1531606 -2071623 -4031902 -5333723 -3496828
43563c496828L857672N79035m561866l368111L570846N606054j255163o730297
$$ -3496828 360844 939879 -3621987 -6990098 -3419252 2186802 931639 -5798658
43555e798658k481930M180907K747811l001006k233062M195095N672220k90176
$$ -5798658 -8280588 -4099681 -1351870 -4352876 -6585938 -2390843 3281377 2991201
43547B991201n036476l287570P65114K713782L091393J990134j975079n622137
$$ 2991201 -2045275 -5332845 -4567731 -1853949 1237444 3227578 1252499 -4369638
43539d369638l218246L266806M807499q90059n056994j450491M040375L157969
$$ -4369638 -7587884 -4321078 486421 -403638 -5460632 -6911123 -2870748 287221
43531B87221k159632l963823n43595K621792J989418j87135p72520J32092O78522
$$ 287221 -1872411 -5836234 -6379829 -3758037 -1768619 -1955754 -2728274 -2596182 -1917660
43522a917660R7782p73555p06308L21183P43912m63759j675683n27269K258053
$$ -1917660 -1819878 -2593433 -3299741 -2978558 -2234646 -2698405 -4374088 -4901357 -2643304
43513b643304L457888J920123k41641j390733k130922k540663j213028J307436
$$ -2643304 814584 2734707 2493066 1102333 -1028589 -3569252 -4782280 -3474844
43505c474844J662451j147439k769141P83935O411282P094524J369089m418853
$$ -3474844 -1812393 -2959832 -5728973 -4945038 1466244 8560768 9929857 5511004
43497E511004m445593o06454J160329n47987j632272K36318K010643J017983n6732
$$ 5511004 1065411 458957 1619286 1071299 -560973 -324655 1685988 2703971 2647239
43488B647239J618368K262341l224485j0646241r914235n89767N426799J464426
$$ 2647239 4265607 6527948 3303463 -7342778 -17257013 -17846780 -12419981 -10955555
43480a0955555l019545K519825J1580777R526250l380008j1418743o242225K656272
$$ -10955555 -13975100 -11455275 125502 9651752 6271744 -5146999 -11389224 -8732952
43472h732952L957928m47754k741769k131292k190357j710932K593525P570997
$$ -8732952 -4775024 -5222778 -7964547 -10095839 -12286196 -13997128 -11403603 -3832606
43464c832606O499728k75316m826957k647067J559855J199074l049064m530464
$$ -3832606 2667122 2391806 -2435151 -5082218 -3522363 -2323289 -5372353 -9902817
43456i902817J89989O317986O525504O29075l696470j468276K242381J30130n289135
$$ -9902817 -9712828 -3394842 3130662 3759737 63267 -1405009 837372 967502 -4321633
43447d321633n001086J821443N625138J397824l467568j531678K812694J646215
$$ -4321633 -9322719 -7501276 -1876138 -478314 -3945882 -5477560 -2664866 -1018651
43439a018651k771070k228122L309066N851644K355563j842131k817818k690796
$$ -1018651 -3789721 -6017843 -2708777 3142867 5498430 3656299 838481 -1852315
43431a852315l071843j769529J496721K875737Q18306j007495n0983J227678O31527
$$ -1852315 -4924158 -6693687 -5196966 -2321229 -1502923 -2510418 -2561401 -1333723 -702196
43422g02196N7657P63833O45l577001n740659k583907L082995N874824N159536
$$ -702196 -644539 119294 119939 -3457062 -9197721 -11781628 -8698633 -2823809 2335727
43413B335727L523432J024896l410170o962435n412585r9700L180561K428764
$$ 2335727 5859159 6884055 3473885 -3488550 -8901135 -9000835 -5820274 -3391510
43405c391510J390632K502210L141255R35999j770913j887551o51023j111412
$$ -3391510 -2000878 501332 3642587 4578586 2807673 920122 269099 -842313
43397h42313k693226k238868K61031R63412j812911m030513r31082N805244R003321
$$ -842313 -3535539 -5774407 -5513376 -4549964 -6362875 -10393388 -11324470 -5519226 3484095
43388C484095M698671k628196n451168k195087J951893K534927O07347p58054
$$ 3484095 8182766 5554570 103402 -2091685 -139792 2395135 3002482 2244428
43380B244428j135965j575291j435478L81857K435406K189061L7741q08374J425352
$$ 2244428 1108463 -466828 -1902306 -1520449 914957 3104018 3141759 2333385 3758737
43371C758737M837697N857675K369790m215108q837928o758356K46597M176639
$$ 3758737 8596434 14454109 16823899 12608791 3770863 -2987493 -2740896 1435743
43363A435743O05963m508609k725499M365275P263186K667826k408259k390720
$$ 1435743 2041706 -2466903 -5192402 -827127 6436059 9103885 6695626 4304906
43355D304906r05368k529835m068826o54876M655592N000429L60528l360165l989278
$$ 4304906 3399538 869703 -3199123 -3853999 801593 5802022 6162550 2802385 -1186893
43346a186893m246185m137214l21877N878112P577429K322112l422701l498356
$$ -1186893 -5433078 -9570292 -9892169 -4014057 3563372 5885484 2462783 -1035573
43338a035573l97642j0812k442200l253130j036983J466678K448099K607150K209044
$$ -1035573 -1433215 -1444027 -3886227 -7139357 -8176340 -6709662 -4261563 -1654413 554631
43329E54631O22673j138600r62510P17973Q51792j670499l852010k431531J704456
$$ 554631 1177304 38704 -923806 -205833 645959 -1024540 -4876550 -7308081 -5603625
43320e603625M508636L534369M75190j196949m69095J74017j593726m148566l598108
$$ -5603625 -1094989 2439380 2914570 1717621 1248526 1422543 -171183 -4319749 -7917857
43311g917857O23878M187532L293588l68082k407168j980285j997936l440369
$$ -7917857 -7293979 -3106447 187141 -180941 -2588109 -4568394 -6566330 -10006699
43303a0006699l314056J51307L478430K380956j278562j058545M804731R496920
$$ -10006699 -13320755 -13169448 -9691018 -7310062 -8588624 -9647169 -4842438 4654482
43295D654482N949419l116088p754888l472230L084795L307798k123100n186096
$$ 4654482 10603901 7487813 -267075 -3739305 -654510 2653288 530188 -4655908
43287d655908j870845L230267M043737N66240k527238k055762J033502L664243
$$ -4655908 -6526753 -3296486 747251 1313491 -1213747 -3269509 -2236007 1428236
43279A428236L569777J074044j205641j255971k70556p67681k336854j961888
$$ 1428236 4998013 6072057 4866416 3610445 3339889 2572208 235354 -1726534
43271a726534Q54134K427392J3236m062740n497341l163761P76391L851856M380297
$$ -1726534 -872400 1554992 1568228 -2494512 -7991853 -11155614 -10379223 -6527367 -2147070
43262b147070J831921j540722j674959J944798M166721Q29807m511763m901468
$$ -2147070 -315149 -1855871 -3530830 -1586032 2580689 3410496 -1101267 -6002735
43254f002735J06347L840708K138700j343920j363267J354959K039020p32168
$$ -6002735 -5896388 -2055680 83020 -1260900 -2624167 -1269208 769812 37644
43246C7644l089537j483527K169976K683058j401280n117767l307186J817100
$$ 37644 -3051893 -4535420 -2365444 317614 -1083666 -6201433 -9508619 -7691519
43238g691519L156423q68009l425397M47322N768555N070781m9010k005683M11922
$$ -7691519 -4535096 -5403105 -8828502 -8381180 -2612625 2458156 2409146 403463 815385
43229H15385J246342j173886j181608L361700N999455K286836k246753j261482
$$ 815385 2061727 887841 -293767 3067933 9067388 11354224 9107471 7845989
43221G845989J651410n72552n879361o141215n84591L062044Q13100k651713k723262
$$ 7845989 9497399 8924847 3045486 -3095729 -3680320 -618276 194824 -2456889 -5180151
43212e180151r57915l1658P78257K045295J793589k70262j240931m91185j142587
$$ -5180151 -6138066 -6169724 -5391467 -3346172 -1552583 -1822845 -3063776 -3554961 -4697548
43203d697548l059330q88619O301407J0128567M378640m286713n414431k17767
$$ -4697548 -7756878 -8645497 -2344090 7784477 12163117 7876404 2461973 2244206
43195B244206J740434j348882j879770K615019M666125r5343n116933l484542
$$ 2244206 3984640 2635758 755988 3371007 8037132 7941789 2824856 -659686
43187f59686J730957L806087K482226J248678j4244k789008m637062k985932o50293
$$ -659686 1071271 4877358 7359584 8608262 8594018 5805010 1167948 -1817984 -2468277
43178b468277j046568j525220J469022M216450J071348m661248m609674R93399
$$ -2468277 -3514845 -5040065 -3571043 645407 1716755 -2944493 -7554167 -6560768
43170f560768L379884m66216l481786p19745L499398M188763K814252J423065
$$ -6560768 -3180884 -3647100 -7128886 -7848631 -4349233 -160470 2653782 4076847
43162D076847k015792o813580o014064L043074J1068032Q156458j841877o980331
$$ 4076847 2061055 -4752525 -10766589 -7723515 3344517 11500975 9659098 2678767
43154B678767l935442J19957O79970J202199M206810N828114K699451k014437
$$ 2678767 -1256675 -1136718 -456748 745451 4952261 10780375 13479826 11465389
43146A1465389l563860k383546j969248k732365j873126J512316M214289K524867
$$ 11465389 7901529 5517983 3548735 816370 -1056756 455560 4669849 7194716
43138G194716k946141o997437n125841J007543M933926K895607j850987l561026
$$ 7194716 4248575 -2748862 -7874703 -6867160 -1933234 962373 -888614 -4449640
43130d449640p57918L490183N935109N125087Q99332m696462p124839l639043
$$ -4449640 -5207558 -1717375 4217734 9342821 10242153 5545691 -1579148 -5218191
43122e218191K383767M629314J467724k550131l053782o97370J273584J660402
$$ -5218191 -2834424 1794890 3262614 712483 -2341299 -3038669 -1765085 -104683
43114a04683J703684K151807J854079l92615l467575m607215k894227o13434L46783
$$ -104683 1599001 3750808 5604887 5212272 1744697 -2862518 -5756745 -6370179 -6023396
43105f023396J623615M912291P101256L854838k366199m117042j30234K105372
$$ -6023396 -4399781 512510 7613766 11468604 9102405 4985363 4855129 6960501
43097F960501j975994o555860m608320J462728M606704L636392K057975M44865
$$ 6960501 4984507 -1571353 -6179673 -4716945 -110241 3526151 5584126 6028991
43089F028991k516204m320846j631387K950058M148006K244772J272945J270513
$$ 6028991 3512787 -808059 -2439446 510612 4658618 6903390 8176335 9446848
43081I446848k65780j560408N01036K620206n69146n857394n217003M17597K095559
$$ 9446848 9181068 7620660 8121696 10741902 10172756 4315362 -901641 -484044 1611515
43072A611515j844803l200710J065090L391712l50675l174732J71504L358394
$$ 1611515 -233288 -3433998 -2368908 1022804 672129 -2502603 -2331099 1027295
43064A027295j85310n033295k536683M669783O874586K001200k932571k924402
$$ 1027295 841985 -4191310 -6727993 -2058210 4816376 6817576 3885005 960603
43056I60603m562J895739J417061m20325j501902q43683o85366l103174m541546
$$ 960603 956041 2851780 4268841 3848516 2346614 1502931 817565 -2285609 -6827155
43047f827155q2396O177341M268187n173065q526457O11556J0062641P140233
$$ -6827155 -6909551 -732210 3535977 -1637088 -10163545 -9551989 510652 7650885
43039G650885k170822m067436J412769L565465O4648k073949j411467l087401
$$ 7650885 5480063 1412627 2825396 6390861 6455509 4381560 2970093 -117308
43031a17308n924879k991834M201376N857061L40165k697892J099490L873104
$$ -117308 -6042187 -9034021 -4832645 1024416 1364581 -1333311 -233821 3639283
43023C639283M2540m156433k062077K611206L486231J641968R20047L05376j984309
$$ 3639283 3681823 -474610 -2536687 74519 3560750 5202718 6122765 6428141 4443832
43014D443832k933466p2499K762256J290961k156346l123281k062393j419733
$$ 4443832 1510366 1437867 4200123 5491084 3334738 211457 -1850936 -3270669
43006c270669k15931K748177M382353J753100k489405m355978m523030m994535
$$ -3270669 -3486600 -738423 3643930 5397030 2907625 -1448353 -5971383 -10965918
42998a0965918l869606P10084N059576M625189J193738m81133k28459n75846n45282
$$ -10965918 -14835524 -14125440 -9065864 -4440675 -3246937 -3728070 -3956529 -4532375 -5077657
42989e077657J820886L562177R89356k381263k92711N070009N181023j329812
$$ -5077657 -3256771 305406 1294762 -1086501 -1379212 3690797 8871820 7542008
42981G542008o194351m246259r2799J056080J223517L645339N640969L409409
$$ 7542008 1347657 -2898602 -2991401 -1935321 -711804 2933535 8574504 11983913
42973A1983913p61947j992929l33796N56460j73624n48715m09798j252891k522239
$$ 11983913 11221966 9229037 8895241 9451701 9278077 8729362 8319564 7066673 4544434
42964D544434k423179j597819j879720k169289J44978M082862N863477M784296
$$ 4544434 2121255 523436 -1356284 -3525573 -3380595 702267 6565744 11350040
42956A1350040L616401K730334p58781o270575p842141k580406L574250L374067
$$ 11350040 14966441 17696775 16937994 10667419 2825278 244872 3819122 7193189
42948G193189j717574m399142k192547P10785J319860J290983J889389J407523
$$ 7193189 5475615 1076473 -1116074 -405289 914571 2205554 4094943 5502466
42940E502466n41244j261147J62094Q88558k42282j03421K651606L826578L69953
$$ 5502466 4961222 3700075 3862169 4750727 4508445 4405024 7056630 10883208 11253161
42931A1253161l723193l620092j738149l114376n959018m550507L76667K635325
$$ 11253161 7529968 3909876 2171727 -942649 -6901667 -11452174 -11075507 -8440182
42923h440182J444953K166825N145669L682190l313661o342554N88219Q958340
$$ -8440182 -6995229 -4828404 317265 3999455 685794 -5656760 -5068541 3889799
42915C889799P388953j412018n183031m95542L773740J222268l688697m677571
$$ 3889799 11278752 9866734 4683703 4188161 7961901 9184169 5495472 817901
42907H17901k810412j938528j087096K584863O680070N677749n95081n763791
$$ 817901 -1992511 -3931039 -5018135 -2433272 4246798 9924547 9329466 3565675
42899C565675n089299j000055J390620J361236K108764M536813N394731K590682
$$ 3565675 -1523624 -2523679 -1133059 228177 2336941 6873754 12268485 14859167
42891A4859167r62171j437520K28675K96578j566248k495691k430823m426895
$$ 14859167 13896996 12459476 12688151 12984729 11418481 8922790 6491967 2065072
42883B065072p715216o390253J519681Q824823P980891J254807l423803l550458
$$ 2065072 -5650144 -12040397 -10520716 -1695893 6284998 7539805 4116002 565544
42875E65544k629716k095114j00905K367743J812214o76998K4171L894047M563096
$$ 565544 -2064172 -4159286 -4260191 -1892448 -80234 -757232 -733061 3160986 7724082
42866G724082j17589l802988j961549P37092j088068m027571j937061L342418
$$ 7724082 7606493 3803505 1841956 2579048 1490980 -2536591 -4473652 -1131234
42858a131234N134981K563326J86815p52798k693840m653691l036371O60627J198334
$$ -1131234 4003747 6567073 6753888 6001090 3307250 -1346441 -4382812 -3722185 -2523851
42849b523851q05242O88123N460784N211816k693720q665756m367716M586272
$$ -2523851 -3329093 -2640970 2819814 8031630 5337910 -3327846 -7695562 -3109290
42841c109290P093473K264541j742708r75703R91375J414003J675564J960835
$$ -3109290 3984183 6248724 4506016 3530313 4521688 5935691 7611255 9572090
42833I572090j26159m165612n820715k829542K065099N030863M417164M85574
$$ 9572090 9445931 5280319 -540396 -3369938 -1304839 3726024 8143188 8628762
42825H628762l958562l733315K532779P422888K793875p402797j0598783l316948
$$ 8628762 4670200 936885 3469664 10892552 13686427 6283630 -4315153 -7632101
42817g632101L784028K287038k016718k69509M602598L785723k023604m014277
$$ -7632101 -3848073 -1561035 -3577753 -3847262 755336 4541059 2517455 -1496822
42809a496822j2781K770338L51040k303480q41984J447077N01418j160035N90951
$$ -1496822 -1509603 1260735 1611775 -691705 -1533689 -86612 414806 -745229 -154278
42800a54278L646383K725877j976188m705567k265458K210080M228188L304517
$$ -154278 3492105 6217982 4241794 -463773 -2729231 -519151 3709037 7013554
42792G013554J953673J524232R81836p38855k625855k448484L84465L326775K921186
$$ 7013554 8967227 10491459 11473295 10734440 8108585 5660101 6044566 9371341 12292527
42783A2292527r83183m049305j969892L712311O244973J709162n143810o185320
$$ 12292527 11309344 7260039 5290147 9002458 15247431 16956593 11812783 5627463
42775E627463p08379L286578K80590m791170l858110K429980O088822L537560
$$ 5627463 4919084 8205662 8486252 3695082 -163028 2266952 8355774 11893334
42767A1893334n96167j691071p51985k43329k04638p60564k963288m713595j725560
$$ 11893334 11297167 9606096 8854111 8610782 8406144 7645580 4682292 -31303 -1756863
42758a756863M464326N910253j57514n757749l664449J935199L170371Q49572
$$ -1756863 2707463 8617716 8460202 2702453 -961996 973203 4143574 4993146
42750D993146N80271J507366j059408m926559l591199J745021L251806l94831
$$ 4993146 5573417 7080783 6021375 1094816 -2496383 -751362 2500444 2105613
42742B105613k227373O23848K947293J909428J373058K644723J028122l917195
$$ 2105613 -121760 502088 3449381 5358809 6731867 9376590 10404712 6487517
42734F487517m638524J718255O152255J346758n548581l449448M960276O964617
$$ 6487517 1848993 3567248 9719503 11066261 5517680 2068232 7028508 13993125
42726A3993125j152202r309392q476160j594560K945686K326850O9937m25884
$$ 13993125 12840923 3531531 -4944629 -6539189 -3593503 -1266653 -1196716 -1622600
42718a622600P28961J871933K448273K972708L223432J972747p25940k501668
$$ -1622600 -893639 978294 3426567 6399275 9622707 11595454 10869514 8367846
42710H367846j737082k05443j43797n44653J10840k69106l538693n442306p73372
$$ 8367846 6630764 6425321 6281524 5736871 5847711 5578605 2039912 -3402394 -4175766
42701d175766O521627P024940L50634l482793L89921M652305K625828j693160
$$ -4175766 2345861 9370801 9721435 6238642 6628563 11280868 13906696 12213536
42693A2213536k458149j616329k400157j803545K025592L029421k555969o904575
$$ 12213536 9755387 8139058 5738901 3935356 5960948 8990369 6434400 -470175
42685d70175k388889M363808K654896m016520m036214K172300L683585j013077
$$ -470175 -2859064 1504744 4159640 143120 -3893094 -1720794 1962791 949714
42677I49714k053265K783767L531907l404169p546531j916216N140575M060188
$$ 949714 -1103551 1680216 5212123 1807954 -5738577 -7654793 -2514218 1545970
42669A545970j378215k831270j120074j283486j753184J218154M301188K458158
$$ 1545970 167755 -2663515 -3783589 -5067075 -6820259 -5602105 -1300917 1157241
42661A157241q81393J126939O725239Q116120L939047J3550j216769k880820n215246
$$ 1157241 275848 1402787 8128026 16244146 20183193 20196743 18979974 16099154 10883908
42652A0883908l886955J162947L096975j757249p158296n142792K625494O854882
$$ 10883908 6996953 8159900 11256875 9499626 2341330 -2801462 -175968 6678914
42644F678914K912792l428434l905645J517556N149148K391870k085335j685416
$$ 6678914 9591706 6163272 2257627 3775183 8924331 11316201 9230866 7545450
42636G545450K071307K251455k113975m267216o30164L521268K934222P01588
$$ 7545450 9616757 11868212 9754237 5487021 4856857 8378125 11312347 12013935
42628A2013935K043164M427002J136611p213515j1791168o837774L246167R504399
$$ 12013935 14057099 18484101 19620712 12407197 616029 -6221745 -2975578 6528821
42620F528821P750173J146972m068318m268871j024567J410312J098865j56894
$$ 6528821 14278994 15425966 11357648 7088777 6064210 7474522 8573387 8416493
42612H416493k87077N98079J844013L267165L373564J75003m444866n319197j576674
$$ 8416493 8129416 8727495 10571508 13838673 17212237 17387240 12942374 7623177 6046503
42603F046503Q19423k221179o115109m365691J714355N658012N174788K956577
$$ 6046503 6865926 4644747 -1470362 -5836053 -4121698 1536314 6711102 9667679
42595I667679P54643j182695r87451K022282L399184n85908m980029k104512N503381
$$ 9667679 10422322 9239627 8252176 10274458 13673642 13087734 8107705 6003193 11506574
42586A1506574P298560O20260n199841l330067J222559J441832q00649k10065
$$ 11506574 18805134 19425394 14225553 10895486 12118045 13559877 12759228 12549163
42578A2549163J903782O79919k953612l296292J236287O014580O554470K874707
$$ 12549163 14452945 15132864 12179252 8882960 10119247 16133827 22688297 25563004
42570B5563004k005520m777454l686138j02113K407098J920476k99911k565269
$$ 25563004 23557484 18780030 15093892 14991779 17398877 19319353 19019442 16454173
42562A6454173m129688l190404K035676Q375893Q856061K018823m662772m634628
$$ 16454173 12324485 9134081 11169757 19545650 28401711 30420534 25757762 21123134
42554B1123134q10669M51897q94109r84586r4547j016688k216668l21765K312506
$$ 21123134 20312465 20764362 19870253 18885667 18791120 17774432 15557764 15235999 17548505
42545A7548505N59073l680452l041344L165600O628972K283565m299850n231213
$$ 17548505 18107578 14427126 11385782 14551382 21180354 23463919 19164069 13932856
42537A3932856l18137M760407N779493K479776k262554l486855J523366Q147118
$$ 13932856 13614719 18375126 24154619 26634395 24371841 20884986 22408352 30555470
42529C0555470Q385308J729216l521459k227803Q17729J8202j937200k04519K728438
$$ 30555470 38940778 40669994 37148535 34920732 35738461 35756663 33819463 33614944 36343382
42520C6343382J470952k115950j643689K617790L649271r46827n120368l867835
$$ 36343382 37814334 35698384 34054695 36672485 40321756 39374929 34254561 30386726
42512C0386726j65578Q35347j91348J174496N232569O550807J060573p176602
$$ 30386726 30221148 31056495 30865147 32039643 37272212 43823019 44883592 37706990
42504C7706990q832890l49005R968331J0963033L146269j912459J775419O399661
$$ 37706990 28874100 28525095 38493426 49456459 52602728 50690269 52465688 58865349
42496E8865349L689337j579049l18791M770162L836067k257970k279671O250215
$$ 58865349 62554686 60975637 60656846 65427008 69263075 67005105 64725434 70975649
42488G0975649J1913478P808365K568978N597206J1985719J1935751P045756N973962
$$ 70975649 82889127 90697492 93266470 98863676 110849395 122785146 129830902 135804864
42480A35804864R186625R759095O789384O621075J0958953J4228803J4152469
$$ 135804864 144991489 154750584 161539968 168161043 179119996 193348799 207501268
42473B07501268J5372057J9769791K1973536J8946924J6678676K1452727K9678428
$$ 207501268 222873325 242643116 264616652 283563576 300242252 321694979 351373407
42466C51373407L2704210K8591412K3133424K0787656K0112370J8061640J4129758
$$ 351373407 384077617 412669029 435802453 456590109 476702479 494764119 508893877
42459E08893877R110055L021347m049565j0764731j5498158j7778652j8436538
$$ 508893877 518003932 521025279 516975714 506210983 490712825 472934173 454497635
42452D54497635j9173359k1997652k7639967l3760729l5904005l1706111k3975491
$$ 454497635 435324276 413326624 385686657 351925928 316021923 284315812 260340321
42445B60340321j8302010j7313708j8439666j7851375j5125657j2631597j1592207
$$ 260340321 242038311 224724603 206284937 188433562 173307905 160676308 149084101
42438A49084101j1031788j0180454r497136r206599r077692r629947j0930330
$$ 149084101 138052313 127871859 118374723 109168124 100090432 90460485 79530155
42431G9530155j0433891n831511l95589m26583n598151p718127k818261J746453
$$ 79530155 69096264 63264753 62869164 62442581 56844430 49126303 46308042 48054495
42423D8054495j462867p245990n459880K010935L453056l512251p360800j277707
$$ 48054495 46591628 39345638 33885758 35896693 39349749 35837498 28476698 27198991
42415B7198991N337281J832891o594031p475451o75544K855552n03311k536751
$$ 27198991 32536272 34369163 27775132 20299681 19624137 22479689 21976378 19439627
42407A9439627J575442N212455K130464l106648l150077N33674J504889r14949
$$ 19439627 21015069 26227524 28357988 25251340 22101263 22634937 24139826 23224877
42399B3224877k410292k181531k926078l729269p24046M904271O847637L201885
$$ 23224877 20814585 18633054 15706976 11977707 11253661 16157932 23005569 26207454
42391B6207454m79920j20574J018190j060703m115332l987857j642969p18986
$$ 26207454 25727534 25606960 26625150 25564447 21449115 17461258 15818289 15099303
42383A5099303j218280q82682l56974j550904k769891j138972J488858J022145
$$ 15099303 13881023 12998341 12641367 11090463 8320572 7181600 8670458 9692603
42375I692603j275416j78458M298107N840274J511981l812144n070581l298120
$$ 9692603 8417187 8238729 12536836 18377110 19889091 16076947 11006366 7708246
42367G708246j450455M65208K531077K348667n08720j999559J18914J914379j11634
$$ 7708246 6257791 6722999 9254076 11602743 11094023 9094464 9213378 11127757 11016123
42358A1016123k488113o29636K665824J495048k951374l955759p4673K977379
$$ 11016123 8528010 7898374 10564198 12059246 9107872 5152113 5077440 8054819
42350H054819J764198k55532O53710K733044K109844j726097n803024o575889
$$ 8054819 9819017 9563485 10217195 12950239 15060083 13333986 7530962 955073
42342I55073k467617L821311O084329J395061m557359l707076L018210O396625
$$ 955073 -1512544 2308767 8393096 9788157 5230798 1523722 4541932 10938557
42334A0938557K008138l773441l804485k49332K40964k790458l780916l93123
$$ 10938557 12946695 9173254 5368769 5119437 5360401 2569943 -1210973 -1604096
42326a604096L019325J882891k506749n090417l323738M36516K520608K496060
$$ -1604096 1415229 3298120 791371 -4299046 -7622784 -7186268 -4665660 -2169600
42318b169600K833482M296175M074647J89397m384756n061852j938032P70556
$$ -2169600 663882 4960057 9034704 9224101 4839345 -222507 -2160539 -1389983
42310a389983J025149Q14475J611146K118766J515603J086140J232507N03169
$$ -1389983 -364834 449641 2060787 4179553 5695156 6781296 8013803 8516972
42302H516972q17182L5595L216847M144114l37692o447737p701748l001631K667402
$$ 8516972 7699790 7735385 10952232 15096346 14758654 8310917 609169 -2392462 274940
42293B74940M534957K293935j160344k762354j389266J238899K122634O08632
$$ 274940 4809897 7103832 5943488 3181134 1791868 3030767 5153401 5762033
42285E762033n81169O84531K425239J261769k262761l938006j750854J239617
$$ 5762033 5180864 5865395 8290634 9552403 7289642 3351636 1600782 2840399
42277B840399J447977P0071Q58145L246749J998148m154765p764412k012085P431909
$$ 2840399 4288376 4358447 5216592 8463341 10461489 6306724 -1457688 -3469773 3962136
42268C962136P710986l027737j1345145o835780L341809N782898J44483l020967
$$ 3962136 11673122 8645385 -2699760 -9535540 -6193731 -410833 -266350 -3287317
42260c287317J36650K941963J310926o75164j27112n1888j589023p72013L157335
$$ -3287317 -3150667 -208704 1102222 427058 299946 248058 -1340965 -2112978 1044357
42251A044357M731972J672070r57887l00905o76837l856860l710363K495450O553161
$$ 1044357 5776329 7448399 6490512 6189607 5512770 1655910 -2054453 440997 6994158
42242F994158J870707m604584l303999K224948K288200j933747j672700K641494
$$ 6994158 8864865 4260281 956282 3181230 5469430 3535683 1862983 4504477
42234D504477K258156l065562l696657K482714N359201j86154n194016j692984
$$ 4504477 6762633 3697071 414 2483128 7842329 7656175 2462159 769175
42226G69175M171385K913768k970755m424946o52360J665739M99509J9625J439559
$$ 769175 4940560 7854328 4883573 458627 -193733 1472006 1971515 1991140 3430699
42217C430699J344912n87145k85094K775195L438850o87967m694687l745794j08856
$$ 3430699 4775611 4188466 3903372 6678567 10117417 9429450 4734763 988969 880113
42208H80113J216860o7846j032514j253283j887510j313284K220664M645010j29594
$$ 880113 2096973 2029127 996613 -256670 -2144180 -3457464 -1236800 3408210 3278616
42199C278616r452698j2407838m478950N057591N843921O30713p02653L191294
$$ 3278616 -6174082 -18581920 -23060870 -18003279 -12159358 -11528645 -12231298 -9040004
42191i040004M986055K258049O25633K267177J693029l279882n694901n30404
$$ -9040004 -4053949 -1795900 -1170267 1096910 2789939 -489943 -6184844 -6715248
42183f715248N981422N338871n80056l545222j599140K48796m90673j289308p10431
$$ -6715248 -733826 4605045 4024989 479767 -1119373 -870577 -1361250 -2650558 -3360989
42174c360989k45062k1496J569652L592199K897697n76978k934169j476268K242485
$$ -3360989 -3606051 -3627547 -2057895 1534304 4432001 3855023 920854 -555414 1687071
42165A687071M653938L259664j531331n491181l580358L406135P946746M990419
$$ 1687071 6341009 9600673 8069342 2578161 -1002197 2403938 10350684 15341103
42157A5341103j172006l542663k259160j983183k745820q69114K648944K644673
$$ 15341103 14169097 10626434 8367274 6384091 3638271 2769157 5418101 8062774
42149H062774j274287l679774k119708j85340m43638p68680L64671Q89170k25247
$$ 8062774 6788487 3108713 989005 803665 360027 -408653 -43982 845188 619941
42140F19941o39779O80756J280209J0928n39699J183520K746468J992840M53731
$$ 619941 -19838 660918 1941127 1952055 1412356 2595876 5342344 7335184 7788915
42131G788915J36371L48418j16783p26123r08682j101587r14236N92275K015822
$$ 7788915 7925286 8273704 8156921 7430798 6522116 5420529 4506293 5098568 7114390
42122G114390P32831k263507k851879k90920J234007p00872k920427j802002J562565
$$ 7114390 7847221 5583714 2731835 2440915 3674922 2974050 53623 -1748379 -185814
42113a85814L755646L399814J174402j583167k868512j607669p9388j282025l586567
$$ -185814 3569832 6969646 8144048 6560881 3692369 2084700 2005312 723287 -2863280
42104b863280k515761J655633L572157J345587n90206N94823J575131m35980k459856
$$ -2863280 -5379041 -3723408 -151251 1194336 604130 1198953 2774084 2338104 -121752
42095a21752j558098m08398j928508l044083K60711N179200N556170J054359k791519
$$ -121752 -1679850 -2088248 -4016756 -7060839 -6800128 -1620928 3935242 4989601 2198082
42086B198082k548907o3604J664586J620278J24794j601812j566283P27245K824483
$$ 2198082 -350825 -414429 1250157 2870435 2995229 1393417 -172866 554379 3378862
42077C378862K253055k87143k626312m256757n432072n001714j988215J932672
$$ 3378862 5631917 5344774 2718462 -1538295 -6970367 -11972081 -13960296 -12027624
42069a2027624M148830M399271M198399L975096K912821J030336l32817l9246
$$ -12027624 -7878794 -3479523 718876 4693972 7606793 8637129 8304312 8265066
42061H265066J482401K192481K61330l206089m676071l078157j732646k375336
$$ 8265066 9747467 11939948 12201278 8995189 4319118 1240961 -491685 -2867021
42053b867021q19882N780043J0725084N475374n804318r833154l477614J810486
$$ -2867021 -3686903 2093140 12818224 18293598 12489280 2656126 -821488 988998
42045I88998j579839o185374l267871K910014L877029J278007J686678L812051
$$ 988998 -590841 -6776215 -10044086 -7134072 -3257043 -1979036 -292358 3519693
42037C519693K335427l97293J615875N565627L367117l924496p007732l435654
$$ 3519693 5855120 5457827 7073702 12639329 16006446 12081950 5074218 1638564
42029A638564l62743j213002r24781K936318N063971K580822P85249L397030N204659
$$ 1638564 1275821 62819 -861962 2074356 7138327 9719149 10504398 13901428 19106087
42020A9106087P34767o088063p571694l161682J326198K328321J078523m20224
$$ 19106087 19840854 13752791 6181097 3019415 4345613 6673934 7752457 7332233
42012G332233j440278j584905r23784l15572q8770J5837r80071m093793o519722
$$ 7332233 5891955 4307050 3383266 3067694 2978924 2994761 2014690 -2079103 -8598825
42003h598825l341261M627138R161732M529240m353904p929242l716686K374154
$$ -8598825 -11940086 -7312948 1848784 6378024 2024120 -5905122 -9621808 -7247654
41995g247654M693018L000828m50596m052377n873922l556065K281973O750253
$$ -7247654 -2554636 446192 -4404 -4056781 -9930703 -13486768 -11204795 -4454542
41987d454542N609352P74522j622194J011100M303710K893787j999261m073409
$$ -4454542 1154810 1929332 307138 1318238 5621948 8515735 6516474 2443065
41979B443065p59975L180213K529191j222145k824495j225197k22478j489219
$$ 2443065 1683090 4863303 7392494 6170349 3345854 2120657 1898179 408960
41971D08960j471448K775484P680747O444830k105390j0614784j0748018k728994
$$ 408960 -1062488 1712996 9393743 15838573 13733183 3118399 -7629619 -10358613
41963a0358613M826948N063837K70572k907188k781270k653186l043818l05271
$$ -10358613 -5531665 -467828 -197256 -3104444 -5885714 -8538900 -11582718 -11887989
41955a1887989N738198R038247N585577n84222l578128l343616k798281j760678
$$ -11887989 -6149791 2888456 8474033 7889811 4311683 968067 -1830214 -3590892
41947c590892O89695J577748j681712m928609k168190M436972O438530R91111
$$ -3590892 -2901197 -1323449 -3005161 -7933770 -10101960 -5664988 773542 1764653
41939A764653n450438o241756k004144K300026L366977J379463q35901R9685M247627
$$ 1764653 -3685785 -9927541 -11931685 -9631659 -6264682 -4885219 -5721120 -5621435 -1373808
41930a373808P204039N510397J382488j368177l283142o221878p410660l185111
$$ -1373808 5830231 11340628 12723116 11354939 8071797 1849919 -5560741 -8745852
41922h745852L273988N239046K367850p1997q34265l059110n299585j872869O113464
$$ -8745852 -5471864 -232818 2135032 2063035 1228770 -1830340 -7129925 -9002794 -2889330
41913b889330R549625M412645k344419l671283j250586N11614J475857K154794
$$ -2889330 6660295 11072940 8728521 5057238 3806652 4318266 5794123 7948917
41905G948917N36464k577656k189764K065087L253307j342536m310494m33931
$$ 7948917 8485381 5907725 3717961 5783048 9036355 7693819 3383325 2949394
41897B949394L622336O70402l932050j465141M221253K571570n585096q908362
$$ 2949394 6571730 7242132 3310082 1844941 6066194 8637764 3052668 -5855694
41889e855694l410593L071084M937015N328232O178475L274045m120511q495706
$$ -5855694 -9266287 -6195203 -1258188 4070044 10248519 13522564 9402053 906347
41881I06347m992094N47727O75672k651631k627537J582076N187748N829240N075786
$$ 906347 -4085747 -3538020 -2862348 -5513979 -8141516 -6559440 -1371692 4457548 9533334
41872I533334L630567N54300l231088m935961l502660n10751K023196K685538
$$ 9533334 13163901 13718201 10487113 5551152 2048492 1537741 3560937 6246475
41864F246475P68596k356603l358134r16537J803302J290714j175278j717071
$$ 6246475 7015071 4658468 1300334 383797 2187099 3477813 2302535 585464
41856E85464l1463M91040j320772k369109k68526K897615L635782J523934j272144
$$ 585464 554001 1045041 -275731 -2644840 -2913366 -15751 3620031 5143965 3871821
41847C871821l142679l643246k325136P17116L648854M265163K548925M16914
$$ 3871821 729142 -2914104 -5239240 -4522124 -873270 3391893 5940818 6357732
41839F357732q95205j702488k298660k240615j453548n45465K81328J231174J727550
$$ 6357732 5462527 3760039 1461379 -779236 -2232784 -2778249 -2496921 -1265747 461803
41830D61803R84377m1242M80694J799446P08000l367827o117752l706838J664035
$$ 461803 1446180 1404938 1885632 3685078 4393078 1025251 -5092501 -8799339 -7135304
41821g135304M531685L123464M76481m34861M68261J895752K497591R38094k409194
$$ -7135304 -2603619 519845 996326 561465 1029726 2925478 5423069 6361163 3951969
41812C951969m219802j848994K161123K878223J77843j206167N36883J417360
$$ 3951969 -267833 -2116827 44296 2922519 3100362 1894195 2431078 3848438
41804C848438j368527m279839k787646J637875M009712K924364J016616j31219
$$ 3848438 2479911 -1799928 -4587574 -2949699 1060013 3984377 5000993 4869774
41796D869774j284606k369936k029506o40527l39028j365335j462068J30236J108899
$$ 4869774 3585168 1215232 -814274 -1454801 -1793829 -3159164 -4621232 -4490996 -3382097
41787c382097J71775j60188K562175N950901N394615Q58398k624454j996305p8301
$$ -3382097 -3210322 -3370510 -808335 5142566 10537181 11395579 8771125 6774820 6696519
41778F696519l74344j402894M487K151346N26198m082885n345198p52786M222361
$$ 6696519 6322175 4919281 4923768 7075114 7601312 3518427 -1826771 -2579557 1642804
41769A642804M240932J431019N13159R36030o76306l282727k888828R1945R94755
$$ 1642804 5883736 7314755 7827914 8763944 8087638 4804911 1916083 2008028 3002783
41760C002783j635638m069722l453085j202588N27400J734231K830550L218304
$$ 3002783 1367145 -2702577 -6155662 -7358250 -6830850 -5096619 -2266069 952235
41752I52235K513099J055477n87136r37139J597541M788014K926840m650494r421864
$$ 952235 3465334 4520811 3933675 2996536 4594077 9382091 12308931 7658437 -1763427
41743a763427m362000M872162P442034L059059N20893K294985J956391k504636
$$ -1763427 -6125427 -1253265 6188769 9247828 9768721 12063706 14020097 11515461
41735A1515461m708592j834889P82843N62926J820837M692758K129723n908248
$$ 11515461 6806869 4971980 5754823 6317749 8138586 12831344 14961067 9052819
41727I052819p898752J068771Q759650M230835m526578m434660J238949Q49240
$$ 9052819 1154067 2222838 10982488 15213323 10686745 6252085 7491034 8340274
41719H340274l978986k347223M555798M503516l941891q285838l031068K528584
$$ 8340274 4361288 2014065 6569863 11073379 7131488 -1154350 -4185418 -1656834
41711a656834J632571L8027K625315L808083p72138m756960k227222J506795k60953
$$ -1656834 -24263 13764 2639079 6447162 5675024 918064 -1309158 197637 -63316
41702f3316l361655n26551N105580N052034j87832k488203L29367K249371K36952
$$ -63316 -3424971 -3951522 1154058 6206092 6018260 3530057 3859424 6108795 6345747
41693F345747j292129J067537L950004K975958n68057k089693m9445K681081K707121
$$ 6345747 5053618 6121155 10071159 13047117 12479060 10389367 10339922 13021003 15728124
41684A5728124k02551l102663l166120r15563M79997p60243k998585l701503k507900
$$ 15728124 15525573 12422910 9256790 8341227 8821224 8060981 5062396 1360893 -1147007
41675a147007r25943k39412m82307m72489J280638M338286N430627K097241l073964
$$ -1147007 -2072950 -2312362 -2794669 -3267158 -1986520 2351766 7782393 9879634 6805670
41666F805670m894679k334442P49010J977536K989686M214831K387694l364553
$$ 6805670 1910991 -423451 325559 2303095 5292781 9507612 11895306 8530753
41658H530753p592965n517719o24362K63786k619959k708575K259559O658541
$$ 8530753 937788 -4579931 -5204293 -4940507 -7560466 -10269041 -8009482 -1350941
41650a350941N539641J315266j021828j022454j175111j271434O84268L201420
$$ -1350941 4188700 5503966 4482138 3459684 2284573 1013139 1697407 4898827
41642D898827K187576k207747m418277j349206K630140K057907j527858k573172
$$ 4898827 7086403 4878656 460379 -888827 1741313 3799220 2271362 -301810
41634c01810l80998Q70597K78001J586947N075989N107025n19063n013756k045096
$$ -301810 -682808 187789 465790 2052737 7128726 12235751 11716688 6702932 4657836
41625D657836M027231M258043j483830m716883j029745M608957N990392K992316
$$ 4657836 8685067 12943110 11459280 6742397 5712652 10321609 16312001 19304317
41617A9304317q90023l347514l602393j856604j94136r89472l332230l903277
$$ 19304317 18414294 15066780 11464387 9607783 9413647 8424175 5091945 1188668
41609A188668j834830M86416J546954J952361J529902n05941k140473j35364L973228
$$ 1188668 -646162 -159746 1387208 3339569 4869471 4363530 2223057 2087693 6060921
41600F060921M515885J86488l049285l62564M861657N846913J321612l779786
$$ 6060921 10576806 10763294 7714009 7351445 12213102 18060015 19381627 15601841
41592A5601841m715581j577236J364442o696m576274n856672P5402P566602P409457
$$ 15601841 10886260 9309024 10673466 10666770 6090496 233824 309226 7875828 15285285
41583A5285285j89833n201727k055325K755712J283029m104784n483647j348289
$$ 15285285 15095452 9893725 7838400 10594112 11877141 7772357 2288710 940421
41575I40421K862065L765081L249058L410281L432113J916603r29945l569706
$$ 940421 3802486 7567567 10816625 14226906 17659019 19575622 18645677 15075971
41567A5075971l840109o25518L595719M190440M38781k640635j104267K470182
$$ 15075971 11235862 10610344 14206063 18396503 18835284 16194649 15090382 17560564
41559A7560564L652033K947243L579033N176891M647809J719600j044807k551312
$$ 17560564 21212597 24159840 27738873 32915764 37563573 39283173 38238366 35687054
41551C5687054l204250k065513J374359L857708J963409j606456q34412M351059
$$ 35687054 32482804 30417291 31791650 35649358 37612767 36006311 35171899 39522958
41543C9522958P287872M399437M28764J111058M843865N463394J079610l562144
$$ 39522958 46810830 51210267 51639031 52750089 57593954 63057348 64136958 60574814
41535F0574814l260544J539005N628315N224475K205050J339391L933335O485815
$$ 60574814 57314270 58853275 64481590 69706065 71911115 73250506 77183841 83669656
41527H3669656O175575M609284M115383L492151R80721j055638Q57252M887951
$$ 83669656 89845231 94454515 98569898 102062049 103042770 101987132 102844384 107732335
41519A07732335N616032K100826q06568j13658J186351m58529l805717n516630
$$ 107732335 113348367 115449193 114642625 114528967 115715318 115256789 111451072 105934442
41511A05934442m932189l385797j419667M35844K89420k627783n611054n588877
$$ 105934442 101002253 97616456 96196789 96632633 96922053 94294270 88683216 83094339
41503H3094339l547190k962747m508762n364786l794215j468032n10529p88698
$$ 83094339 79547149 76584402 72075640 66710854 62916639 61448607 60938078 60149380
41495F0149380j397714k664231m782843n940088m136090m50171J616567L36961
$$ 60149380 58751666 56087435 51304592 45364504 41228414 40778243 42394810 42731771
41487D2731771k302480l327989k102095k77499M82095l6058p68810o04535Q0988
$$ 42731771 40429291 37101302 34999207 34721708 35203803 35167745 34398935 33794400 33875388
41478C3875388n22745k900085m247901j692417K777288L997343R54607j631251
$$ 33875388 33352643 30452558 26204657 24512240 27289528 31286871 32241478 30610227
41470C0610227q89989l33137l177518n579076k272821L880595M832266q97871
$$ 30610227 29720238 29387101 26209583 20630507 18357686 22238281 27070547 26172676
41462B6172676n984341m636378N08761L475214K321728m90973j790424m77096
$$ 26172676 20188335 15551957 16060718 19535932 21857660 21366687 19576263 19099167
41454A9099167J122567p64842n469867o593580j184249L478309j44221o268577
$$ 19099167 20221734 19456892 13987025 7393445 6209196 9687505 9543284 3274707
41446C274707k947333Q100141J1868204K903359n897111l552758K891184K007096
$$ 3274707 327374 8427515 20295719 23199078 17301967 13749209 16640393 18647489
41438A8647489l448497l752916L56613R12998k001384j616431J963456K340503
$$ 18647489 15198992 11446076 11802689 12715687 10714303 9097872 11061328 13401831
41430A3401831o00236q08450J861013J454321k002064j895560K254810K967100
$$ 13401831 12801595 11993145 13854158 15308479 13306415 11410855 13665665 16632765
41422A6632765j868389m812855j546903K552592K719788J949615K918235K091925
$$ 16632765 14764376 9951521 8404618 10957210 13676998 15626613 18544848 20636773
41414B0636773k154889m105440j82520L760447K019596j002748J248811N438538
$$ 20636773 18481884 14376444 14193924 17954371 19973967 18971219 20220030 25658568
41406B5658568L743923k609807n180579k025317M3693k571176m713906j471651
$$ 25658568 29402491 26792684 21612105 19586788 19630481 17059305 12345399 10873748
41398A0873748M098722N955777L130536r51432l899479n176920l547468J861840
$$ 10873748 14972470 20928247 24058783 23107351 19207872 14030952 10483484 12345324
41390A2345324P887021Q638761K527689m417488n121755j29907L678168K572828
$$ 12345324 20232345 28871106 31398795 26981307 21859552 21729645 25407813 27980641
41382B7980641j87664q96354o66849j310039q43102K320386M717188K836956n84956
$$ 27980641 27792977 26896623 26229774 24919735 24076633 26397019 31114207 33951163 33366207
41373C3366207j286003j143546l883166o177984k148885M819757N166048j497887
$$ 33366207 32080204 30936658 27053492 20875508 18726623 23546380 28712428 27214541
41365B7214541m992753r46932K437220j360081o508487n209568p2546J806205
$$ 27214541 22221788 21274856 23712076 22351995 15843508 10633940 10561394 12367599
41357A2367599K95183l08514K92265L73548J709831N261517N854063n57451q113581
$$ 12367599 12662782 12354268 12646533 13020081 14729912 19991429 25845492 25288041 17174460
41348A7174460q127749j933466K032304J480371J277894K591561R15130m295585
$$ 17174460 9046711 7113245 9145549 10625920 11903814 14495375 15410505 11114920
41340A1114920o946450l489110K255469N434712N144567J672831m702098j0169147
$$ 11114920 4168470 679360 2934829 8369541 13514108 15186939 10484841 315694
41332C15694r035743j795551L897332L237260J98422L01092K374466J869583j128555
$$ 315694 -8720049 -10515600 -6618268 -3381008 -3182586 -2881494 -507028 1362555 234000
41323B34000k108078R05287M471279M215592K77254k573036l88737M666258O218038
$$ 234000 -1874078 -968791 3502488 7718080 7995334 5422298 5033561 9699819 15917857
41314A5917857J803712l583892m469057k301752j807806k813840j588801J278068
$$ 15917857 17721569 14137677 9668620 7366868 5559062 2745222 1156421 2434489
41306B434489J262192j746487k402617J351636M892889M411654J862660r7120
$$ 2434489 3696681 1950194 -452423 899213 5792102 10203756 12066416 11969296
41298A1969296k250322m717895m370001l50342K743270J507025q94820m94781
$$ 11969296 9718974 5001079 631078 280736 3024006 4531031 3636211 3141430
41290C141430O82321j160783m235706l913927m29383J833225J239024q1m26495
$$ 3141430 3823751 2662968 -1572738 -5486665 -5916048 -4082823 -2843799 -2843880 -3270375
41281c270375l50610O01588K516478L037259O23466j596601j65202K201037L73606
$$ -3270375 -3620985 -3019397 -502919 2534340 3157806 1561205 1396003 3597040 3970646
41272C970646m078849m485257J49238L389090J871661Q561J223846J956194q21606
$$ 3970646 -108203 -4593460 -4444222 -1055132 816529 825090 2048936 4005130 3183524
41263C183524k840618J74286L820474J529395l845565l861881J593127L691113
$$ 3183524 342906 517192 4337666 5867061 2021496 -1840385 -247258 3443855
41255C443855j019021m923498j566595M467414N510173K359175R03871J625563
$$ 3443855 2424834 -2498664 -4065259 402155 5912328 8271503 9175374 10800937
41247A0800937L84522k618081k911267n13884n91822l899705m273997J043768
$$ 10800937 11185459 8567378 5656111 5142227 4550405 650700 -3623297 -2579529
41239b579529N545182K991326k731143l625221L59154K335065l60405l125022
$$ -2579529 2965653 5956979 3225836 -399385 -40231 2294834 1934429 -1190593
41231a190593k179910O24880K231476K340888J499093j80195r97117J015625L298470
$$ -1190593 -3370503 -2745623 -514147 1826741 3325834 3145639 2148522 3164147 6462617
41222F462617N91721n916515p046463J981976J2172215J0443249l052856j3948098
$$ 6462617 7054338 1137823 -5908640 -3926664 8245551 18688800 15635944 1687846
41214A687846j0837174J746892R930861O772062j386408m118676M87323M633044
$$ 1687846 -9149328 -7402436 2528425 9300487 7914079 3795403 4282726 8915770
41206H915770J805882m483293o064141j880690J251382k72214j778933R08807
$$ 8915770 10721652 6238359 174218 -1706472 -455090 -727304 -2506237 -1597430
41198a597430M231059L436989P67046O08326J128057j508847m236496j470684
$$ -1597430 2633629 6070618 6837664 7445990 8574047 7065200 2828704 1358020
41190A358020L865557L756311j164180k100504K711636M814772M83437l051397
$$ 1358020 5223577 8979888 7815708 5715204 8426840 13241612 13725049 10673652
41182A0673652j508382j565188p041324q803565K51005J0000360O960188l653855
$$ 10673652 9165270 7600082 558758 -8244807 -7993802 2006558 8966746 5312891
41174E312891n560327K759836O863693P39604m730544j339112M147322L840015
$$ 5312891 -247436 2512400 9376093 10115697 5385153 4046041 8193363 12033378
41166A2033378J259222J608584J185913l709896o988845k619533L427963K201290
$$ 12033378 13292600 14901184 16087097 12377201 5388356 2768823 6196786 8398076
41158H398076l361279l981616K52566J634133p64898o44212K684737K982869o51950
$$ 8398076 5036797 1055181 1307747 2941880 2176982 1532770 4217507 7200376 6548426
41149F548426j519045K367581M138252k5822m130995k385566J883196K851526
$$ 6548426 5029381 7396962 11535214 11509392 7378397 4992831 6876027 9727553
41141I727553J246592Q60127J196537k27899j932559q05452J871221K042661o29335
$$ 9727553 10974145 11834272 13030809 12802910 10870351 10064899 11936120 13978781 13349446
41132A3349446k261236l10126L543674N836163M550873M95120l079782l174651
$$ 13349446 11088210 10778084 14321758 20157921 24708794 25203914 22124132 18949481
41124A8949481m39217J373228N4254k676920m014767l102461n57339K498206M012970
$$ 18949481 18510264 19883492 19937746 17260826 13246059 10143598 9586259 12084465 16097435
41115A6097435K288249j139883k456720n63302J465744J037072n99449j015961
$$ 16097435 18385684 17245801 14789081 14225779 15691523 16728595 16129146 15113185
41107A5113185p3077P72997O27317l64864j070082j5094K089246J869230j595364
$$ 15113185 15040108 15813105 16440422 16075558 15005476 14990382 17079628 18948858 17353494
41098A7353494l557308m39070K871855o1912n167245k756171N716233P890644
$$ 17353494 13796186 13357116 16228971 16167059 10999814 8243643 13959876 21850520
41090B1850520K41210n477012j465031L577425M96634m006598L4899O966976M766617
$$ 21850520 22091730 16614718 15149687 18727112 19223746 15217148 15252047 22219023 26985640
41081B6985640l574787m759168K303812N860162K295721M64999L284121K189462
$$ 26985640 23410853 18651685 20955497 26815659 29111380 29576379 32860500 35049962
41073C5049962n255668q440377j867754M253072J011166m365567j863239L943193
$$ 35049962 29794294 21353917 19486163 23739235 24750401 20384834 18521595 22464788
41065B2464788K754182l390999m721374j054862n58631l890181l236240K790186
$$ 22464788 25218970 21827971 17106597 16051735 15493104 11602923 8366683 11156869
41057A1156869N871916J958104k248398o41942L211147L014033j050558m794819
$$ 11156869 17028785 18986889 16738491 16096549 19307696 22321729 21271171 16476352
41049A6476352o420296n983385k838782K015326M546548K811264N45391J604949
$$ 16476352 10056056 4072671 1233889 3249215 7795763 10607027 11152418 12757367
41041A2757367L568770J548568l574276o038449l802412q54158k7265J108491
$$ 12757367 16326137 17874705 14300429 8261980 4459568 3605410 3578145 4686636
41033D686636M431987O145563K384750l037912k863329K263555L674074k107782
$$ 4686636 9118623 15264186 17648936 14611024 11747695 14011250 17685324 15577542
41025A5577542o926321k711535N749874P064071m09079o600189m316798J859845
$$ 15577542 8651221 5939686 11689560 18753631 18344552 11744363 7427565 9287410
41017I287410L725419L50298k898775k073641K169762O349962O676965K340228
$$ 9287410 13012829 13363127 10464352 8390711 10560473 16910435 23587400 25927628
41009B5927628k308222k140243J257605J153021l787351o552166k616629K569571
$$ 25927628 23619406 21479163 22736768 23889789 20102438 13550272 10933643 13503214
41001A3503214K062665k131255l515470j473682J48400J295664M305170O407684
$$ 13503214 15565879 13434624 9919154 8445472 8593872 9889536 14194706 20602390
40993B0602390K439401n317504q520259m906297j026078j121182j319200J872419
$$ 20602390 23041791 17724287 9204028 4297731 3271653 2150471 831271 2703690
40985B703690M771033L073557o18832j281017P47627J765444J293642J381002
$$ 2703690 7474723 10548280 9929448 8648431 9396058 11161502 12455144 13836146
40977A3836146J506824o64451m389894o125431m499290j574468O78028K084472
$$ 13836146 15342970 14678519 10288625 4163194 -336096 -1910564 -1232536 851936
40969H51936K426061Q45169k111022l943593k850244M9068K003170J871563J380084
$$ 851936 3277997 4123166 2012144 -1931449 -4781693 -4732625 -2729455 -857892 522192
40960E22192K586972M514337M086315J115195l20020K059594M034112O73742n102045
$$ 522192 3109164 7623501 11709816 12825011 12504991 14564585 18598697 19272439 14170394
40951A4170394n864123j168204J536841j018076k883419K10862K795169q97378
$$ 14170394 8306271 7138067 8674908 7656832 4773413 4984275 7779444 6882066
40943F882066n914130l763439L574800O574444L137722M55142J733217J521521
$$ 6882066 967936 -2795503 779297 7353741 10491463 10946605 12679822 14201343
40935A4201343k887814n165676n14196N257519M236536j513593l920544j371233
$$ 14201343 11313529 6147853 5633657 10891176 15127712 13614119 9693575 8322342
40927H322342N67347p82699k033543q77574L12221l43797r98305l44651m74393
$$ 8322342 8889689 8106990 6073447 5195873 5508094 5164297 4165992 3821341 3346948
40918C346948k584391l727965j380525J751506J542529r43417j178531J323530
$$ 3346948 762557 -2965408 -4345933 -2594427 -1051898 -1995315 -3173846 -1850316
40910a850316K142151n83072k524683L17823M985478N313732M64968m382214n223638
$$ -1850316 291835 -291237 -2815920 -2498097 2487381 7801113 8266081 3883867 -1339771
40901a339771l011530j2467L250118N794015M955377L53006l806985l722634j130628
$$ -1339771 -4351301 -4363768 -1113650 4680365 9635742 9988748 6181763 2459129 1328501
40892A328501n1344m84615M65755K637613K885386P71573p66873q77806j910010
$$ 1328501 1277157 792542 1258297 3895910 6781296 7552869 6785996 5908190 3998180
40883C998180l969655l641803l10122J495197o18896k230625P11773M316968K355943
$$ 3998180 28525 -3613278 -3923400 -2428203 -3047099 -5277724 -4565951 -248983 2106960
40874B106960l329842m834322J38383N177819M736116J083166n92347L81262P38441
$$ 2106960 -1222882 -6057204 -5918821 -741002 3995114 5078280 4485933 4867195 5605636
40865E605636j283111l891194m153494j131139K679361L128873p31929m157830
$$ 5605636 4322525 431331 -3722163 -4853302 -2173941 954932 223003 -3934827
40857c934827j861916M456451P295064K927256l788891n906114k502617J970843
$$ -3934827 -5796743 -1340292 5954772 8882028 5093137 -812977 -3315594 -1344751
40849a344751L758338K527242M836j435110j54270K562410L004147k53221l653687
$$ -1344751 2413587 4940829 4945665 3510555 3356285 5918695 8922842 8669621 5015934
40840E015934l013391Q37914L449455K753464P61917k39874k02893J61020O39153
$$ 5015934 2002543 2840457 6289912 9043376 9805293 9565419 9362526 9523546 10162699
40831A0162699O02999q65004k913226k911113J48898L619023M083312J470994
$$ 10162699 10765698 9900694 6987468 4076355 4225253 7844276 11927588 13398582
40823A3398582j216234j881906j341020j030332m81756J397788L517753L395256
$$ 13398582 12182348 10300442 8959422 7929090 7447334 8845122 12362875 15758131
40815A5758131R80864o94273J17521J138924k45227k558425k474294j71296J088110
$$ 15758131 16738995 16044722 16162243 17301167 17055940 14497515 12023221 11851925 12940035
40806A2940035J54912r95896j388410k096344k666882r40781K271740K973474
$$ 12940035 13094947 12099051 10710641 8614297 5947415 5006634 7278374 10251848
40798A0251848N14351m89748K149801L570518m43145n567061m954059p0823J791696
$$ 10251848 10766199 10276451 12426252 15996770 15553625 9986564 5032505 4961682 6753378
40789F753378m61835k29729N131940Q848607M708290l257053o319833k979190
$$ 6753378 6291543 6061814 11193754 20042361 24750651 21493598 15173765 12194575
40781A2194575J52224j651108n275157m943005j62261L732406K132938l399803
$$ 12194575 12346799 10695691 5420534 477529 315268 4047674 6180612 2780809
40773B780809o805299m168744K149315O383808N605002K129949N6181O90212J932211
$$ 2780809 -4024490 -8193234 -6043919 339889 5944891 8074840 8131021 8821233 10753444
40764A0753444J477321l18245j213572l97545J92296j237664l273708l078003
$$ 10753444 12230765 11912520 10698948 10301403 10493699 9256035 5982327 2904324
40756B904324o81816J039741P50196J45152M68140O79441K85326O94963K016413
$$ 2904324 2222508 3262249 4012445 4157597 4625737 5305178 5590504 6285467 8301880
40747H301880J876815l42797j632130m94391j95746l170423n866974l971587K98189
$$ 8301880 10178695 9835898 8203768 7709377 7513631 4343208 -1523766 -5495353 -5197164
40738e197164J672904K85323N37398K938213L546670J302866l08008M99873J532323
$$ -5197164 -3524260 -3238937 -2701539 236674 3783344 5086210 4778202 5278075 6810398
40729F810398J415648J411248J523987o2110k637411l059359j137512J34321M06695
$$ 6810398 8226046 9637294 11161281 11099171 8461760 5402401 4264889 4399210 4805905
40720D805905K270238M759790L187399k475835n806439l537030l63730m56986
$$ 4805905 7076143 11835933 15023332 12547497 6741058 3204028 2840298 2383312
40712B383312r24105J362132K945206J90512k964980j095254K958779K379808
$$ 2383312 1459207 2821339 5766545 5957057 2992077 1896823 4855602 7235410
40704G235410k198624l715483p6779L308408K677163M25009p97842j943218l278435
$$ 7235410 5036786 1321303 1244524 4552932 7230095 7655104 6857262 4914044 1635609
40695A635609k064292K164689M589146J461998l514069l488597K143213O647239
$$ 1635609 -428683 1736006 6325152 7787150 4273081 784484 2927697 9574936
40687I574936M576870j640033n359106m031096j201991m79355p02589R40893L501058
$$ 9574936 14151806 12511773 7152667 3121571 1919580 1440225 737636 1678529 5179587
40678E179587L613207J278896L3815R37572P69126k150750m457998k832287P07186
$$ 5179587 8792794 10071690 10105505 11043077 11812203 9661453 5203455 2371168 3078354
40669C078354J947093N97272j98106R33281K075788J263343j016685k513393j536339
$$ 3078354 5025447 5622719 5424613 6357894 8433682 9697025 8680340 6166947 4630608
40660D630608Q33130J132289j986586m379539j151805N383504P505549K916953
$$ 4630608 5463738 6596027 4609441 229902 -921903 4461601 11967150 14884103
40652A4884103k001311k189914r23794k663356m888289l067462Q59179J799860
$$ 14884103 12882792 10692878 9769084 7105728 2217439 -850023 9156 1809016
40644A809016J01853j1143J751796K296588J768041K755685L964751J602994l248867
$$ 1809016 1910869 1899726 3651522 5948110 7716151 10471836 14436587 16039581 12790714
40635A2790714n361482l584761j764524j005395J944004P001363Q424893L362594
$$ 12790714 7429232 3844471 2079947 1074552 3018556 10019919 18444812 21807406
40627B1807406k939518m310894j682612j3588o39253j008411o7404L70939n12997
$$ 21807406 18867888 14556994 12874382 12860794 12221541 11213130 11145726 11516665 11003668
40618A1003668n90676J955970M984009M196803q85569n018566l839835n98994
$$ 11003668 10412992 12368962 17352971 21549774 20664205 15645639 11805804 11206810
40610A1206810j667416n991820n768021P19247M882837J034419m042096k018017
$$ 11206810 9539394 3547574 -2220447 -1501200 3381637 4416056 373960 -1644057
40602a644057L303036K842449k255701l178904J252219L558864J185294m26076
$$ -1644057 1658979 4501428 2245727 -933177 319042 3877906 5063200 4637124
40594D637124R00005R38735j030449k45658K985528J966831l457689m186370K584032
$$ 4637124 5537129 6475864 5445415 5199757 8185285 10152116 6694427 2508057 5092089
40585E092089O587164P81719o151160l225165N534813Q086020K486197l086596
$$ 5092089 11679253 12460972 6309812 3084647 8619460 16705480 19191677 16105081
40577A6105081m315552l912035l099440j62886L050448K131080j929688l271585
$$ 16105081 11789529 7877494 4778054 4615168 7665616 9796696 7867008 4595423
40569D595423l38709K067589P79881j603967j873812n64417L63822N46117O81642
$$ 4595423 4256714 6324303 7104184 5500217 3626405 3061988 3425810 3971927 4653569
40560D653569J343585K544913K906674N30017l468719m639763j008054L500945
$$ 4653569 5997154 8542067 11448741 11978758 8510039 3870276 2862222 6363167
40552F363167M513924L026836K129954J343334j091348l299465k513933m00391
$$ 6363167 10877091 13903927 16033881 17377215 16285867 12986402 10472469 10072078
40544A0072078k88142j217079l04787R94357q18837m067948l374071J974454O884447
$$ 10072078 9783936 8566857 8262070 9256427 8437590 4369642 995571 2970025 9854472
40535I854472P612458M895934M24525m402062o560378l878351M52937J068922
$$ 9854472 17466930 22362864 22787389 18385327 11824949 7946598 8399535 9468457
40527I468457j871059l330157j447940O78445J227063J720371K401226J462214
$$ 9468457 7597398 4267241 2819301 3497746 4724809 6445180 8846406 10308620
40519A0308620k54048M55873L102238L335220k0209l251637m133380m320064m257608
$$ 10308620 10054572 10510445 13612683 16947903 16927694 13676057 9542677 5222613 965005
40510I65005j820995K271522L726423J463795n19733J5578O50408J0651J08250
$$ 965005 -855990 1415532 5141955 6605750 6086017 6101595 6752003 6762654 6870904
40501F870904J051978J57736j610359P2624L677106J871205n232296o897612J696235
$$ 6870904 7922882 8080618 6470259 6542883 10219989 12091194 6858898 -38714 1657521
40492A657521R603804N803933l945662o919397k893188j034938k550643q23254
$$ 1657521 11261325 17065258 13119596 6200199 3307011 2272073 -278570 -1101824
40484a101824L456842K274017l901808m719819K485064P237577L160933j892931
$$ -1101824 2355018 4629035 727227 -3992592 -1507528 5730049 8890982 6998051
40476F998051o75L934444K406616j285958l75840K361869M95356k978959r05559
$$ 6998051 6997376 10931820 13338436 12052478 11676638 14038507 14533863 11554904 10649345
40467A0649345L495412P87455p248124q304521M42506O554707J613991n836037
$$ 10649345 14144757 14932212 7684088 -620433 -177927 6376780 7990771 2154734
40459B154734m493174K438290M273607K80449j238176K075028L764052N87093
$$ 2154734 -2338440 99850 4373457 4653906 3415730 5490758 9254810 9841903
40451I841903k322016n66391K729531K505806j082330m134723m029837r07610
$$ 9841903 7519887 6953496 9683027 12188833 11106503 6971780 2941943 2034333
40443B034333K910248L929173R99063j904393k16647L993962M392301L70664j617732
$$ 2034333 4944581 8873754 9872817 7968424 7751777 11745739 16138040 16508704 14890972
40434A4890972J401059L861934R75517l156020k264875K056797L376598K50818
$$ 14890972 16292031 20153965 21129482 17973462 15708587 17765384 21141982 21392800
40426B1392800l195368m408586m271168l229109r99114P55358K69031p61085J46179
$$ 21392800 18197432 13788846 9517678 6288569 5289455 6044813 6313844 5552759 5698938
40417E698938J534482P18445o22682Q54512L389478K357111j519756k801035r0319
$$ 5698938 7233420 7951865 7329183 8183695 11573173 13930284 12410528 9609493 9519174
40408I519174K415236K410633J791866R63028j937119n040989l725838N74811
$$ 9519174 11934410 14345043 16136909 17099937 15162818 10121829 6395991 6970802
40400F970802P99323l690049m500389J752039O107235J129023o166117m713063
$$ 6970802 7770125 4080076 -420313 1331726 7438961 8567984 2401867 -2311196
40392b311196L403469O973618L231663J1560J356117K168207j033261l832026
$$ -2311196 1092273 8065891 11297554 11309114 12665231 14833438 13800177 9968151
40384I968151k099043J255850K088550J465357J743273J340901j477829l576098
$$ 9968151 7869108 9124958 11213508 12678865 14422138 15763039 14285210 10709112
40376A0709112j391385K018153M04098n624258p720754q65374Q881637J1181228
$$ 10709112 9317727 11335880 11739978 6115720 -1605034 -2470408 6411229 17592457
40368A7592457M065568m092792n364561j230430J365678r7009j881666r74527
$$ 17592457 21658025 17565233 12200672 10970242 12335920 12238911 10357245 9382718
40360I382718Q84624J075871k20955k013316m279903n508840k538380L889861
$$ 9382718 10267342 11343213 11122258 9108942 4829039 -679801 -3218181 671680
40352F71680P351908L832610j753508k161092J929654M092801K381856N81512
$$ 671680 8023588 11856198 10102690 7941598 9871252 13964053 16345909 16927421
40344A6927421K10271j359838m093170l709493R09741M796576M109360J122232
$$ 16927421 17137692 15777854 11684684 7975191 8884932 13681508 17790868 18913100
40336A8913100o00431j005551p73214J137926L832914L334722j019802l799492
$$ 18913100 18312669 17307118 16533904 17671830 21504744 24839466 23819664 20020172
40328B0020172j513075J268095q35780m921421m435909K87795L219694K362294
$$ 20020172 18507097 19775192 18939412 14017991 9582082 9869877 13089571 15451865
40320A5451865R67904P0471k430890m926691k390099M272846O600757K64936p628449
$$ 15451865 16419769 16490240 14059350 9132659 6742560 11015406 17616163 17881099 10252650
40311A0252650p852154j197569M002243L337755j82957k347435k126002j63916
$$ 10252650 2400496 1202927 5205170 8542925 8359968 6012533 3886531 3722615
40303C722615K685570M801036M921500M054256L609343K163748k374360p464172
$$ 3722615 6408185 11209221 16130721 20184977 23794320 25958068 23583708 16119536
40295A6119536p261747q34833N046857M319165l31952j846568Q04342J734433
$$ 16119536 8857789 8022956 13069813 17388978 17057026 15210458 16014800 17749233
40287A7749233k197941o108983m165349J824618N062155L180045L83053K55247
$$ 17749233 15551292 9442309 5276960 7101578 12163733 15343778 15726831 15982078
40279A5982078J125105L83479o22620N51899K288992R10590l012536m663012j902629
$$ 15982078 17107183 17490662 16868042 17419941 19708933 20619523 17606987 12943975 11041346
40270A1041346J571536J639173p23760j729386m06121R57904R28724N40742P62582
$$ 11041346 12612882 14252055 13528295 11798909 11392788 12350692 13279416 13820158 14582740
40261A4582740Q31733j5670q30125k00117J566368K602448J636941p26810k825364
$$ 14582740 15414473 15398803 14568678 14368561 15934929 18537377 20174318 19447508 16622144
40252A6622144l375389k039157N49237K674956K325701n18277k803503j560754
$$ 16622144 13246755 11207598 11756835 14431791 16757492 16239215 13435712 11874958
40244A1874958J792766K874201Q02862j68636K302954L823232j06069n647442
$$ 11874958 13667724 16541925 17344787 17176151 19479105 23302337 23196268 17548826
40236A7548826n198478P93334M002406R88284k156035p93617P49597j876327l968200
$$ 17548826 12350348 13143682 17146088 18134372 15978337 15184720 15934317 14057990 10089790
40227A0089790K92667O192133M635567k746684n188852N34219N428215K793176
$$ 10089790 10382457 16574590 21210157 18463473 13274621 13808840 19237055 22030231
40219B2030231k139455j915770J646034K139866p68809k328877j059705L08241
$$ 22030231 19890776 17975006 19621040 21760906 20992097 18663220 17603515 17911756
40211A7911756M15253K00575n99015k760353l988687r47933M836581P479071M270404
$$ 17911756 18327009 18527584 17928569 15168216 11179529 10231596 15068177 22547248 26817652
40202B6817652o85193j926679O54746K366060o9853m311148m906263j27753M686159
$$ 26817652 26132459 24205780 24860526 27226586 27156733 22845585 17939322 17811569 22497728
40193B2497728K824863m623596q685896l618040N165585Q000027L512334p70126
$$ 22497728 25322591 20698995 12013099 8395059 13560644 21560671 25073005 24302879
40185B4302879J92928K623314J006868l175347m049450n05015K127582L394l834388
$$ 24302879 24495807 27119121 28125989 24950642 20901192 20396177 22523759 22527153 18692765
40176A8692765m407340k101377r43582j053908J668400P298991R229655L549697
$$ 18692765 14285425 12184048 11240466 10186558 11854958 19153949 28383604 31933301
40168C1933301l759911m611304k21446K054222P47425Q35966L108167K411866
$$ 31933301 28173390 23562086 23340640 25394862 26142287 26978253 30086420 32498286
40160C2498286j850598k925394J787616N141832J575570l724243l645149m08025
$$ 32498286 30647688 27722294 29509910 34651742 36227312 32503069 28857920 28449895
40152B8449895k87717k499147j812601J467072K467638L52632j487239j941281
$$ 28449895 28162178 25663031 23850430 25317502 27785140 28137772 26650533 24709252
40144B4709252k187138j324899J484587K907964O5840l411601k849596r32959
$$ 24709252 22522114 21197215 22681802 25589766 25655606 22244005 19394409 18461450
40136A8461450k887369o385730n108509R9878L027234L012994M181833N553295
$$ 18461450 15574081 9188351 4079842 4179720 7206954 10219948 14401781 19955076
40128A9955076K734249j624205o98598L449368K023500m692654o834747k046852
$$ 19955076 22689325 21065120 20366522 23815890 25839390 21146736 14311989 12265137
40120A2265137Q81931j279439n77522N723699Q038552J507153m033787p86051
$$ 12265137 13147068 11867629 11290107 17013806 25052358 26559511 22525724 21739673
40112B1739673L541229L12921m274918j244921M043651J682741m353342l301933
$$ 21739673 25280902 25593823 21318905 20073984 24117635 25800376 21447034 18145101
40104A8145101L037483M014238q91132k577396M48444P68313k590268k320126
$$ 18145101 21182584 25196822 24305690 21728294 22176738 22945051 20354783 18034657
40096A8034657K587130M233911N8030k901886r23845P87428j149500k569081o06521
$$ 18034657 20621787 24855698 24913728 22011842 21087997 21875425 20725925 18156844 17550323
40087A7550323J332626J183036J860490L809707K695047j880629l963730j283032
$$ 17550323 18882949 20065985 21926475 25736182 28431229 26550600 22586870 21303838
40079B1303838Q22950o08786j037922K083182L480446l88715l928070j374073
$$ 21303838 22126788 21518002 20480080 22563262 26043708 25654993 21726923 20352850
40071B0352850L483909L691235j12869k291994j302494L23362J586782K651199
$$ 20352850 23836759 27527994 27415125 25123131 23820637 24143999 25730781 28381980
40063B8381980J852154j495136l970270k611081N5890J44164j198630k93619K596859
$$ 28381980 30234134 28738998 24768728 22157647 22213537 22357701 21159071 20865452 23462311
40054B3462311M149568L579831K864959K573580J404763q30847k750249l207051
$$ 23462311 27611879 31191710 34056669 36630249 38035012 37204165 34453916 31246865
40046C1246865j706867J432260L844669K473723k049171n092948l985979j320579
$$ 31246865 29539998 30972258 34816927 37290650 35241479 30148531 26162552 24841973
40038B4841973l57712n53393j09860M73077K99764M11377J299902J039006j251284
$$ 24841973 24484261 23930868 23821008 24294085 24593849 25005226 26305128 27344134 26092850
40029B6092850k971790j898611L09323J057214M33447m15926j347537j503940
$$ 26092850 23121060 21222449 21531772 22588986 23022433 22606507 21258970 19755030
40021A9755030P55613L965873L886050K85064j492807J064207L074926L37577
$$ 19755030 20510643 24476516 28362566 28647630 27154823 28219030 31293956 31631533
40013C1631533l546677l523684j466890j804847l120205j330983J965643J862516
$$ 31631533 28084856 24561172 23094282 21289435 18169230 16838247 18803890 20666406
40005B0666406j170013k211169k91851R36808K27965J6844R32958Q71115n25623
$$ 20666406 19496393 17285224 16993373 17930181 18158146 18174990 19107948 19979063 19453440
39996A9453440j562905k194290l260523l229935p31774J454597O95415N57899
$$ 19453440 17890535 15696245 12435722 9205787 8474013 9928610 10624025 11181924
39988A1181924N442610J0993209Q530893j156529p575055n404623o63804M79719
$$ 11181924 16624534 27617743 36148636 34992107 27417052 22012429 21348625 21828344
39980B1828344M4867J205338J309495k070172m708306k064992K710832L626967
$$ 21828344 21873211 23078549 24388044 22317872 17609566 15544574 18255406 21882373
39972B1882373J067972j52335P84270N55639j550562k629478j490581r4852L54708
$$ 21882373 22950345 22798010 23582280 24137919 22587357 19957879 18467298 18372446 18727154
39963A8727154O71314R67906L78947k59416J118602L973097M657975Q31075n419009
$$ 18727154 19398468 20366374 20745321 20485905 21604507 25577604 30235579 31066654 25647645
39954B5647645r467810q056279j729496M987014O534381J726189m086244m660093
$$ 25647645 16179835 8123556 6394060 11381074 17915455 19641644 15555400 10895307
39946A0895307m40264K473650J104164o69675R36573L027229P32374l935621l861287
$$ 10895307 10455043 12928693 14032857 13363182 14299755 17326984 18059358 14123737 10262450
39937A0262450K310324P117651M765106n47370j395711J717385K280007j159966
$$ 10262450 12572774 19690425 24455531 23908161 22512450 24229835 26509842 25349876
39929B5349876l082282n36767K357774J688905n04550j017773q57130j966424
$$ 25349876 22267594 21730827 24088601 25777506 25272956 24255183 23398053 21431629
$$ [...]
##END NTUPLES=NMR SPECTRUM
##END=
