##TITLE=31Pdec_SR104_0
 D2O, 24 sc
 17.2.2022
##JCAMPDX= 6.0         $$ Bruker NMR JCAMP-DX V2.0
##DATA TYPE= NMR SPECTRUM
##DATA CLASS= NTUPLES
##ORIGIN= UXNMR, Bruker Analytische Messtechnik GmbH
##OWNER= root
$$ XWIN-NMR		Version 3.5
$$ Thu Feb 17 10:44:18 2022 Russian Standard Time (UT+4h)  she@DPX200
##.OBSERVE FREQUENCY= 81.013821
##.OBSERVE NUCLEUS= ^31P
##.ACQUISITION MODE= SIMULTANEOUS
##.ACQUISITION SCHEME= undefined
##.AVERAGES= 24
##.DIGITISER RES= 16
##SPECTROMETER/DATA SYSTEM= spect
##.PULSE SEQUENCE= zgpg30
##.SOLVENT NAME= Acetone
##.SHIFT REFERENCE= (INTERNAL, Acetone, 0, 248.564)
##AUDIT TRAIL= $$ (NUMBER, WHEN, WHO, WHERE, WHAT)
$$ ##TITLE= Audit trail, XWIN-NMR		Version 3.5
$$ ##JCAMPDX= 5.01
$$ ##ORIGIN= Bruker BioSpin GmbH
$$ ##OWNER= she
$$ F:/spectra/data/she/nmr/P31/1/pdata/1/auditp.txt
$$ ##AUDIT TRAIL=  $$ (NUMBER, WHEN, WHO, WHERE, WHAT)
(   1,<2022-02-17 10:42:54.09 +0400>,<she>,<DPX200>,
      <created by zg, POWCHK disabled, PULCHK disabled
       configuration hash MD5:
       00 E9 B6 7A A2 85 ED C7 34 08 36 98 17 FE 4E 26
       data hash MD5: 32K
       BA 12 43 66 68 13 00 B4 83 16 B2 60 F3 25 E8 09>)
(   2,<2022-02-17 10:43:12.12 +0400>,<she>,<DPX200>,
      <Start of raw data processing
       efp BC_mod = 2 LB = 1 FT_mod = 6 PKNL = 1 PHC0 = -9734.065 PHC1 = 613.0746 SI = 64K 
       data hash MD5: 64K
       8C 74 B8 CE 4C 15 68 CC 4F A0 75 75 73 3B 73 3A>)
(   3,<2022-02-17 10:43:32.15 +0400>,<she>,<DPX200>,
      <pk PHC0 = 115.1041 PHC1 = -382.2 
       data hash MD5: 64K
       49 EB 40 AE 6C 03 9B E2 FA 5E 30 AF C9 D6 68 FE>)
(   4,<2022-02-17 10:43:36.04 +0400>,<she>,<DPX200>,
      <abs ABSG = 5 
       data hash MD5: 64K
       64 DE 8E F8 9F BE 4D CB E8 E9 75 34 CC F4 74 46>)
$$ ##END=
$$ 
$$ hash MD5
$$ 2B C4 8B 18 4A FF 13 7D 35 AC FE 4C CB CE 67 93
##$RELAX= 
##$RELAX= 
##$RELAX= 
##$RELAX= 
##$RELAX= 
##$RELAX= 
##$RELAX= 
##$RELAX= 
$$ Bruker specific parameters
$$ --------------------------
##$DU= <F:/spectra>
##$EXPNO= 1
##$NAME= <P31>
##$PROCNO= 1
##$TYPE= <nmr>
##$USER= <she>
##$AMP= (0..31)
100 100 100 100 100 100 100 100 100 100 100 100 100 100 100 100 100 100 
100 100 100 100 100 100 100 100 100 100 100 100 100 100 
##$AQSEQ= 0
##$AQ_mod= 1
##$AUNM= <au_zg>
##$AUTOPOS= <>
##$BF1= 81.014009
##$BF2= 200.13
##$BF3= 200.13
##$BF4= 200.13
##$BF5= 200.13
##$BF6= 200.13
##$BF7= 200.13
##$BF8= 200.13
##$BYTORDA= 1
##$CFDGTYP= 0
##$CFRGTYP= 5
##$CHEMSTR= <none>
##$CNST= (0..31)
1 1 145 1 1 1 1 1 1 1 1 1 1 1 1 1 1 1 1 1 1 1 1 1 1 1 1 1 1 1 1 1 
##$CPDPRG= <waltz16>
##$CPDPRG1= <>
##$CPDPRG2= <waltz16>
##$CPDPRG3= <>
##$CPDPRG4= <mlev>
##$CPDPRG5= <mlev>
##$CPDPRG6= <mlev>
##$CPDPRG7= <mlev>
##$CPDPRG8= <mlev>
##$CPDPRGB= <>
##$CPDPRGT= <>
##$D= (0..31)
0 1 0 0 0 0 0 0 0 0 0 0.03 2e-05 3e-06 0 0 0 0 0 0 0 0 0 0 0 0 0 0 0 0 
0 0 
##$DATE= 1645080173
##$DBL= (0..7)
120 120 120 11 120 120 24 19 
##$DBP= (0..7)
150 150 150 150 150 150 150 150 
##$DBP07= 0
##$DBPNAM0= <>
##$DBPNAM1= <>
##$DBPNAM2= <>
$$ [...]
##$SUBNAM3= <"">
##$SUBNAM4= <"">
##$SUBNAM5= <"">
##$SUBNAM6= <"">
##$SUBNAM7= <"">
##$SUBNAM8= <"">
##$SUBNAM9= <"">
##$SW= 501.771253377433
##$SWIBOX= (0..15)
0 1 3 0 0 0 0 0 0 0 0 0 0 0 0 0 
##$SW_h= 40650.406504065
##$TD= 32768
##$TD0= 1
##$TE= 0
##$TE2= 300
##$TE3= 300
##$TEG= 300
##$TL= (0..7)
0 120 53 12 22 120 120 120 
##$TP= (0..7)
150 150 150 150 150 150 150 150 
##$TP07= 0
##$TPNAME0= <>
##$TPNAME1= <>
##$TPNAME2= <>
##$TPNAME3= <>
##$TPNAME4= <>
##$TPNAME5= <>
##$TPNAME6= <>
##$TPNAME7= <>
##$TPOAL= (0..7)
0.5 0.5 0.5 0.5 0.5 0.5 0.5 0.5 
##$TPOFFS= (0..7)
0 0 0 0 0 0 0 0 
##$TUNHIN= 0
##$TUNHOUT= 0
##$TUNXOUT= 0
##$USERA1= <user>
##$USERA2= <user>
##$USERA3= <user>
##$USERA4= <user>
##$USERA5= <user>
##$V9= 5
##$VALIST= <valist>
##$VCLIST= <CCCCCCCCCCCCCCC>
##$VD= 0
##$VDLIST= <DDDDDDDDDDDDDDD>
##$VPLIST= <PPPPPPPPPPPPPPP>
##$VTLIST= <TTTTTTTTTTTTTTT>
##$WBST= 1024
##$WBSW= 4
##$XGAIN= (0..3)
0 0 0 0 
##$XL= 0
##$YL= 0
##$YMAX_a= 6290
##$YMIN_a= -7000
##$ZGOPTNS= <>
##$ZL1= 120
##$ZL2= 120
##$ZL3= 120
##$ZL4= 120
##$ABSF1= 248.5645
##$ABSF2= -253.2056
##$ABSG= 5
##$ABSL= 3
##$ALPHA= 0
##$AQORDER= 0
##$ASSFAC= 0
##$ASSFACI= 0
##$ASSFACX= 0
##$ASSWID= 0
##$AUNMP= <proc_1d>
##$AZFE= 0.1
##$AZFW= 0.5
##$BCFW= 0
##$BC_mod= 2
##$BYTORDP= 0
##$COROFFS= 0
##$CY= -3
##$DATMOD= 1
##$DC= 0
##$DFILT= <>
##$DTYPP= 0
##$F1P= 0
##$F2P= 0
##$FCOR= 1
##$FTSIZE= 65536
##$FT_mod= 6
##$GAMMA= 0
##$GB= 0
##$INTBC= 1
##$INTSCL= 5.30512e-09
##$ISEN= 30
##$LB= 1
##$LEV0= 0
##$LPBIN= 0
##$MAXI= 10000
##$MC2= 0
##$MEAN= 0
##$ME_mod= 0
##$MI= 50
##$NCOEF= 0
##$NC_proc= -6
##$NLEV= 6
##$NOISF1= 182.463
##$NOISF2= 159.3651
##$NSP= 0
##$NTH_PI= 0
##$NZP= 0
##$OFFSET= 248.5645
##$PC= 4
##$PHC0= -9618.961
##$PHC1= 230.8746
##$PH_mod= 1
##$PKNL= yes
##$PPARMOD= 0
##$PSCAL= 0
##$PSIGN= 0
##$REVERSE= no
##$SF= 81.014009
##$SI= 65536
##$SIGF1= 159.3651
##$SIGF2= -187.1042
##$SINO= 113.3802
##$SIOLD= 16384
##$SREGLST= <1H.CDCl3>
##$SSB= 0
##$STSI= 65536
##$STSR= 0
##$SW_p= 40650.406504065
##$SYMM= 0
##$S_DEV= 0
##$TDeff= 32768
##$TDoff= 0
##$TI= <>
##$TILT= no
##$TM1= 0
##$TM2= 0
##$TOPLEV= 0
##$USERP1= <user>
##$USERP2= <user>
##$USERP3= <user>
##$USERP4= <user>
##$USERP5= <user>
##$WDW= 1
##$XDIM= 65536
##$YMAX_p= 495239168
##$YMIN_p= -23420898
$$ End of Bruker specific parameters
$$ ---------------------------------
##NTUPLES= NMR SPECTRUM
##VAR_NAME=  FREQUENCY,     SPECTRUM/REAL,   SPECTRUM/IMAG
##SYMBOL=    X,             R,               I
##VAR_TYPE=  INDEPENDENT,   DEPENDENT,       DEPENDENT
##VAR_FORM=  AFFN,          ASDF,            ASDF
##VAR_DIM=   65536,         65536,           65536
##UNITS=     HZ,            ARBITRARY UNITS, ARBITRARY UNITS
##FACTOR=    0.620285442955139, 1,           1
##FIRST=     20137.2065510759, 0,            0
##LAST=      -20513.1999529892, 0,           0
##MIN=       -20513.1999529892, -23420898,   0
##MAX=       20137.2065510759, 495239168,    0
$$ Real data points
##PAGE= N=1
##DATA TABLE= (X++(R..R)), XYDATA
$$ [...]
40606A23179k96974k69621J18729O67862M67073n65151r92871J21548J459980
40597H33754J170398l34259j009084k84520L59801O3987j64893L97176O47118
40588A679478m19109j662593j372160K6384O52591R7815k22852L74874Q23356
40579b2216L09699l71506l04853Q5641Q4506L9232M75866P96446K22688o23688
40569F91815n57261J44855J14885p75038j054923K4303J259432J266205L31179
40560A445452l43997l55925j40537L7530J87823J23007k19846l03683K76942Q19374
40550A526140K51094j153284j796179q30042O19741Q82443j44521j004072n90800
40541b239480O29473J421778J255827N90895j9612n22490r48821r44031k21741
$$ plain form
40606 123179 -173795 -443416 -324687 343175 810248 245097 -747774 -626226 833754
40597 833754 2004152 1669893 660809 376289 736090 800077 635184 1032360 1679478
40588 1679478 1260369 -402224 -1774384 -1748000 -1095409 -997594 -1220446 -845572 -22216
40579 -22216 287483 -84023 -388876 -303235 -218729 -179497 296369 1092815 1315503 691815
40569 691815 134554 279409 394294 -380744 -1435667 -1411364 -151932 1114273 1445452
40560 1445452 1101455 745530 604993 642523 830346 953353 733507 429824 706766 1526140
40550 1526140 1777234 623950 -1172229 -2002271 -1382530 -500087 -644608 -1648680 -2239480
40541 -2239480 -1610007 -188229 1067598 1658493 1638881 1116391 167570 -776461 -998202
40532i98202P26315R71006K59095p07523j201690j135676o46511K47303J117196
40523a368687J003422l33988j552513j177717L10602J025190L42184l04152K46300
40514a809359J088678P80493l77639r41358o01888l52961n53261l87566M64373
40505b690488J076311Q16318L73066M03677L29712l85387q04678R7230J313481
40496E29242R26083q29488j595685l54733J083334R56690J19412K48908R13173
40487A996936M56202r21451j213981J92951J429510R10828m73103r69325m82205
40478I26362j78988l99990m06312P8636M13333K40086M7206J96273K97339N7382
40468A271327k9048M26552P17117k1220j100881p80696J142197K442209J186240
$$ plain form
40532 -998202 -271887 699119 958214 250691 -950999 -2086675 -2733186 -2485883 -1368687
40523 -1368687 -365265 -699253 -2251766 -3429483 -3118881 -2093691 -1751507 -2055659 -1809359
40514 -1809359 -720681 59812 -317827 -1259185 -1861073 -2214034 -2767295 -3154861 -2690488
40505 -2690488 -1614177 -797859 -424793 -21116 308596 -76791 -881469 -784239 529242
40496 529242 1455325 625837 -969848 -1324581 -241247 715443 834855 1083763 1996936
40487 1996936 2453138 1531687 317706 510657 1940167 2850995 2377892 1408567 926362
40478 926362 747374 347384 -58928 19708 433041 673127 720333 916606 1213945 1271327
40468 1271327 1242279 1668831 2385948 2364728 1263847 483151 1625348 4067557 5253797
40459E253797j454990k541386j232596L17606K40732n75334l09473Q91973J413468
40450B003797P94022J36377J21467K12512l1920k51259k06225k17520l34676j42342
40440B084233L06152M59406M27533R07505J611919J281299q8229o65887M93214
40431F817145J736453J326247K41690N03963J778427K048234J204307J349545
40423A7006011L267423N115581N562823N943122P643096R016387P067239J578350
40415F2200032m349797p822474q656229q193587p159517n545765l703411k427286
40407A4341966k037112k042374j835236j356818r73439r42627j140374j201123
40399B812863q57709k31772K13156J54080j84791l54192l68707o20000j009119
$$ plain form
40459 5253797 3798807 1257421 24825 342431 583163 7829 -301644 590329 2003797
40450 2003797 2797819 2934196 3055663 3268175 3236255 2984996 2778771 2561251 2226575 2084233
40440 2084233 2390385 2849791 3277324 4184829 5796748 7078047 6989818 6323931 6817145
40431 6817145 8553598 9879845 10121535 10625498 12403925 14452159 15656466 17006011
40423 17006011 20273434 25389015 30951838 36894960 44538056 53554443 60621682 62200032
40415 62200032 57850235 50027761 41371532 33177945 26018428 20472663 16769252 14341966
40407 14341966 12304854 10262480 8427244 7070426 6096987 5154360 4013986 2812863
40399 2812863 1955154 1723382 1936538 2090618 1905827 1551635 1182928 562928 -446191
40390d46191q38604J7000N80537J98266k11611M49034J339958O61800j270116
40381D80073j933847k60688J552525J195284m42151r04629Q8342O92436J13018
40372E80363n13704m02126k20052m80436n64515k5835N02606M25668J22260J16240
40362d59531K42915K17068J94893K65078J57486j23853j60615L9776q3829n79330
40352b89942o99351j11826N02678N13064J24485k97442p24746q60071j31207J104434
40342h69924J456610L68915r34300j180624o99754m27437l13634J38242O41965
40333a819941O79084N54005O89371N83394k29236q75137l16884O90430N11135
40324D66221p20945j133933L1539J271976J062709j23512p90785m02120L94125
$$ plain form
40390 -446191 -1284795 -1267795 -687258 -488992 -700603 -251569 1088389 1750189 480073
40381 480073 -1453774 -1714462 -161937 1033347 591196 -313433 -225091 467345 580363
40372 580363 66659 -335467 -555519 -1035955 -1600470 -1626305 -1123699 -698031 -575771 -459531
40362 -459531 -216616 452 195345 460423 617909 494056 333441 373217 289388 -289942
40352 -289942 -989293 -1101119 -598441 -85377 39108 -258334 -983080 -1843151 -1974358 -869924
40342 -869924 586686 955601 21301 -1159323 -1859077 -2286514 -2600148 -2461906 -1819941
40333 -1819941 -1140857 -586852 102519 685913 456677 -418460 -735344 -44914 466221
40324 466221 -254724 -1388657 -1357118 -85142 977567 854055 63270 -338850 55275
40315E5275Q28969O07470j18616q41654j045354p61118m80279l67181k416Q49309
40305a275595J621532J461323K38006j154426j526811n30343Q60504J233065K74654
40296A201909q66011r61097n8511Q23875Q90178Q7529j034540j532698p31676
40287b181042P60639J341734L90265p59006o55439K28747M24405k52021p28147
40278a429865n49193k37883j202M26608P22346K73979l95723n5395J161708J659030
40268A574410P42737m10186o61021l27930p5354J63471L66581q1418j106097j411391
40258a226198l26319R07076Q50289p6746m65123k8064M17382M44521K45227j61610
40248E80435p63034r59428k73157O17616O22829j74719o86655m32534q5Q4588
$$ plain form
40315 55275 884244 1491714 1373098 531444 -513910 -1275028 -1755307 -2122488 -2124904 -1275595
40305 -1275595 345937 1807260 2045266 890840 -635971 -1166314 -305810 927255 1201909
40296 1201909 335898 -625199 -683710 140165 1030343 1117872 83332 -1449366 -2181042
40287 -2181042 -1420403 -78669 311596 -447410 -1102849 -874102 -449697 -701718 -1429865
40278 -1429865 -1979058 -2216941 -2218143 -1791535 -1069189 -795210 -1190933 -1246328 -84620 1574410
40268 1574410 2317147 1906961 1245940 918010 842656 1006127 1372708 1291290 185193 -1226198
40258 -1226198 -1552517 -645441 204848 128102 -337021 -365085 52297 496818 742045 580435
40248 580435 -182599 -1142027 -1415184 -797568 -174739 -349458 -1036113 -1468647 -1468732 -1384144
40238a384144L2905K06877N49370P60774O15077R7753m71560o42005m19055k77611
40228i31619l21098l5774O90608J070035O05801L313J1982J28125m12225j012790
40218b03642n11178P56927J204202L01141p71747r76597o00887k22779K57499
40209g67061R37296J260505P83774o2817n82553o65753n77599m07291j79922o4118
40199c25539m5680K03761P48779J073921P52256J00097k51908j91013j11303k30923
40189A722448l49733l05074l10512o08254r15590n73102N54270J611711J660144
40180B486308R19999M45708N04927J66004j081889k206804j950159o05222M93642
40171h27486Q14116R07736J095196R70953K80626n85961j115732j070818m33077
$$ plain form
40238 -1384144 -1351239 -1144362 -594992 165782 780859 878612 407052 -234953 -654008 -931619
40228 -931619 -1252717 -1288491 -597883 472152 1077953 1081266 1093248 1221373 809148 -203642
40218 -203642 -714820 42107 1246309 1547450 775703 -200894 -801781 -1024560 -767061
40209 -767061 170235 1430740 2214514 2151697 1569144 903391 325792 -81499 -261421 -325539
40199 -325539 -371219 -167458 581321 1655242 2407498 2507595 2255687 2064674 1953371 1722448
40189 1722448 1372715 1067641 757129 148875 -766715 -1339817 -785547 826164 2486308
40180 2486308 3406307 3852015 4356942 4522946 3441057 1234253 -715906 -1321128 -827486
40171 -827486 -13370 894366 1989562 2960515 3241141 2655180 1539448 468630 35553
40162C5553M27479P33528J76387m38259k33147L69304L10768l61210o14962j63888
40152B41553K28139K06094K49993M60770K77645k59599l04409K82705N15039p5972
40142A821958o64461o40868n84842r08992q21937K73811J423506J366018L42201
40133A606394m78466p06656p60824p48181m27316N5659L04773K66415L6077m54235
40123a306360r54090p65822J83603Q58947N12528j77588k38701J34237K66671
40114a486575L28661P37957R49313K37291p98213r07446n3193O96403Q20068O02880
40104A127146R7603p64388j282268o82396M21589P13312K01561L9308M04042K87230
40094E62739m50862o38676J18496O35967J56939m05584j25018M36484M04453P1304
$$ plain form
40162 35553 463032 1196560 1372947 934688 701541 1070845 1381613 1020403 405441 241553
40152 241553 469692 675786 925779 1386549 1664194 1404595 1100186 1382891 1897930 1821958
40142 1821958 1157497 516629 -68213 -977205 -1799142 -1525331 -101825 1264193 1606394
40133 1606394 1127928 421272 -339552 -1087733 -1515049 -1459390 -1154617 -888202 -852125 -1306360
40123 -1306360 -2260450 -3026272 -2842669 -1983722 -1471194 -1648782 -1887483 -1753246 -1486575
40114 -1486575 -1157914 -419957 529356 766647 -31566 -939012 -992205 -295802 524266 1127146
40104 1127146 1224749 460361 -821907 -1504303 -1082714 -369402 -167841 -128533 275509 562739
40094 562739 111877 -526799 -408303 227664 384603 -20981 -145999 290485 694938 766242
40084G66242Q6641J47364l44720j020095j011063k31818O28283R83231O45843
40075F49908k09895q83003o28620J86787K46767p88633j480568o01673R79792
40066b529138J517861P97433Q8093J10193L03363M2827m74595p04530m18496J93482
40056a073507O41791M61295k20426o85259n15216q6427J35798K10650K32381l3894
40046i32814m68942l71354L68371P45241J87678l23017J51743P55342K27786p43964
40036d03930n02216O72218Q26394l85188r70834J36974J213489M39190j214945
40027a88848j499113k04235Q49417O58973J36161K88289P49053O32906q3831o64957
40017F73815o28064j59545K63365L02546r8014o93311r94592n69664M67640J303513
$$ plain form
40084 766242 852883 1000247 655527 -364568 -1375631 -1607449 -979166 4065 649908
40075 649908 440013 -442990 -1071610 -884823 -638056 -1426689 -2907257 -3508930 -2529138
40066 -2529138 -1011277 -213844 -125751 -15558 287805 330632 -143963 -848493 -1266989 -1073507
40056 -1073507 -431716 29579 -190847 -876106 -1391322 -1477749 -1341951 -1131301 -898920 -932814
40046 -932814 -1401756 -1773110 -1404739 -659498 -471820 -794837 -643094 112248 340034 -403930
40036 -403930 -906146 -233928 592466 207278 -763556 -626582 586907 1026097 -188848
40027 -188848 -1687961 -1892196 -1042779 -383806 -247645 40644 789697 1422603 1338772 673815
40017 673815 45751 -113794 149571 452117 354103 -339208 -1333800 -1903464 -1435824 -132311
40007a32311J080971j08289j132562r84205J33392J119490J160483L35179o68894
39998H03254j065485m91211N27689R11289K88526m64101m93624k05174l64295
39989e53132n83175r586Q59566P07975k51001l05272R01292J451473J06423j567128
39979G57435j517029k55179K50033k42923k55406O31305J098066L71889n95683
39970B42508p45123k96649P6546L03274M78472K91204m18280j142161j263101
39961b473310o86782K96141J213648J398225N51796n14381n66719M02507J133437
39952G54562R31749M34986J75089l01169j131143j288195j97901Q91551N67680
39943H37209n30935o99746K00393P49399L13957l04485n37877o79850o46774J81634
$$ plain form
40007 -132311 948660 840371 -292191 -1276396 -1143004 -23514 1136969 1472148 803254
39998 803254 -262231 -753442 -225753 685536 974062 509961 16337 -188837 -553132
39989 -553132 -1136307 -1145893 -286327 421648 170647 -134625 766667 2218140 2324563 757435
39979 757435 -759594 -1014773 -764740 -1007663 -1263069 -631764 466302 838191 242508
39970 242508 -502615 -799264 -722718 -419444 59028 350232 -68048 -1210209 -2473310
39961 -2473310 -3160092 -2863951 -1650303 -252078 299718 -214663 -781382 -378875 754562
39952 754562 1686311 2121297 2296386 1995217 864074 -424121 -622022 269529 837209
39943 837209 306274 -393472 -193079 556320 870277 565792 27915 -651935 -1298709 -1117075
39933a117075J383169J401066j41628j475430j070702K34991O86754J55681j54222
39924i7396J68364L88711J18266j47146p014K86368L19519o3753p04503j002738
39914g41322k90367J063702J566794M74006r53472j148241m59365k66304n48525
39905a303094j92407O07922M23050p39829j050353J55124J093306L90408o59196
39896a275069k49474J023296J251906K33787n10133k41009K25344J46105k03035
39887D01718l19016j17235L16543Q02849R11469L88273l93597r14744j077087
39878h27q33261N8477J237427J544914N64570m71899m03971J12791j22588p52083
39868I33550o42921j0749R7305j26688K74745Q59010L03506j014779j269463j85761
$$ plain form
39933 -1117075 266094 1667160 1525532 50102 -1020600 -785609 -98855 56826 -97396
39924 -97396 70968 459679 577945 430799 423785 710153 1029672 965919 261416 -741322
39914 -741322 -1031689 32013 1598807 2072813 1119341 -28900 -488265 -754569 -1303094
39905 -1303094 -1495501 -887579 -464529 -1204358 -2254711 -2099587 -1006281 -615873 -1275069
39896 -1275069 -1524543 -501247 750659 984446 474313 233304 458648 604753 401718
39887 401718 82702 -34533 282010 1084859 1996328 2384601 1991004 1076260 -827
39878 -827 -834088 -775611 461816 2006730 2571300 2099401 1695430 1808221 1685633 933550
39868 933550 290629 279880 377185 250497 525242 1384252 1687758 672979 -596484 -782245
39858g82245N40255J92018k1521M10332K84929o78568p51714P47768J695709L94670
39848B031633j486985j446293N9485P67075K49831j33237j4434j64117l83772
39839e20814K33692J129835P70972o13268j085604j29797M95625k91547j125179
39830a136085m50079J029982J459045M03146q41928j001841o9149R10525Q72118
39821A175734j59509r03375k65323J087926J368949n690j587464j721419m71100
39812a481271P20498P70485q8313q13248o90510K822M66770M47270M33338O77620
39802D45461P15977K79282j02449o5401j52139p14458r53708k08977O25343L81080
39792B50011m07570m43139L5141j91539q45496m12112J093393J831887J011618
$$ plain form
39858 -782245 -241990 -49972 -71493 338839 623768 -54800 -806514 -58746 1636963 2031633
39848 2031633 544648 -901645 -842160 -75085 174746 41509 27075 -137042 -520814
39839 -520814 -287122 842713 1613685 1000417 -85187 -214984 280641 -10906 -1136085
39830 -1136085 -1586164 -556182 902863 1306009 464081 -537760 -606909 303616 1175734
39821 1175734 1016225 112850 -152473 935453 2304402 2298712 711248 -1010171 -1481271
39812 -1481271 -760773 9712 -78601 -891849 -1582359 -1579537 -1112767 -665497 -232159 445461
39802 445461 1161438 1440720 1338271 1272870 1120731 406273 -547435 -756412 -131069 250011
39792 250011 -157559 -600698 -565557 -757096 -1602592 -2014704 -921311 910576 1922194
39783A922194m4297k96726l88451q15419p35599K40478Q83782L05493m94700m08815
39773A67940o1283l75507o90428j7592R54487R22384J76281o4738J19361l62923
39763G67982j438256j764448q21722L63180P36557L26574k44035m18190Q0718
39754b411640Q86238J055044K75814m10583k4237P49710N44917n44042j172931
39745a051710q46192l35021m0497N14436J273960J207499o0652j308198j201967
39736a848342J4987J032363J124882O26111R8399k93025n61879n24412J6137P32034
39726D17255Q35184R4442n36431q9085Q04277O44473m88394q09360K21710O57606
39716A751677q49600k438543j632018P07790J618881N70171j54878M02486M52946
$$ plain form
39783 1922194 1877897 1581171 1192720 377301 -358298 -117820 765962 1071455 576755 167940
39773 167940 106657 -268850 -959278 -976870 -22383 900001 1076282 1011544 1130905 767982
39763 767982 -670274 -2434722 -3256444 -2893264 -2156707 -1830133 -2074168 -2492358 -2411640
39754 -2411640 -1525402 -470358 -194544 -605127 -629364 120346 665263 121221 -1051710
39745 -1051710 -1897902 -2232923 -2273420 -1758984 -485024 722475 661823 -646375 -1848342
39736 -1848342 -1833355 -800992 323890 950001 1048400 755375 193496 -330916 -314779 417255
39726 417255 1252439 1346881 810450 721365 1525642 2170115 1681721 872361 1094071 1751677
39716 1751677 902077 -1536466 -3168484 -2460694 -841813 -271642 -426520 -24034 428912
39707D28912r67353j913441p21140J023714R01030n33472p48719P93335K024006
39698B86872J483718J13433n46647l68168j49636j85332j58927K5512M2991k26848
39688C16968l19429K35753J001162Q17430o34081j907861j358234N29102J566259
39679B47069Q04784l38165m77465k55641p43524j204697k82057J378840J801830
39670I30974P82909J64598O87596P63456o28598j836537j024252P09517Q86737
39661A436400m49158q40641N52451J524751L53060j398903j289989K70660Q25073
39652I83704l25370j341196q71331J98071N41652J84841l12335r30115j416317
39643c288396q03467R91397K176762J213934q08683j490007l27906R62903J094992
$$ plain form
39707 428912 -538441 -2451882 -3173022 -2149308 -1248278 -1781750 -2530469 -1737134 286872
39698 286872 1770590 1884023 1337376 969208 819572 634240 475313 500825 543816 316968
39688 316968 -2461 233292 1234454 2051884 1417803 -490058 -1848292 -1319190 247069
39679 247069 1051853 713688 236223 -19418 -762942 -1967639 -2249696 -870856 930974
39670 930974 1713883 1878481 2566077 3329533 2700935 864398 -159854 549663 1436400
39661 1436400 987242 146601 699052 2223803 2576863 1177960 -112029 158631 983704
39652 983704 658334 -682862 -1554193 -1356122 -814470 -629629 -941964 -1872079 -3288396
39643 -3288396 -4091863 -3100466 -923704 290230 -518453 -2008460 -2336366 -1373463 -278471
39634b78471N38870J26342j31972m00679m16094q1613J93855J53265k917j34349
39624d33763k48390n9056O37892J156027N80607o45776j012682j10129P42200
39615F06930N13862j30322j56583K14557J29772m55710q52737o28244J20644R75561
39605C37730J259109N60335m37321n06526L43612O89056j44817r62156o26569
39596E12453J05131o6280p98251p96046m2100K83703j40020l47416J85576P07122
39586c96128M41449l00686o83051l81043K53401O55564N20934P0488j81857p1801
39576g2730P4705Q2337J80636L55852J61995l66321m17252L25317R29038N57962
39566A811539k28951m83302l62774m76829n13552J01078P90009N93369r9710j87244
$$ plain form
39634 -278471 260399 386741 254769 -145910 -562004 -643617 -449762 -296497 -299414 -433763
39624 -433763 -682153 -741209 -103317 1052710 1633317 987541 -25141 -135270 606930
39615 606930 1120792 990470 833887 1048444 1178216 722506 -130231 -758475 -637831 337730
39605 337730 1596839 2157174 1719853 1213327 1556939 2245995 2101178 1139022 512453
39596 512453 617584 551304 -246947 -1042993 -1085093 -801390 -941410 -1288826 -1103250 -396128
39586 -396128 45321 -255365 -938416 -1319459 -1066058 -410494 110440 180928 -929 -72730
39576 -72730 1975 84312 264948 620800 782795 416474 -778 324539 1253577 1811539
39566 1811539 1582588 1099286 736512 259683 -253869 -152791 637218 1230587 1130877 943633
39556I43633J33432k27604r90273o46244Q65697J604566M64440j138055j374674
39547c65082m09657L75530M52281L08388K84150K47729L2272l92834p95158n55890
39537h18271N75915J544446R76045o39010j211795p8072Q77433J46819r91316
39528C82194n75911Q50046J183957J26127n78755q2751M65566R9401m85756l39027
39518A045091K43578M79059L42923J89660j08285p38891j154114o19024N50908
39509B30905J067087K08862j148206j439315k82433R83033R53570K1097j79739
39500D14861Q19789J544477P85332m80248n51144L49557M75693n99758j286274
39491A472285n06682O75031Q11969J68025r7235R4665r4180p75670j143930p87092
$$ plain form
39556 943633 1077065 849461 -140812 -787056 78641 1683207 2147647 1009592 -365082
39547 -365082 -774739 -399209 53072 361460 645610 893339 925611 532777 -262381 -818271
39537 -818271 -242356 1302090 2278135 1639125 427330 349258 1226691 1373510 382194
39528 382194 -193717 656329 1840286 1966413 1387658 1304907 1770473 1869874 1384118 1045091
39518 1045091 1288669 1767728 2110651 2300311 2192026 1453135 299021 -320003 230905
39509 230905 1297992 1506854 358648 -1080667 -1363100 -380067 573503 594600 414861
39500 414861 1234650 2779127 3564459 3084211 2533067 2882624 3358317 2758559 1472285
39491 1472285 965603 1640634 2452603 2620628 2523393 2618058 2523878 1748208 604278 -182814
39481a82814j39547L31611M85032J31696p33659j327763p38698O31996J300257
39472b41889O86317j39311j60923J78112K9697l40222j53173L85489L78694k63947
39462C58844p47650p14197n67712m54386p623O70797Q19843K10412l97274m62368
39452a291314m31824p02053p16839K6664P97478N53616l47441n01490N33236J600676
39442d79291J517638M77347m31760n39531j05858J26127l14504j090126j286066
39433b126024m78020N80490Q22199K71939r7400J08537K14653j92004l78727L41045
39423i33312J209562Q92189m48642j080673l1186J439112J417321j64689j545585
39414G54097j476823n30792J55835M08080N78867M33381l91706j212375q81103
$$ plain form
39481 -182814 -322361 9250 494282 625978 -107681 -1435444 -2174142 -1542146 -241889
39472 -241889 444428 305117 144194 322306 352003 11781 -141392 244097 622791 358844
39462 358844 -388806 -1103003 -1670715 -2125101 -2132724 -1461927 -642084 -431672 -828946 -1291314
39452 -1291314 -1723138 -2425191 -3142030 -3115366 -2317888 -1764272 -2111713 -2613203 -2079967 -479291
39442 -479291 1038347 1515694 1083934 544403 438545 564672 250168 -839958 -2126024
39433 -2126024 -2604044 -2023554 -1201355 -929416 -1026816 -918279 -703626 -895630 -1274357 -933312
39423 -933312 276250 1168439 719797 -360876 -392062 1047050 2464371 2299682 754097
39414 754097 -722726 -1253518 -1097683 -689603 -110736 322645 -69061 -1281436 -2162539
39405b162539M11465J156150O50483q9578o7185K36755k0106n14597m55560l4338
39395h89050K0564k12345j45823J12237Q0113N1834N79354J056785L37371j199840
39385b08800j750231o11853P94614R98217L20911o6128J36201M02715L49189j04429
39375B60406q76644j412493r28218M05686J247152P49380k46889m68839P390J86810
39365a076259j34440k01978L00750P22067M75974j55453n34867m66232j81148
39356a251586J23443L96862N27005L64542N1864M8795N01320P57390R6432j027481
39346E88586j281979l27539N57064L80826r0527J44491M30899k64846j063551
39337i26576l38863J241044J343362k38948j099451j79569N43123l84471j317121
$$ plain form
39405 -2162539 -1751074 -594924 55559 -34019 -101204 135551 115445 -399152 -854712 -889050
39395 -889050 -868486 -1080831 -1226654 -1114417 -1034304 -982470 -403116 653669 991040 -208800
39385 -208800 -1959031 -2570884 -1776270 -778053 -457142 -523270 -387069 15646 364835 260406
39375 260406 -616238 -2028731 -2956949 -2551263 -1304111 -554731 -801620 -1270459 -1263069 -1076259
39365 -1076259 -1210699 -1412677 -1111927 -389860 86114 -69339 -604206 -1070438 -1251586
39356 -1251586 -1128143 -731281 -204276 160266 212130 260925 762245 1519635 1616067 588586
39346 588586 -693393 -1020932 -463868 -83042 -173569 -29078 401821 136975 -926576
39337 -926576 -1265439 -24395 1318967 1080019 -19432 -199001 344122 -40349 -1357470
39328a357470m69677Q51248M92220p85607o07728R97938J725010O94635n73289
39319I67280q67850o52606n04506k04275K29501K41489j82856m52931m40799l64922
39309b232475J29212J291880K036349J161521m43092p81467J69504N08437l71445
39300A468424r31404k96860M00327K54428l2297L2637l59980j413156j718235
39291b596116n54760O27090N60853K74359J069248J949488J198419n58683j109470
39282H60428M8783J196893J027539N9648o45395p47543m02672J28103M04005Q1241
39272B011030o10483j110334j130157p41188k35046r1145m46427m77986O69329
39263b162407K140621K007162J79142j043491k98537Q20430N08879l89164k70099
$$ plain form
39328 -1357470 -1827147 -975899 -483679 -1269286 -1877014 -879076 845934 1540569 967280
39319 967280 99430 -553176 -1057682 -1261957 -1032456 -790967 -973823 -1426754 -1867553 -2232475
39309 -2232475 -2103263 -811383 1224966 2386487 1943395 1161928 1331432 1839869 1468424
39300 1468424 537020 240160 640487 894915 862618 895255 535275 -877881 -2596116
39291 -2596116 -3150876 -2523786 -1962933 -1688574 -619326 1330162 2528581 1969898 860428
39282 860428 909211 2106104 3133643 3193291 2547896 1800353 1397681 1525784 1929789 2011030
39272 2011030 1400547 290213 -839944 -1581132 -1816178 -1907323 -2353750 -2831736 -2162407
39263 -2162407 -21786 1985376 2164518 1121027 822490 1642920 2151799 1762635 1492536
39254A492536K21756l57146j150857l62739J117678P44321j240806j802624K304
39245a335577J468045O39843q07681p19970J82068J50672n09790m70266P8175
39236a324481J20989j04057J81842M62477j46777r04759m48057P61773J069262
39227c31788L55804L1245M18284L45599l97857m11957P71733J491029M74853j037426
39217A709519j144944p3271N00120J57074K6126N51183O76622k94410j343496
39208G64523j099598J94876J027934O42066j68950l72084m6656K5752l33648m84795
39198A49420l9889M80443M05661o4662j35872L76337O84992J08303r02148j244901
39188a82316n25989N32844J070123R83211O32342J49248m29543o57888p8044Q44546
$$ plain form
39254 1492536 1714292 1357146 206289 -156450 961228 1705549 464743 -1337881 -1335577
39245 -1335577 132468 772311 -35370 -755340 -573272 -422600 -932390 -1402656 -1324481
39236 -1324481 -1203492 -1307549 -1125707 -663230 -810007 -1714766 -2162823 -1401050 -331788
39227 -331788 24016 55261 473545 819144 421287 9330 781063 2272092 2746945 1709519
39217 1709519 564575 491304 991424 1148498 1174624 1725807 2402429 2108019 764523
39208 764523 -335075 -140199 887735 1529801 1360851 988767 942111 967863 634215 149420
39198 149420 109531 589974 995635 930973 795101 1171438 1856430 1964733 1062585 -182316
39188 -182316 -708305 -175461 894662 1877873 2510215 2659463 2229920 1572032 1493988 2338534
39178B338534R56409r6197j256087j375555n79329K31808O62948Q48092O56503
39169B387126j22724r61072r64490j39126O09973Q34487R37530J040104N75232
39160D197040m96608j142268p03807k162o8978n39487m28596P3468o2409p87697
39150C8496q42116K09134J095287O40830n18374q86448j95164M03390O6270o66090
39140f54785p40768J2726P67872P94944K74335q8860L465K10142J93765Q2242
39130H55078Q7206K7640l48151p59616o31465L8619N20616K52205m36773p46965
39120a141606l50916L24928O51273M27948j0836j96176K236K99734L96621L47716
39110G50922L87118M71279K79682k59231p22801o95664l44629j88962l29798k70296
$$ plain form
39178 2338534 3294943 3198746 1942659 567104 -12225 219583 882531 1730623 2387126
39169 2387126 2264402 1303330 338840 199714 809687 1644174 2581704 3621808 4197040
39160 4197040 3700432 2558164 1854357 1852195 1783217 1243730 815134 888602 826193 38496
39150 38496 -803620 -594486 500801 1141631 623257 -263191 -458355 -54965 11305 -654785
39140 -654785 -1395553 -1382827 -614955 179989 454324 365464 368929 579071 772836 855078
39130 855078 942284 969924 621773 -137843 -769308 -730689 -210073 42132 -394641 -1141606
39120 -1141606 -1492522 -1167594 -516321 -88373 -99209 -295385 -293149 6585 403206 750922
39110 750922 1138040 1609319 1889001 1629770 906969 211305 -133324 -322286 -652084 -922380
39100i22380L01011Q43459N34766n06544j105358m63899O91953R57965N7720q70283
39090d81590q37609j42515L54560M26532M03690L79800J80926q9014j07456J26907
39080B14231L28257M25509N30156M86611K1513o55662r68368p62504m47477k69086
39070a096820k0250L66482N39444L20392M2646k9975j24599m25669o03143l49727
39060a381219L473n5022m07058m68005N327O99635J172119J119515M66864l75103
39050G80526o13278J9614O76901L45039p56818j409646r86981q2702N27370P75030
39040g24945Q90080Q16516M68273N0173k69699n67503p50246m88164Q2299K33569
39030b59647k64704o09721k04835K70697L566l68201L41565J675002J834460L66249
$$ plain form
39100 -922380 -621369 222090 756856 250312 -855046 -1318945 -626992 330973 388693 -481590
39090 -481590 -1319199 -1461714 -1107154 -680622 -276932 102868 283794 194780 87324 214231
39080 214231 542488 967997 1498153 1984764 2006277 1350615 382247 -380257 -827734 -1096820
39070 -1096820 -1117070 -750588 -211144 109248 151894 121919 -2680 -428349 -1031492 -1381219
39060 -1381219 -1377746 -1432768 -1839826 -2307831 -2302504 -1602869 -430750 688765 1155629 780526
39050 780526 167248 186862 863763 1208802 451984 -957662 -1944643 -2027345 -1499975 -724945
39040 -724945 165135 981651 1449924 1500097 1230398 662895 -87351 -575515 -493216 -259647
39030 -259647 -524351 -1134072 -1338907 -1068210 -1064644 -1432845 -1091280 583722 2418182 2784431
39020B784431j055382j127521o68329q45316j057855j51908J202096J257155n577
39011C31794p50338j68678L53406l46857j249460q07162N89451J239468O08040
39002b00336k25505l60814l1243K76585N07777N81927K32210k95685k17853N99223
38992H66286J126635M84785p63882j345537r36086l17180n6549J03959M21187
38983d16382N23842O5832n41023o44711l23927k15616m41824l62375L94702J206235
38973g55247J205466M55579j51538r4011J87121K1044n66093r37906o63114M2384
38963a256315O53424Q88271Q24524N80816J16404n17791r29762p65595l08141
38954g14165j83712l33908M3619J101200J660661P88531n78574q12834l1449J74568
$$ plain form
39020 2784431 1729049 601528 -66801 -912117 -1969972 -2121880 -919784 337371 331794
39011 331794 -418544 -587222 -233816 -580673 -1830133 -2637295 -2047844 -808376 -200336
39002 -200336 -425841 -786655 -817898 -541313 -33536 548391 780601 484916 267063 866286
38992 866286 1992921 2477706 1713824 368287 -567799 -884979 -941528 -837569 -416382
38983 -416382 107460 173292 -367731 -1012442 -1336369 -1551985 -1993809 -2356184 -1961482 -755247
38973 -755247 450219 905798 754260 660249 847370 868414 302321 -635585 -1298699 -1256315
38963 -1256315 -602891 285380 1109904 1690720 1807124 1289333 359571 -406024 -714165
38954 -714165 -897877 -1231785 -1188166 -86966 1573695 2362226 1783652 970818 939369 1113937
38944A113937n74219q32597Q4624P77686J35812o60208j37772Q37089M73974q18229
38934D00097j042500M2380O12137m8353m39552M29895J368748J082292R4346n94909
38924A904581j124192j695083j416208J25898J382100P82851p08945r03225L30627
38915a321596J070247M40411k66301J47130J074079J255382M44750o29288j123040
38906A091774o05199N02630R42497l9121j392763j373579M0634J083558P16836
38897I67267j57362m10009k28952k61770m45981n27039o78025p61352m6697J355577
38887a194343J857120M57879j411070j577053j02169R75321O26698l1484K33802
38878a65299J018799J129231K42449q77237j309225p73495J40038M57698p5866
$$ plain form
38944 1113937 539718 -292879 -208255 569431 705243 45035 -92737 744352 1218326 400097
38934 400097 -642403 -600023 12114 -36239 -475791 -45896 1322852 2405144 2499490 1904581
38924 1904581 780389 -914694 -2330902 -2205004 -822904 -40053 -748998 -1652223 -1321596
38915 -1321596 -251349 189062 -77239 69891 1143970 2399352 2844102 2214814 1091774
38906 1091774 486575 989205 1931702 1892581 499818 -873761 -833127 250431 967267
38897 967267 809905 399896 170944 -90826 -536807 -1063846 -1741871 -2503223 -2549920 -1194343
38887 -1194343 662777 1120656 -290414 -1867467 -1969636 -994315 -367617 -399101 -165299
38878 -165299 853500 1982731 2225180 1347943 38718 -734777 -594739 -137041 -212907
38869b12907n42678r4189O29670L00989r43821j394600j96502J290565J340182
38860A76709J65538o15872k57614M43738N51021R3878l24123l22599M1052M09587
38850C61315L84005k2431k45820J17853O04355M55625j68139l12982K63881N68278
38840B005940j13090r09555m99598Q28941J369230L64341q59947o87127O29917
38831B129052J420778Q09110m23913j119217j023547n66518p0091L52419N33597
38822B041670L72359L4357k75035n42911p11881m92256K44654J091008J455631
38813C217596J134320K96982p67449j547505j392413l17822N99889M06411l73891
38804A256118m87014P0496M6171q50845j138695J77881J741286J568122j20945
$$ plain form
38869 -212907 -755585 -849774 -220104 80885 -862936 -2257536 -2454038 -1163473 176709
38860 176709 342247 -273625 -531239 -87501 463520 557398 233275 -89324 -48272 361315
38850 361315 745320 722889 477069 594922 1199277 1654902 1486763 1173781 1437662 2005940
38840 2005940 1892850 983295 483697 1312638 2681868 3046209 2186262 1499135 2129052
38831 2129052 3549830 4358940 3935027 2815810 1792263 1225745 1155654 1508073 2041670
38822 2041670 2414029 2448386 2173351 1630440 918559 426303 670957 1761965 3217596
38813 3217596 4351916 4648898 3881449 2333944 941531 623709 1223598 1630009 1256118
38804 1256118 769104 839600 885771 34926 -1103769 -925888 815398 2383520 2262575
38795B262575j332090j169657n94245l11574K60306J327977J735795P67634l90105
38786B556616l73697J89501j61310j140046j174504j48018L49076k74580o56894
38777h33856P0698P51707K71405m57538j15280O61873L49904q24343j229956m59413
38767a814799K61103K55475J90718M35787L30152l78790q60044o09101k09911
38758b399410m6729L87716J132767J137813O1868o46632J66185J327926J002806
38749B124310m62149j155891n86491j42816o03803j015287m86066M06795P08553
38740a212845M79644L62076N14476O23488M75561O8609m64111p97529o59908k29778
38730h40317R9561K69327L83673K43402k32710m25813J57177P23504J42362r92738
$$ plain form
38795 2262575 930485 -239172 -833417 -1144991 -884685 443292 2179087 2946721 2556616
38786 2556616 2182919 2372420 2211110 1071064 -103440 -251458 97618 -176962 -833856
38777 -833856 -763158 -11451 259954 -197584 -312864 349009 698913 -125430 -1355386 -1814799
38767 -1814799 -1553696 -1298221 -1107503 -671716 -341564 -720354 -1580398 -2189499 -2399410
38758 -2399410 -2446139 -2058423 -925656 212157 274025 -372607 -206422 1121504 2124310
38749 2124310 1662161 506270 -80221 -223037 -826840 -1842127 -2328193 -1921398 -1212845
38740 -1212845 -733201 -371125 143351 766839 1242400 1311009 846898 49369 -610539 -840317
38730 -840317 -740756 -471429 -87756 155646 -77064 -502877 -345700 377804 520166 -472572
38720d72572q01361J022414K386355J628452k63377j326231j254114j007455p90681
38711h78570m6845J004214J379915Q43729J87369l4488o1829k16976n31999j061691
38701E82829j699484j740427n80368J092035J756304R28785k45452n03035J81454
38692b27359R87247J259555Q09354j53193j016750j186067p53296k99125M0350
38683e39284O01530J139718P31148o79877j533469m86050J480388J969693K16537
38674B900334j863251k077982n37562R05374J177990Q63993O57839K14549p96217
38665A445067j456715o58509R40212J385526Q1058j298940j167358j61214Q0795
38656h10078n85167q51572j04726Q16156J021481N91728O364m69073n58753j9511
$$ plain form
38720 -472572 -1273933 -251519 2134836 3763288 3499911 2173680 919566 -87889 -878570
38711 -878570 -925415 78799 1458714 2302443 2489812 2455324 2393495 2176519 1644520 582829
38701 582829 -1116655 -2857082 -3437450 -2345415 -589111 339674 94222 -408813 -227359
38692 -227359 759888 2019443 2828797 2675604 1658854 472787 -280509 -579634 -539284
38683 -539284 62246 1201964 1933112 1253235 -280234 -766284 714104 2683797 2900334
38674 2900334 1037083 -1040899 -1578461 -673087 504903 1368896 2026735 2241284 1445067
38665 1445067 -11648 -670157 270055 1655581 1736639 437699 -729659 -890873 -810078
38656 -810078 -1395245 -2246817 -2351543 -1535387 -513906 77822 84186 -384887 -943640 -963151
38646i63151P45774Q78140K31594l32407j89461J84193O7967l55872k98163N00388
38636D69002J411013J595262Q24241k82289q32391o36577l94459o10057p85626
38627G58119l56693J11825k14297p53223k05133J070233J165539l76527j499494
38618b99651n83072J179885J729376J046446M50468J62977m50461r81944m68780
38609A785244N40139N09326m80567p04795L25190R62343Q4806j158167j247045
38600F16474m26143K06601M95406Q31122Q90569J21065j026155j496045r90384
38591g77490r1521O41202R51425O39152j86651q65897q43640l20174K20822O68611
38581C5839R38546O04576l33321q89310k89379O70378N63001n53475j108736k25184
$$ plain form
38646 -963151 -217377 660763 892357 559950 370489 554682 622649 266777 -31386 469002
38636 469002 1880015 3475277 4299518 4017229 3184838 2548261 2153802 1543745 758119
38627 758119 401426 513251 298954 -454269 -659402 410831 1576370 1199843 -299651
38618 -299651 -882723 297162 2026538 3072984 3523452 3686429 3235968 2254024 1785244
38609 1785244 2325383 2834709 2354142 1649347 1974537 2936880 3021686 1863519 616474
38600 616474 190331 396932 892338 1723460 2614029 2735094 1708939 212894 -777490
38591 -777490 -869011 -227809 723616 1362768 1176117 310220 -533420 -853594 -632772 35839
38581 35839 974385 1578961 1245640 356330 66951 737329 1300330 746855 -361881 -587065
38571e87065J081088J285937K10532r70322j166276m54265J47164j23024q12383
38562a388614p63299L27559J396427J409957O41737k5135l85647o60755o00031
38553d7801M7954O19631L28123l35185l09112J71010n7262q99147r18866K51346
38543a149309J158682Q11634O6026j12151j73386o74592r25382l02345L53905
38534i46918J58744j10915O04445J505390J050145m19243j132413o51023k09223
38525a51011l58699k60392L87121N90073j37178p77845l96739N13121R62915O88329
38515A059695j05612j123385j584869o49241J102039J769317N19540j177430j512381
38506a702327n25756N20566R27162P07842q9299j065780j249132l18635O27336
$$ plain form
38571 -587065 494023 1779960 1990492 1020170 -146106 -600371 -453207 -576231 -1388614
38562 -1388614 -2151913 -1824354 -427927 982030 1623767 1598632 1212985 552230 -47801
38553 -47801 153 619784 947907 612722 303610 474620 417358 -481789 -1400655 -1149309
38543 -1149309 9373 821007 887033 774882 601496 -73096 -998478 -1300823 -946918
38534 -946918 -788174 -899089 -294644 1210746 2260891 1841648 709235 58212 -151011
38525 -151011 -509710 -770102 -382981 207092 69914 -707931 -1104670 -591549 371366 1059695
38515 1059695 954083 -169302 -1754171 -2403412 -1301373 467944 987484 -189946 -1702327
38506 -1702327 -2228083 -1707517 -780355 -72513 -161812 -1227592 -2476724 -2795359 -2168023
38497b168023N98916K21336M93785Q99103L49679n98274l69611R45062J455484
38488A827457L36575r19198p87860J95883N40343q3087p89624q53876k87933N03593
38478c17727J002203Q52814L03783J0957J25038Q9046l63648o66213l48268J01401
38468G89386o6475p31991j119093q54933k33376L60442P20673O56580J22839m84312
38458h40260o23776k77503L4358K582l0638L96365J072887J201595M04366o14221
38448G25755p95179q2992M65490J45005m12589k44697M54987O75109J58587l07665
38438G81811j91095J29298K30432L13255O04221P84291M74143k18933r67666j521049
38428D18708j507224o30609N81451R66223J74202p17772n88583L48510J100816
$$ plain form
38497 -2168023 -1569107 -1347771 -853986 45117 394796 -203478 -573089 371973 1827457
38488 1827457 2164032 1244834 456974 652857 1193200 1110113 320489 -533387 -821320 -317727
38478 -317727 684476 1537290 1841073 1852030 1977068 2066114 1702466 1036253 687985 789386
38468 789386 722911 -9080 -1128173 -1983106 -2216482 -1856040 -1135367 -478787 -355948 -840260
38458 -840260 -1464036 -1741539 -1707181 -1704599 -1735237 -1338872 -265985 935610 1339976 725755
38448 725755 -69424 -152416 313074 458079 45490 -199207 255780 930889 1089476 781811
38438 781811 590716 720014 950446 1263701 1867922 2652213 3126356 2907423 1939757 418708
38428 418708 -1088516 -1719125 -1137674 -171451 2751 -715021 -1303604 -955094 145722
38419A45722J159369N76727m72048j381428j107355M49581J637678R15378q40501
38410A083123j323381j6825J130182N89289o90430r23782l55P64404O53234J32325
38400A397784k64907n22639n95315k35989L43723L86859l56092r81033m57183
38391a284792Q82195J536480O91962o68277r69367l8040P77898M85464l03275
38382A110248m01634K48603O17750J27984o03579p28058l09476j18848n20425
38373e77435r51775o04657N23560J470358J340219L54976m56288n69852m32864
38364I6242m49051k17098O03761J247909O70354p34958j337606m51420O71392
38355I9525O06652k78769n14986K59031Q27403K18882r05581j170758k73160P62925
$$ plain form
38419 145722 1305091 1881818 1409770 28342 -1079013 -629432 1008246 1923624 1083123
38410 1083123 -240258 -257083 873099 1462388 771958 -151824 -152179 612225 1265459 1397784
38400 1397784 1132877 610238 14923 -221066 122657 509516 153424 -827609 -1284792
38391 -1284792 -402597 1133883 1825845 1157568 188201 150161 928059 1413523 1110248
38382 1110248 708614 957217 1574967 1702951 1099372 371314 61838 -57010 -577435
38373 -577435 -1529210 -2133867 -1610307 -139949 1200270 1555246 1098958 529106 96242
38364 96242 -352809 -569907 33854 1281763 1952117 1217159 -120447 -571867 99525
38355 99525 706177 427408 -87578 171453 998856 1217738 312157 -858601 -1131761 -368836
38345c68836R59393M47688K6853P2786K34579R7949j86868q8384N81024J272072
38335C048256J177335J76139q63878j007702l94108m002k26382l07171L74211
38326A972698J150123R69452J1450n94902m72104l28769n66915p09972m94652
38317I36409l90037n49120l48444L74984P02526R2611n40527k27860M73758M83526
38307A007826j902n5441K43961R9652l73872l39496J44800K21593j25531q0727
38297G40863L18601J57568m67351k82347R13142J557034P21506m09394n45769
38288B703853k81009o72033j100561l22926J099703J298926j30877j493653j342221
38279b40798j77742N98539M50321q5555l22990p0375L71079N82234M79932L64816
$$ plain form
38345 -368836 590557 1038245 1065098 1137884 1372463 1470412 1283544 1195160 1776184 3048256
38335 3048256 4225591 4401730 3537852 2530150 2136042 2132040 1905658 1598487 1972698
38326 1972698 3122821 4092273 4103723 3508821 3036717 2707948 2141033 1431061 936409
38317 936409 546372 -2748 -351192 23792 726318 818929 278402 50542 524300 1007826
38307 1007826 1005924 950483 1194444 1294096 920224 580728 725528 947121 821590 740863
38297 740863 1059464 1217032 749681 467334 1380476 2937510 3659016 3249622 2703853
38288 2703853 2422844 1750811 650250 327324 1427027 2725953 2595076 1101423 -240798
38279 -240798 -418540 179999 630320 544765 221775 151400 522479 1104713 1584645 1949461
38269A949461M20565M16584J33879k40203m56298n70375n93156k39133M28803
38260A250127N81734l56953j557310j547037j18749J340643J569630P73574K105
38251A937764k06670j74823m30436j036224j446436r86545K91335J301585R47780
38242A97330m42956j251874m79568R45108J353798N53404k699N92503J285747
38233B750793O18869r46124j519797n33423M46080J64501m88267j90334N20498
38224H22796L24942l58723j8368J076272R42914q13001k013737j127409N40019
38215f24295J121265Q43746Q23987P74984j41897j285190j386216p32309n72269
38206a178194q58007m91914N07260R84839O44456K50995m7099p27145j250984
$$ plain form
38269 1949461 2370026 2786610 2920489 2680286 2223988 1653613 1060457 821324 1250127
38260 1250127 1831861 1474908 -82402 -1629439 -1748188 -407545 1162085 1935659 1937764
38251 1937764 1731094 1556271 1125835 89611 -1356825 -2343370 -2052035 -750450 197330
38242 197330 -245626 -1497500 -1977068 -1031960 321838 875242 872543 1465046 2750793
38233 2750793 3369662 2423538 903741 370318 816398 980899 492632 302298 822796
38224 822796 1147738 789015 770647 1846919 2789833 1976832 -36905 -1164314 -624295
38215 -624295 496970 1340716 2164703 2939687 2797790 1512600 126384 -605925 -1178194
38206 -1178194 -2036201 -2528115 -2020855 -1036016 -391560 -140565 -187664 -914809 -2165793
38197b165793m53726J157968J550263J85802j034802o53474L61492N49945J85630
38188c16695K49310N50635L39167j74797k77934n0675m8379k49901k86220j77726
38178d43215p4420R8324J13713n30019j379848j025636O78665J705218N81049
38169b76169j175498j138886M69936J436155J118141Q94600J129377L79248j601338
38160A235566k518190p55120J822130K178531J94844j490591j267463k58239l9465
38151h97997l61728m2688R14064J309968N91329l67001n71510k29294j87994n35111
38141c77962n66097o0024K84305k2342m34546k02236N25307J033683J047499P48275
38131A975862J84555n60256r02887l55132N30212P11515J53925j67105J36205
$$ plain form
38197 -2165793 -2619519 -1461551 88712 274514 -760288 -1413762 -1052270 -502325 -316695
38188 -316695 -67385 483250 822417 647620 369686 319011 270632 20731 -265489 -443215
38178 -443215 -517635 -419311 -305598 -835617 -2215465 -3241101 -2562436 -857218 -276169
38169 -276169 -1451667 -2590553 -2120617 -684462 433679 1328279 2457656 2836904 1235566
38160 1235566 -1282624 -2037744 -215614 1962917 2157761 667170 -600293 -858532 -897997
38151 -897997 -1259725 -1302413 -388349 921619 1512948 1145947 574437 345143 157149 -377962
38141 -377962 -944059 -1004083 -719778 -742120 -1176666 -1378902 -853595 180088 1227587 1975862
38131 1975862 2160417 1600161 697274 342142 872354 1583869 1737794 1570689 1706894
38122A706894L07252j55778n88092l18206J32353p4858o18854m83585L53177P70406
38112A030709J60297o74064o66287J06633O87338N58107J51609R6549L87035M88070
38102B325996Q9830m73141o11085j67905M28449O91879N67756L04912K7986l26709
38092B857968p04070q21334m74684J58354O08063M81515k10472r72405j116879
38083a93944l75170P01202J164423O53059k17996o10400l84649q987K03224K96581
38073A227343K33121j33989n36492l79880L23844P06915K25761m40953l57072
38064H68598K27921K84537l48771p43148m05014J0124p3194j41952M46301J156269
38054A281671Q78127l88629j339503r85766J53044P71929L45827l79586m19664
$$ plain form
38122 1706894 2014146 1858368 1270276 952070 1084423 1009565 390711 -92874 260303 1030709
38112 1030709 1191006 516942 -149345 -42712 644626 1202733 1354342 1450891 1837926 2325996
38102 2325996 2415826 1942685 1331600 1163695 1592144 2284023 2851779 3156691 3184677 2857968
38092 2857968 2153898 1332564 857880 1016234 1624297 2105812 1895340 922935 -193944
38083 -193944 -569114 132088 1296511 1949570 1731574 1121174 736525 727538 930762 1227343
38073 1227343 1460464 1326475 789983 410103 733947 1440862 1666623 1225670 868598
38064 868598 1096519 1381056 1032285 289137 -115877 -105753 -178947 -320899 125402 1281671
38054 1281671 2159798 1771169 431666 -554100 -401056 370873 716700 337114 -82550
38045h2550J96999M78620j83067j084585j048189K0259J040963J229223Q98002
38036A465675N43686k5186r84510j558301p73898R81841K063080J462211J1862
38027C186460o69912j01441O26005L30491p10996j095983j76812R75520R66517
38018C329849m4563p17470n19182j84957j39032J52380P34203N18838q71016j871581
38008C87469j036162O07454R56997j1845m10331M37158J083259N21176k90907
37999B244268l07559j40603p25452j489296j248221j64114N54437M97395L64354
37990d14791N80044P04603L48655j64586l05796K4286N45561R03845Q23344K85826
37980C330991l35116n61528l24338k2223L765p9801J70573P63329R96226K54541
$$ plain form
38045 -82550 114449 593069 410002 -674583 -1722772 -1702513 -661550 567673 1465675
38036 1465675 2009361 1984175 999665 -558636 -1332534 -350693 1712387 3174598 3186460
38027 3186460 2516548 2415107 3041112 3371603 2660607 1564624 1387812 2363332 3329849
38018 3329849 3285286 2567816 2048634 1863677 1724645 1877025 2611228 3130066 2259050 387469
38008 387469 -648693 -41239 915758 903913 493582 930740 2013999 2535175 2244268
37999 2244268 1936709 1796106 1070654 -418642 -1666863 -1830977 -1276540 -779145 -414791
37990 -414791 165253 869856 1218511 1053925 748129 772415 1317976 2221821 3045165 3330991
37980 3330991 2995875 2434347 2110009 2087786 2091551 2011750 2182323 2945652 3941878 4196419
37970D196419r20768j176600j29872Q60491M73111n91277n81936O01186J153892
37961C884646P6884j320054j353869k23319O35446N73329J00056j46534J07639
37952B334224P99901J287638O84056p99902j590589p42136O09999Q96798L72665
37943C852654K92040N81149J71598p17659p00154K67481N60614l95736j049629
37934B862358k76452P73182O41133j30088j93571K58759Q6292n94097n82286K83556
37924C128786Q11451L53461l30054l63352J56612O48797P71947M46365j10848
37915E513165k67784L65058J122979R47950r3018q42884o91052j77404K08855
37906F085865O83388J212591J104913K70135j97924L68405R63567L97739p55964
$$ plain form
37970 4196419 3275651 2099051 1969179 2829670 3302781 2711504 2129568 2730754 3884646
37961 3884646 3961530 2641476 1287607 1064288 1699734 2273063 2373119 2226585 2334224
37952 2334224 3134125 4421763 5105819 4305917 2715328 1973192 2583191 3479989 3852654
37943 3852654 4144694 4725843 4897441 4179782 3479628 3747109 4307723 3911987 2862358
37934 2862358 2585906 3359088 4000221 3870133 3676562 3935321 4021613 3427516 2845230 3128786
37924 3128786 3940237 4293698 3963644 3600292 3756904 4405701 5177648 5624013 5513165
37915 5513165 5245381 5610439 6733418 7681368 7588350 6745466 6054414 5877010 6085865
37906 6085865 6769253 7981844 9086757 9356892 9158968 9527373 10490940 10888679 10132715
37897A0132715j039011l85325j7646k98280k90643L65195P08208J64990l49732
37888H990471Q2117Q42619P62023q0089o06230l43838K30034O59330Q55072O31390
37878A2022899j33982q67734p51432N1059M84070J69195R98O93902J533885J356513
37868A4559373K76597m60659k24442K64890J44456l31420k33027O55602J434542
37859A6085912J167398P5648n82188J51215J820883K930906K493836J088658J92186
37850B5424454N30912J428569J879922J817436J867558K173323K241015K039083
37842C9402272K399975L803534N396610N984424N610089N306209N536445N911179
37834G9350737O448309P938644J0593733J3299789J4955829J5942235J7563771
$$ plain form
37897 10132715 9093704 8708379 8690733 8392453 8101810 8467005 9175213 9340203 8990471
37888 8990471 9072588 9915207 10677230 10597141 9990911 9647073 9877107 10536437 11391509 12022899
37878 12022899 11888917 11021183 10269751 10320810 10804880 10974075 10975073 11668975 13202860 14559373
37868 14559373 14835970 14375311 14150869 14415759 14560215 14228795 13995768 14651370 16085912
37859 16085912 17253310 17328958 16746770 16897985 18718868 21649774 24143610 25232268 25424454
37850 25424454 25955366 27383935 29263857 31081293 32948851 35122174 37363189 39402272
37842 39402272 41802247 45605781 51002391 56986815 62596904 67903113 73439558 79350737
37834 79350737 85799046 93737690 104331423 117631212 132587041 148529276 166093047
37827A66093047K0476862K4283895K8283219L1988161L5153656L7726556L9423759
37820C83429155L9022138L4672388K5516336J2599151k092115j6628678k8765000
37813D47753375l6079057l8014231l6944037l5588605l3957116l0506391k5647004
37806B11016934k1787833j9903407j8426809j6102808j3734369j2200070j0834065
37799I8027573r064417p823227p772586p679356o276118m457448l808849m025709
37791D7119863l724668k949367k784222l057055k611339j631482j507132k266634
37783B6587964k268430r26842J92980k07294j274944j504256q34310k42539k00255
37774A9322074m53759o47890m67568K09405P95201L59152j009711k002844j757809
$$ plain form
37827 166093047 186569909 210853804 239137023 271125184 306278840 344005396 383429155
37820 383429155 422451293 457123681 482640017 495239168 493147053 476518375 447753375
37813 447753375 411674318 373660087 336716050 301127445 267170329 236663938 211016934
37806 211016934 189229101 169325694 150898885 134796077 121061708 108861638 98027573
37799 98027573 88963156 81139929 73367343 65687987 59411869 54954421 51145572 47119863
37791 47119863 43395195 40445828 37661606 34604551 31993212 30361730 28854598 26587964
37783 26587964 24319534 23392692 23585672 23378378 22103434 20599178 19764868 19522329 19322074
37774 19322074 18868315 18220425 17752857 17962262 18757463 19116615 18106904 16104060 14346251
37765A4346251q88447l16262p241M02555O16503K38810l59191o67929r48735j549248
37755A0867066j843694r99283M51416R62521q211j268528j438898n37167L25522
37746F510744L81119n4677j71001K58310N99493K99635j94059m2424N42645L59201
37736H488986r58181k093799j723940l05012O68909O35163K30156L310p0086J5515
37726D891021L25445M22635k25369j186260j381980o63640r8606l39401o62784
37717A081061k20248N69170O94412J15202k42912R6630N53281M47985j9609j34416
37707B940556K52039M68746r990o91778o37517J28682M42163l86366j386985j123508
37697c958K86808J315898J126364M68080K25081J42693l69065j030511j141643
$$ plain form
37765 14346251 13457804 13141542 13134301 13536856 14153359 14392169 14032978 13365049 12416314 10867066
37755 10867066 9023372 8024089 8475505 9438026 9429815 8161287 6722389 6185222 6510744
37746 6510744 6891863 6837186 6666185 6924495 7523988 7823623 7629564 7587140 8129785 8488986
37736 8488986 7530805 5437006 3713066 3408054 4076963 4712126 4942282 4945592 4875506 4891021
37726 4891021 5216466 5639101 5413732 4227472 2845492 2181852 2083246 1743845 1081061
37717 1081061 860813 1429983 2124395 2239597 1996685 2093315 2646596 3094581 3074972 2940556
37707 2940556 3192595 3661341 3651351 2959573 2322056 2450738 2892901 2506535 1119550 -3958
37697 -3958 282850 1598748 2725112 3193192 3418273 3560966 3191901 2161390 1019747
37688A019747o57304K6256Q47618J691641J696418K32895j535107j536819L52728
37679B138073J733973Q27770r97340j193601K86952J084763O7483j107246p59338
37670B081489K48064J58118o81053m31668J061609J826682Q18352n20741o51690
37661C909162k07259m82338j018356n71258L29905j2126j435821j741565q4021
37652a313677J504922J105035k70369m04877P74248J427168P56537j62659m36259
37643B980069m92363q01669r03320l54700M12811Q46369J035192J128858Q11389
37634D662636L7201m49246j27730L57325J25649n36160o23120L5934O16752N64060
37624D663301J20775l85793q99222j171091q07389l4619L38329L7210k93696j57038
$$ plain form
37688 1019747 362443 388699 1236317 2927958 4624376 4857271 3322164 1785345 2138073
37679 2138073 3872046 4699816 3702476 2508875 2795827 3880590 3948073 2840827 2081489
37670 2081489 2329553 2487671 1806618 1374950 2436559 4263241 5081593 4560852 3909162
37661 3909162 3701903 3219565 2201209 1629951 1959856 1947730 511909 -1229656 -1313677
37652 -1313677 191245 1296280 1025911 621034 1395282 2822450 3578987 3416328 2980069
37643 2980069 2487706 1686037 782717 428017 840828 1687197 2722389 3851247 4662636
37634 4662636 4699837 4250591 4122861 4480186 4605835 4069675 3446555 3482489 4099241 4663301
37624 4663301 4784076 4398283 3499061 2327970 1520581 1485962 1824291 1861501 1567805 1410767
37614A410767P9787p065r9856J87174M33864L3927o89319q42351k60177L50117
37604E96868M87387L10400K2495l97963p19904m91141J65230M60891P824o11608
37594a69521p16645l98545p8607K30414O34660Q11545M58889k3209k2243L19224
37584A045962L54253J1557j64605k9130l5370k70222j67469M37566P69347K20339
37574B172228o22966p66297j85350L24477L81492L09358L19729K07081o7820k11341
37564A860591j97460l78796p32592o35838J85813J028893J081919N19891R8169
37555B830590n8387m74048j144315j182276n5314J383236J718081O56912o50082
37546C024397j013497m66353Q2348P6930k18751l45188k54592j59730j29811q3385
$$ plain form
37614 1410767 1490554 1483489 1383633 1570807 2004671 2038598 1349279 506928 246751 596868
37604 596868 1084255 1394655 1417150 1019187 299283 -191858 -26628 434263 442087 -169521
37594 -169521 -886166 -1284711 -1363318 -1132904 -498244 313301 772190 748981 726738 1045962
37584 1045962 1400215 1411772 1247167 1218037 1182667 912445 744976 1182542 1951889 2172228
37574 2172228 1549262 782965 597615 922092 1303584 1612942 1932671 2139752 2071932 1860591
37564 1860591 1663131 1284335 551743 -84095 101718 1130611 2212530 2732421 2830590
37555 2830590 2772203 2298155 1153840 -28436 -83750 1299486 3017567 3674479 3024397
37546 3024397 2010900 1544547 1626895 1703825 1485074 1139886 885294 725564 595753 512368
37536E12368K9399K48391N92304Q24781N41578j93476o65441m44934j21434l88065
37526I35471p56795k51558P50453P65796l83214r34230J59438J381977Q87825
37517B555163n66892q15408K65443O96703k51005r37278k19117O52422K14334
37508A594365p99532q00679P9449M80854J71818J51191O30601N84613m29248j329369
37498C34063r60188L32990J153725P00470m16925r27988l70337L35292J11915
37489B93017o47826n53518N57591J130064K80613p06637m82820R3283m35850j308162
37479a780245o66821J007073J252747l80579j387667k19502J325978J044795m17470
37470b21691j030792m85474J02597L77500O59595N70310k91776r42782k33282
$$ plain form
37536 512368 541767 790158 1382462 2207243 2748821 2555345 1889904 1444970 1323536 935471
37526 935471 178676 -72882 677571 1443367 1060153 125923 285361 1667338 2555163
37517 2555163 1988271 1172863 1438306 2135009 1884004 946726 727609 1380031 1594365
37508 1594365 794833 -5846 73603 554457 726275 877466 1508067 2092680 1663432 334063
37498 334063 -626125 -293135 860590 1561060 1144135 216147 -154190 181102 293017
37489 293017 -354809 -908327 -350736 779328 1059941 353304 -129516 -36233 -472083 -1780245
37479 -1780245 -2447066 -1439993 -187246 -567825 -1955492 -2174994 -849016 195779 -221691
37470 -221691 -1252483 -1737957 -1635360 -1257860 -598265 -27955 -319731 -1262513 -1495795
37461a495795R73188Q21461n77962j245164m01759O14120Q18023Q83494J249192
37452A638798R02695o94216k026772j453815K65135R71059J36038o27862m6183
37443i35123J154835J470778O16934l48098n42025k48672k31957n06386l82188
37434D8098K77567O26701J24163m93049l72692m8141n43198j364135r75726O35971
37424b084441J578035P90144m30784n64550n6888r9280m54200j13238O73538P46927
37414a4737N0730l14800M3215L53444J43684j81725l68408o27604p06124N4120
37404a568205J325143J708312O50013o22357p76609q2342K97489n3059o51803
37395B26582j000810q84211k75852M08088M41738k31655o61196j38780P40303
$$ plain form
37461 -1495795 -522607 298854 -279108 -1524272 -1926031 -1311911 -493888 389606 1638798
37452 1638798 2541493 1847277 -179495 -1633310 -1368175 -397116 -261078 -888940 -935123
37443 -935123 219712 1690490 2307424 1959326 1417301 1168629 936672 430286 48098
37434 48098 325665 952366 1076529 583480 210788 162647 -380551 -1744686 -2720412 -2084441
37424 -2084441 -506406 283738 -147046 -711596 -768484 -867764 -1321964 -1435202 -761664 -14737
37414 -14737 35993 -278807 -235592 117852 261536 79811 -288597 -916201 -1622325 -1568205
37404 -1568205 -243062 1465250 2115263 1492906 716297 633955 931444 878385 226582
37395 226582 -774228 -1658439 -1934291 -1526203 -1084465 -1316120 -1977316 -2116096 -1375793
37386a375793R40076M06503r8916j43925J29342M82328N83232J6896r21738j027584
37376a009579K15316J405124Q85536p54899j373783l53719P01786O11174J92827
37367E19783M60952Q49775M22998l54557m33814L7951J34287j78947j50433K58629
37357A566624L02438j56684l87423p9354J63733p9673l51148j21355L74805N31277
37347A763240J51930m47967p70386m39964M22329J066220Q01896j17843p66345
37338A663110p08898l65337j92819j49563r7194r2723q8531M8934O4165m39556
37328c58412j069699q04020M94199J538235J210172K537q04283p64361l08837
37319h64469K15270O21152M81384l01408q31311k25819Q78415R93047m2596p90357
$$ plain form
37386 -1375793 -435717 -29214 -128130 -272055 -142713 339615 922847 939743 18005 -1009579
37376 -1009579 -794263 610861 1496397 741498 -632285 -986004 -284218 326956 519783
37367 519783 980735 1830510 2253508 1898951 1465137 1503088 1637375 1458428 1307995 1566624
37357 1566624 1869062 1712378 1324955 1245601 1409334 1329661 978513 857158 1231963 1763240
37347 1763240 1915170 1467203 696817 256853 679182 1745402 2547298 2429455 1663110
37338 1663110 954212 588875 396056 246493 149299 56576 -31955 16979 81144 -358412
37328 -358412 -1428111 -2232131 -1737932 -199697 1010475 1013012 208729 -555632 -864469
37319 -864469 -649199 -28047 453337 151929 -679382 -905201 -26786 966261 923665 133308
37309A33308l70541L67703L79488m5719j34798m2030l21789o66705l85501K30514
37299h56070K62210k30023k14369N41613R69737M57670o2267L68986J054206O36775
37289B928468p29203j485863q88617O9954K30158k48419m90847k26975J49709
37280f91635L42547L28124Q6113k93398m73615l10708j55151k43682j39244O02660
37270i47989J497551J615194Q71311P4165k75896m20610n14545k65202K78227
37261A912206L95255l06366j142136j175086m11048L18438L85557j14004o14463
37252g51647n40560K14246J023313J067378L49443k49902j52978K16361K32706
37243A408360m8458k83443n02416p52264o34606L3443N38542J07889q61801j268109
$$ plain form
37309 133308 -237233 130470 509958 464239 329441 287411 -34378 -701083 -1086584 -856070
37299 -856070 -593860 -823883 -1038252 -496639 473098 930768 868501 1237487 2291693 2928468
37289 2928468 2199265 713402 -175215 -105261 124897 -123522 -614369 -841344 -691635
37280 -691635 -349088 -20964 65149 -228249 -701864 -1012572 -1167723 -1411405 -1550649 -947989
37270 -947989 549562 2164756 3036067 3110232 2834336 2413726 1899181 1633979 1912206
37261 1912206 2307461 2001095 858959 -316127 -727175 -408737 -23180 -137184 -751647
37252 -751647 -1292207 -1077961 -54648 1012730 1362173 1112271 959293 1175654 1408360
37243 1408360 1359902 1076459 574043 -178221 -812827 -779384 -240842 -132953 -994754 -2262863
37233b262863q01979j34895K51506N26214Q13961R11937Q00745O77362M11041
37224A193029k69319j001808j056505m85340j05611j52014O5303Q13663J275750
37215B77148Q06569n5751n12363o06720o44458l27350N64362J283857J020168
37206A805462K34569n1924M3045m08516j230575j056215M49774J637073R86477
37197B409170p54680j567278p64571M17771O80118J88115J0801N92600J194980
37188B407026Q14272n02295j476168j008211L52355R29845N3709j058271j016963
37179e04701j24592L22653L0241j65865N3602N8973l09671k24634O31881J229018
37169I96905P28151j15199j75742K17648j413o46230n44920L37205O35689k31398
$$ plain form
37233 -2262863 -3064842 -3199737 -2948231 -2422017 -1608056 -696119 104626 781988 1193029
37224 1193029 923710 -78098 -1134603 -1619943 -1725554 -1877568 -1812265 -998602 277148
37215 277148 1083717 1027966 515603 -91117 -735575 -1062925 -498563 785294 1805462
37206 1805462 2040031 1988107 2031152 1622636 392061 -664154 -214380 1422693 2409170
37197 2409170 1654490 87212 -677359 -259588 420530 608645 619446 1212046 2407026
37188 2407026 3221298 2719003 1242835 234624 586979 1516824 1570533 512262 -504701
37179 -504701 -629293 -306640 -276399 -442264 -388662 -329689 -639360 -863994 -232113 996905
37169 996905 1725056 1609857 1434115 1651763 1650350 1004120 459200 796405 1432094 1200696
37159A200696j047061o41199L66460N59645k62361r60166o07284M87841J194788
37150B91359P21224m61526r15297O2496J246771R02106p13196j558046p43419
37141a167528K82843J45203m72810l96267l4149k97941o10407J26837J345546
37132a078673J555402Q08690M26860N29812l3622j231688j530368n04206L14533
37123g43260j5479l78171K59192J002786O78692j50311l32106j10281l52533p15495
37113h56966k90999N09559M43880m39891q01606j67015M04311J17584l78218j70851
37103a630212N17830Q06054M47220M758j6645K83437N14868N49091N65278N79790
37093B621469K42991n62225j156188p44156L37714Q51995L65242j48587J21653
$$ plain form
37159 1200696 153635 -487564 -121104 438541 176180 -783986 -1391270 -903429 291359
37150 291359 1012583 551057 -364240 -301744 945027 1847133 1133937 -424109 -1167528
37141 -1167528 -884685 -739482 -1212292 -1608559 -1642708 -1940649 -2551056 -2424219 -1078673
37132 -1078673 476729 1285419 1712279 2242091 2208469 976781 -553587 -1057793 -743260
37123 -743260 -758739 -1136910 -877718 125068 803760 653449 321343 211062 -141471 -856966
37113 -856966 -1147965 -638406 -194526 -634417 -1436023 -1603038 -1198727 -1081143 -1459361 -1630212
37103 -1630212 -1112382 -306328 140892 145650 129005 412442 927310 1476401 2041679 2621469
37093 2621469 2864460 2302235 1146047 401891 739605 1591600 1956842 1808255 1929908
37084A929908N57570K00342o52780r65542n89423k72105k59192K3541Q07070J388878
37074B168267J001565k20584j322653j362168k85288Q48253Q81864O897m48912
37065A267241P245K75483m00018r20144r1148J089601P44686q13559j397409k95734
37055e33756P99140O25849P1161K23165N49186J86097m56088o53486o52795p15375
37045e56902j38981J269925J915516M43593j766258k156982o14409N45837J41229
37036i17432m79750l9524O99943N52780r8843j83801K73126M87289K97978Q5951
37026F77717j39705n15260o22455o0349O03650N03942j07813k06075L08901M25929
37016H68482k40383o80156m0671R67492J046444J22697p12005q05984n99556o15619
$$ plain form
37084 1929908 2487478 2687820 2035040 1069498 480075 207970 -51222 -27681 779389 2168267
37074 2168267 3169832 2949248 1626595 264427 -20861 827392 1709256 1716153 1267241
37065 1267241 1274486 1549969 1149951 229807 138659 1228260 1972946 1159387 -238022 -533756
37055 -533756 265384 891233 962394 1185559 1734745 1920842 1464754 811268 158473 -556902
37045 -556902 -695883 574042 2489558 2933151 1166893 -990089 -1604498 -1058661 -917432
37036 -917432 -1397182 -1436706 -736763 -183983 -282826 -466627 -193501 293788 591766 677717
37026 677717 538012 22752 -599703 -660052 -56402 447540 339727 133652 442553 868482
37016 868482 628099 -52057 -92728 874764 1921208 2043905 1331900 525916 -73640 -689259
37006f89259n84546K7179J055696J704388J500109Q27134L74036K43884r4801
36997D363820r09384j580959j278817j70409N81542K44590n48159p12280j62891
36988a72947K86709K61053K28881M58325M27337k18498q01389m98374K94994M44842
36978G10933j48257l33191L82245P77277l18844j939445j970307q5490J673456
36969a251623J622938M92911k2725L00683M40494R4756l9732K20057J95684k80047
36959A773396m33798P3350M94250K89244O468J67798K73343k18201p91095p28539
36949I06216l21152k01830j67450K22053N10805P3596n41076l54692L43802M85055
36939I55327J16485K33683Q20662P56527j47070o97640l16528J14972m1748j73275
$$ plain form
37006 -689259 -1273805 -1246626 -190930 1513458 3013567 3840701 4214737 4458621 4363820
36997 4363820 3454436 1873477 594660 424251 1005793 1250383 702224 -10056 -172947
36988 -172947 113762 374815 603696 1062021 1489358 1270860 469471 -28903 266091 710933
36978 710933 562676 229485 611730 1389007 1070163 -869282 -2839589 -2925079 -1251623
36969 -1251623 371315 864226 841501 1142184 1582678 1677434 1637702 1857759 2053443 1773396
36959 1773396 1339598 1412948 1907198 2196442 2202910 2370708 2644051 2425850 1634755 906216
36949 906216 585064 383234 215784 437837 948642 1022238 481162 126470 470272 955327
36939 955327 1071812 1305495 2126157 2882684 2735614 2037974 1721446 1836418 1794670 1621395
36929A621395J90245M31795J27538r1384J55553J46269n41230j073703q24654
36920A41824m64766m90628j09225J052181J616104N67782o65926l28354O34745
36911A953737J09186j417449j439547L64411J405523K16721j401697j331163m1986
36902a582264P88293P94512N79605K19538l76647o05890o4284M55398R4657o24135
36892c21217o61646j29609J34572J16813M20174Q42329N44457l72113p37146l0990
36882a94376Q06900P19400j00573o86809o08824k64352j02431l0768K91215P38038
36872E67420O01286m81360j592337j225596P26227K361311J910651K3550j110602
36863A780550p14928j98168o89740j205931l17125J317459J622420J14833j297400
$$ plain form
36929 1621395 1811640 2243435 2370973 2279589 2435142 2581411 2040181 966478 141824
36920 141824 -322942 -813570 -922795 129386 1745490 2313272 1647346 1318992 1953737
36911 1953737 2062923 645474 -794073 -429662 975861 1192582 -209115 -1540278 -1582264
36902 -1582264 -793971 541 580146 799684 423037 -182853 -247137 208261 302918 -321217
36892 -321217 -982863 -1112472 -977900 -861087 -440913 401416 945873 573760 -163386 -194376
36882 -194376 612524 1331924 1231351 544542 -64282 -328634 -431065 -461833 -170618 567420
36872 567420 1168706 687346 -904991 -2130587 -1404360 956951 2867602 2891152 1780550
36863 1780550 1065622 867454 177714 -1028217 -1345342 -27883 1594537 1709370 411970
36854D11970r65707L32034P66593P0027m63489j48251L03041K62842J85441N57417
36844A311918Q32306K72747p05201r39592j01266Q74245R68260J73572o82407
36835B004582q63918l78666J36212J59865j05178q5937K57332L76581R9647q546
36825A591974L81999P03155M03804n5015Q3988N89449N91752o534m32100l38966
36815C513506k77389o67183j087918r35398k36784M93659Q12211N66577n3229
36806B128052n21141m00513P6702J93129l24685q61444o25569L48370J130290
36797A143191Q90123j04729p23631l87962J04202k65728j073109r65166J63971
36788a218838Q44075L24354k40989J86854P43575K82257m54702j10110P24687
$$ plain form
36854 411970 -553737 -221703 544890 614917 151428 3177 306218 569060 754501 1311918
36844 1311918 2144224 2416971 1711770 772178 670912 1545157 2513417 2686989 2004582
36835 2004582 1140664 761998 898210 1058075 952897 866960 1124292 1500873 1600520 1591974
36825 1591974 1973973 2677128 3080932 3025917 3109905 3699354 4291106 4284572 3852472 3513506
36815 3513506 3236117 2568934 1481016 545618 308834 802493 1614704 2181281 2128052
36806 2128052 1606911 1206398 1283100 1476229 1151544 290100 -335469 12901 1143191
36797 1143191 2033314 1928585 1204954 816992 921194 655466 -417643 -1382809 -1218838
36788 -1218838 -374763 -50409 -291398 -104544 639031 921288 466586 356476 1081163
36779A081163L54737j027664j445229k80013Q60391Q13228L24048J72648j67192
36770F86117r83415j227927k62444P47419N84012o4490J37526R27054J026924
36761A570776L18365j64490j01214k37624q41014j114219m99745L79698N72963
36752a16504M4734l83453j14433N35580P78171L42144k20348l16717o4391P7744
36742E62527O3602Q6691k4392m95199r12913o79074j3915L41448K58398J43907
36732f68920j0081m01346n29993J29785Q23608M60621l42897q1738Q30330M25251
36722F34620j285612j826406k84346R58470J64746p84435K79053J864858J269455
36713I90403p17034j034884N63406J246732r3798j213305m54584O80065K93663
$$ plain form
36779 1081163 1435900 408236 -1036993 -1317006 -456615 356613 680661 853309 686117
36770 686117 -297298 -1525225 -1787669 -1040250 -456238 -520728 -383202 543852 1570776
36761 1570776 1889141 1724651 1623437 1385813 544799 -569420 -1069165 -689467 -116504
36752 -116504 -71770 -455223 -569656 -34076 744095 1086239 865891 549174 484783 562527
36742 562527 626129 712820 688428 193229 -719684 -1398758 -1412673 -1071225 -812827 -668920
36732 -668920 -679001 -1080347 -1610340 -1480555 -656947 -196326 -539223 -620961 209369 634620
36722 634620 -650992 -2477398 -2761744 -1803274 -1638528 -2422963 -2143910 -279052 990403
36713 990403 273369 -761515 -198109 1048623 954825 -258480 -713064 -32999 260664
36704B60664q95094j013920P3116J009953J088743O90119J97321k93237m88096
36695F29569j06851N03167O29551Q1281n85542p42209l67369M611o771q3777L31692
36684B87352J040530J126980K84519n50406m38062K74123N87638K69589j41468
36675B740795l18160l23502j65887L9849j71021r08231j375056q60878J13623
36666a228468N26643L24379K15132L91065M77736M30466M50161L07159k27396
36657A666877o12390k74641K46799O4145n10473m85632K1625l8519p75729j121717
36647a819655n75825J45558L89534L00116J25282q2011n158N70729R81237M89115
36637E18922k66763o1759P79355P37025l13832p81261q4514K71157p23068j711132
$$ plain form
36704 260664 -634430 -1648350 -1575234 -565281 523462 1213581 1410902 1117665 629569
36695 629569 522718 1025885 1655436 1736717 1151175 408966 41597 46208 39437 -44340 287352
36684 287352 1327882 2454862 2739381 2188975 1750913 2025036 2612674 2882263 2740795
36675 2740795 2422635 2099133 1933246 1973095 1802074 893843 -481213 -1342091 -1228468
36666 -1228468 -701825 -377446 -162314 228751 706487 1136953 1587114 1894273 1666877
36657 1666877 1054487 779846 1026645 1090790 580317 94685 116310 77791 -697938 -1819655
36647 -1819655 -2395480 -2249922 -1860388 -1560272 -1434990 -1517001 -1522159 -951430 29807 518922
36637 518922 252159 190400 969755 1706780 1392948 611687 527173 798330 75262 -1635870
36627a635870j039188O40912J352285N70644l85545l57753M02525R08553O12585
36618A069148j53200o17901m78343k42142l58222l96066J84083Q56357P02259
36609E65973l0961l32972j93120m49546r43092n84601N28031R50171L26938L5688
36599a27491O50544P95147l48168j341928q10147K78174M00460M9972M93957J164718
36589A205238N74485q50444j153076R9784J209401R54659K7433m94430n67261
36580A005789n48834l87748n2026J29185M1765m830L6570k07508o78774o51118
36570a317529J43159P98899L68490o36587p10082N77719J725726J111964p53839
36561A307920j728640q69615L32663K05894o76801n82966N63071J134543M47684
$$ plain form
36627 -1635870 -2675058 -2034146 -681861 -111217 -496762 -854515 -451990 456563 1069148
36618 1069148 915948 298047 -180296 -422438 -780660 -1176726 -992643 -136286 565973
36609 565973 535012 202040 8920 -440626 -1383718 -1968319 -1440288 -490117 -163179 -127491
36599 -127491 523053 1318200 970032 -371896 -1182043 -903869 -503409 -453437 40520 1205238
36589 1205238 1779723 929279 -223797 -124013 1085388 2040047 2067480 1573050 1005789
36580 1005789 456955 69207 17181 146366 188131 183301 219871 12363 -666411 -1317529
36570 -1317529 -1174370 -375471 -6981 -643568 -1353650 -775931 949795 2061759 1307920
36561 1307920 -420720 -1290335 -957672 -751778 -1428579 -2011545 -1448474 -313931 133753
36552A33753k99525j06056M06302L33659r2677k61608k41992k61899r9870K53015
36542b36898K70928q1706l5858N60058O58944k68464j112474p84335R8316L65814
36532e65675J11119O0178Q6585k03087k18439P03151J721696J437726O9544q18915
36522B383883n70516k1612L7724l27765q62623j336724j120201K16267J783564
36513A81997K021620O83616q10773j213142p38278k88911k35529l56089m10872
36504a166361l69905k94078j78711Q5773M72145O06733K32305j64377J10775P58367
36494I2666P69863P5394k77756N9493J52147l76232m88535L16989Q18407J36949
36484A279385n63500l7352Q44869P03436Q5189J87371M03950m30534j383573p32255
$$ plain form
36552 133753 -165772 -271828 134474 468133 375456 113848 -128144 -390043 -489913 -236898
36542 -236898 34030 -47676 -83534 476524 1135468 867004 -245470 -1029805 -931489 -565675
36532 -565675 -454556 -394378 -307793 -510880 -729319 -26168 1695528 3133254 3202798 2383883
36522 2383883 1813367 1791755 1829479 1501714 639091 -697633 -1817834 -1601567 181997
36513 181997 2203617 2887233 2076460 863318 125040 -163871 -399400 -755489 -1166361
36504 -1166361 -1536266 -1830344 -2009055 -1923282 -1451137 -844404 -612099 -776476 -665701 92666
36494 92666 862529 937923 660167 719660 871807 495575 7040 324029 1142436 1279385
36484 1279385 715885 678533 1523402 2226838 2312027 2499398 2903348 2472814 1089241 356986
36474C56986P71959Q53299m21194p65520L08288P53884k20183p62580J76131R16043
36464A967113M7183j159274j051075j67793K65866N11233J092628J114766j17308
36455B503339j198677n59853P45655M88056j158524j837562o71108N58887L28832
36446h00955m48495j31255J074538J503612M78492p82792q66199K358M26922j46558
36436C09668p53484m92337J20903J35194k37547j28851L65653M15792Q4344K52106
36426G1441Q82492Q82961l1016q19944q69044p61279p85411k42107R89201J698348
36416A015642J140837K35880o3028k48241r12830j250681m05892P26180O86044
36407I23911k88214p81117m46692j56369k41558j47551K42070L46732M8523q5173
$$ plain form
36474 356986 1128945 1982244 1561050 795530 1103818 1857702 1637519 874939 1051070 1967113
36464 1967113 2014296 855022 -196053 -363846 -97980 413253 1505881 2620647 2503339
36455 2503339 1304662 744809 1490464 1978520 819996 -1017566 -1688674 -1129787 -800955
36446 -800955 -1249450 -1380705 -306167 1197445 1675937 893145 26946 29304 456226 309668
36436 309668 -443816 -936153 -815250 -680056 -917603 -1046454 -680801 -265009 -180665 71441
36426 71441 953933 1836894 1805878 985934 116890 -644389 -1429800 -1671907 -682706 1015642
36416 1015642 2156479 2392359 2329331 2081090 1168260 -82421 -488313 237867 923911
36407 923911 635697 -145420 -592112 -748481 -990039 -1137590 -895520 -548788 -500265 -585438
36397e85438J20264J87046m3915j20833J54036L86269L07232J26025J2823j15097
36387D28412j54336J83400P05031O50864l55484j603187j909555q95590N41604
36378b408841J134086O01255j16543j33146K65854K88100K6444K44272Q56603
36369G58084P93060k90332j267896j127040l62955m8796k89570m24844j79666
36360b439955J91985M90728O31199M77795J19357q9465r0858j71222k14824K67879
36350h27381J047323J125311K67173n05209n42053m76222p74237p49553m0168
36341a475016L36338k83180p68600n2514Q59275N75455j45770K80171J300860
36332F27019J028322m75833j232711n72410J24982R2741J71781O88227O58194
$$ plain form
36397 -585438 -465174 -278128 -322043 -442876 -288840 97429 404661 530686 543509 428412
36387 428412 274076 457476 1162507 1813371 1457887 -145300 -2054855 -2950445 -2408841
36378 -2408841 -1274755 -673500 -790043 -923189 -657335 -369235 -342791 -98519 758084
36369 758084 1551144 1260812 -7084 -1134124 -1497079 -1545875 -1835445 -2260289 -2439955
36360 -2439955 -2247970 -1757242 -1126043 -648248 -528891 -618356 -709214 -880436 -1095260 -827381
36350 -827381 219942 1345253 1612426 1107217 565164 88942 -685295 -1434848 -1475016
36341 -1475016 -1138678 -1421858 -2190458 -2242972 -1383697 -808242 -954012 -673841 627019
36332 627019 1655341 1179508 -53203 -625613 -500631 -407890 -236109 452118 1110312
36323A110312j66989n96057j69998N013m87072l85766P79519J298741m6911j696761
36313c55969j544677n0992Q24635O84053O31299R06345O64638j61815o23464l72646
36303F01407m7277m1975j59668l71538o91100m95628O76824J809396J371175l64889
36293B286727j470822j034814j85006p0250l33571k50087o404J4465O5012K56580
36283g28170K7305o61290o91934M63151J385440N90566j009102j272434m3077
36274a939545P32969J37627m64319J20407J034933J009301L95016K10364K73425
36265A510178j70378p27393m41102K96101J56326q06294r96253J40479J013491
36256b4845K65070j077107j101664J67801R16724K52923o20226k84464Q65716
$$ plain form
36323 1110312 943323 347266 177268 182281 -304791 -690557 88962 1387703 1340792 -355969
36313 -355969 -1900646 -1951638 -1127003 -442950 188349 1094694 1759332 1597517 974053 601407
36303 601407 554130 512155 352487 -19051 -710151 -1205779 -528955 1280441 2651616 2286727
36293 2286727 815905 -218909 -403915 -474165 -807736 -1057823 -1064227 -1049762 -984750 -728170
36283 -728170 -700865 -1362155 -2054089 -1590938 -205498 385068 -624034 -1896468 -1939545
36274 -1939545 -1206576 -1068949 -1533268 -1412861 -377928 631373 1026389 1236753 1510178
36265 1510178 1339800 612407 171305 467406 623732 -182562 -1178815 -1038336 -24845
36256 -24845 240225 -836882 -1938546 -1770745 -854021 -601098 -1221324 -1505788 -640072
36247f40072J227198J98492j017026r81932J53787R69686P51197L32924N98483
36238A592737R53412K53431j169893j685161o85625M67652L36683p35102j345432
36229b017298q58883K42214J240737J628516J094240j36454j146275j116849j58773
36220a228825R51495J503872J073183l21604j764842j868239l98413J110269J168661
36211B25557J73314m59365l68325k85825m47118l30974J08524K54491n313p9789
36201a214823J68672J63586k39363m05593m3508L46221N02799Q26558J280622
36192A385171R70888m09690j642398j445180k36457N24543L13808j15515j21887
36183g76717P7565J04052M3297Q8869Q3921k33417p57743j040634p44983P226
$$ plain form
36247 -640072 587126 785618 -231408 -1213340 -1059553 -89867 661330 994254 1592737
36238 1592737 2546149 2799580 1629687 -55474 -741099 -273447 63236 -671866 -2017298
36229 -2017298 -2876181 -2633967 -1393230 235286 1329526 1193072 46797 -1070052 -1228825
36220 -1228825 -277330 1226542 2299725 1978121 213279 -1654960 -2053373 -943104 225557
36211 225557 398871 -60494 -428819 -714644 -1161762 -1492736 -1384212 -1129721 -1135034 -1214823
36201 -1214823 -1046151 -882565 -1121928 -1527521 -1571029 -1224808 -722009 104549 1385171
36192 1385171 2356059 1946369 303971 -1141209 -1377666 -853123 -539315 -654830 -776717
36183 -776717 -699152 -595100 -551803 -462934 -379013 -612430 -1370173 -2410807 -3155790 -3148564
36173c148564P27873R91602P61912K99479j13073k47722L8392N45517O89695J62773
36163G07884m70090l85337K89964N51394k1685o04127l71417K30884J83018n08555
36153c98067p60246J3545J012727J076012J51182o97574o02146J87054P63283
36144G45770O55428K05545m2096K348O3942J0380o537J28405K55548R2457m30564
36133A680626r84708j034179l87119M26585O04052K2289n58184m39882J99512
36124d71008P31053R26030R15380O24282r2551q54260r73421l78149K42581L70284
36114A040221K22774J86274J99176O0956m8159J58193M70389L55234k45753p18315
36104A680990n79337j59224j00526l31943j21714O78787J098224L51194p95268
$$ plain form
36173 -3148564 -2420691 -1429089 -667177 -367698 -480771 -728493 -690101 -144584 545111 707884
36163 707884 237794 -147543 142421 693815 672130 68003 -303414 -72530 110488 -398067
36153 -398067 -1158313 -1144768 -132041 943971 1095153 397579 -204567 -17513 745770
36144 745770 1401198 1606743 1564647 1566995 1630937 1641317 1634780 1763185 2018733 2111190 1680626
36133 1680626 695918 -338261 -725380 -298795 305257 327546 -230638 -670520 -471008
36124 -471008 260045 1186075 2101455 2725737 2633186 1778926 805505 427356 669937 1040221
36114 1040221 1262995 1449269 1648445 1709401 1661242 1819435 2289824 2645058 2399305 1680990
36104 1680990 1101653 942429 841903 509960 388246 1067033 2165257 2516451 1721183
36095A721183r04670K1688M63937l09839j039531l53555J080128J419986J96081
36086B295408j186911j409653o56647J07353M07553L78373J72127k00231n60259
36077f52887n02879J26486P86701O78053j16858m24460M13746J200885L51176
36068A859963j477170j867295j62726J321404O55305q56248q40929M84076R51565
36059F7945k0243q09687l69699M73951P79607P45999P05955L48304m36471j049335
36049D36326j037493o14985q3205M62044P87603P18034N87579O68202M86697k95757
36039B115045q85150n31804l4693m10084p64742L40494J905535J513516o83016
36030B565101j861475q79412K14909o9780m10779L63081Q98986o4269j150437
$$ plain form
36095 1721183 816513 838201 1302138 992299 -47232 -400787 679341 2099327 2295408
36086 2295408 1108497 -301156 -957803 -850450 -442897 -64524 107603 -92628 -652887
36077 -652887 -1155766 -1029280 -242579 435474 318616 -105844 307902 1508787 1859963
36068 1859963 382793 -1484502 -1647228 -325824 329481 -526767 -1367696 -883620 67945
36059 67945 47702 -761985 -1131684 -657733 121874 867873 1573828 1922132 1485661 436326
36049 436326 -601167 -1216152 -1299357 -837313 -49710 668324 1255903 1924105 2410802 2115045
36039 2115045 1229895 698091 663398 253314 -511428 -170934 1734601 3248117 2565101
36030 2565101 703626 -175786 39123 -30657 -441436 -78355 820631 756362 -394075
36021c94075p20232K62565J66185l08360L30175J318623R15758l74372o55576
36012E40691L9251O2092o60470n36383O18211J039237n7637j239653j137952j92175
36002a524788M23045K04028o55298j409557r46958Q58907K209019J354223p13633
35993b01012j353300Q730J246821Q59583j23824k24594L07920L85182j57494o26968
35983A21044m63685L75091J301922J250960j33551j545670j438005k38893L16661
35974d54126o0680K5539R79462J357334L36787q81930j071503o68207m56803j89612
35964a083739L40863L90903k79406m55982O03066J586442J046913k39625n66367
35955A343068j6486J7041n79237n58579L31713Q47756L56585k32118j55758J6265
$$ plain form
36021 -394075 -1114307 -851742 -685557 -993917 -663742 654881 1570639 1196267 540691
36012 540691 579942 642034 -18436 -554819 63392 1102629 1044992 -194661 -1332613 -1524788
36002 -1524788 -1101743 -897715 -1553013 -2962570 -3909528 -3050621 -841602 512621 -201012
35993 -201012 -1554312 -1545582 -298761 560822 436998 212404 520324 905506 748012 121044
35983 121044 -342641 32450 1334372 2585332 2451781 906111 -531894 -770787 -454126
35974 -454126 -514806 -489267 490195 1847529 2184316 1302386 230883 -437324 -894127 -1083739
35964 -1083739 -742876 -351973 -631379 -1087361 -484295 1102147 2149060 1909435 1343068
35955 1343068 1326582 1343623 764386 205807 537520 1385276 1741861 1509743 1353985 1370250
35945A370250l64752p42529k98390N54336O63714j47461p89406m22997M35508
35936B58273O89485J14904m78910m14938P1661L45035J76578k29613n94917o08644
35926f71086m3836P37857Q47797j6729r61232j020318m17250L9839K62956N99358
35916f42644P48559K07220n04036l98495L22168N22672k6714m80711n39874o68088
35906a459943o66680J66147J226849R56825m86467j037586l6653N29085n91031
35897a399454j559804m40954J385422J269530n38171j406272l51018R91699J246441
35888h02581Q38094M68035N7467l61630l14070J17655K43139k1814o8333J75259
35878C31221J51603j29920r8883J04140k58504r78409r22656P8264P87451M64740
$$ plain form
35945 1370250 1005498 262969 -35421 518915 1182629 1035168 245762 -177235 258273
35936 258273 947758 1062662 583752 168814 240475 585510 762088 532475 -62442 -671086
35926 -671086 -714922 22935 870732 854003 -107229 -1127547 -1544797 -1504958 -1242002 -642644
35916 -642644 105915 313135 -190901 -589396 -267228 255444 228730 -251981 -791855 -1459943
35906 -1459943 -2126623 -1960476 -733627 223198 -263269 -1300855 -1337508 -808423 -1399454
35897 -1399454 -2959258 -3400212 -2014790 -745260 -1283431 -2689703 -3040721 -2049022 -802581
35888 -802581 35513 503548 561015 199385 -114685 2970 246109 224295 155962 331221
35878 331221 482824 352904 254021 358161 99657 -878752 -1801408 -1723144 -935693 -470953
35868d70953j51454l10058l29081m98346k24163P69697J499215J072208J13854
35859A470919k75956k62579p29616j465722j280027M4281J112828O95059o21701
35850a312514j162462k25057J176732J670374J129454N11323L52107J64921m63136
35841A841742r78971p38680j83535j97293o01048l66534O81248J448965J125974
35832B031868K29116l01920k86610j14797P927J24329K32679K98036K78346L828
35822B502802o06594j190075j276525r35987n13485J13088J138560J802087R86977
35813B020848q59445j693945m65420J343069J648478L62171r48907j283398r58205
35804h34754n62018k64929o4687J12681M91943J035287J189342O24089j36947
$$ plain form
35868 -470953 -622407 -932465 -1261546 -1759892 -1984055 -1214358 284857 1357065 1470919
35859 1470919 1194963 932384 202768 -1262954 -2542981 -2498700 -1385872 -690813 -1312514
35850 -1312514 -2474976 -2700033 -1523301 147073 1276527 1787850 2139957 2304878 1841742
35841 1841742 862771 124091 -59444 -256737 -857785 -1224319 -543071 905894 2031868
35832 2031868 2260984 1959064 1672454 1557657 1565584 1689913 1922592 2220628 2498974 2502802
35822 2502802 1896208 706133 -570392 -1506379 -2019864 -1906776 -768216 1033871 2020848
35813 2020848 1161403 -532542 -997962 345107 1993585 2355756 1406849 123451 -834754
35804 -834754 -1396772 -1661701 -1726388 -1613707 -1121764 -86477 1102865 1726954 1590007
35795A590007m59527n03680o33339n17726J18731M08138n43770j707617j047561
35786c296344J349448K850292J773439l09926r96270l69330j92891p64741p26385
35777f82708K22733O39289j36397p28984k5329R05042O00225l40957l30934M93574
35767F15554N75768l48285q24223j37450O64655P03257M84293M51319n512j070560
35757A108816j561257p27621L28681L74343q1475p3569J634m18159m13476P29969
35747g32114J455043J70390j480795p34977J504011J635528p92322k176322p29584
35738a881142P95462J04086q13350L51091J824314R27095r63758p23387J018688
35729F39099J024357q44898j478788L1938J075409K93143l15275O23404J324601
$$ plain form
35795 1590007 1130480 626800 -6539 -524265 -405534 2604 -541166 -2248783 -3296344
35786 -3296344 -1946896 903396 2676835 2366909 1370639 1001309 808418 43677 -682708
35777 -682708 -459975 179314 42917 -686067 -711396 193646 793871 452914 121980 615554
35767 615554 1191322 843037 18814 -118636 546019 1249276 1733569 2184888 2179376 1108816
35757 1108816 -452441 -1180062 -851381 -477038 -558513 -632082 -630448 -1048607 -1462083 -732114
35747 -732114 722929 893319 -587476 -1322453 181558 1817086 1024764 -1151558 -1881142
35738 -1881142 -1085680 -981594 -1794944 -1443853 380461 1307556 343798 -379589 639099
35729 639099 1663456 818558 -660230 -628292 447117 740260 424985 1048389 2372990
35720B372990J92789j227922q84396M22748N90490m66750j172927q44131n8810
35711a075919O65178J043949O52343l42717q45282k99509M01657M42586L71679
35702A013965P41084P50056k94479j311895r33405K21756N00257j99735n36702
35693d9098N559O22272P20447M51410q6486q00247j014412l10711L38481k49039
35683c71824j404104j342299J13709J225413R15029L1758l17200j83466K0041
35674a312943L87657Q95709R67836L37281m52857q66854r35938p25110j20248
35665a825467N73093P46755M96499N43421Q66974N29496o78081j548397j092820
35656a388527R6487Q31607Q07050L71556l09003r88394r68327K2691J037791R08651
$$ plain form
35720 2372990 2565779 1337857 453461 876209 1466699 999949 -172978 -1017109 -1075919
35711 -1075919 -410741 633208 1285551 942834 97552 -201957 199700 642286 1013965
35702 1013965 1755049 2505105 2210626 898731 -34674 187082 687339 487604 -49098
35693 -49098 -43539 578733 1299180 1750590 1664104 863857 -150555 -461266 -122785 -371824
35683 -371824 -1775928 -3118227 -3004518 -1779105 -864076 -832318 -1149518 -1332984 -1312943
35674 -1312943 -925286 -29577 938259 1275540 822683 -44171 -980109 -1705219 -1825467
35665 -1825467 -1252374 -505619 -9120 534301 1401275 1930771 1252690 -295707 -1388527
35656 -1388527 -1292040 -460433 346617 718173 409170 -579224 -1547551 -1524860 -487069 421582
35646D21582k36564j191410j169400m30335L69969Q08040P59347L64794m6348
35637c50325k73550m04929n18175m66775j54520K32420M62037N18948N19361N50635
35627A15127N86846L88046k83645j039000r09961L46072J471878J171397m0431
35618A806329n82559r3648L80735K88166O5547k42070j041785j661063p94076
35609a874424R80258J329133k44399j246403n7299J349906N94242j251686j562084
35600a982756l56515L16065J49899N99100J558501J224398m93115j368022l76608
35591g29053P61460M99225l78259o14568m35340l86345m9035P20981Q82597l4297
35581B37366o95536R795R94816O64657n02020q45409k12997J16456k22453k73659
$$ plain form
35646 421582 185018 -1006392 -2175792 -2606127 -2236158 -1428118 -668771 -303977 -350325
35637 -350325 -623875 -1028804 -1546979 -2013754 -2168274 -1935854 -1473817 -954869 -435508 115127
35627 115127 701973 1090019 806374 -232626 -1142587 -796515 675363 1846760 1806329
35618 1806329 1223770 1130122 1510857 1799023 1864570 1622500 580715 -1080348 -1874424
35609 -1874424 -894166 434967 190568 -1055835 -1113134 236772 831014 -420672 -1982756
35600 -1982756 -2339271 -2023206 -1873307 -1274207 284294 1508692 1015577 -352445 -729053
35591 -729053 32407 531632 153373 -461195 -896535 -1282880 -1331915 -610934 271663 237366
35581 237366 -458170 -448375 546441 1211098 709078 -136331 -349328 -232872 -455325 -728984
35571g28984L15424O50961K11965k74839j19925K29652N152p04875j184382j023655
35561b623506l62147M39187R82229R67894M85253j0059k04657j89406p2792K67994
35551c20010P14820O26755l10789j195257p84036O22425J218762J45487j158077
35542d39920j032374m4319J56900l00380J16421J275889J163067o55597j844737
35533a605050q82614N07127L67525k32793N35105J567770N75301j608421j961596
35524b737646j45127J086580N43971J34225R41157J245765n3922j161465m99652
35515f46114N32526J63044o46990j76997Q17605N23003o03516o24137N66803J245948
35505A151175P40996M1821k36287m47305n57683o1955O84501O61601j88552q86220
$$ plain form
35571 -728984 -413560 237401 449366 174527 54602 284254 289406 -415469 -1599851 -2623506
35561 -2623506 -2985653 -2546466 -1564237 -596343 -111090 -121149 -325806 -515212 -588004 -320010
35551 -320010 394810 1021565 710776 -484481 -1268517 -646092 572670 718157 -439920
35542 -439920 -1472294 -1516613 -1359713 -1660093 -1543672 -267783 895284 239687 -1605050
35533 -1605050 -2487664 -1980537 -1613012 -1845805 -1310700 257070 832371 -776050 -2737646
35524 -2737646 -2882773 -1796193 -1252222 -1117997 -176840 1068925 1015003 -146462 -646114
35515 -646114 -113588 49456 -597534 -774531 43074 566077 -37439 -661576 -94773 1151175
35505 1151175 1892171 1933992 1697705 1250400 692717 630762 1315263 1976864 1788312 902092
35495I02092r48691p53245m92515j5138M17904M03444K58644N01472P52490L09288
35485A335745n24758q92031p72471o56853l01706P15085J587755J096035l18253
35476A268548r30804k22400N63347M61195j06357m61137n23818k86431L24119
35467H6262Q50242P07220K49330K81901N71216J47590r22131j453415r32426q1247
35457d95458M24721N38075K00894n22100q05441j7154R02576O33044k80364l01207
35447B77586L09148m1702j123289r98313L58651O35558p14504j170333M63647
35438b003551J552979o0220k046364j065980J753480K437939K48741j470764m75752
35429a129492J563345K097763J003473k30741q15069r75792r92911q40491l71629
$$ plain form
35495 902092 -46599 -799844 -1292359 -1307497 -889593 -486149 -227505 273967 1026457 1335745
35485 1335745 810987 -81044 -853515 -1510368 -1812074 -1096989 490766 1586801 1268548
35476 1268548 337744 115344 678691 1139886 1033529 572392 48574 -237857 86262
35467 86262 936504 1643724 1893054 2174955 2746171 2893761 1971630 518215 -414211 -495458
35457 -495458 -70737 467338 668232 146132 -659309 -676463 226113 859157 578793 277586
35447 277586 586734 545032 -578257 -1576570 -1217919 -582361 -1296865 -2467198 -2003551
35438 -2003551 -450572 -510792 -2557156 -3623136 -1869656 568283 817024 -653740 -1129492
35429 -1129492 433853 2531616 3535089 3304348 2489279 1513487 520576 -319915 -691544
35420f91544M27884J081318Q19459k89806r57134k99984P27677O53426l28348
35411A142948q59003o56768o13693p98925j83171J290112K040897J055921n08301
35402A910017q73040O9308R30199P52791p8154o27123m70321L0457J89483k88424
35392A545193r65279j108832m82045L99930P69999L22041m60395p11350j60639
35383h51377M13392J97016l35023K3807J236176J736444O25912r80162j602287
35374D63898j311873r41678m25589O32075J473220R47553n21927j285863p35536
35365a705720J57446N57287O33931N96906K19374l66397n79426m09134m40426
35356a336159o17832j61848R16283J409968N98361o81213j245491r60001l42638
$$ plain form
35420 -691544 -263660 817658 1637117 1347311 390177 90193 817870 1471296 1142948
35411 1142948 283945 -372823 -986516 -1785441 -1968612 -678500 1362397 2418318 1910017
35402 1910017 1036977 1106285 2036484 2789275 2711121 2083998 1613677 1644134 1833617 1545193
35392 1545193 579914 -528918 -1010963 -611033 158966 481007 20612 -690738 -851377
35383 -851377 -437985 -240969 -575992 -552185 683991 2420435 3046347 2066185 463898
35374 463898 -847975 -1789653 -2215242 -1583167 -109947 837606 315679 -970184 -1705720
35365 -1705720 -1548274 -990987 -357056 239850 459224 92827 -486599 -895733 -1336159
35356 -1336159 -1953991 -2115839 -1199556 210412 808773 127560 -1117931 -2077932 -2420570
35347b420570L48901R51406J062892N97258J22136N7053P7454j53822k71538J37117
35337E08287O84884O87926J54666l52853n40131m80444j79450L41154O96084M66468
35327A986591j66348n96972n79724l98298k67605n8724K44071K88472q8602l77170
35317a4309n909O62920O26517k69392q81227l81822L84436J55096o60144n52959
35307i36793N47182R98138J00046p15165k38469N98389M54880j88902j40703L26509
35297H05112K11013k13356m5669L21026m0783n13083J57472J262886Q91548p81716
35287B054450j511445n58429L32367J04526j08565L68221K43487j101454j852937
35278b029779n82898J121926J019358k93402n27762O55810J410639O53792o72247
$$ plain form
35347 -2420570 -2071669 -1120263 -57371 539887 662023 719076 796530 642708 371170 508287
35337 508287 1193171 1881097 2035763 1682910 1142779 662335 482885 824039 1520123 1986591
35327 1986591 1820243 1223271 643547 245249 -22356 -81080 162991 451463 362861 -14309
35317 -14309 -20218 642702 1269219 999827 118600 -263222 121214 276310 -383834 -936793
35307 -936793 -389611 608527 708573 -6592 -245061 353328 808208 619306 478603 805112
35297 805112 1016125 802769 757100 1078126 1037343 524260 681732 1944618 2836166 2054450
35287 2054450 543005 -15424 316943 421469 312904 681125 924612 -176842 -2029779
35278 -2029779 -2612677 -1490751 -471393 -764795 -1292557 -636747 773892 1427684 755437
35269G55437j202322o25314L78582P89353J50099o58032l46861O49630M25540
35260C16112j242369j904839o9638K114874J906515K9003q52000l53039j47551
35251b02932m52350K0722R51572N62936r24572j220477N1588M94156q74139j699047
35241c292543k37015J588693J305238j97581m46455N57324Q08783j09168o02595
35232f25319K5724O30032M09043P0834K77847M63336o6572q87386j046837l29070
35222a078368N88568R34275N29987j12961l03332P5771M22826K10430l04555m57796
35212E04845o4727L92166L50257k63114r10043q25296J89428J302613J401250
35203B077379L96025o90737j004678o30994l3040M66659M57184l21940j112211
$$ plain form
35269 755437 -446885 -1072199 -693617 95736 245835 -412197 -759058 -109428 316112
35260 316112 -926257 -2831096 -2900734 -785860 1120655 1149658 297658 -55381 -202932
35251 -202932 -655282 -634560 317012 879948 -44624 -1265101 -1213513 -719357 -1593496 -3292543
35241 -3292543 -3529558 -1940865 -635627 -833208 -1279663 -722339 86444 -22724 -625319
35232 -625319 -599595 30437 439480 510314 788161 1251497 1184925 297539 -749298 -1078368
35222 -1078368 -489800 444475 974462 861501 558169 633940 1056766 1267196 962641 504845
35212 504845 440118 832284 1182541 919427 9384 -815912 -626484 676129 2077379
35203 2077379 2473404 1782667 777989 146995 113955 580614 1037798 715858 -396353
35194c96353o12364R97221J677102K47690j583702j411540M02076J291137K92239
35185I03506p07090r445J365374J314376l10508j639491j338116o7478O64639
35176A75767K99724m54884p02748l38317P9377J73006J26781J64806Q6612k81733
35166f71609m96949M362Q94225J149821M49043k78200j03012N89994O27613l32934
35156A832354j330666j338826m90673K54840M03748L81601O17978P06797J8865
35147A056018j062638j296909k24311J029960J134494K27780n07058n84373n78085
35138h05122p91049o50263J38012P26230J99616r85763j474299p51948L09963
35129d084623O56181J75914m66812n98983N826R51502J345387O18740n65864q14867
$$ plain form
35194 -396353 -1008717 -11496 1665606 1913296 329594 -1081946 -679870 611267 903506
35185 903506 196416 186971 1552345 2866721 2556213 916722 -421394 -488872 175767
35176 175767 475491 20607 -682141 -1020458 -941081 -768075 -641294 -476488 -389876 -671609
35166 -671609 -1168558 -1164196 -269971 879850 1328893 1050693 947681 1537675 2165288 1832354
35156 1832354 501688 -837138 -1327811 -1072971 -669223 -287622 330356 1037153 1056018
35147 1056018 -6620 -1303529 -1527840 -497880 636614 864394 357336 -227037 -805122
35138 -805122 -1596171 -2246434 -2108422 -1382192 -1182576 -2168339 -3642638 -4394586 -4084623
35129 -4084623 -3428442 -3252528 -3719340 -4318323 -4312497 -3360995 -2015608 -1396868 -1962732 -2777599
35119b777599K45303J367162J361428O47744K67310Q0024o62643j363060n81486
35110a415817J262831J759780O6140j369792l45176J496347J022909j449461k510360
35101a482599q25372J071748R12670j80087j87853N40662N47483M2841J55972
35092E95465N61089J18358q20002q93849r0004M07864L92008O17890Q57071J52292
35082A898182r76112q79947L48978P16796l42282r20789k522N89641o58065k009120
35072b235240j025886J439663K417119J181841j43544j26430L13237J05601k89065
35063A637296j82166N8808n0372j78307o1313k20906r07334j282940o29388L98515
35053a418107P28219M54365L89021M92722N607r55007j204039k49425Q00409P50324
$$ plain form
35119 -2777599 -2532296 -1165134 196294 844038 1111348 1191372 528729 -834331 -1415817
35110 -1415817 -152986 1606794 1672934 303142 -42034 1454313 2477222 1027761 -1482599
35101 -1482599 -2307971 -1236223 -323553 -503640 -691493 -150831 396652 439493 595465
35092 595465 1156554 1274912 454910 -438939 -528943 -121079 270929 888819 1745890 1898182
35082 1898182 922070 42123 391101 1107897 765615 -155174 -157696 431945 -226120 -2235240
35072 -2235240 -3261126 -1821463 595656 1777497 1633953 1507523 1820760 1926361 1637296
35063 1637296 1455130 1513938 1463566 1285259 1223946 1003040 95706 -1187234 -1816622 -1418107
35053 -1418107 -689888 -235523 153498 646220 651827 -303180 -1507219 -1756644 -956235 -205911
35043b05911p071k02804L39169M98767k98474j046053n54175P69423J384786O41884
35033A319541n10586r16756n33452l5912K32088L61879L46201O7330l13364m48720
35023d31751k69100k915K22065M68643O88999O37818J78270m73876q84249p74406
35013f40502k94718J38282L67086O48765J026751R12517n1863r83007o50377N55414
35003A028348Q13134m77691j559272q06145Q10110J140733n9610j068934p94705
$$ plain form
35043 -205911 -212982 -415786 -76617 422150 123676 -922377 -1476552 -707129 677657 1319541
35033 1319541 808955 -107801 -641253 -677165 -445077 -83198 263003 330333 16969 -431751
35023 -431751 -700851 -703766 -481701 -13058 675941 1313759 1492029 1018153 133904 -640502
35013 -640502 -935220 -796938 -429852 218913 1245664 2158181 2106318 1123311 472934 1028348
35003 1028348 1841482 1363791 -195481 -1001626 -191516 949217 889607 -179327 -974032
$$ [...]
##END NTUPLES=NMR SPECTRUM
##END=
