##TITLE=31Pdec_SR103
 d2O, 24 sc
 8.2.2022
##JCAMPDX= 6.0         $$ Bruker NMR JCAMP-DX V2.0
##DATA TYPE= NMR SPECTRUM
##DATA CLASS= NTUPLES
##ORIGIN= UXNMR, Bruker Analytische Messtechnik GmbH
##OWNER= root
$$ XWIN-NMR		Version 3.5
$$ Wed Feb  9 11:58:12 2022 Russian Standard Time (UT+4h)  she@DPX200
##.OBSERVE FREQUENCY= 81.013821
##.OBSERVE NUCLEUS= ^31P
##.ACQUISITION MODE= SIMULTANEOUS
##.ACQUISITION SCHEME= undefined
##.AVERAGES= 24
##.DIGITISER RES= 16
##SPECTROMETER/DATA SYSTEM= spect
##.PULSE SEQUENCE= zgpg30
##.SOLVENT NAME= CDCl3
##.SHIFT REFERENCE= (INTERNAL, CDCl3, 0, 248.564)
##AUDIT TRAIL= $$ (NUMBER, WHEN, WHO, WHERE, WHAT)
$$ ##TITLE= Audit trail, XWIN-NMR		Version 3.5
$$ ##JCAMPDX= 5.01
$$ ##ORIGIN= Bruker BioSpin GmbH
$$ ##OWNER= she
$$ F:/spectra/data/she/nmr/P31/1/pdata/1/auditp.txt
$$ ##AUDIT TRAIL=  $$ (NUMBER, WHEN, WHO, WHERE, WHAT)
(   1,<2022-02-09 11:56:57.68 +0400>,<she>,<DPX200>,
      <created by zg, POWCHK disabled, PULCHK disabled
       configuration hash MD5:
       00 E9 B6 7A A2 85 ED C7 34 08 36 98 17 FE 4E 26
       data hash MD5: 32K
       FB D3 CA A3 6A D8 FF BE BE 35 F2 C3 50 04 18 52>)
(   2,<2022-02-09 11:57:06.79 +0400>,<she>,<DPX200>,
      <Start of raw data processing
       efp BC_mod = 2 LB = 1 FT_mod = 6 PKNL = 1 PHC0 = -9420.138 PHC1 = 256.4736 SI = 64K 
       data hash MD5: 64K
       78 5C 19 DE 1B 4E 87 27 51 79 B8 C2 4B 09 4B 8B>)
(   3,<2022-02-09 11:57:27.76 +0400>,<she>,<DPX200>,
      <pk PHC0 = 27.76878 PHC1 = -132.8 
       data hash MD5: 64K
       06 08 73 91 3C 31 4D A5 EB FE 3F F7 F3 BD D7 E9>)
$$ ##END=
$$ 
$$ hash MD5
$$ F2 C0 C2 26 91 FB E4 EE CD AA 5F 3E 84 FE 7E 92
##$RELAX= 
##$RELAX= 
##$RELAX= 
##$RELAX= 
##$RELAX= 
##$RELAX= 
##$RELAX= 
##$RELAX= 
$$ Bruker specific parameters
$$ --------------------------
##$DU= <F:/spectra>
##$EXPNO= 1
##$NAME= <P31>
##$PROCNO= 1
##$TYPE= <nmr>
##$USER= <she>
##$AMP= (0..31)
100 100 100 100 100 100 100 100 100 100 100 100 100 100 100 100 100 100 
100 100 100 100 100 100 100 100 100 100 100 100 100 100 
##$AQSEQ= 0
##$AQ_mod= 1
##$AUNM= <au_zg>
##$AUTOPOS= <>
##$BF1= 81.014009
##$BF2= 200.13
##$BF3= 200.13
##$BF4= 200.13
##$BF5= 200.13
##$BF6= 200.13
##$BF7= 200.13
##$BF8= 200.13
##$BYTORDA= 1
##$CFDGTYP= 0
##$CFRGTYP= 5
##$CHEMSTR= <none>
##$CNST= (0..31)
1 1 145 1 1 1 1 1 1 1 1 1 1 1 1 1 1 1 1 1 1 1 1 1 1 1 1 1 1 1 1 1 
##$CPDPRG= <waltz16>
##$CPDPRG1= <>
##$CPDPRG2= <waltz16>
##$CPDPRG3= <>
##$CPDPRG4= <mlev>
##$CPDPRG5= <mlev>
##$CPDPRG6= <mlev>
##$CPDPRG7= <mlev>
##$CPDPRG8= <mlev>
##$CPDPRGB= <>
##$CPDPRGT= <>
##$D= (0..31)
0 1 0 0 0 0 0 0 0 0 0 0.03 2e-05 3e-06 0 0 0 0 0 0 0 0 0 0 0 0 0 0 0 0 
0 0 
##$DATE= 1644393417
##$DBL= (0..7)
120 120 120 11 120 120 24 19 
##$DBP= (0..7)
150 150 150 150 150 150 150 150 
##$DBP07= 0
##$DBPNAM0= <>
##$DBPNAM1= <>
##$DBPNAM2= <>
##$DBPNAM3= <>
##$DBPNAM4= <>
##$DBPNAM5= <>
##$DBPNAM6= <>
##$DBPNAM7= <>
##$DBPOAL= (0..7)
0.5 0.5 0.5 0.5 0.5 0.5 0.5 0.5 
##$DBPOFFS= (0..7)
0 0 0 0 0 0 0 0 
$$ [...]
##$SUBNAM2= <"">
##$SUBNAM3= <"">
##$SUBNAM4= <"">
##$SUBNAM5= <"">
##$SUBNAM6= <"">
##$SUBNAM7= <"">
##$SUBNAM8= <"">
##$SUBNAM9= <"">
##$SW= 501.771253377433
##$SWIBOX= (0..15)
0 1 3 0 0 0 0 0 0 0 0 0 0 0 0 0 
##$SW_h= 40650.406504065
##$TD= 32768
##$TD0= 1
##$TE= 0
##$TE2= 300
##$TE3= 300
##$TEG= 300
##$TL= (0..7)
0 120 53 12 22 120 120 120 
##$TP= (0..7)
150 150 150 150 150 150 150 150 
##$TP07= 0
##$TPNAME0= <>
##$TPNAME1= <>
##$TPNAME2= <>
##$TPNAME3= <>
##$TPNAME4= <>
##$TPNAME5= <>
##$TPNAME6= <>
##$TPNAME7= <>
##$TPOAL= (0..7)
0.5 0.5 0.5 0.5 0.5 0.5 0.5 0.5 
##$TPOFFS= (0..7)
0 0 0 0 0 0 0 0 
##$TUNHIN= 0
##$TUNHOUT= 0
##$TUNXOUT= 0
##$USERA1= <user>
##$USERA2= <user>
##$USERA3= <user>
##$USERA4= <user>
##$USERA5= <user>
##$V9= 5
##$VALIST= <valist>
##$VCLIST= <CCCCCCCCCCCCCCC>
##$VD= 0
##$VDLIST= <DDDDDDDDDDDDDDD>
##$VPLIST= <PPPPPPPPPPPPPPP>
##$VTLIST= <TTTTTTTTTTTTTTT>
##$WBST= 1024
##$WBSW= 4
##$XGAIN= (0..3)
0 0 0 0 
##$XL= 0
##$YL= 0
##$YMAX_a= 3331
##$YMIN_a= -3008
##$ZGOPTNS= <>
##$ZL1= 120
##$ZL2= 120
##$ZL3= 120
##$ZL4= 120
##$ABSF1= 0
##$ABSF2= 0
##$ABSG= 0
##$ABSL= 0
##$ALPHA= 0
##$AQORDER= 0
##$ASSFAC= 0
##$ASSFACI= 0
##$ASSFACX= 0
##$ASSWID= 0
##$AUNMP= <proc_1d>
##$AZFE= 0.1
##$AZFW= 0.5
##$BCFW= 0
##$BC_mod= 2
##$BYTORDP= 0
##$COROFFS= 0
##$CY= -3
##$DATMOD= 1
##$DC= 0
##$DFILT= <>
##$DTYPP= 0
##$F1P= 0
##$F2P= 0
##$FCOR= 1
##$FTSIZE= 65536
##$FT_mod= 6
##$GAMMA= 0
##$GB= 0
##$INTBC= 1
##$INTSCL= 5.30512e-09
##$ISEN= 30
##$LB= 1
##$LEV0= 0
##$LPBIN= 0
##$MAXI= 10000
##$MC2= 0
##$MEAN= 0
##$ME_mod= 0
##$MI= 50
##$NCOEF= 0
##$NC_proc= -6
##$NLEV= 6
##$NOISF1= 182.463
##$NOISF2= 159.3651
##$NSP= 0
##$NTH_PI= 0
##$NZP= 0
##$OFFSET= 248.5645
##$PC= 4
##$PHC0= -9392.369
##$PHC1= 123.6736
##$PH_mod= 1
##$PKNL= yes
##$PPARMOD= 0
##$PSCAL= 0
##$PSIGN= 0
##$REVERSE= no
##$SF= 81.014009
##$SI= 65536
##$SIGF1= 159.3651
##$SIGF2= -187.1042
##$SINO= 113.3802
##$SIOLD= 16384
##$SREGLST= <1H.CDCl3>
##$SSB= 0
##$STSI= 65536
##$STSR= 0
##$SW_p= 40650.406504065
##$SYMM= 0
##$S_DEV= 0
##$TDeff= 32768
##$TDoff= 0
##$TI= <>
##$TILT= no
##$TM1= 0
##$TM2= 0
##$TOPLEV= 0
##$USERP1= <user>
##$USERP2= <user>
##$USERP3= <user>
##$USERP4= <user>
##$USERP5= <user>
##$WDW= 1
##$XDIM= 65536
##$YMAX_p= 314822485
##$YMIN_p= -13777214
$$ End of Bruker specific parameters
$$ ---------------------------------
##NTUPLES= NMR SPECTRUM
##VAR_NAME=  FREQUENCY,     SPECTRUM/REAL,   SPECTRUM/IMAG
##SYMBOL=    X,             R,               I
##VAR_TYPE=  INDEPENDENT,   DEPENDENT,       DEPENDENT
##VAR_FORM=  AFFN,          ASDF,            ASDF
##VAR_DIM=   65536,         65536,           65536
##UNITS=     HZ,            ARBITRARY UNITS, ARBITRARY UNITS
##FACTOR=    0.620285442955139, 1,           1
##FIRST=     20137.2065510759, 0,            0
##LAST=      -20513.1999529892, 0,           0
##MIN=       -20513.1999529892, -13777214,   0
##MAX=       20137.2065510759, 314822485,    0
$$ Real data points
##PAGE= N=1
##DATA TABLE= (X++(R..R)), XYDATA
$$ [...]
40989C9366k02089R5718Q5641q8158o1027P5499N09j81758j36920K5342o1037
40978d08914k65528j18520K93621L58331l0040k38895O5199L86508K57325m9587
40968B49500j03581j7195o9011j35998k7876M7845j13854k39865m1122K12743
40958b38414J42685n5886J4583K01810R4215j68825j01965K35269K93815k6825
40948C90462k14769j7212J92492J03127p4898q4529m6241j26876k00594j16659
40938a95697K8052J14347J95338K72756J85545q0993k62680j89576l0625J1663
40928D8130q429K5455N4752l385p2721n3961K5361J10829J95318K25575J37154
40917F84078J8226K194k109j67618l47118k16282J37948K42878j6781j83300K2578
$$ plain form
40989 39366 -162723 -67005 18636 -69522 -130549 -55050 -54541 -236299 -373219 -347877 -408914
40978 -408914 -674442 -792962 -499341 -141010 -171050 -409945 -344746 41762 299087 249500
40968 249500 145919 128724 59713 -76285 -104161 -56316 -170170 -410035 -451157 -238414
40958 -238414 -95729 -151615 -137032 64778 158993 -9832 -111797 123472 417287 390462
40948 390462 175693 158481 350973 454100 379202 294673 248432 121556 -79038 -195697
40938 -195697 -167645 -53298 142040 414796 600341 519348 256668 67092 36467 48130
40928 48130 39701 65156 119908 116523 43802 -10159 15202 126031 321349 546924 684078
40917 684078 702304 704498 702389 534771 187653 -28629 109319 352197 335416 152116 174694
40906A74694K40787R3714j93287k13299m0761q688j13029j09239O841N4340L7129
40895g0798O0089M0898j09847j95736k2426J93753J32258p4639n5536J52178J69723
40884B19917o4906k15311j33631l8012m2391J7469J72573J78478m4676k12387
40874a62877j08750J02902J84073J41085O3963p0056k34948k53864p0428R4286
40864c14614O2772j7926O6354K29080K15187l804j96179j90362m7529P5170R6294
40853b5557L4638m6102r0663q0048k1190O3187J09301L8773j14361j72060k6600
40842c30682J72002J91971L9583o8642k8540M6494M6711L044k5456l3025j0523
40831B937L8479K7748q9954j54582J6128K72588K48763r8812l60197k22199J15710
$$ plain form
40906 174694 415481 509195 315908 102609 61848 53160 -59869 -169108 -162267 -107927 -70798
40895 -70798 -10709 30189 -79658 -275394 -297820 -104067 28191 -46448 -101984 50194 219917
40884 219917 155011 -60300 -193931 -231943 -274334 -256865 -84292 94186 49510 -162877
40874 -162877 -271627 -168725 15348 156433 220396 150340 -84608 -338472 -408900 -314614
40864 -314614 -251842 -269768 -203414 25666 240853 237049 40870 -149492 -197021 -121851 -25557
40853 -25557 9081 -37021 -127684 -207732 -228922 -165735 -56434 -17661 -132022 -304082 -330682
40842 -330682 -158680 33291 72874 4232 -24308 22186 68897 71941 46485 13460 2937
40831 2937 41416 69164 -20790 -175372 -159244 113344 362107 263295 -96902 -319101 -203391
40820b03391K70561J93353J08300R5631K4055j47237k54945j69377J2879Q9292
40810A9121j508j08505m8681J54580K70651J52862m5867p5815N1497R8528k0424
40799D46439j28149r9846m9729q9476j18075j6282J21200J30219K5780o8079j25256
40788B8746j77224j66547l8018R2589O6853n2277n3292Q1396J21223n0686k12298
40777c59535r4972K06068L12585O1536k60320k83936k5388J93962K18373J90288
40767A58661J89396N5232k53717m13169j57833K40643L00176K9463j15787M0906
40757G3971J67087J2563k05519k04914n3193O1977J53331K52635K00361p0321
40747C87978k79389j63087J00395J62884L4966j4902M6386J7805j11439j39614
$$ plain form
40820 -203391 67170 260523 368823 464454 488509 341272 86327 -83050 -70171 19121
40810 19121 17613 -90892 -139573 15007 285658 438520 392653 316838 368335 466863 446439
40799 446439 318290 218444 168715 79239 -38836 -55118 66082 196301 222081 154002 28746
40788 28746 -148478 -315025 -353043 -260454 -193601 -245878 -299170 -217774 -96551 -147237 -359535
40777 -359535 -454507 -248439 64146 125682 -134638 -418574 -443962 -250000 -31627 158661
40767 158661 348057 403289 149572 -263597 -421430 -180787 119389 148852 33065 73971
40757 73971 241058 253621 48102 -156812 -210005 -148028 5303 257938 458299 387978
40747 387978 108589 -54498 45897 208781 243747 228845 275231 293036 181597 41983
40737D1983n3732o7968k03059j92469O6239K84554J89552q4019k08329r9589N6170
40726b70667J07313Q1370O2755O7709N8297J3065m0771n9828m4877l7295l8293
40715a01222P948J05327J57260J02842K1701M318P52p3581j54574j10658K9583
40704a0304R0834o603j43867j52617J4354K39833L12226J15271j81884k50388
40694B6855k5755J58899L3260k02385j86774M5420J54971N4232j6438L5901Q958
40683H7144j71542k53749o6294J74364J83430J7665n8046L0039J06471K4655j40435
40672f6298j72303L9397L05017K76127r7141l90967k35555J17525J26300k14772
40662c12670l53845l8147L22593L30928J48052Q1334O6383p8294k40245k37045
$$ plain form
40737 41983 -11749 -79717 -282776 -475245 -409006 -124452 65100 -18919 -227248 -326837 -270667
40726 -270667 -163354 -81984 -19229 48480 106777 119842 79071 19243 -25634 -62929 -101222
40715 -101222 -93274 12053 169313 272155 293856 298174 298926 225345 70771 -39887 -10304
40704 -10304 80530 73927 -69940 -222557 -208203 31630 343856 459127 277243 26855
40694 26855 1100 159999 193259 -9126 -195900 -150480 4491 58723 42285 78186 87144
40683 87144 -84398 -338147 -404441 -230077 -46647 -28982 -87028 -56989 49482 74137 -66298
40672 -66298 -238601 -199204 105813 381940 284799 -106168 -341723 -224198 -97898 -312670
40662 -312670 -666515 -704662 -382069 -51141 96911 178245 244628 166334 -73911 -310956
40652c10956j53682j07489J1989K13454J77047k06065m36059q9141M23020M11216
40642f6666k7811k18161j2865Q8346j02815j98735m0330J8251j50048j63016J07290
40631g66560K00184j07577l12896k2446L25704J71534k40396l13384r3785r4073
40621a253695l54053l96812n2080L05672L67904K32284R4527K5422P6990K40872
40611g12969L12909J38774p1982l3142J28624Q7449r3515p8895J02125Q3287j62570
40600b99905k39781j7618J48982N1577m3201P5011J85337P6516o2975j4534P2649
40589f7942j3157j41883p6808J15586J92046R0594p5289k04740k06002r312K53481
40578a43426L14951J61212P4293J46156J11268j34990k64757p0793J11768o0627
$$ plain form
40652 -310956 -464638 -572127 -560138 -346684 -169637 -375702 -811761 -900902 -477882 -66666
40642 -66666 -94477 -312638 -325503 -237157 -339972 -538707 -579037 -560786 -710834 -873850 -766560
40631 -766560 -566376 -673953 -986849 -1009295 -683591 -512057 -752453 -1065837 -1159622 -1253695
40621 -1253695 -1607748 -2004560 -2056640 -1750968 -1383064 -1150780 -1056253 -1030831 -953841 -712969
40611 -712969 -400060 -261286 -333268 -366410 -237786 -150337 -243852 -322747 -220622 -137335 -299905
40600 -299905 -539686 -557304 -408322 -356745 -399946 -324935 -139598 -63082 -126057 -140591 -67942
40589 -67942 -81099 -222982 -299790 -184204 7842 98436 23147 -181593 -387595 -396907 -143426
40578 -143426 171525 332737 407030 553186 664454 529464 264707 193914 305682 245055
40568B45055l33134k53525Q6938K22640N0410j02448n1462O3678J25040J59000
40558B12192J43275L9373l7113O277K835j95105l56496j92533J12490J55651j6479
40547a25633j0832K08778K85439J45730J24350L05266L11606l9580l79921l51456
40537D73747j00966N8587J04186J38196J01140n0206j42837m9129O4215k469j56048
40526D38416j68556r356J59223J88457L4126k07071k92185o5017K65011L26154
40516F69202R8619p9202n7859n2604j76153k15137n2009R4088P1463N0761J28216
40505D79385P9769j79665k90275J0638L82391L52744K5989j33128j7555Q0350
40495G90643J5931n8535m1534q753l907J3756L8635M9786J02619K14638K79344
$$ plain form
40568 245055 -88079 -341604 -254666 -32026 18384 -84064 -135526 -71848 53192 212192
40558 212192 355467 394840 357727 364004 366839 171734 -184762 -377295 -264805 -109154 -125633
40547 -125633 -136465 72313 357752 503482 627832 933098 1244704 1205124 825203 473747
40537 473747 372781 431368 535554 673750 774890 724684 581847 532718 596933 594464 438416
40526 438416 269860 260504 419727 608184 642310 435239 143054 78037 343048 669202
40516 669202 767821 688619 630760 578156 402003 186866 134857 228945 300408 351169 479385
40505 479385 559154 379489 89214 99852 482243 834987 860976 727848 710293 790643
40495 790643 806574 748039 706505 697752 693845 707601 746236 796022 898641 1113279 1392623
40484A392623K45726K12120K12915J60511J25538L22208O40370O38294K63072
40475D213377P1962L90268Q18818J016528J303287J904398K410387K844418M278254
40466A9251697O882278Q083305M857627j906252p400931q139213n552415l298373
40458A2777723k645720k254537j340168p33381r18755j059973n38629o911j72065
40449C107584o00591n36922j41820p8613l60597m22226j01291J59315N3458j90174
40439H88123k26877m5471J04303K7829k24793l86051k33904R7802K14018j7519
40429A97460k38803j03925K00570K48249L0064q1697K2233L1721j99133l49669
40419b42930j54620J27549J08359j16824j44295Q7332K44582J69394P9447J17700
$$ plain form
40484 1392623 1638349 1850469 2063384 2223895 2349433 2671641 3312011 3950305 4213377
40475 4213377 4285339 4675607 5494425 6510953 7814240 9718638 12129025 14973443 19251697
40466 19251697 26133975 34217280 39074907 37168655 29767724 21628511 16076096 12777723
40458 12777723 10132003 7877466 6537298 5803917 4885162 3825189 3286560 3279649 3107584
40449 3107584 2506993 1970071 1828251 1749638 1389041 966815 865524 1024839 1078297 888123
40439 888123 661246 615775 720078 747907 523114 137063 -96841 961 214979 197460
40429 197460 -41343 -145268 55302 303551 333615 251918 274151 305872 106739 -242930
40419 -242930 -397550 -270001 -161642 -278466 -422761 -335429 -90847 78547 157994 275694
40409B75694R7033j18900l05378k01802Q6192K68615K69341J85003K6218j94960
40399C87056k64865j9181K76200J87532k29246m31410j51116K32345K75365P2735
40389C35415j6216L1985l7833k40807k92867p6708J69702K13320J09567J6306
40379B11864m4328q9046l3112J52799K72555J16484k05584l55851j99497M4172
40369a29544J18086J6934j07873j63039j26579M593J46211J35780l5333j23199
40359b63963M3593K50160J53238k05884m25735k92696k8387P9296L7649K4401
40349f28328J06623K13876K45632J25544j04479k18990m5736K13349J79507j28761
40339d1763k64136k0225K48931J97724o185n4838j9721j04802j82976l5982J72077
$$ plain form
40409 275694 372727 253827 -51551 -253353 -167161 101454 370795 555798 582016 387056
40399 387056 122191 103010 379210 566742 337496 -93914 -245030 -12685 262680 335415
40389 335415 319199 351184 313351 72544 -220323 -297031 -127329 85991 195558 211864
40379 211864 167536 78490 45378 198177 470732 587216 381632 25781 -173716 -129544
40369 -129544 -11458 5476 -102397 -265436 -392015 -387422 -241211 -105431 -140764 -263963
40359 -263963 -220370 29790 183028 -22856 -448591 -741287 -769674 -690378 -652729 -628328
40349 -628328 -521705 -307829 -62197 63347 -41132 -260122 -305858 -92509 86998 -41763
40339 -41763 -305899 -326124 -77193 120531 114346 59508 39787 -65015 -247991 -283973 -111896
40328a11896J42208j4544K1539J72476R7120j47983j57880J04866K23707M6375
40318C75988p6795N9234J66747J5077j55332q4139M8649l0682j97734j51902Q6513
40307E5624K35035J66888O041r0275n1625R3084J87711P4325j51325j96676J1278
40296C40085J89109J06769r6800j65664q0525O211L629r3240k38473k91797j32541
40285d53237J14675J98469J21994J07953J55520L0056k26204k52424o954P3618
40275a36534j81614l19333k5984K87663J68621j02243l3190J90047O0445k90922
40265c83044k78108J23817L26588J02779j19342m3147Q8453N7732L3763J22078
40255C1569R2978j46704k72432n1823K43120K48969K5921j32683j40170r1886
$$ plain form
40328 -111896 30312 15768 37307 209783 306903 158920 1040 105906 329613 375988
40318 375988 299193 358427 525174 540251 384919 300780 349429 318747 121013 -30889 55624
40307 55624 290659 457547 463588 373313 321688 414772 602483 676808 525483 328807 340085
40296 340085 529194 635963 539163 373499 292974 299185 302814 209574 -28899 -320696 -453237
40285 -453237 -338562 -140093 -18099 89854 245374 275430 49226 -203198 -210152 -136534
40275 -136534 -318148 -637481 -663465 -375802 -207181 -309424 -342614 -152567 -92122 -383044
40265 -383044 -661152 -537335 -210747 -107968 -227310 -270457 -182004 -124272 -90509 31569
40255 31569 124547 -22157 -294589 -346412 -103292 145677 171598 38915 -101255 -193141
40245a93141k5032M9283O0196J7380M5989J30795O5844j75626k98484j31379N9926
40234c94249j7061j99681j36455J31793K29073K7823j67349o9471K08731L24793
40224f2053J23954j99605l18387j20294J71747K70497J72456J03837J41825J09695
40214C93672q5396k48436j84485J236P8676J7529n8506j10968j65469j51607O611
40203e07143J94706K18580Q5956j8062j4701R546K0235R0564J95054J59052p8119
40192C55668l06953k89438n9920J46054K03084J98110K30145K41772J17261j19361
40182G16422k95362k82273j36902k0614j6864o8921p5543j877R9088J37176O0208
40171A14538q7054j82517j38858L199J16140J13240J9268o7058o5921K638K8350
$$ plain form
40245 -193141 -218173 -168890 -108694 -91314 -45325 85470 151314 -24312 -322796 -454175 -394249
40234 -394249 -411310 -610991 -747446 -615653 -386580 -358757 -526106 -595577 -386846 -62053
40224 -62053 61901 -137704 -456091 -576385 -404638 -134141 38315 142152 283977 393672
40214 393672 308276 59840 -124645 -123409 -44733 -27204 -85710 -196678 -362147 -513754 -507143
40203 -507143 -312437 -93857 -7901 -25963 -40664 -31118 -10883 79681 274735 433787 355668
40192 355668 48715 -240723 -300643 -154589 48495 246605 476750 718522 835783 716422
40182 716422 421060 138787 1885 -18729 -35593 -104514 -180057 -181934 -82846 54330 114538
40171 114538 27484 -155033 -293891 -290692 -174552 -61312 -42044 -109102 -175023 -172385 -144035
40160a44035n0617j29417n7146J13823J51401j3945j45336l9416J54407J63236
40150B955J1191n0669L6173P7831j7437j10028r9644o0594l7079M0071J39716
40139f7514Q9801j22490k52484j53697m273j436m9441L2747J83193K20285J47303
40128B1994Q8440M2034n4646j20871n6197J5044r3575k71042k12911J05468L49566
40117a86696K83051N1672q0760o1602n959k456o8730j58857j43977O0208K92107
40106b1999K67472j1007j93678p6683Q1122l5947k77694k36429J14417L53524
40096c6902K22796k7952n4607Q9168J05714o2494j75066q2797P2342J04423M2881
40085A97506K7122N9974J8538j21607k16296j47555O555P0041q049j05101r0956
$$ plain form
40160 -144035 -194652 -324069 -381215 -267392 -115991 -129936 -275272 -314688 -160281 2955
40150 2955 14146 -36523 -350 77481 60044 -49984 -149628 -210222 -247301 -207230 -67514
40139 -67514 22287 -100203 -352687 -506384 -510657 -512093 -561534 -528787 -345594 -125309 21994
40128 21994 110434 152468 97822 -23049 -79246 -64202 -157777 -428819 -641730 -536262 -186696
40117 -186696 96355 148027 67267 5665 -294 -2750 -71480 -230337 -374314 -314106 -21999
40106 -21999 245473 234466 40788 -35895 45227 9280 -268414 -504843 -390426 -36902
40096 -36902 185894 157942 103335 192503 298217 235723 60657 -22140 50202 154625 197506
40085 197506 224628 284602 303140 181533 -34763 -182318 -175763 -105722 -113771 -218872 -309828
40074c09828K3473J18650J00434j7127j26705j13961K7487J56446J20481m4614
40064f5264j32698l9421P6616J1500j78444k42163q1793J31251K08213J47318
40054a64885L7820p0655j15914q225J98312K63224N7056k10205k45987p3891L5680
40043b97670k0397p1139J4783J37653J53239O9507j9661n5705r079J15651K13936
40032B31118J50231n2754k13635k19652j27541j5517J03590J80407J21644l7948
40022A19943j20570m5639O8249J09300J04605P4656l4261j67057j36770O5911
40012C8367J66121k189k15089k02213o4561o0870j46978p8450J14868J32521r8448
40001d16921k69491j42863J06409J61157N534q0291Q5438L36106L53369P8863
$$ plain form
40074 -309828 -286355 -167705 -67271 -84398 -211103 -325064 -297577 -141131 -20650 -65264
40064 -65264 -197962 -237383 -160767 -149267 -327711 -569874 -651667 -520416 -312203 -164885
40054 -164885 -127065 -197720 -313634 -321859 -123547 139677 196733 -13472 -259459 -333350 -297670
40043 -297670 -318067 -389206 -374423 -236770 -83531 -14024 -33685 -89390 -98469 17182 231118
40032 231118 381349 328595 114960 -104692 -232233 -247750 -144160 36247 157891 119943
40022 119943 -627 -46266 21983 131283 235888 310544 276283 109226 -27544 38367
40012 38367 204488 202299 -12790 -215003 -279564 -340434 -487412 -565862 -450994 -318473 -416921
40001 -416921 -686412 -829275 -722866 -561709 -556175 -636466 -551028 -214922 138447 217310
39991B17310j72196j04309J35183J41819j44664l23556j29857J67809J93695J1977
39981f789o3153R221K2068o7440j12030q1458o1722j4512J34884K37826R9650
39970I6545j32545j28936R2711J75163j4963k02754j47109O7882K50908L05504
39960C62406J70884j26535l34410k16552N2617R5993o9051p9868R7740P2625k52904
39949b27055m10703q2916L82395M99081K87312N7323q3389j56091q1967J03179
39939B87169J06506j79883l80608j61412K25717L29570J70767Q0190R5300P254
39929E80570j50713j62078p7594j24921k28996j05084J85280K53982O728k11778
39919c4604j80974q0023o8831j0426J80836K70434N8268k42349k63924R482K37542
$$ plain form
39991 217310 45114 -59195 75988 217807 73143 -250413 -380270 -212461 -18766 -6789
39981 -6789 -69942 -60721 -38653 -106093 -218123 -299581 -361303 -375815 -240931 -3105 96545
39970 96545 -36000 -164936 -72225 102938 87975 -114779 -261888 -194006 56902 362406
39960 362406 533290 406755 72345 -144207 -91590 4403 -64648 -144516 -46776 25849 -227055
39949 -227055 -637758 -720674 -338279 160802 448114 505437 422048 265957 183990 287169
39939 287169 393675 213792 -166816 -328228 -102511 227059 397826 478016 573316 580570
39929 580570 429857 267779 190185 65264 -163732 -268816 -83536 170446 177174 -34604
39919 -34604 -215578 -295601 -364432 -374858 -194022 76412 134680 -107669 -371593 -362111 -124569
39908a24569J73410o5280j86817p9395Q1852P8776n3955q2783O8430J90093J11272
39897A11034l5888n2202k423p1690k16920k35722j12796k3405k3727J40Q2919
39886e80680J28293J15170J27697J62192J10672m4922j97809k68953k38993q5488
39876g72821J33001K20327Q7290n1135K4525J64293R0567j00395p3456J61784
39866a16020K38777L1098j72782j73963j19426j28023p2463R1064J57413L8175
39856b26150n5258O026M9107l2045n4080P0599J07702m9157r4423J55485L23662
39845B01468L9023l72423l21613J18735L23955P5918j89928j39265L0380O8305
39835a65445P2421J67166J94463K0653j65096j55622p1264j04470j47943j0975
$$ plain form
39908 -124569 48841 -16439 -203256 -282651 -200799 -122023 -175978 -258761 -190331 -238 111034
39897 111034 75146 22944 20521 -51169 -268089 -503811 -616607 -640012 -663739 -663599 -580680
39886 -580680 -452387 -337217 -209520 -47328 63344 18422 -179387 -448340 -687333 -772821
39876 -772821 -639820 -419493 -332203 -383338 -358813 -194520 -103953 -204348 -277804 -116020
39866 -116020 122757 153855 -18927 -192890 -312316 -440339 -512802 -421738 -264325 -226150
39856 -226150 -281408 -275382 -226275 -258320 -312400 -241801 -134099 -183256 -277679 -122194 201468
39845 201468 240491 -131932 -453545 -334810 -10855 65063 -124865 -264130 -233750 -165445
39835 -165445 -93024 74142 268605 289258 124162 -31460 -102724 -207194 -355137 -366112
39825c66112J68349J04056j30173j63527Q8117K71826J40086q1659o4241J34849
39815A01571J96269M115k54192l66466k61643K4356L25221L56468J3700l71593
39805b32194l62878j2269J97843N8061r9534J6010K01583J63531J7283J3243N6382
39794A7061o0589j74658q586K43832J49222k08095k93929J1051K23548P6070q6803
39783a11876J8129J29878j989j10713P6844K69089Q2296k64987l01618q8982n9310
39772c63239k35682k25355O4262K81319K27310Q4207o920j08494j59188K9609
39762d12171L33663L38872l1672l37192k45887N1868K35689K63807J92403o102
39752C83278k05337j08087K51721L82840L6648l51675l00427J1726J22903K7645
$$ plain form
39825 -366112 -197763 -93707 -223880 -387407 -299290 -27464 112622 30963 -33278 101571
39815 101571 297840 301955 47763 -318703 -580346 -555990 -230769 125699 139399 -232194
39805 -232194 -595072 -607341 -409498 -351437 -450971 -434961 -233378 -69847 -52564 -39321 17061
39794 17061 -43528 -218186 -226772 17060 166282 -41813 -335742 -324691 -101143 -25073 -111876
39783 -111876 -93747 36131 34142 -76571 273 269362 351658 86671 -214947 -303929 -363239
39772 -363239 -598921 -824276 -760014 -478695 -251385 -167178 -174098 -282592 -441780 -412171
39762 -412171 -78508 260364 228692 -108500 -354387 -302519 -66830 196977 389380 383278
39752 383278 177941 69854 321575 704415 741063 389388 88961 100687 223590 251235
39742B51235Q230J2524j81434l63863j34132L12921L36237j42591m57195k11772
39732e69840J68929K09326J00539K09703L70622K13322j33378k42041r7226n7306
39722A72650j94807k00162L7731K23956J35814o9294j60534j42583j10770m7355
39712c55354P8912J90232K10888J70064J11278K9874m3565m0475J2635L74r8825
39701B66038j79749j88667j72308j23226L0418K26838K63095P4189j54613k41284
39691a99269k07495j48316p9902r082J6443K0907J00698K36854K84253K07651
39681B22742J21251M5539j09133k51697j41343J61145K53205O943j81827n0829
39671G5996O0642j74349m05238j37760L68622M25117r950k94623j34774O0811
$$ plain form
39742 251235 259465 271989 90555 -273308 -407440 -94519 241718 99127 -358068 -569840
39732 -569840 -400911 -191585 -91046 118657 489279 702601 569223 327182 229956 172650
39722 172650 -22157 -222319 -184588 39368 175182 105888 -54646 -197229 -307999 -355354
39712 -355354 -276442 -86210 124678 294742 406020 435894 392329 351854 364489 364863 266038
39701 266038 86289 -102378 -274686 -397912 -367494 -140656 122439 196628 42015 -199269
39691 -199269 -406764 -555080 -634982 -644064 -627621 -606714 -506016 -269162 15091 222742
39681 222742 343993 389532 280399 28702 -112641 48504 301709 308652 126825 75996
39671 75996 136638 -37711 -442949 -580709 -212087 213030 203080 -91543 -226317 -165506
39661a65506j9528j13595L7693K19972J76222L5031j2138m6555j31604r0199J14743
39650D536J79815j9141j13140J57930M21233K23720k19051l53349j22843O6188
39640B25898M3018m548l88n0207r3944K1352J57160N4993j36434j9299L51999
39629E49600M68320J60089j36185p9337J00990P0750r7607j64974j25131q0336
39619F66179q033Q8419N8207j28718k42652j43455q621L902K9352J75535K28201
39608G18316L494k56087k03196P7687K12002P9177j20998k34780k63475j94677
39598a82537l0188Q9216N7179M416O7429R9133p5612k65344j55605J53834K67042
39587B8963R6102p0738q6101r5099j46927r7685K6578K896j49187j32288R4551
$$ plain form
39661 -165506 -185034 -298629 -260936 -40964 135258 170289 158151 111596 -20008 -110207 4536
39650 4536 184351 165210 52070 210000 631233 854953 635902 282553 159710 225898
39640 225898 268916 264368 263980 213773 119829 141181 298341 353334 216900 197601 549600
39629 549600 1017920 1178009 1041824 962487 1063477 1134227 1036620 871646 746515 666179
39619 666179 658146 746565 804772 676054 433402 289947 281326 285228 314580 490115 718316
39608 718316 721810 465723 262527 340214 552216 631393 510395 275615 12140 -182537
39598 -182537 -212725 -123509 -66330 -61914 5515 104648 29036 -236308 -391913 -238079 28963
39587 28963 125065 54327 -31774 -126873 -273800 -371485 -344907 -342011 -491198 -623486 -528935
39576e28935J91854K6218p7092Q6987K20596M3840k05556j81080K169K6564p4415
39565d68850o0463L4961J2706o8558j6043P7833k0959k15940j90813N8195K27576
39554f30355K16685K06129K32068J26881p0860r1189Q4104J35744n6404j93662
39544d0859n9662J28366R5099q1647j74641j56561j13132m0358N0773M0767p9508
39533d31363j05700O2781K19370J75228N8228M3524J8348j76248l58518k25592
39523g19942J34614L12016J48105p5564p4760P5701J22842k327j31045r4048P1892
39512b32516J66678P7484n9878m8692N6232J6941j83625k61374o9475J46864J28104
39501b63257j1835l3286R585p8421k14364j39183J23891K70828J81458N6960M8951
$$ plain form
39576 -528935 -337081 -310863 -387955 -300968 -80372 -36532 -242088 -423168 -420999 -394435 -468850
39565 -468850 -529313 -494352 -481646 -550204 -566247 -488414 -509373 -725313 -916126 -857931 -630355
39554 -630355 -413670 -207541 24527 151408 80548 -10641 73463 209207 152803 -40859
39544 -40859 -100521 27845 122944 41297 -133344 -289905 -403037 -443395 -392622 -351855 -431363
39533 -431363 -537063 -474282 -254912 -79684 -21456 22068 40416 -135832 -494350 -719942
39523 -719942 -585328 -273312 -125207 -200771 -275531 -199830 -76988 -79315 -210360 -304408 -232516
39512 -232516 -65838 11646 -48232 -96924 -40692 -23751 -207376 -468750 -538225 -391361 -263257
39501 -263257 -275092 -308378 -298793 -377214 -591578 -730761 -606870 -336042 -154584 -97624 -48673
39490d8673N4102l0152j05351n5418N9809J15190Q9064L1661k4951n7582l9274
39479a1575K0453Q0159J05916N7643r2832k48199k10237L8189K09849Q0699j42724
39468a12659r8372J71174K65798L5837j99566j36419J03790K00066N9725j33706
39458A55668j72312k1245J49954J12594j43639l29214k14509J8321L9395r2770
39448d97757k1083K82400M03744J30157k01204k21723m3187L5620L0592J29190
39438B6749K59544J82013q7798k78423k46414r7620L7424J12840R0028k3298q6066
39427a11021J3209J41818Q9278q4591j13295N9080J79143O5248j43080k23194
39417a27405j65087r1505k9624P3687J90131K19721J38560K1775o8114j17916
$$ plain form
39490 -48673 5429 -24723 -130074 -185492 -125683 -10493 78571 110232 85281 27699 -11575
39479 -11575 8878 89037 194953 252596 159764 -88435 -298672 -260483 -50634 30065 -112659
39468 -112659 -211031 -39857 225941 261778 62212 -74207 29583 229649 289374 155668
39458 155668 -16644 -37889 112065 224659 81020 -248194 -462703 -444382 -404987 -497757
39448 -497757 -518840 -236440 167304 297461 96257 -125466 -168653 -133033 -102441 26749
39438 26749 286293 468306 380508 102085 -144329 -241949 -204525 -91685 -1657 -24955 -111021
39427 -111021 -97812 44006 133284 48693 -64602 -5522 173621 238869 95789 -127405
39417 -127405 -292492 -383997 -413621 -339934 -149803 69918 208478 230253 162139 44223
39407D4223j04515j5097O1907p13j54464j59904Q4931L13969J95703j81054l77193
39396b92207j93370Q4490J44401O2521L9331j289k03247l63091j63292K43676
39386f42077L48402L5931k26411j03868J32682J06817o4446l6281J58425J87142
39376a03684j6705j64335q3287N7324N9290l0887o6712l0434L617J5797M0300
39365c19716P5115P3651J2353o7382q3485J2119J64889K44495J73514J6061r3584
39354B08030j01388p8925j09063j52941q2412J23246K74967J82189n3743j26440
39344H3520M3766J69509K2975k04055j92464J5955J11267l767j37680j67843j55838
39333d14655j12822L2061K01107K10867Q4560K4081M3437l6918j88175j46245
$$ plain form
39407 44223 -60292 -75389 -13482 -14195 -168659 -328563 -243632 70337 266040 84986 -292207
39396 -292207 -485577 -401087 -256686 -194165 -154834 -156123 -359370 -722461 -885753 -642077
39386 -642077 -293675 -257744 -484155 -588023 -455341 -348524 -412970 -449251 -290826 -103684
39376 -103684 -120389 -284724 -368011 -310687 -251397 -282284 -348996 -379430 -375813 -360016 -319716
39365 -319716 -244601 -170950 -158597 -225979 -309464 -297345 -132456 112039 285553 301614 208030
39354 208030 106642 27717 -81346 -234287 -316699 -193453 81514 263703 209960 83520
39344 83520 127286 296795 319770 115715 -76749 -60794 50473 46706 -90974 -258817 -414655
39333 -414655 -527477 -495416 -294309 -83442 1118 25199 68636 31718 -156457 -302702
39323c02702J12901K60846J35237r231L5660R1392l3886j75399j10527N7027J08469
39312A69787O2953M3389K0447m4237k8276J17117J91865O1419r1152p8599j3865
39301D10848l7462l0164J02681J62807J4881r6040L6276J55243k2762k49739j37002
39290C09567J49173J57005o6100o7674K20176L89205K48859N5501J1045L9354
39280A446111J04331K64059L62650J50687k28154l44362j40022m503j25575k62084
39270A223138k64855l11561m59671m50663j70976J11306J69343R9182K4934q4817
39260a14640j70344p1354J01209L7816j85792j12504L15448N40180K38403j67563
39250D10859k16337r1519j49217k50202r8674J45482J57107M2568R3788K07164
$$ plain form
39323 -302702 -189801 71045 206282 197051 232711 324103 290217 114818 4291 61318 169787
39312 169787 232740 276129 296576 252339 224063 341180 533045 594464 503312 424713 410848
39301 410848 373386 343222 445903 608710 623591 527551 563827 719070 696308 446569 309567
39290 309567 458740 615745 549645 481971 702147 1091352 1340211 1395712 1406757 1446111
39280 1446111 1550442 1814501 2177151 2327838 2099684 1755322 1615300 1610797 1485222 1223138
39270 1223138 958283 646722 187051 -263612 -434588 -323282 -153939 -54757 -29823 -114640
39260 -114640 -284984 -356338 -255129 -217313 -403105 -515609 -200161 340019 578422 410859
39250 410859 194522 103003 -46214 -296416 -395090 -249608 -92501 -49933 43855 251019
39240B51019J07465o9074K306J91264Q9569k55512l77469j48080O6901N7532L4503
39229d9576J29632J33467p6040k58290j88799P013J06095J09694J21396J23780
39219A58372O1334j2649j7807L6546R3226R8319j637j75056k48662j23923L296
39208a28641j02409k85419j66329K35539M44934K29149m5582j066J69073O2748
39198D11997k42392l06690l3432J83842O7267j60261j48528Q2907K25328J16227
39188A96265j02411k13992j63976n5876l497k0851k8213M3696J52167J72904N6400
39177C2616q2117q6177L9508J22876M9166p8036p7730M2100P9389o1099j82652
39166b02156m6698K43605L05647n560l21728j94377K82537N38828K53397k42194
$$ plain form
39240 251019 358484 289410 291716 482980 572549 317037 -60432 -208512 -141611 -84079 -49576
39229 -49576 80056 213523 137483 -120807 -309606 -302593 -196498 -86804 34592 158372
39219 158372 219706 207057 189250 225796 319022 417341 415704 240648 -8014 -131937 -128641
39208 -128641 -231050 -516469 -682798 -447259 -2325 226824 181242 180176 349249 411997
39198 411997 169605 -137085 -170517 13325 80592 -79669 -228197 -145290 80038 196265
39188 196265 93854 -120138 -284114 -339990 -343487 -364338 -392551 -348855 -196688 -23784 32616
39177 32616 -49501 -135678 -96170 26706 75872 -2164 -79894 -37794 41595 -19504 -202156
39166 -202156 -248854 -5249 300398 294838 -26890 -221267 61270 600098 853495 611301
39156F11301m30645k57541o8002m6514n0348K3908N0445n3114j43523q9245K8321
39145d24957R2524J23405J30130J7574j84434k33375l3680J49455R4175n462R8979
39134a75666K16508K4101k96944k55401J54565L86926J55455j86755k46291j13613
39124c37115m6503j8484J10526K51171K16741K6162j51865k17447j56443q286
39114c31543P8724k8299j85402j04574J69343K60445O8292m1724J27378K28180
39104B40820l2236l38324k62410K8860Q2905q1984q8044J00853J66438N1939L0196
39093a00987J53567J65148J4640l7253P3575P8034j18229k37259j13517L4191
39083h8090J2767m3912k98J1698j09206j90118r1104L9680O5660J13888K55160
$$ plain form
39156 611301 180656 -76885 -144887 -191401 -241749 -217841 -167396 -220510 -364033 -453278 -424957
39145 -424957 -332433 -209028 -78898 -61324 -245758 -479133 -512813 -363358 -269183 -274645 -175666
39134 -175666 40842 64943 -232001 -487402 -332837 54089 209544 22789 -223502 -337115
39124 -337115 -383618 -402102 -291576 -40405 176336 202498 50633 -166814 -323257 -331543
39114 -331543 -252819 -281118 -466520 -571094 -401751 -141306 -73014 -114738 12640 240820
39104 240820 208584 -129740 -392150 -363290 -280385 -362369 -450413 -349560 -183122 -131183 -100987
39093 -100987 52580 217728 232368 195115 268690 346724 228495 -8764 -122281 -88090
39083 -88090 -75323 -119235 -119533 -107835 -217041 -407159 -498263 -458583 -392923 -279035 -23875
39072b3875K48368n2047l15767j73653J78338K59400M4143n9088Q4124J50742
39062C40685m5730k39984j71013J8060O2876k2612o4939l0560K1031J01706J87993
39051A57513J14772j77098m16491k95648Q6045L33778K69133O8677q1878j75040
39041a16237j90614l3288K14102K53591k0996k98443k50606J4428J43707N4642
39031b29714j7188O8550J67041R9892j05788k73866k39878L7301L84279M73592
39021C64221J57881k81794m22912k20066p991J0900k616J19024K53146K15517
39011A85310O3576l0623n2753r3588j43967j38546j18735j59171j83752m6561
39001g18810K07228L31756J81791q9155k04157q3421Q5421J00617n092m7951J6602
$$ plain form
39072 -23875 224493 172446 -143321 -316974 -138636 120764 164907 105819 189943 340685
39062 340685 294955 54971 -116042 -97982 -35106 -57718 -122657 -153217 -132186 -30480 157513
39051 157513 272285 95187 -321304 -616952 -530907 -197129 72004 140681 58803 -116237
39041 -116237 -306851 -340139 -126037 127554 106558 -191885 -442491 -428063 -284356 -229714
39031 -229714 -246902 -178352 -11311 88581 -17207 -291073 -530951 -493650 -109371 364221
39021 364221 522102 240308 -182604 -402670 -410661 -399761 -402377 -283353 -30207 185310
39011 185310 248886 218263 165510 71922 -72045 -210591 -329326 -488497 -672249 -718810
39001 -718810 -511582 -179826 1965 -87190 -291347 -374768 -289347 -188730 -193822 -241773 -225171
38990b25171M1686l8685p9307J1952Q0282l130o7388P4996K39742J33402j13110
38979E5269j15881J00828J16407j59559l06538j06508Q6923l1411k08505j05641
38969f74616J26324J56793L3728Q221O6077M9565J8566Q8712J25464Q5p0579J32092
38957F0432L60107K47495n2780r0744J49455K72184J56283P9705J56441J65054
38947A503632M167j37678j45701j08356l5291J51345L10922J93043j02318k01975
38937A431790m5964M8117l8693o9659L6698M7186q7881q7710J11652J67180p0618
38926A442098k58596j49934o444r1571k12401j48444r4890k33979k72518P1507
38916D4828M52908L45157j24971l69013k18150l2708J049Q9400K91084L08570
$$ plain form
38990 -225171 -183485 -222170 -301477 -289525 -209243 -212373 -279761 -204765 34977 168379 55269
38979 55269 -60612 40216 156623 -2936 -309474 -415982 -329059 -360470 -568975 -674616
38969 -674616 -548292 -391499 -357771 -349550 -283473 -233908 -215342 -126630 -1166 -1081 -71660 60432
38957 60432 420539 668034 615254 524510 673965 946149 1102432 1182137 1338578 1503632
38947 1503632 1507799 1370121 1224420 1116064 1080773 1232118 1543040 1736083 1633765 1431790
38937 1431790 1385826 1433943 1395250 1325591 1362289 1409475 1321594 1233884 1345536 1512716 1442098
38926 1442098 1183502 1033568 1027124 935553 723152 574708 479818 245839 -26679 44828
38916 44828 497736 842893 717922 348909 130759 98051 99100 188500 479584 788154
38906G88154q98l31809l66389j88098n3930j0780M4916J09266Q9446r075p4948
38895d145l6810P1904J65161J72711Q4000m8325j54910j85623j02840Q5627K54616
38884C01366K26542j1733k44530k68559j17246L7128J01547Q0772o479r3127m6480
38873d0799J53682K93732J55519j68630l51140k17820O4932K03273Q9357j11002
38863G1104j46111L8172K20790J80851o29p8694m5772j21473k97221k41877J49029
38852b71831M46067K46017k10343l60337r9756J61083J40973j9987j12391j19718
38842b00223o2267Q9005K42346K08373j154j36792o3496P8459J41646J57889J59467
38831F13253O0414j45294k77042k09288n2157L5655N2744O2356O4039P0426J38640
$$ plain form
38906 788154 787256 455447 89058 -99040 -152970 -163750 -118834 -9568 79878 70803 -4145
38895 -4145 -40955 30949 196110 368821 452821 404496 249586 63963 -38877 46750 301366
38884 301366 527908 516175 271645 3086 -114160 -77032 24515 105287 98808 5681 -40799
38873 -40799 112883 406615 562134 393504 42364 -175456 -110524 92749 182106 71104
38863 71104 -75007 -36835 183955 364806 364177 285483 239711 118238 -178983 -420860 -271831
38852 -271831 174236 420253 209910 -150427 -250183 -89100 51873 31886 -80505 -200223
38842 -200223 -262490 -173485 68861 277234 276080 139288 75792 154251 295897 453786 613253
38831 613253 673667 528373 251331 42043 -10114 25541 78285 140641 204680 275106 413746
38820D13746K15130J40294p1663j71848m4136R8799P3847K6008J08630J22707
38810I11514j52983m59292l42932J20132L67587J63981j01085p3982O2440J3444
38800E08824j06674n3369N1984n0055k24534j21665J86718K48018m9878k78564
38790A10805j44282P9887N5416p2330J0752K04352J62550r7970k08852n7365L7081
38779H0044j40740l38666k11087J70742M08145K74939m8132k15979r3148J28206
38769A4324J63885k2985j88841j55218n0246o6444j23808k1536J67367J74040
38759a09462l942o9505P4141J52393J465j32128k0056J31711K7396j88786j37972
38748b74745J74995L43615J56586j32154k03326p0467L7482L424r1093j06429
$$ plain form
38820 413746 628876 769170 697507 525659 481523 580322 654169 680177 788807 911514
38810 911514 758531 299239 -43693 76439 444026 608007 506922 432940 495380 508824
38800 508824 402150 348781 400765 350710 126176 4511 191229 439247 389369 110805
38790 110805 -33477 46410 101826 29496 40248 244600 407150 309180 100328 42963 80044
38779 80044 -60696 -399362 -610449 -439707 -31562 243377 195245 -20734 -113882 14324
38769 14324 178209 155224 -33617 -188835 -239081 -305525 -429333 -450869 -283502 -109462
38759 -109462 -113404 -182909 -108768 43625 45090 -87038 -107094 24617 52013 -136773 -274745
38748 -274745 -99750 243865 400451 268297 64971 -5496 31986 35410 -55683 -162112
38738a62112O091J48463J61512J5092j27878j10115J9661R7180N7201m9506j59673
38727a04084j88477l2593K42299L34984O4180k94075l02823L3020K61435J13245
38717A27111j64981k12160j9140J66479J97472J09901r536p3108o931J44224K02669
38706D62000O3159j53661k47506j71840l6879N3596Q1399P5559O2785L3090n6015
38695A65687j85806k12055j8421K64418L54077J76201l3056n3139N8074J20284
38685F36264Q0156j9367j57389k69797k13447K4809K09157J41017m5941r3729
38675B91733k3726o7759k41815k84343o4873K06217K76422J55816J2028o9006
38665A90694r4865p3098k7098j0340j6609K7909J18557J43261P2574K8655O5084
$$ plain form
38738 -162112 -156021 -7558 153954 169046 41168 -68947 -49286 47894 105095 55589 -104084
38727 -104084 -292561 -325154 -82855 252129 316309 22234 -280589 -247569 13866 127111
38717 127111 -37870 -250030 -269170 -102691 94781 204682 195146 122038 115107 259331 462000
38706 462000 525159 371498 123992 -47848 -84727 -31131 50268 125827 188612 221702 165687
38695 165687 -20119 -232174 -250595 13823 367900 544101 511045 457906 515980 636264
38685 636264 716420 697053 539664 269867 56420 81229 290386 431403 385462 291733
38675 291733 268007 200248 -41567 -325910 -390783 -184566 91856 247672 259700 190694
38665 190694 95829 22731 -4367 -14707 -31316 -3407 115150 258411 330985 359640 424724
38654D24724M9024q9056j65341k0592J55675O2050k25875l18820p9409J85349
38644b2271J84484J3094q4212p3076n5693l0415N1215J22658J13679J09614J82895
38633E11972J83049m3567l14822l06759n6470P4857j8503k2529K34154M27943
38623F69325K30285j46974k66917j31649j02062k42341k21932O7552K63663J09112
38613B28062j18079o4060J21345O7721j58680j58008J07310K23528J5376j60691
38603A03824l1602J24370k2355k39145r1584K96971L85929O3461j89854p0724
38593C29291J22342M6971j44639j44281k3225m9909j98153k22583r3213L292K0530
38582c53577P9372J76298J72065O4138m914r567n4955j35411j38023q1035q0738
$$ plain form
38654 424724 473748 384692 219351 198759 354434 416484 190609 -128211 -207620 -22271
38644 -22271 162213 175307 91095 18019 -37674 -68089 -16874 105784 219463 329077 511972
38633 511972 695021 651454 336632 29873 -26597 48260 29757 7228 241382 669325
38623 669325 899610 752636 485719 354070 252008 9667 -212265 -144713 118950 228062
38613 228062 109983 45923 167268 234989 76309 -81699 25611 249139 264515 103824
38603 103824 72222 196592 174237 -64908 -156492 140479 526408 589869 400015 329291
38593 329291 451633 498604 353965 209684 186459 136550 -61603 -284186 -377399 -374107 -353577
38582 -353577 -274205 -97907 74158 138296 133382 123815 68860 -66551 -204574 -285609 -366347
38571c66347q6083N6678K57464K31031l3174j81384j2231K18380J90572l7981
38561B36925j91963j76745j01598m6669K554P4241J81791K90521K73898N8123
38551F01078j71520j42714P9551J33443q0332k21962p0189J05532Q711j75337
38541F6261j00230J59031K49665J05035l6535p5105j24707k00135j87636j02748
38531b47104n5342L127J73350L04385J65854r8868r8177J86769L19051N9785k80609
38520D32221l24541j28072K1185M0767M9705J13504J98968K54616K02111r070
38510H51394k45225k73969j02642j0906j28938k34718j33397K7214M3484Q111
38500a99592R4213J99597J34914N414M1635J55715O5268j73239j81747J15592
$$ plain form
38571 -366347 -452430 -395752 -138288 92743 59569 -121815 -134046 84334 274906 236925
38561 236925 44962 -131783 -233381 -280050 -277496 -203255 -21464 269057 542955 601078
38551 601078 429558 286844 366395 499838 419506 197544 127355 232887 241598 66261
38541 66261 -33969 125062 374727 479762 443227 368122 243415 43280 -144356 -247104
38531 -247104 -302446 -299319 -125969 178416 344270 245402 147225 333994 653045 712830 432221
38520 432221 107680 -20392 793 41560 91265 204769 403737 658353 860464 851394
38510 851394 606169 332200 229558 218652 89714 -145004 -278401 -251187 -207703 -199592
38500 -199592 -105379 94218 229132 234546 276181 431896 497164 323925 142178 257770
38490B57770K98311O7740k84683l00274J016K15189J54017J8304R83K7442k5579
38479D30236q5827j4310J44485J99598P3686r0044j10173O077P8875p83j12294
38468E19526o6950J05697J73573M3007q7219m2160K7947j01654k95930k13302
38458F2535J13369K40533o773k07204K5238M05069L74427o1152l58007k29601
38448C58434M4274J45040J13911Q4608N897j50155k06097n2219J24272J17935
38438E85900K3260L9716J19605O4218j24890k27939j14167R6373J72270j794k87490
38427C45062l66375p8321L05875L54263M8409j83738r1783P4961M4608l4715P5993
38416D94239K39609J80013k8326r6770J678P0802Q4295J56342K06569M8799k18756
$$ plain form
38490 257770 556081 623821 339138 38864 39880 255069 409086 427390 428373 455815 430236
38479 430236 344409 330099 474584 674182 747868 657824 547651 553728 632603 631820 519526
38468 519526 452576 558273 731846 774853 687634 645474 673421 571767 275837 62535
38458 62535 175904 416437 409664 202460 227698 632767 1007194 946042 588035 358434
38448 358434 402708 547748 661659 746267 752164 602009 395912 343693 467965 585900
38438 585900 609160 648876 768481 832699 707809 479870 365703 462076 634346 632552 345062
38427 345062 -21313 -99634 206241 560504 608913 425175 333392 408353 452961 418246 494239
38416 494239 733848 913861 885535 788765 790443 861245 945540 1101882 1308451 1357250 1138494
38405A138494k83506q2387J30298J74951R9211l9586k24873l27739k21080l6453
38395C27330k412o7348j4946J06269O1653r9593r3834P0789Q7194p7093r5001
38384B03008J12795J90693l6221k40617j45708L8767L2986n5012j5317P0450O3522
38373B19346Q0203K16145K46949j8730l30598l26118p2206R3220Q6789P2844P7385
38362C45229o884j20981j05246j2220l3804j54848j70732k4562J26474J53650
38352c924N9731r1812j63820Q560L41444M42721J07484l02178l14767l0434O7091
38341A20096j23441k21581m0862J21749Q031k01130k14455m6175J13112J99458
38331b85198K40147K01249O6801n8733q2528n6452o6745r5789q7842n1557j8774
$$ plain form
38405 1138494 854988 772601 902899 1077850 1177061 1137475 912602 584863 363783 327330
38395 327330 324918 257570 242624 348893 410546 310953 217119 287908 375102 298009 203008
38384 203008 315803 506496 470275 229658 83950 122717 155703 100691 85374 155824 219346
38373 219346 299549 515694 762643 743913 413315 87197 14991 108211 195000 267844 345229
38362 345229 338345 217364 112118 99898 66094 -88754 -259486 -284048 -157574 -3924
38352 -3924 55807 -36005 -199825 -191265 150179 592900 700384 398206 83439 53005 120096
38341 120096 -3345 -224926 -265788 -144039 -136008 -337138 -551593 -597768 -484656 -285198
38331 -285198 -45051 156198 222999 164266 81738 25286 -41459 -137248 -225090 -276647 -295421
38320b95421M591k936n9239q6579J8577J80087J74594m8365k40197j64597R3610
38309d25875K57562J95102m82j83830k71719k26230o1241J18228J71399N6682
38299c70404j15731j87746j11253N255K7027l8496o3828n132K2272n3807j01809
38288i93652K2934K06729J95711k9696k06583j58927j9730R456m6398k2730J10945
38277i31941K20899K11223J24891M6839P821L123L1587P8778J02637P5402K4746
38266c995p6L124m303k2272k308M7663L4132n8069o3349J41525L71093L18304
38254G61469J6521j54875j3773J62524R2884p0819l6849J24907J26781l5627j12504
38243H60639o3369r0075k00377j48968R1905J90973l5972l03825k62561L3973
$$ plain form
38320 -295421 -290830 -293766 -353005 -439584 -421007 -240920 -66326 -114691 -354888 -519485 -425875
38309 -425875 -168313 26789 26307 -157523 -429242 -655472 -716713 -598485 -427086 -370404
38299 -370404 -486135 -673881 -785134 -779879 -752852 -791348 -855176 -860308 -838036 -891843 -993652
38288 -993652 -970718 -763989 -568278 -597974 -804557 -963484 -983214 -973758 -1020156 -1042886 -931941
38277 -931941 -711042 -499819 -374928 -328089 -320268 -317145 -285558 -206780 -104143 -28741 -3995
38266 -3995 -4071 -947 -5250 -27522 -29830 17833 51965 -6104 -69453 72072 443165 761469
38254 761469 777990 623115 609342 771866 864750 793931 757082 881989 1008770 973143 860639
38243 860639 797270 707195 506818 357850 449755 640728 604756 300931 38370 72343
38233G2343K88044L65238L08167J37840j00204k31269j44043Q955K1191n8119
38223F68143m3660N8386Q9423L2068M689L768p9509j92036j46082M4299J24083
38212E63572j4118j49047p1421J11172J80317J37071J18053J10800n552j85079
38202G95768k18979m6487J30932J24293J883m5440J7843O1649J6764k9885K074
38191H10415M1968k4213j60208k09933j21340k2253k5212o8002m2661J3033l269
38180A88325m7660J4399J51731J77104O2035J8487J47868K27367M7251k15099
38170G71808k26436P59J37390L7368j00767j07460p0278q4440o1636M5540P4622
38159D16470p8512k18001j13421J35951K47842J67752Q6040J03847J24659O8475
$$ plain form
38233 72343 360387 725625 1033792 1171632 1071428 840159 696116 705071 726262 668143
38223 668143 624483 682869 772292 804360 809049 812817 733308 541272 395190 439489 563572
38212 563572 549454 400407 328986 440158 620475 757546 875599 986399 980847 795768
38202 795768 576789 530302 661234 785527 787410 741970 759813 821462 838226 808341 810415
38191 810415 852383 828170 667962 458029 336689 314436 289224 221222 178561 191594 188325
38180 188325 140665 155064 306795 483899 545934 564421 712289 939656 986907 771808
38170 771808 545372 546131 683521 720889 620122 512662 442384 357944 296308 341848 416470
38159 416470 337958 119957 6536 142487 390329 558081 644121 747968 872627 941102
38149I41102j5886o9282r2549r0797p0239o2779m5870P7957K81713L20446N0580
38138A224396k70114k75803j5977J23377l90j21369k5973J48888J90682J04697
38128A082414k603r9617j59421j20951l2828l6741j16981q5979R0822K03060J41091
38117H62266P2324J26266J63129L9461j28767j64373q6902M189R6910J52208N4608
38106A191319j44169j84352L00J13520l9165k11660j27509O8518J13638R6253
38096H76693K10988K97205J01607j85018j75120M6766N0411j85865k20017R0319
38086I07969L23975J66957j36339k32889j52764q9278l1391R5831J86852J35114
38076A174037O5122J33438K45803J97293j4178k02058k35866j27152M9305J97747
$$ plain form
38149 941102 925216 855934 763385 672588 602349 539570 493700 571657 853370 1173816 1224396
38138 1224396 954282 678479 662502 785879 785489 664120 638147 787035 977717 1082414
38128 1082414 1079811 980194 820773 699822 666994 630253 513272 427293 518115 721175 862266
38117 862266 934590 1060856 1223985 1263446 1134679 970306 883404 887593 984503 1136711 1191319
38106 1191319 1047150 862798 863098 976618 937453 725793 598284 666802 780440 876693
38096 876693 1087681 1384886 1486493 1301475 1126355 1173121 1223532 1037667 817650 907969
38086 907969 1231944 1398901 1262562 1029673 876909 787631 756240 852071 1038923 1174037
38076 1174037 1239159 1372597 1618400 1815693 1801515 1599457 1363591 1236439 1285744 1483491
38066A483491K28972J37508Q894p8376r3733j7832J21532K04965J50300M3213
38056B188934j3867r1044k45257k62461P0162M88444M76867K8370k68914o7484
38046B303750K49913J82380j62948l06469q7768K42103M40085M47843K79328L6506
38036C624723n8773R1147K86673L33176L61081N60520P61144O55776L61811L39104
38026G316382P20106J128064J282114J397503J738226K062839J862268J034946
38018A8542448O237q12549j384588j784165j872686j510674r52944o77191p63863
38009H790025p65882l74489O4824Q125m97521q69499p79677m82180l01552k04657
37999D587517n7555M4166k7455j43892j07210K6035N4787m1115j03213m5254P4924
$$ plain form
38066 1483491 1712463 1849971 1858865 1780489 1686756 1668924 1790456 1995421 2145721 2188934
38056 2188934 2175067 2084023 1838766 1576305 1646467 2134911 2611778 2640148 2371234 2303750
38046 2303750 2553663 2736043 2573095 2266626 2178858 2420961 2861046 3308889 3588217 3624723
38036 3624723 3565950 3657097 3943770 4276946 4638027 5198547 5959691 6615467 6977278 7316382
38026 7316382 8036488 9164552 10446666 11844169 13582395 15645234 17507502 18542448
38018 18542448 18548685 17736136 16351548 14567383 12694697 11184023 10231079 9553888 8790025
38009 8790025 8024143 7649654 7714478 7722603 7225082 6355583 5575906 5093726 4792174 4587517
37999 4587517 4529962 4574128 4546673 4402781 4295571 4321606 4376393 4335278 4232065 4186811 4261735
37988D261735J65725J51609P742j39119p5292K01996L98232K90536M1316l0351
37978E274129J37072L40575M08229L30907J94699J23494J89342K86971K52735
37969G538153J75142L25914O63669P59192M54056K15571M61775Q76475Q95257
37960A2365204O16961O36650J090462J488057J516367J429644J524144J743349
37952B2410838J979722K319065K787654L245545L716126M453154N499001O546221
37944E2957326P451876Q559050J0298012J2777788J5984879K0105166K5383527
37937A53517624L1624321L7476034L9748604L4116138J8339764m209931k5289982
37930B85322572l7545466l9712994l5824295l0212259k4565458j9164436j4669885
$$ plain form
37988 4261735 4427460 4579069 4586811 4447692 4372400 4574396 4972628 5263164 5304480 5274129
37978 5274129 5411201 5751776 6160005 6490912 6685611 6809105 6998447 7285418 7538153
37969 7538153 7713295 8039209 8702878 9462070 9916126 10131697 10593472 11469947 12365204
37960 12365204 12982165 13618815 14709277 16197334 17713701 19143345 20667489 22410838
37952 22410838 24390560 26709625 29497279 32742824 36458950 40912104 46411105 52957326
37944 52957326 60409202 68968252 79266264 92044052 108028931 128134097 153517624
37937 153517624 185141945 222617979 262366583 296482721 314822485 310612554 285322572
37930 285322572 247777106 208064112 172239817 142027558 117462100 98297664 83627779
37923H3627779j1657750r649897p842304o294554n521494n322679m910308m023508
37915B8405285l136270k595548k226150j844969j576154j500309j439454j257302
37907A2829129j039742q64610o92567n60741n74876o38919n18079k55109j75139
37898G509347l52182m36422k02891Q4136J17036L2130J15850K86586K74698J58566
37888G586854K85576P01065J067087J200346J321212J629835J922826J815638
37880A7530439J164392J28394j007568j915104k294021k093803j622645j265773
37872H624311j103941r38099o63571m38619m17150m72729l58871r5095J3903j78275
37862C971864l81773k35794J47892K88306M931l21845l11160j21293j51852m01703
$$ plain form
37923 83627779 71970029 62320132 54477828 48183274 42661780 37339101 32428793 28405285
37915 28405285 25269015 22673467 20447317 18602348 17026194 15525885 14086431 12829129
37907 12829129 11789387 10924777 10232210 9671469 9096593 8457674 7939595 7684486 7509347
37898 7509347 7157165 6720743 6517852 6601988 6719024 6751154 6867004 7153590 7428288 7586854
37888 7586854 7872430 8573495 9640582 10840928 12162140 13791975 15714801 17530439
37880 17530439 18694831 18823225 17815657 15900553 13606532 11512729 9890084 8624311
37872 8624311 7520370 6582271 5918700 5480081 5062931 4590202 4231331 4136236 4150139 3971864
37862 3971864 3590091 3354297 3502189 3790495 3795426 3473581 3162421 3041128 2889276 2487573
37852B487573m90803k66606j6763r165j35126j52096l8855O3916R1976O2054l7505
37841A558600j95445k97125k37790p0591N7400O9199j1473j20791j69616p6800
37831E05568J17087K27063J11403j44332l00943k12090L5002K07250J52600l2307
37821F66301r9928K4033J02711q0010l32249k46253K13541N86710M83111M1911
37811A359878l11384l63801k12747m2647J8916m6507r4013N3869L09398L42706
37801A013668M8436k37145j96467J7603O5996m3674n2406O5264R7748J3414n635
37790G86802N7607J8848j22790j32024M0336J34993K0433q0146J7651J40773O7431
37779I49914r6856j21659m0000m4037j15301n8329J33445K15174L7394k34332
$$ plain form
37852 2487573 1996770 1730164 1713401 1704236 1569110 1417014 1378159 1442075 1534051 1596105 1558600
37841 1558600 1363155 1066030 828240 757649 815049 884248 872775 751984 582368 505568
37831 505568 622655 849718 961121 816789 515846 303756 338758 546008 698608 666301
37821 666301 566373 590406 693117 613107 280858 34605 248146 834856 1317967 1359878
37811 1359878 1048494 684693 471946 429299 448215 401708 307695 361564 670962 1013668
37801 1013668 1062104 824959 628492 646095 712091 668417 616011 681275 779023 792437 786802
37790 786802 844409 863257 740467 608443 648779 783772 804205 724059 741710 882483 949914
37779 949914 853058 731399 691399 647362 532061 473732 607177 822351 859745 625413
37769F25413l16084j14467K04201L84749L05289P8227o6992k5296R0895J21987
37759A287922N9982K3080Q7307K11369L02154L10980K86279L40583N21079P25739
37749D156474Q31486Q88175J051834J319793J508942J544987J557766J563848
37741A4423305J275507M61211o31539j467353j784176j743623j578034j357012
37733G598286j121090r71599r12100p94071n46623l15678k56378l10069l10142
37724B060536k11227r3909k2143j1760p3399j73451k08405j27755l3361m9759
37714A055367j43665j82426j22583k0112R4849K07812K24825O1848j77674k94177
37704G04064k68956k48307k25688l040M09342O22803L42723j71142m06577k56824
$$ plain form
37769 625413 309329 194862 399063 783812 1089101 1167328 1100336 1075040 1165935 1287922
37759 1287922 1347904 1370984 1458291 1669660 1971814 2282794 2569073 2909656 3430735 4156474
37749 4156474 4987960 5876135 6927969 8247762 9756704 11301691 12859457 14423305
37741 14423305 15698812 16160023 15528484 14061131 12276955 10533332 8955298 7598286
37733 7598286 6477196 5505597 4593497 3799426 3252803 2937125 2680747 2370678 2060536
37724 2060536 1849309 1755400 1733257 1721497 1648098 1474647 1266242 1138487 1105126 1055367
37714 1055367 911702 729276 606693 586581 681430 889242 1114067 1175915 998241 704064
37704 704064 435108 186801 -38887 -41927 367415 990218 1332941 1161799 755222 498398
37694D98398o5584n6456o8499O3550J93591J21901n7839j03402Q654P9831j486
37683F12659j35508j87996j49474r7658q4540p4535K7765K41896L92746K52814
37673G98169j22597l50431j61105K31059L93259K31756N1439Q0751J95692J82600
37663A530592M6534p4018j33407j65855j57892q9278l6363r0710k02872k28208
37653C98523j20776J5299O6228J9052o8577j35328j42712q9303p125Q5326K00231
37642B20838L07094K94706J00064j51345k51074j62009m9823l3513l8951K8449
37632B64436R8932N5208n4775p2760M3660J87493K62767K38434Q0274j89956l74512
37621E39201k53350Q9222K98223J96301m098n0871N745l121m8874j7774J8061
$$ plain form
37694 498398 432814 376358 307859 371409 565000 686901 629062 525660 534314 614145 612659
37683 612659 477151 289155 139681 42023 -42517 -117052 -89287 152609 545355 798169
37673 798169 675572 325141 164036 395095 788354 1020110 1071549 1152300 1347992 1530592
37663 1530592 1577126 1503108 1369701 1203846 1045954 956676 920313 829603 626731 398523
37653 398523 277747 293046 359274 378326 309749 174421 31709 -57594 -64719 20607 220838
37642 220838 527932 822638 922702 771357 520283 358274 308451 274938 235987 264436
37632 264436 363368 418576 363801 291041 334701 522194 784961 1023395 1103669 913713 539201
37621 539201 285851 375073 673296 869597 865499 814628 820373 817252 768378 750604 768665
37610G68665q1222k40541k84925k48281k67510k51476j8158K68579K19146j55128
37600b90851l58438j18538K13153K07936m3833j86921j58441j30547j08597K6144
37590i48933J91426J86485M1320l9932l8370j00900j88070q9195J66758K50421
37580e68990O460k81515k67278R437K25347K01708O3027J5230R3577J54248P4770
37569b73979p8738j35908o5981j7281n7222l2092J69764L60503K78275j5738k10590
37558g8987j81355j02010j14697j37751o9798K9728O4665N0123M6858O5570R7864
37547c29790J39796J52842J04927N3475O7313Q4528K941j08401q5258L7821L7609
37536A57803j33790k22594l3655K62532L37661J13150j74971k62474j14094Q0517
$$ plain form
37610 768665 687443 446902 161977 -86304 -353814 -605290 -623448 -354869 -135723 -290851
37600 -290851 -649289 -767827 -554674 -346738 -390571 -577492 -735933 -866480 -975077 -948933
37590 -948933 -757507 -571022 -529702 -569634 -608004 -708904 -896974 -986169 -819411 -568990
37580 -568990 -562530 -844045 -1111323 -1101886 -876539 -674831 -611804 -596574 -502997 -348749 -273979
37569 -273979 -352717 -488625 -554606 -571887 -629109 -661201 -491437 -130934 147341 131603 -78987
37558 -78987 -260342 -362352 -477049 -614800 -684598 -654870 -590205 -540082 -493224 -427654 -329790
37547 -329790 -189994 -37152 67775 121250 188563 273091 276032 167631 82373 120194 157803
37536 157803 24013 -198581 -232236 30296 367957 481107 306136 43662 -70432 10085
37526A0085J23464K2475m5994l822K2527m6161o1506Q2199J76245K452k27400
37515E4564j36327J76197K27679p1792k46230j8841K51810J82125m5451q0006
37505B93728m034p8085j78266q715K95388L05513j2332k35435j39350K3642p165
37494B54889j36327j57970o0537O5756J81502K19729P1474k06655l51892k08599
37484c28630N5799J76259J15885M4326P7595J57134J52539J2320j75959k61191
37474B6077j86818m6458N9074J48125K50674K65232Q6774j70696k70518j70662
37464i196n9778n7985p5104k0052M0830L5678L7373J26496K11331J31605j01143
37453B60055k90043k84923j45450l6345j155Q1913K75830L99732K25417j46496
$$ plain form
37526 10085 133549 156024 110030 106208 128735 82574 21068 103267 279512 281964 54564
37515 54564 -81763 94434 322113 250321 4091 -14750 237060 419185 373734 293728
37505 293728 289694 211609 33343 24628 320016 625529 613197 377762 238412 262054 254889
37494 254889 118562 -39408 -99945 -34189 147313 367042 438516 231861 -120031 -328630
37484 -328630 -272831 -96572 19313 63639 141234 298368 450907 463227 287268 26077
37474 26077 -160741 -207199 -148125 0 250674 515906 602680 431984 161466 -9196
37464 -9196 -68974 -126959 -202063 -222115 -181285 -145607 -108234 18262 229593 361198 260055
37453 260055 -29988 -314911 -460361 -496706 -497861 -415948 -140118 259614 485031 338535
37443C38535l26484j48423R0002Q3609j9861Q5180K97262K51659m6124j95674
37433D09681o2364L317k21363m27721k63528J17714L23983K78204J60078J1007
37423C29008k19135l71232k23245J09362K75978J83763O1517L3141k5654j52713
37413G90j67384J062J48503J19034M2474P4055J23292N1117m8437m510J14967
37402D54963R0750r8729k38896j87007l5457N8652O1681L5056K1353J3252j1954
37391A63664n5380p9062l9935M2963R7857J00764J02195J15682O5872q0938k16092
37380B17590k13285r2657L0828R8322J09515N0297n7399r8687j975J16578R5797
37369B54924k5854p6315k9273k4358j09429j67624j36224r8495r7514n2042O0897
$$ plain form
37443 338535 12051 -136372 -46370 37239 17378 102558 399820 651479 605355 409681
37433 409681 347317 350634 129271 -298450 -561978 -444264 -120281 157923 318001 329008
37423 329008 109873 -261359 -484604 -375242 -99264 84499 146016 179157 153503 790
37413 790 -166594 -165532 -17029 102005 144479 218534 341826 392943 344506 339996 454963
37402 454963 545713 446984 208088 21081 -14376 44276 105957 141013 162366 175618 163664
37391 163664 108284 29222 -10713 32250 130107 230871 333066 448748 514620 433682 217590
37380 217590 4305 -88352 -57524 40798 150313 200610 143211 44524 42549 159127 254924
37369 254924 229070 152755 123482 99124 -10305 -177929 -314153 -412648 -510162 -562204 -501307
37358e01307J25617Q7693N3847Q1167N4020q5499j68958n2954J12775R0085p6132
37347b79646j20101N7736K68610K88223P6564k32747m32395l73723j22616P7034
37337g93061J04385J12578K39226L31214J88374o4474j47864o9673n6132j01018
37327b56445K0357K67972K92549l050k52953j74243K8706N1846l1777J1246J27064
37316H1272Q6682j01579k07293j27019K9409J28189R5133p4353k10913n6523L25284
37305c1711M53245N8644m10800l42535J41668L50543M0786k93023k41286l5252
37295c09721l3280j28964l4111J87186K56005J33633n456r1351j41652q2109J05995
37284a43825J98482J2868k33226j89279Q5855K11827P3574o8679p2127j03101
$$ plain form
37358 -501307 -375690 -287997 -234150 -152983 -98963 -184462 -353420 -406374 -293599 -203514 -279646
37347 -279646 -399747 -342011 -73401 214822 291386 58639 -373756 -747479 -870095 -793061
37337 -793061 -688676 -576098 -336872 -5658 182716 118242 -29622 -99295 -155427 -256445
37327 -256445 -236088 31884 324433 321383 68430 -105813 -77107 -25261 -57038 -45792 81272
37316 81272 167954 66375 -140918 -267937 -238528 -110339 -15206 -89559 -300472 -356995 -31711
37305 -31711 421534 480178 69378 -273157 -131489 219054 259840 -33183 -274469 -309721
37295 -309721 -343001 -471965 -506076 -318890 -62885 70748 65292 -26059 -167711 -249820 -143825
37284 -143825 54657 67525 -165701 -354980 -269125 -57298 16276 -52403 -124530 -227631
37274b27631k27819k06645Q8950L69299L07905J4489j45559o1683N1221J1241
37264b6232j33333k36734k08677m8899J42736K17475J38437M0309M2058Q1786
37254H926M2831m7254p1947o602P6407J13643O1682r8500k62556k38476j2137
37243d33983J72580J53193Q4189J28827J32193r2456l37303k54483O9777K22434
37233a55032J00086r794J3595k7703j66572j39261R6500J98321K1062j10621J0978
37222a68441R6896p4992j90469M3926K97370J29360k27635k27792Q2920J93333
37212d5524K5413J789K23985K84934K8677j47328K0805K30348J53834n3473j03246
37201F20214m5005o7897j44581j71164j98693k58403j98885N4734L01626L42174
$$ plain form
37274 -227631 -455450 -662095 -573145 -203846 104059 118548 -27011 -88694 -37473 -26232
37264 -26232 -159565 -396299 -604976 -653875 -511139 -293664 -155227 -114918 -72860 8926
37254 8926 51757 4503 -67444 -74046 2361 116004 177686 79186 -183370 -421846 -433983
37243 -433983 -261403 -108210 -24021 104806 236999 144543 -192760 -447243 -377466 -155032
37233 -155032 -54946 -64740 -51145 -78848 -245420 -384681 -288181 -89860 -68798 -179419 -168441
37222 -168441 -71545 -146537 -337006 -293080 4290 133650 -93985 -321777 -238857 -45524
37212 -45524 -20111 -18322 205663 490597 519274 371946 392751 623099 776933 723460 620214
37201 620214 575209 507312 362731 191567 -7126 -265529 -464414 -409680 -108054 234120
37191B34120K34199R6132q0303k40057k01786p513N554k44304l29681K9591M22605
37180h1443L31049n0197j43305P3478J05753j47514k12455J15506L81677K00479
37170E73028j44714j96415k2717J141j53167j80782N369J51079Q9480m4086q7556
37159i340o9390n3520K174R5870P9494j12014k65361j47085J11481J46270j05219
37148c26640k76771j02277J84014K04793L427o7854P0020J24064n1984k04731
37138d43939j06384O7624L1180j48820j68479L2183J86984J08927n0958l7571
37128e29253J49719K55500J08938j29870j53141P6268K36956P8295k10919k62410
37118c79917m7325J37125J42277R9051O7541o7622k58026k36805K1468J66119
$$ plain form
37191 234120 468319 564451 484148 244091 42305 34792 40346 -203958 -533639 -504048 -81443
37180 -81443 249606 199409 56104 129582 235335 87821 -124634 -9128 372549 573028
37170 573028 428314 231899 209182 210323 57156 -123626 -118257 32822 122302 78216 -9340
37159 -9340 -78730 -132250 -130076 -34206 45288 -66726 -332087 -479172 -367691 -221421 -326640
37148 -326640 -603411 -705688 -521674 -316881 -313454 -381308 -311288 -187224 -239208 -443939
37138 -443939 -550323 -482699 -451519 -600339 -768818 -736635 -549651 -440724 -491682 -529253
37128 -529253 -379534 -124034 -15096 -144966 -298107 -221839 15117 93412 -117507 -379917
37118 -379917 -427242 -290117 -147840 -48789 18752 -48870 -306896 -543701 -522233 -356114
37108c56114L3253m4120J80211L49927M5266m40334m39728P8266M26513J86798
37098A9938k46481k99430K2500K82097K40643N0141n1947n177Q3425P6582n6332
37087A15959j88950j63504Q402J30499M3812j73110k60870n1387L05416M40438
37077B06705J79170j98339k76161m4132J27119O0942j3709O3168Q3503j03616
37067H4650k29468l2754K41660K02136m9810j11086M4107Q6287m3020n8255R8007
37056B32454J28588o5994j82168l0569J51852J11953m0189p1976L3707J66806
37046D34464K68492K72161J15589n6545L4643L92266O70559O37891M26415J91460
37036C387395j33057n31971p08655m95025j99127k07140m25138m53613j90200
$$ plain form
37108 -356114 -322861 -366981 -186770 163157 208423 -231911 -671639 -593373 -166860 19938
37098 19938 -226543 -525973 -503473 -221376 19267 69408 17461 12284 95709 172291 115959
37087 115959 -72991 -236495 -228093 -97594 -53782 -226892 -487762 -539149 -233733 206705
37077 206705 385875 187536 -88625 -132757 -5638 55304 41595 104763 188266 84650
37067 84650 -144818 -177572 64088 266224 216414 105328 149435 235722 192702 134447 232454
37056 232454 361042 295048 112880 82311 234163 346116 305927 233951 267658 434464
37046 434464 702956 975117 1090706 1034161 1068804 1461070 2131629 2769520 3195935 3387395
37036 3387395 3254338 2722367 2013712 1518687 1319560 1112420 687282 233669 43469
37027D3469P8996J36642P2709M4306M5537k114q0846r3683q415P1077J9865j08151
37015B19392r9914Q7777J58849j17620m38075k77933L07852O38287L30132j55703
37005F53044j97705J09712J87504j33368m22324l21712r73J57160M8039j14440
36995c5063j08999M6167J28114j6835k40832k36349N4452L25474K97589O6571
36985B80289p7320l4806O1317P5857k1400j82312k72244j46455J24927K45819
36975E3672P6176j23945m4710K13295K87404P5191j69530k36270j83619j35620
36965a87956q9784q239O9229Q9638O2436K1372j6231l7883m4649n6529n8047O494
36953b50149J20934J70388J16930R0607J78114K44082J39690k3461l5067N8912
$$ plain form
37027 43469 122465 259107 331816 376122 421659 419545 338699 245016 236601 307678 327543 219392
37015 219392 119478 207255 366104 248484 -189591 -467524 -159672 478615 808747 653044
37005 653044 455339 565051 752555 619187 196863 -124849 -125822 31338 79377 -35063
36995 -35063 -144062 -97895 30219 13384 -227448 -463797 -409345 -83871 213718 280289
36985 280289 202969 168163 229480 305337 283937 101625 -170619 -317074 -192147 53672
36975 53672 129848 5903 -38807 174488 461892 537083 367553 131283 -52336 -187956
36965 -187956 -277740 -285979 -216750 -127112 -64676 -43304 -59535 -97418 -142067 -198596 -256643 -250149
36953 -250149 -129215 41173 158103 248710 426824 670906 810596 787135 752068 810980
36943H10980L7159q3078k2966K89939N20716L67690q474k13989j42504k4135j8393
36932A512945k6325M4879P5134n2770j95521j32888O0213Q2779j25223k52697
36922I90526q2272J59056J35784r6627k15174j36454p4703j31752j65456j02419
36912B80509o5285j04628q9790K8951J12114Q8287N8676M6069p1333k53965k46029
36901b16424M537J91293J20570R273N9035P5187j49727l76016k54888R1610K54133
36890a91417J43311K18o7702j34341j38498L5416K11827J03285j78117k31170
36880d47188l476J36834K6847o6965K0419P0285n2994r0774J44285L51819J73002
36869B62094k10869l14223n7787J43369k293k78092k86684M0221L84545M11927
$$ plain form
36943 810980 848139 765061 742095 1032034 1552750 1920440 1911966 1697977 1555473 1531338 1512945
36932 1512945 1486620 1531499 1606633 1553863 1358342 1225454 1285667 1368446 1243223 990526
36922 990526 908254 1067310 1203094 1106467 891293 754839 680136 548384 382928 280509
36912 280509 215224 110596 20806 49757 161871 250158 308834 354903 283570 29605 -216424
36901 -216424 -211887 -20594 99976 109249 168284 243471 93744 -282272 -537160 -445550 -191417
36890 -191417 -48106 -47888 -115590 -249931 -388429 -353013 -141186 -37901 -216018 -447188
36880 -447188 -450664 -313830 -286983 -353948 -333529 -263244 -316238 -407012 -262727 89092 262094
36869 262094 51225 -262998 -320785 -177416 -179709 -457801 -744485 -704264 -319719 92208
36859I2208J09110k38690l60813k49942q9665o142K2559N1513Q1994R2973O6325
36848d28570j4841j07128p9661J32418L67147L69576J00709k03381k94582j41028
36838b99341R4828K07542J02886j01616j71958m2647Q3240L3666p1540m1101N8782
36827a47259N3557M857P8936J60927j1276l43059m25309j42266J63014K36087
36817c71791K18286K48438J75121q0373k42889q8254J53793J34443r3204k03790
36807a50220p1792J73371L87208M28996J42272l68747o37093l64024J10390K43094
36797a06545L6889p7802K0631M7940p2776o3936J31589J70066p3466j95263R9144
36786h3529M54139L67566o2603l31311k63097j08106k5328O4234J30813j155k60578
$$ plain form
36859 92208 201318 -37372 -398185 -648127 -737792 -743934 -721375 -669862 -587868 -494895 -428570
36848 -428570 -443411 -550539 -630200 -497782 -130635 238941 339650 136269 -158313 -299341
36838 -299341 -204513 3029 105915 4299 -167659 -210306 -127066 -93400 -164940 -206041 -147259
36827 -147259 -93702 -88845 -9909 151018 139742 -203317 -628626 -770892 -607878 -371791
36817 -371791 -153505 94933 270054 189681 -53208 -141462 12331 146774 53570 -150220
36807 -150220 -222012 -48641 338567 767563 909835 541088 -96005 -460029 -349639 -106545
36797 -106545 -69656 -147458 -126827 -78887 -151663 -215599 -84010 86056 12590 -182673 -83529
36786 -83529 370610 738176 675573 344262 81165 -26941 -52269 11965 142778 141623 -118955
36775a18955l02643k4657K34891J98173L4249Q979L6565j04152l14677l03979
36765f56206o6194J25610J62253J82812K10196P7716j86019k62271j8421K30261
36755b00263J75769k9458o6939J7306o2038k94761l57035j27497J29828J75242
36745f39846R2867O3901Q4644O1823J0051j262J6567R804k6937p2031j00853n1196
36733e52468J10949K55663J81348r0865k85811k27051m3781Q3485J78771K98853
36723i0907L03471N7319k54497k98102m8845J76979J59029Q059p5769n8852q869
36712a30984L7850M2036n2192j92858k17108p7658N9191N8468K1905R2205J77832
36701a81313Q8963j18918j86196m5128P0601m662j12852l9661J34761J59483p678
$$ plain form
36775 -118955 -421598 -446255 -211364 -13191 21058 30037 66602 -37550 -352227 -656206
36765 -656206 -722400 -596790 -434537 -251725 -41529 36187 -149832 -412103 -430524 -200263
36755 -200263 -24494 -53952 -120891 -103585 -165623 -460384 -817419 -944916 -815088 -639846
36745 -639846 -546979 -483078 -398434 -336611 -326560 -327822 -311255 -301451 -328388 -400419 -501272 -552468
36733 -552468 -441519 -185856 -4508 -95373 -381184 -608235 -652016 -568531 -389760 -90907
36723 -90907 212564 269883 15386 -282716 -331561 -154582 4447 12506 -63263 -122115 -130984
36712 -130984 -93134 -51098 -103290 -296148 -513256 -590914 -531723 -473255 -451350 -359145 -181313
36701 -181313 -92350 -211268 -397464 -442592 -371991 -376653 -489505 -529166 -394405 -234922 -242600
36690b42600j58654j40710n629J45360K68519K94402J35957j30897k61212j36139
36680b31603O3777J04658L496n6561j6953K2222M528k1490l0538n3954p7549m6003
36668c35970J3683M519p7960j19572n9661K8063O8780Q2581R0647M3261p4094
36657c35723j59277j19314j1255M1382K2961J7823O4111J17274J40508J29585
36647i1925N5927r7928k25060j47099J39627L73930L08983K5782j70963j47119
36637B4155o4939q7280j40622q4897K9851M6961m1765j00845o5150J7966J19260
36626c47305K17480J94672l6718l02590l08954n8117J29835Q4946J096O0426J41443
36615b23786J01885O8234J65354K03626j6958k74266j95935J36331K76079Q7308
$$ plain form
36690 -242600 -401254 -541964 -547593 -402233 -133714 160688 296645 165748 -95464 -231603
36680 -231603 -167826 -63168 -59672 -116233 -133186 -110964 -106436 -127926 -158464 -212418 -289967 -335970
36668 -335970 -322287 -317768 -395728 -515300 -574961 -546898 -478118 -395537 -304890 -261629 -335723
36657 -335723 -495000 -614314 -625569 -584187 -561226 -543403 -479292 -362018 -221510 -91925
36647 -91925 -35998 -133926 -358986 -506085 -366458 7472 316455 342237 171274 24155
36637 24155 -40784 -128064 -268686 -353583 -323732 -276771 -318536 -419381 -484531 -466565 -347305
36626 -347305 -129825 64847 28129 -274461 -583415 -641532 -511697 -426751 -425655 -365229 -223786
36615 -223786 -121901 -53667 111687 315313 298355 24089 -171846 -35515 240564 327872
36605C27872r5892m8186K9242o7838j78940q5052R9834J32977M8484O6056K09895
36594D38452L01444K82344K79958L39427L25195J59017k8549q9979p0687j00598
36584A836024j67317j53073o4296m8196j41015j74481m9191N1867q3690l34477
36574F72155l90919k28429j34713k19525k27591J0706K59474K51945J17732J26408
36564B37243K12985J18731j28766k54651j92155j31434j33067n5768J04549J52782
36554f9551L8391n4651l7208l1579p8749l9443J04794J56169M0777m4375K5321
36543I896R1139J1907r2529q5869m9169p1637n8104L6294L0686j61992k72246
36532f11624m1354L25170M05454J51844r3927j17793m8669n4184j00976p7260
$$ plain form
36605 327872 231980 183794 213036 145198 -33742 -118794 -18960 114017 162501 228557 438452
36594 438452 739896 1022240 1302198 1641625 1966820 2125837 2097288 2007309 1936622 1836024
36584 1836024 1668707 1515634 1451338 1403142 1262127 1087646 1038455 1090322 1006632 672155
36574 672155 281236 52807 -81906 -301431 -529022 -518316 -258842 -6897 110835 237243
36564 237243 450228 568959 440193 185542 -6613 -138047 -271114 -326882 -222333 -69551
36554 -69551 -31160 -85811 -123019 -154598 -233347 -272790 -167996 -11827 28950 -15425 9896
36543 9896 101035 112942 20413 -65456 -114625 -186262 -244366 -208072 -177386 -339378 -611624
36532 -611624 -652978 -327808 77646 229490 135563 17770 -30899 -85083 -186059 -263319
36522b63319M2276K02784L04186K31728j2634k33542k40392r0371J2913J4105
36512c2266K0697N9937L4998n7239p0008N9853J80995J23192q0246k46258k50141
36501b56486j22175J4786O4146L6919J6224K2833k4225j41514j59082P3695L84642
36490i0237L93786J3488l53828k87463R8214K92997N7578k88582l22776m4815
36480e31638K24727L10438K95002K37686P6488j43611k20377j00376r830j17402
36470B1107k62241k09657m946J46900K04398K46745K34137Q7032p8489p8900J9204
36459C25290j2738j84103k67423j61990j4148M1417K7088M466K1936J42699L07267
36448B29761K64275q1979l79621k51467J02283J72719o3855j59049Q391O8560
$$ plain form
36522 -263319 -221043 -18259 285927 517655 505021 271479 31087 -59284 -46371 -32266
36512 -32266 -11569 48368 83366 26127 -43881 15972 196967 320159 239913 -6345 -256486
36501 -256486 -378661 -363875 -299729 -262810 -246586 -223753 -247978 -389492 -548574 -474879 -90237
36490 -90237 303549 317037 -36791 -324254 -226040 66957 124535 -164047 -486823 -531638
36480 -531638 -306911 3527 298529 536215 612703 469092 248715 148339 138509 21107
36470 21107 -241134 -450791 -455737 -308837 -104439 142306 376443 463475 384986 306086 325290
36459 325290 312552 128449 -138974 -300964 -315112 -273695 -246607 -242141 -220205 -77506 229761
36448 229761 494036 412057 32436 -219031 -116748 55971 -7884 -166933 -158542 -89982
36438h9982r4415r7206J92030L11197k786k80724q0809K42181J26058k55384l07864
36427c37704K682J77479N4385k2053J07836J66821j6068k07948j74022l429J07838
36416a44183J09495K8050j09255k01965j32823M9749J67261J36182J9981r5134
36406a72642j37318n4095P3510N5557j12182j67269J2631J60920L9936j51442
36396d52394j22023J4197r564r3411K0973K03830J27333j14754j33672O7237J11900
36385c80348m3019l3133J97332K25179j06421l46913j36789K37077L19791J25382
36375E8138m5934r7834j06654o5614K4908K9725q7449j18722M5050J57511j1909
36364b18784k61636k36164L2358J96021J22982L3132J02192K08600J56006l1343
$$ plain form
36438 -89982 -184397 -281603 -89573 221624 218838 -61886 -142695 99486 225544 -29840 -337704
36427 -337704 -335022 -157543 -103158 -125211 -17375 149446 133378 -74570 -248592 -252021 -144183
36416 -144183 -34688 -6638 -115893 -317858 -450681 -400932 -233671 -97489 -77508 -172642
36406 -172642 -309960 -364055 -290545 -234988 -347170 -514439 -501808 -340888 -300952 -452394
36396 -452394 -574417 -560220 -569784 -663195 -642222 -438392 -311059 -425813 -559485 -492248 -380348
36385 -380348 -423367 -456500 -259168 -33989 -140410 -487323 -624112 -387035 -67244 58138
36375 58138 12204 -85630 -192284 -257898 -232990 -203265 -290714 -409436 -364386 -206875 -218784
36364 -218784 -480420 -716584 -684226 -488205 -365223 -332091 -229899 -21299 134707 103364
36354A03364j47410p5402O1599N0070j29270k50226j40258O8920J30907L7493
36344b90213k1176O055j4672j11526j35690l3337N7949O0859P5430J55111J85789
36333f5421R2924k7764q7597j27435j69466j31591R268J34420J54798J16508P4708
36322b6648J9076l4558m8236p7637j88937k56639q8300K21045L29059J08179j87628
36311b31224k91579k10993p7815L2225O0460p029k8106J17860K44017Q4145j98821
36300e06860j67904J66054K82393k9016l08716j55296J82902K89100K02324J61833
36290A16814J28545k655o7537L8103L0777k72276m67205j35121L71103L60583
36280A01131j30771l89358j11157K28864K00860M417M59J46205J88690Q4262m3161
$$ plain form
36354 103364 -44046 -119448 -57849 -7779 -137049 -387275 -527533 -458613 -327706 -290213
36344 -290213 -311389 -305334 -320006 -431532 -567222 -600559 -542610 -481751 -406321 -251210 -65421
36333 -65421 27503 -261 -87858 -215293 -384759 -516350 -507082 -372662 -217864 -101356 -26648
36322 -26648 -7572 -42130 -90366 -168003 -356940 -613579 -701879 -480834 -151775 -43596 -231224
36311 -231224 -522803 -733796 -811611 -779386 -718926 -725955 -754061 -636201 -392184 -308039 -506860
36300 -506860 -674764 -508710 -226317 -255333 -564049 -719345 -536443 -247343 -45019 116814
36290 116814 245359 242704 175167 213270 244047 -28229 -495434 -630555 -259452 101131
36280 101131 -29640 -418998 -530155 -301291 -100431 -96014 -95555 50650 239340 323602 280441
36269B80441j30255j53519o4069R7986J78341J16014L9682P3221J72003K12276
36259H22121J35112k0139j27492n1189J71381K96636J75506j7068m9504j328r0046
36248A243990k38998j72202Q3426J65596q3843l76893l93575j64486Q2104K13090
36238C58209K03245O8289q3751j05798j9331q657j31398k10018r6739J20483K61113
36227C55647K48596R8223j28717k89208k38242k1388J49464J60965R4558L6770
36217D66668k3494p2423m6346J4968j1991j06972j10937j7433j4146j40351j68244
36206b30701K2101K00090J21632r7331j72904n8541P4130J32262J41594Q1365
36196B13697p9422k23285j77896M0309K46269L28463L07742J86699o2113l37309
$$ plain form
36269 280441 150186 -3333 -67402 30584 208925 324939 364621 437842 609845 822121
36259 822121 957233 937094 809602 758413 929794 1226430 1401936 1384868 1335364 1334036 1243990
36248 1243990 1004992 832790 916216 1081812 997969 621076 227501 63015 145119 358209
36238 358209 561454 629743 545992 440194 420863 412206 280808 70790 -25949 94534 355647
36227 355647 604243 702466 573749 284541 46299 24911 174375 335340 429898 466668
36217 466668 443174 370751 324405 339373 327382 220410 109473 92040 77894 -62457 -230701
36206 -230701 -208600 -8510 113122 15791 -157113 -215654 -141524 -9262 132332 213697
36196 213697 134275 -89010 -266906 -226597 19672 348135 655877 842576 780463 443154
36186D43154m24376k50368m649P5067l2169j39336q1466J09041K43386J81195
36176A19479k390q8243J8090J47242P7470j53270k72795j33561Q5791J29553J5398
36165e7236k3967P6781R7376j08523l16341k05393J51953L39000J57218j22028
36155a1160j78415p0272m5076j15187q7697P7608K02689J64891K8541q7770j06587
36144b28435R005J83340K20965O0715n9108O7615K30018Q2344k59551l26497k7709
36133d7298J89373N1076j35377m5077J17737N863k66298l33954j76040o0703m0315
36122g41013O1225K28811K50181J22033O4931J03207J7499k08988k79078n9438
36112d40630J71503J47822j929k6724L4371j5515j49494j60298k2280N3629m8231
$$ plain form
36186 443154 18778 -231590 -236239 -161172 -193341 -332677 -414143 -305102 -61716 119479
36176 119479 117089 28846 46936 194178 271648 118378 -154417 -287978 -202187 -72634 -57236
36165 -57236 -81203 -4422 92954 -15569 -331910 -537303 -385350 -46350 110868 -11160
36155 -11160 -189575 -259847 -304923 -420110 -507807 -430199 -227510 -62619 -34078 -121848 -228435
36144 -228435 -219430 -36090 184875 245590 186482 254097 484115 566459 306908 -19589 -47298
36133 -47298 142075 193151 57774 12697 130434 136297 -130001 -463955 -639995 -700698 -741013
36122 -741013 -679788 -450977 -200796 -78763 -13832 89375 106874 -102114 -381192 -440630
36112 -440630 -269127 -121305 -123234 -149958 -115587 -131102 -280596 -440894 -463174 -409545 -457776
36101d57776j57017m0655K71516M80353L38212n7553l55114l52429k03475j27002
36091f60940n9743J64875L90638K55464k10807m84363k34874K09580L52186K00438
36081g7546J06326J53898J26134k3892j02403p0020j05910k24277k03105P048
36071d13747J59461J29761J11533K16658K23599k3000k60634j73770J06946K02550
36061B79357L4544j48933j95763j79098j51438o6024N5200J15561J08555R7854
36051e0185P1716N970r093P2922P5275j41107l38562j79381K06961L36810P9932
36040A31258j64955j03399O3580O2425k5501j1371M9010L2725J6479Q2667Q7529
36029B20447r0057k68911k25579n9021o422n4433k9373O6538J08711J15679J66166
$$ plain form
36101 -457776 -614793 -655448 -383932 96421 434633 377080 21966 -330463 -533938 -660940
36091 -660940 -720683 -555808 -165170 90294 -120513 -604876 -839750 -630170 -277984 -77546
36081 -77546 28780 182678 308812 284920 182517 112497 6587 -217690 -420795 -413747
36071 -413747 -254286 -124525 -12992 203666 427265 404265 143631 -30139 76807 279357
36061 279357 313901 164968 -30795 -209893 -361331 -427355 -372155 -256594 -148039 -50185
36051 -50185 21531 27501 18408 91330 166605 25498 -313064 -492445 -285484 51326 131258
36040 131258 -33697 -137096 -73516 -11091 -36592 -47963 1047 33772 50251 132918 220447
36029 220447 130390 -138521 -364100 -423121 -429543 -483976 -513349 -446811 -338100 -222421 -56255
36018e6255J73988M7991n3369M1887J57633K3125k16039j75314J22461K45995
36008C12103L8798j65286j21857j7110m6936q0674L821K8054j36159k43079n4313
35997d82638K03580J49149j46872k59141m5997J81485J50867k7884j02235k7644
35987d07330M9989L1147l1458k4862P2941J42690O9807n6610j7446J94812K73184
35976B96864J827l68902l95908l7835K89928K77607P1717m0971n3069j31186k47794
35965c37722j93054N9849K46998J62573n4549j19939J5186J41186J02472l2334
35955i334j17205r1267L5628K02963K52323L8031l12374m30690j61755J80542
35945d13138K18209J7810p5293J0527L6176o8589q3545O4084J20973n3086j98045
$$ plain form
36018 -56255 117733 165724 112355 154242 311875 335000 118961 -56353 66108 312103
36008 312103 350901 185615 63758 46648 -288 -80962 -77141 -49087 -185246 -428325 -482638
35997 -482638 -279058 -129909 -276781 -535922 -581919 -400434 -249567 -277451 -379686 -407330
35987 -407330 -357341 -326194 -357652 -382514 -309573 -166883 -97076 -153686 -171132 23680 296864
35976 296864 298691 -70211 -466119 -503954 -214026 63581 135298 94327 41258 -89928 -337722
35965 -337722 -530776 -470927 -223929 -61356 -115905 -235844 -220658 -79472 23000 -9334
35955 -9334 -126539 -217806 -182178 20785 273108 311139 -1235 -431925 -593680 -413138
35945 -413138 -194929 -177119 -252412 -241885 -205709 -274298 -357843 -293759 -172786 -225872 -423917
35934d23917n7382J94850K27526O0300k2914N1737Q8268o720r7181q6264n3793
35923a25490o6591o0768J2029Q3168Q1618K4012n5183j42955j85958j21659j0271
35912e68048L611q2619q7912P5626K23393J42403p6893j39574L7584K03955J44001
35901a24473k131L9515K27731K31034n8492k98076j62523J60000K24985j7717
35891B19853j77407m2296J21630L7789j41619j17255P1742J46263L1914r5353
35881E5261j36184j55546j63382o9107J15023K32387J85457L4708j04118j29105
35871a34606K5574K64335L02232q723l78291l71902Q044L19625K75039L1590j58596
35860A74321k52435k54636r2334J59126K26898M5969o3320J13499K89605J15580
$$ plain form
35934 -423917 -481299 -286449 -58923 1377 -21537 30200 118468 111748 14567 -71697 -125490
35923 -125490 -192081 -252849 -240820 -157652 -76034 -52022 -107205 -250160 -436118 -557777 -568048
35912 -568048 -564437 -647056 -734968 -659342 -435949 -293546 -370439 -510013 -472429 -268474 -124473
35901 -124473 -126604 -87089 140642 371676 313184 15108 -147415 12585 237570 219853
35891 219853 42446 150 121780 159569 17950 -99305 -27563 118700 150614 55261
35881 55261 -80923 -236469 -399851 -468958 -353935 -121548 63909 98617 -5501 -134606
35871 -134606 -109032 155303 457535 448812 70521 -301381 -293337 26288 301327 332917 174321
35860 174321 -78114 -332750 -425084 -265958 -39060 6909 -56411 57088 346693 462273
35850D62273k12507k15533J09359K58171k2233l75637l79212r4650J39543K08007
35840a22419K44475K99120K50021L9508j87915k43735j14571K4733J0145j13560
35830H5802j32946N8080K77676K52518k7163k77216k63220m8662J43015J86869
35820B54753J02318m2206j58134j48849j5388R2470M3972q4560j10127j5140K9731
35809e1160n2093j00508K7806J94039J57080l6322q2961J07412K29899L9755k31293
35798B01654j99826O0069J04007j88275m09466k56783J0731J7856j29832o9069
35788h58934J90587K85293R4480q3820j1161J72137K14398Q2093q7518j63408
35778a65853p7492J08353J60358p9031l76642l18748R9697M01422K63111q2179
$$ plain form
35850 462273 249766 34233 143592 401763 379530 3893 -375319 -469969 -330426 -122419
35840 -122419 122056 421176 671197 710705 522790 279055 164484 189217 199362 85802
35830 85802 -47144 10936 288612 541130 513967 236751 -26469 -75131 67884 254753
35820 254753 357071 314865 156731 7882 -7506 84964 128936 44376 -65751 -80891 -51160
35809 -51160 -103253 -203761 -175955 18084 175164 138842 55881 163293 393192 432947 201654
35798 201654 1828 61897 165904 -22371 -431837 -688620 -677889 -660033 -789865 -858934
35788 -858934 -668347 -383054 -288574 -372394 -383555 -211418 2980 85073 -2445 -165853
35778 -165853 -243345 -134992 25366 -53665 -430307 -749055 -649358 -247936 15175 -67004
35768f7004k50031k07835j38572p5668K9923Q1476j2558r7740K0764K31088K50253
35757b35904L9677j60797j60677K5358K73662M10384K78602m9495k48926j42645
35747B9239K7432k5864j79045j36544N2567J12816M7168P7357J59020M9727j53749
35736F0124q3509K18808K49280j42756m30224k03975J91709K22410l1297j11996
35726f1426M0976P5945j23375k53432q5068K11548L16567J14028k40731m48695
35716d53663k84646J56344M73843L76675K1222k15560k05701j18658q6972o5881
35706d02997p140N1668R5034J47060J60145N1782j21590j87784j01933k1795o8934
35695d06484j32368j6371K66536M54857L19400n8943l50258l25790q7970R3932
$$ plain form
35768 -67004 -317035 -524870 -663442 -739110 -709187 -627711 -640269 -738009 -717245 -486157 -235904
35757 -235904 -196227 -357024 -517701 -492343 -218681 191703 470305 420810 171884 29239
35747 29239 56671 30807 -148238 -284782 -232215 -119399 -72231 5126 164146 213873 60124
35736 60124 -23385 195423 444703 301947 -128277 -332252 -140543 81867 50570 -61426
35726 -61426 -20450 55495 -67880 -321312 -406380 -194832 121735 235763 -4968 -453663
35716 -453663 -738309 -581965 -108122 268553 289775 74215 -131486 -250144 -337116 -402997
35706 -402997 -410137 -358469 -263435 -116375 43770 95552 -26038 -213822 -315755 -337550 -406484
35695 -406484 -538852 -555223 -288687 166170 485570 426627 76369 -249421 -337391 -243459
35685b43459J06624N4518N1177Q2034O8341l7551k00709k65302o5268K86562L73274
35674B10241n019m23864l19555J91571M38538J61114j77329j87146r7440j94536
35664d03425k47547K8896L44668K36718j48757k56300K0047K32993J17622p8870
35654a53955p9075L7032O1434l1897j32066j39347q939J86268K44665N6919k10159
35643a69120l20727k67103j74461n4293J05911J65234L6177p3680N2878K52798
35633d46386K25657K9434n4414k6196j01275k27387j43440J12376K31099J69989
35623b30543J79705K76418J99020m0835r8691Q2187J18878j49072l54958k18868
35613b36759L706l463j07257l6167J38141J82279R8138J7824p1484k05369k46296
$$ plain form
35685 -243459 -136835 -82317 -31140 50894 119235 81684 -119025 -384327 -449595 -163033 210241
35674 210241 205222 -218642 -538197 -346626 91912 253026 75697 -111449 -208889 -403425
35664 -403425 -650972 -622076 -277408 -40690 -189447 -445747 -425700 -192707 -75085 -153955
35654 -153955 -233030 -195998 -134564 -166461 -298527 -437874 -446813 -260545 -15880 41039 -169120
35643 -169120 -489847 -756950 -931411 -985704 -879793 -714559 -678382 -752062 -699184 -446386
35633 -446386 -220729 -191295 -245709 -271905 -373180 -600567 -744007 -631631 -400532 -230543
35623 -230543 -50838 225580 424600 383765 285074 367261 486139 337067 -17891 -236759
35613 -236759 -233053 -236516 -343773 -379940 -241799 -59520 38618 56442 -15042 -220411 -466707
35602d66707q2804J38943K08276J24911J2252p1087r4163k2163O3945K9187o1549
35591b20959j7754J04718O1061r1288r289K94112L42685k5446l06771j15227J91067
35580B06909J19067j75375k42467j00251o1904r3752N2902K75882K76921J30042
35570C87974J24716J71013m6429l99537m14016m0355K53204K14188Q2449M8074
35560C81281k1587j69615j82167l0913j2235k18426l10986q5352J51258Q5444
35550d13298q1128N483K43689K51419p031j80372q1643P2881L5991j21960j57176
35539d33145J887J75913J59962m4548k33058k16476j5363J79151K13824J05545
35529a06308j4832m2071J6113O1345K4642l4426l503J00260J23160k191j36393
$$ plain form
35602 -466707 -549511 -410568 -202292 -77381 -65129 -136216 -230379 -252542 -188597 -159410 -220959
35591 -220959 -238713 -133995 -72934 -164222 -173511 120601 463286 437840 131069 15842 206909
35580 206909 325976 150601 -91866 -192117 -254021 -347773 -294871 -18989 257932 387974
35570 387974 512690 683703 637274 237737 -176279 -216634 36570 250758 333207 381281
35560 381281 359694 190079 7912 -23001 -35236 -253662 -564648 -650000 -498742 -413298
35550 -413298 -494426 -488943 -245254 6165 -866 -181238 -262881 -190000 -154009 -275969 -433145
35539 -433145 -431258 -255345 -95383 -139931 -372989 -589465 -604828 -425677 -211853 -106308
35529 -106308 -121140 -163211 -147098 -85753 -61111 -95537 -99040 1220 124380 122189 -14204
35518a4204j21761J472O9766J8465o7480p6370K3643J49662J49468k7051j95370
35507h9760j25186J18253K24901Q6805n2097l694P3997k4139k05243k57238j68618
35496d22019m5166R6546K25978J95716j1483j40841l0835J03413L8761n5155O1867
35485A6782K20803J16915j26923j47857L1079N9274j21005k11830j09948l2259
35475c04969n3492Q564J64869J62017n9504k15990j26152M5917J08557P3548j5557
35464b12192j51798k00333k1834J94399J18231j53881j76569J14742K67034O7960
35454a54241r9041P0999K87148J84374p8388j59582j08405j52815k11100p6278
35444d97329J31076J44671L0492N6784J99624J89698r278j52772j30818q8701
$$ plain form
35518 -14204 -135965 -134493 -64727 -46262 -113742 -190112 -166469 -16807 132661 105610 -89760
35507 -89760 -214946 -96693 128208 215013 162916 159222 233219 209080 3837 -253401 -422019
35496 -422019 -467185 -370639 -144661 51055 39572 -101269 -132104 -28691 10070 -45085 16782
35485 16782 237585 354500 227577 79720 110799 170073 49068 -162762 -272710 -304969
35475 -304969 -358461 -349897 -185028 -23011 -82515 -298505 -424657 -378740 -270183 -196635 -212192
35464 -212192 -363990 -564323 -586157 -391758 -273527 -427408 -603977 -489235 -222201 -154241
35454 -154241 -253282 -182283 104865 289239 210851 51269 -57136 -209951 -421051 -497329
35444 -497329 -366253 -221582 -191090 -134306 65318 255016 245738 92966 -37852 -126553
35434a26553j12524r2768M1341J79216J86680O4864p0484q2590O4518K04160J06825
35423C62685j77776k92748m9129K59734K47055k7798j88275r6732K7954Q817p3763
35412B4r8181q5994r6214j07418p5167j622P8968J09847L4511j06145j60534n9227
35400e67152N1165L147j29638j30685L2254J50370O1961j36439k12256n8139J99540
35389g35872L31297K48567J00781O9156J05406K5695j43856j46096R5708K86897
35379B37683J65189r8673j45004N7026K01758J06853p7745j47886j19877j36519
35369D2805k21785k36881o8624J86334K77555Q5457k00730k95799j69588k5352
35359f26608M6691J57733L15807L04393J8211k96091l29202r2808J53359K27359
$$ plain form
35434 -126553 -239077 -331845 -290504 -111288 75392 140256 69772 -12818 51700 255860 362685
35423 362685 184909 -107839 -156968 102766 349821 322023 133748 37016 64970 73787 24
35412 24 -98157 -184151 -280365 -387783 -462950 -464572 -385604 -275757 -241246 -347391 -507925 -567152
35400 -567152 -515987 -512840 -642478 -773163 -740909 -590539 -528578 -665017 -877273 -935412 -735872
35389 -735872 -404575 -156008 -55227 13929 119335 145030 1174 -144922 -49214 237683
35379 237683 402872 304199 159195 216221 417979 524832 447087 299201 179324 42805
35369 42805 -178980 -415861 -484485 -298151 -20596 64861 -135869 -431668 -601256 -626608
35359 -626608 -579917 -422184 -106377 198016 216227 -79864 -409066 -501874 -348515 -121156
35349a21156J28979m9905j74329j45653m0935k8284p1437N0653L20026L77009
35339B44968M9329l13044l17732q0941L5629M37K9463J11423N7318p4716m2511
35328c00377J28305J69607M2710j8843M1000J6161j33750j73630k3865P6212j3672
35317a90142j02001k9343O1596L2607K4483J64303K55404P2091k10579k17375
35307a38956O7329K53671Q5644k28508l24780j50085K8268J1640r0924n9691J13937
35296d32455K33782J90942Q4741K2398k3571p3904m5128O8260R4762m8504j64808
35285i3485p5433O3698J9281j06491o3806O9713J6473j54203p7311K56540L80077
35274B35053N0672l53060l82165j06787J27868K22093K64117J96100q0628l90104
$$ plain form
35349 -121156 7823 -42082 -216411 -362064 -402999 -431283 -502720 -452067 -132041 244968
35339 244968 294297 -18747 -336479 -417420 -381791 -381354 -351891 -240468 -183150 -257866 -300377
35328 -300377 -172072 -2465 40245 21402 62402 78563 -55187 -228817 -252682 -176470 -190142
35317 -190142 -292143 -321486 -259890 -227283 -202800 -38497 216907 288998 78419 -138956
35307 -138956 -71627 182044 267688 39180 -285600 -435685 -407417 -395777 -486701 -546392 -432455
35296 -432455 -198673 -7731 77010 99408 75837 1933 -43195 25065 119827 71323 -93485
35285 -93485 -168918 -105220 -85939 -192430 -256236 -186523 -170050 -324253 -401564 -145024 235053
35274 235053 285725 -67335 -449500 -556287 -428419 -206326 57791 253891 173263 -216841
35264b16841m23292j64997Q9952J34292M0646l5658m8599l5392l7914o8133p7690
35253h43626P58J22601J33355j6070j73936k14046k18710k89152l16166j41516
35243a956508J53241L35801L34646K52961J37206k9359j39227l7459J86546K44738
35233e17414O5170q0664J3840J77280J35154p3563j78565q2083N1809Q9136Q8324
35222c11576J27689J54331R8164Q493k7620j2219J6374P4020J48575J13494j06069
35211B83656l25851k70260L1146K30657J27886o3653o2180O3922M8907j25977
35201f1747k13872r7814N3630O8154n566k9884K8892J15540J61939R0312j25609
35190a6025l43247l36086p9440J71122J79447M044j16805o1189R2323K00052J74140
$$ plain form
35264 -216841 -640133 -805130 -715178 -580886 -540240 -575898 -624497 -659889 -697803 -765936 -843626
35253 -843626 -842868 -720267 -586912 -602982 -776918 -990964 -1209674 -1498826 -1814992 -1956508
35243 -1956508 -1803267 -1467466 -1132820 -879859 -742653 -772012 -911239 -948698 -762152 -517414
35233 -517414 -452244 -532908 -519068 -341788 -206634 -280197 -458762 -540845 -489036 -399900 -311576
35222 -311576 -183887 -29556 68608 77101 49481 37262 53636 127656 276231 389725 283656
35211 283656 -42195 -312455 -281309 -50652 77234 13581 -48599 15323 64230 -61747
35201 -61747 -275619 -373433 -319803 -251649 -257215 -287099 -258207 -142667 19272 109584 -16025
35190 -16025 -359272 -695358 -774798 -603676 -424229 -420185 -536990 -598179 -505856 -305804 -131664
35179a31664K1972j47438j91172p4197Q1961J33088O0344m2217q2152m5072L064
35168d13483j6712q4600o6317J09424K94330K69385L9892j64536j92376j08219
35158c33212l823J28606K49843K00066o8356l19469k78539J0111K22154J34991
35148e7628j36365k88367j56228J14548K28164R4425l9925P6670L10460K91069
35138D36823n7210l82776l76202j31233P9417J55052J34210K8828j05358j07902
35128c26351O3912J97226J13500m8830o0396L3241K1726j06959j76236j16257
35118d05424j079J37548K84142K98893P3761k15550k82727j26476Q391K7944N9493
35107a41084J43105J61393R8743P3094P5690k1578j59808j18377Q0519J28655
$$ plain form
35179 -131664 -109692 -257130 -448302 -522499 -440538 -307450 -247106 -289323 -371475 -416547 -413483
35168 -413483 -430195 -514795 -581112 -471688 -177358 92027 131919 -32617 -224993 -333212
35158 -333212 -337035 -208429 41414 241480 173124 -146345 -424884 -414773 -192619 -57628
35148 -57628 -193993 -482360 -638588 -524040 -295876 -201451 -241376 -164706 145754 436823
35138 436823 379613 -3163 -379365 -510598 -431181 -276129 -141919 -113091 -218449 -326351
35128 -326351 -262439 -65213 48287 -543 -60939 -27698 -5972 -112931 -289167 -405424
35118 -405424 -406503 -268955 15187 314080 387841 172291 -110436 -236912 -228521 -200577 -141084
35107 -141084 2021 163414 262157 335251 410941 389363 229555 111178 191697 320352
35097C20352q7162k85081k24337l6877N5366O6000Q6169O9218j2462m0811J4323
35086g5302o509j16429n3356K44431L66607J2584m39569m11174K4332K73708J05032
35075g5645j32518j60627j08176r2853L1898K97074L96835J27265k46324l32767
35065b95838j16331J16346J71501N9733j30126k66568k10993Q470J72852J57110
35055c33844R1888J03426Q3716p7466k10741r0079J70004K32927K6488j63332
35045a67013j16044M8799J06915M5829J2666N8597Q2528J2238o8026k8804J00493
35034H8178J31464k7560k01943j64711L0645J14458k809j19044q2945o994j4431
35023b55692j2324R5263J81394J14956J8672M7907Q5779l5705j66661n9179J53013
$$ plain form
35097 320352 233190 -51891 -276228 -313105 -257739 -191739 -105570 -36352 -48814 -89625 -75302
35086 -75302 -81811 -198240 -251596 -7165 359442 372026 -67543 -478717 -454385 -180677 -75645
35075 -75645 -208163 -368790 -476966 -569819 -537921 -240847 155988 283253 36929 -295838
35065 -295838 -412169 -295823 -124322 -64589 -194715 -461283 -672276 -663806 -490954 -333844
35055 -333844 -241956 -138530 -54814 -132280 -343021 -433100 -263096 -30169 -3681 -167013
35045 -167013 -283057 -234258 -127343 -81514 -68848 -10251 72277 84515 16489 -12315 88178
35034 88178 219642 192082 -9861 -174572 -143927 -29469 -32278 -151322 -234267 -241261 -255692
35023 -255692 -268016 -172753 8641 123597 142269 190176 275955 240250 73589 14410 167423
35012A67423J18776j24674j77166M0111J19469j40910l57353j77251J29156J02790
35002b99629j65187j98384J04196L42720K45567J0494p5798k7523j2023m7086
34992a22653l4264K8568L3957o3199j55311q7237J48938L38689K41720r4955l26934
34981i2681k11248R1995K50449J78362L6381q2756k03828k47165p2435K01277
34971a51649K31943m9080k60237r9303J92773J79222j32586l31530k08426K2331
34961f06542J24880J38113J64895J45889J6655j12255j16987n3081j7552L7106
34951b78879J63979K35523J23949l7996l1697Q4700P0054q2387j38655m7516k1630
34940C9445j15170r2368J12680J78977q0626l14607j29450K57725L15502N256
$$ plain form
35012 167423 286199 161525 -15641 24470 143939 3029 -354324 -531575 -402419 -299629
35002 -299629 -464816 -663200 -559004 -216284 29283 39777 -36021 -63544 -75567 -122653
34992 -122653 -156917 -128349 -94392 -157591 -312902 -400139 -251201 87488 329208 234253 -92681
34981 -92681 -303929 -211934 38515 216877 253258 170502 -33326 -280491 -352926 -151649
34971 -151649 80294 31214 -229023 -328326 -135553 43669 -88917 -420447 -628873 -606542
34961 -606542 -481662 -343549 -178654 -32765 -16110 -128365 -245352 -298433 -315985 -278879
34951 -278879 -114900 120623 244572 206576 174879 259579 329633 247246 108591 61075 39445
34940 39445 -75725 -168093 -55413 123564 42938 -271669 -401119 -143394 172108 177364
34930A77364j95197m6423J61777J56953O6393P2154P6167l3585r0561P5008K79448
34919F99498K13194r2168l01960k34042m6365K4378o7112j88287j95742o1817
34909b50423J12619K07800K07258J66180Q9130m7935j71248j67277q3845q9274
34899b7015j87099j76201K3245K13161K05060P0478k8949o9939p1915L4182K44382
34888B29390L47099J70558j37030k73124j56643K2332O2608o5847k27755k24710
34878b53122K824K25501J54579j24076k05898L4496K26153Q2372j50148j28378
34868a35697K8904K2255o4110L7735K06507R2924k32882l32140r8691J00546M9384
34857c25265l8460J8016P6632J3025m0932J6253O8730M3078L1503K4738j20474
$$ plain form
34930 177364 -17833 -64256 97521 254474 320867 393021 469188 435603 345042 420050 699498
34919 699498 912692 820524 518564 284522 238157 262535 195423 7136 -188606 -250423
34909 -250423 -137804 69996 277254 443434 532564 484629 313381 146104 62259 -27015
34899 -27015 -214114 -390315 -367070 -153909 51151 121629 92680 22741 -49174 -14992 229390
34888 229390 576489 747047 610017 336893 180250 202582 265190 199343 -28412 -253122
34878 -253122 -250298 -24797 129782 5706 -200192 -165696 60457 142829 -7319 -135697
34868 -135697 -106793 -84538 -148648 -110913 95594 188518 -44364 -376504 -475195 -374649 -325265
34857 -325265 -363725 -345709 -269077 -256052 -296984 -280731 -212001 -168923 -137420 -112682 -233156
$$ [...]
##END NTUPLES=NMR SPECTRUM
##END=
