##TITLE=31Pdec_SR102_2_2
 CDCl3, 24 sc
 8.2.2022
##JCAMPDX= 6.0         $$ Bruker NMR JCAMP-DX V2.0
##DATA TYPE= NMR SPECTRUM
##DATA CLASS= NTUPLES
##ORIGIN= UXNMR, Bruker Analytische Messtechnik GmbH
##OWNER= root
$$ XWIN-NMR		Version 3.5
$$ Tue Feb  8 11:49:17 2022 Russian Standard Time (UT+4h)  she@DPX200
##.OBSERVE FREQUENCY= 81.013821
##.OBSERVE NUCLEUS= ^31P
##.ACQUISITION MODE= SIMULTANEOUS
##.ACQUISITION SCHEME= undefined
##.AVERAGES= 24
##.DIGITISER RES= 16
##SPECTROMETER/DATA SYSTEM= spect
##.PULSE SEQUENCE= zgpg30
##.SOLVENT NAME= CDCl3
##.SHIFT REFERENCE= (INTERNAL, CDCl3, 0, 248.564)
##AUDIT TRAIL= $$ (NUMBER, WHEN, WHO, WHERE, WHAT)
$$ ##TITLE= Audit trail, XWIN-NMR		Version 3.5
$$ ##JCAMPDX= 5.01
$$ ##ORIGIN= Bruker BioSpin GmbH
$$ ##OWNER= she
$$ F:/spectra/data/she/nmr/P31/1/pdata/1/auditp.txt
$$ ##AUDIT TRAIL=  $$ (NUMBER, WHEN, WHO, WHERE, WHAT)
(   1,<2022-02-08 11:46:55.76 +0400>,<she>,<DPX200>,
      <created by zg, POWCHK disabled, PULCHK disabled
       configuration hash MD5:
       00 E9 B6 7A A2 85 ED C7 34 08 36 98 17 FE 4E 26
       data hash MD5: 32K
       1A 19 25 62 7C CB EC CC 5B F9 C6 61 E7 F3 3E 9E>)
(   2,<2022-02-08 11:47:09.50 +0400>,<she>,<DPX200>,
      <Start of raw data processing
       efp BC_mod = 2 LB = 1 FT_mod = 6 PKNL = 1 PHC0 = -9342.504 PHC1 = 102.2737 SI = 64K 
       data hash MD5: 64K
       8A D2 64 F0 E1 F1 8F A0 66 93 E4 15 1D 03 AE 0C>)
(   3,<2022-02-08 11:47:52.93 +0400>,<she>,<DPX200>,
      <pk PHC0 = -227.5212 PHC1 = 518.2 
       data hash MD5: 64K
       30 9C AC A2 91 84 C1 5C 5B 86 FF 55 A6 64 0E 40>)
$$ ##END=
$$ 
$$ hash MD5
$$ C7 10 79 D4 70 E5 77 A2 DB B2 C5 35 28 F5 FC FB
##$RELAX= 
##$RELAX= 
##$RELAX= 
##$RELAX= 
##$RELAX= 
##$RELAX= 
##$RELAX= 
##$RELAX= 
$$ Bruker specific parameters
$$ --------------------------
##$DU= <F:/spectra>
##$EXPNO= 1
##$NAME= <P31>
##$PROCNO= 1
##$TYPE= <nmr>
##$USER= <she>
##$AMP= (0..31)
100 100 100 100 100 100 100 100 100 100 100 100 100 100 100 100 100 100 
100 100 100 100 100 100 100 100 100 100 100 100 100 100 
##$AQSEQ= 0
##$AQ_mod= 1
##$AUNM= <au_zg>
##$AUTOPOS= <>
##$BF1= 81.014009
##$BF2= 200.13
##$BF3= 200.13
##$BF4= 200.13
##$BF5= 200.13
##$BF6= 200.13
##$BF7= 200.13
##$BF8= 200.13
##$BYTORDA= 1
##$CFDGTYP= 0
##$CFRGTYP= 5
##$CHEMSTR= <none>
##$CNST= (0..31)
1 1 145 1 1 1 1 1 1 1 1 1 1 1 1 1 1 1 1 1 1 1 1 1 1 1 1 1 1 1 1 1 
##$CPDPRG= <waltz16>
##$CPDPRG1= <>
##$CPDPRG2= <waltz16>
##$CPDPRG3= <>
##$CPDPRG4= <mlev>
##$CPDPRG5= <mlev>
##$CPDPRG6= <mlev>
##$CPDPRG7= <mlev>
##$CPDPRG8= <mlev>
##$CPDPRGB= <>
##$CPDPRGT= <>
##$D= (0..31)
0 1 0 0 0 0 0 0 0 0 0 0.03 2e-05 3e-06 0 0 0 0 0 0 0 0 0 0 0 0 0 0 0 0 
0 0 
##$DATE= 1644306415
##$DBL= (0..7)
120 120 120 11 120 120 24 19 
##$DBP= (0..7)
150 150 150 150 150 150 150 150 
##$DBP07= 0
##$DBPNAM0= <>
##$DBPNAM1= <>
##$DBPNAM2= <>
##$DBPNAM3= <>
##$DBPNAM4= <>
##$DBPNAM5= <>
##$DBPNAM6= <>
##$DBPNAM7= <>
##$DBPOAL= (0..7)
0.5 0.5 0.5 0.5 0.5 0.5 0.5 0.5 
##$DBPOFFS= (0..7)
$$ [...]
##$SUBNAM2= <"">
##$SUBNAM3= <"">
##$SUBNAM4= <"">
##$SUBNAM5= <"">
##$SUBNAM6= <"">
##$SUBNAM7= <"">
##$SUBNAM8= <"">
##$SUBNAM9= <"">
##$SW= 501.771253377433
##$SWIBOX= (0..15)
0 1 3 0 0 0 0 0 0 0 0 0 0 0 0 0 
##$SW_h= 40650.406504065
##$TD= 32768
##$TD0= 1
##$TE= 0
##$TE2= 300
##$TE3= 300
##$TEG= 300
##$TL= (0..7)
0 120 53 12 22 120 120 120 
##$TP= (0..7)
150 150 150 150 150 150 150 150 
##$TP07= 0
##$TPNAME0= <>
##$TPNAME1= <>
##$TPNAME2= <>
##$TPNAME3= <>
##$TPNAME4= <>
##$TPNAME5= <>
##$TPNAME6= <>
##$TPNAME7= <>
##$TPOAL= (0..7)
0.5 0.5 0.5 0.5 0.5 0.5 0.5 0.5 
##$TPOFFS= (0..7)
0 0 0 0 0 0 0 0 
##$TUNHIN= 0
##$TUNHOUT= 0
##$TUNXOUT= 0
##$USERA1= <user>
##$USERA2= <user>
##$USERA3= <user>
##$USERA4= <user>
##$USERA5= <user>
##$V9= 5
##$VALIST= <valist>
##$VCLIST= <CCCCCCCCCCCCCCC>
##$VD= 0
##$VDLIST= <DDDDDDDDDDDDDDD>
##$VPLIST= <PPPPPPPPPPPPPPP>
##$VTLIST= <TTTTTTTTTTTTTTT>
##$WBST= 1024
##$WBSW= 4
##$XGAIN= (0..3)
0 0 0 0 
##$XL= 0
##$YL= 0
##$YMAX_a= 2513
##$YMIN_a= -2185
##$ZGOPTNS= <>
##$ZL1= 120
##$ZL2= 120
##$ZL3= 120
##$ZL4= 120
##$ABSF1= 0
##$ABSF2= 0
##$ABSG= 0
##$ABSL= 0
##$ALPHA= 0
##$AQORDER= 0
##$ASSFAC= 0
##$ASSFACI= 0
##$ASSFACX= 0
##$ASSWID= 0
##$AUNMP= <proc_1d>
##$AZFE= 0.1
##$AZFW= 0.5
##$BCFW= 0
##$BC_mod= 2
##$BYTORDP= 0
##$COROFFS= 0
##$CY= -3
##$DATMOD= 1
##$DC= 0
##$DFILT= <>
##$DTYPP= 0
##$F1P= 0
##$F2P= 0
##$FCOR= 1
##$FTSIZE= 65536
##$FT_mod= 6
##$GAMMA= 0
##$GB= 0
##$INTBC= 1
##$INTSCL= 5.30512e-09
##$ISEN= 30
##$LB= 1
##$LEV0= 0
##$LPBIN= 0
##$MAXI= 10000
##$MC2= 0
##$MEAN= 0
##$ME_mod= 0
##$MI= 50
##$NCOEF= 0
##$NC_proc= -8
##$NLEV= 6
##$NOISF1= 182.463
##$NOISF2= 159.3651
##$NSP= 0
##$NTH_PI= 0
##$NZP= 0
##$OFFSET= 248.5645
##$PC= 4
##$PHC0= -9570.025
##$PHC1= 620.4737
##$PH_mod= 1
##$PKNL= yes
##$PPARMOD= 0
##$PSCAL= 0
##$PSIGN= 0
##$REVERSE= no
##$SF= 81.014009
##$SI= 65536
##$SIGF1= 159.3651
##$SIGF2= -187.1042
##$SINO= 113.3802
##$SIOLD= 16384
##$SREGLST= <1H.CDCl3>
##$SSB= 0
##$STSI= 65536
##$STSR= 0
##$SW_p= 40650.406504065
##$SYMM= 0
##$S_DEV= 0
##$TDeff= 32768
##$TDoff= 0
##$TI= <>
##$TILT= no
##$TM1= 0
##$TM2= 0
##$TOPLEV= 0
##$USERP1= <user>
##$USERP2= <user>
##$USERP3= <user>
##$USERP4= <user>
##$USERP5= <user>
##$WDW= 1
##$XDIM= 65536
##$YMAX_p= 411216737
##$YMIN_p= -8262210
$$ End of Bruker specific parameters
$$ ---------------------------------
##NTUPLES= NMR SPECTRUM
##VAR_NAME=  FREQUENCY,     SPECTRUM/REAL,   SPECTRUM/IMAG
##SYMBOL=    X,             R,               I
##VAR_TYPE=  INDEPENDENT,   DEPENDENT,       DEPENDENT
##VAR_FORM=  AFFN,          ASDF,            ASDF
##VAR_DIM=   65536,         65536,           65536
##UNITS=     HZ,            ARBITRARY UNITS, ARBITRARY UNITS
##FACTOR=    0.620285442955139, 1,           1
##FIRST=     20137.2065510759, 0,            0
##LAST=      -20513.1999529892, 0,           0
##MIN=       -20513.1999529892, -8262210,    0
##MAX=       20137.2065510759, 411216737,    0
$$ Real data points
##PAGE= N=1
##DATA TABLE= (X++(R..R)), XYDATA
$$ [...]
42909 -2130844 -2366509 -1489097 -738350 -1000214 -1724000 -1833689 -1101712 -192677 239199
42900 239199 79953 -340816 -512498 -98186 654850 990733 424267 -607327 -1095662
42891 -1095662 -463642 883365 1932145 1905243 885642 -230886 -506013 156134 961825
42882 961825 1160259 839454 588955 597418 523648 239961 172771 624860 1160368 1155875 801721
42871 801721 970901 1959375 2880107 2702611 1563348 510620 84295 -189535 -724711
42862 -724711 -981674 -248001 1043143 1574231 808357 -296908 -580171 -105926 272501
42853 272501 362929 774446 1614694 1995927 1327830 386301 304294 909907 1043959 470123
42843 470123 384697 1591280 3054367 3077699 1470661 -281928 -845468 -295893 434883
42834 434883 692050 488728 237408 305018 584316 507106 -216019 -1010845 -1095597 -621639
42824 -621639 -474539 -868301 -930048 -25842 1219994 1783675 1584989 1336207 1414929 1562332
42814 1562332 1528139 1380476 1178032 841423 435050 218140 305653 470804 331586 -309217
42804 -309217 -1171218 -1508290 -742738 729302 1730804 1595400 918176 666201 920199
42795 920199 1005776 594135 71804 -95121 143281 531926 720385 442863 -130368 -349087
42785 -349087 186154 966695 1106438 465232 -193169 -133223 635765 1503841 1771643 1154587
42775 1154587 167736 -143505 721241 2043330 2659134 2190608 1126805 60665 -588325
42766 -588325 -488623 203744 637179 250676 -301963 -91081 530228 412644 -516623 -1151934
42756 -1151934 -1022698 -828518 -889849 -514156 506223 1143281 743113 193232 468455
42747 468455 1053963 977099 537800 705221 1404199 1735346 1521696 1356876 1341743 1018735
42737 1018735 480647 340984 546219 369107 -237594 -400436 215457 743753 455896
42728 455896 -102670 -11631 621678 955464 770452 722052 1214808 1673783 1280838 161540
42718 161540 -581647 -119551 1090995 1834288 1558751 868624 561441 672154 741078 606731
42708 606731 507222 630797 951341 1368682 1729704 1860790 1783674 1701375 1648347 1476305
42698 1476305 1279060 1331577 1447880 1070737 321392 178283 1057552 1983138 1906478 1142427
42688 1142427 632828 487086 309588 331402 913963 1373225 766309 -327175 -325460 975994
42678 975994 2024449 1790057 998921 616017 457192 20280 -455046 -576842 -543565 -558986
42668 -558986 -336732 120559 104217 -665933 -1289923 -912856 4434 498967 521404 604456
42658 604456 710547 456052 79501 132517 419464 213554 -553045 -1158938 -1137331 -754646
42648 -754646 -482806 -579389 -1065589 -1550348 -1292011 -82695 1149943 1335701 656701
42639 656701 185724 330540 551916 568564 812509 1457268 1905385 1655366 993196 435395
42629 435395 86485 -76072 126138 644428 933212 624562 122439 32560 278158 295250
42619 295250 -60881 -330592 -176358 142600 176383 -93456 -240251 64880 639773 987145
42609 987145 870887 578533 539224 804581 1069276 1113567 991128 796543 511892 173169
42599 173169 -21781 70622 315984 437247 360340 323312 562371 890653 739382 -177346
42589 -177346 -1282244 -1532762 -532889 1012074 2118061 2502531 2481668 2222411 1597637
42580 1597637 695229 -20413 -172036 184194 722160 1114474 1144011 828915 478544 391263
42570 391263 470240 346469 -129979 -734153 -1143749 -1123741 -537109 464017 1290799 1379299
42560 1379299 871145 454139 441118 426662 16247 -554179 -829663 -800120 -763766 -784658
42550 -784658 -722591 -659720 -819765 -1036920 -749410 257092 1360921 1636976 819650 -436413
42540 -436413 -1222744 -1153739 -506174 190329 572917 604156 520400 594558 786841 670243
42530 670243 -81582 -1127040 -1631636 -1106295 117304 1289719 1859506 1637476 759533
42521 759533 -248223 -704005 -443866 -60280 -151505 -568823 -778028 -702979 -694951 -825025
42511 -825025 -795780 -532932 -281692 -46482 475386 1213381 1533269 1049994 206793 -302678
42501 -302678 -339992 -190003 48369 460880 864337 845155 303181 -381597 -824100 -1026173
42491 -1026173 -1167400 -1216408 -993514 -566538 -300880 -375146 -475302 -261725 26205 -89761
42481 -89761 -407049 -144490 747137 1112058 96960 -1437366 -1942676 -1283001 -692870
42472 -692870 -712315 -459760 658859 1746425 1723154 925536 420618 368397 162396 -166974
42462 -166974 116459 1075659 1684852 1147216 -64562 -877459 -875852 -547536 -566686 -1110685
42452 -1110685 -1748152 -1875881 -1353511 -660693 -293640 -218343 -229123 -552214 -1463655 -2398031
42442 -2398031 -2251234 -867707 443974 398892 -689840 -1381282 -881591 233819 952609
42433 952609 871486 226365 -567543 -1097127 -1027735 -405889 222623 322644 -15329 -231863
42423 -231863 -69399 123589 -40786 -446222 -732882 -809312 -728290 -280836 726568 1816258
42413 1816258 2096400 1392860 557251 288824 201167 -365390 -1052310 -847940 340816
42404 340816 1324190 1096708 58697 -604823 -349632 342651 762255 718150 494447 355551
42394 355551 250680 -6565 -360142 -490889 -257702 51420 115267 12849 -32794 -94451
42384 -94451 -268182 -172321 636383 1785827 2341726 2061592 1683523 1743948 1875767 1664191
42374 1664191 1406645 1421518 1320509 751595 264590 495762 935132 586125 -366008 -681170
42364 -681170 121874 1177414 1697661 1923357 2249435 2363802 1859302 982764 180520
42355 180520 -510512 -1086796 -1203283 -773279 -386873 -485869 -622820 -209974 497815 931506
42345 931506 1241868 1889344 2548136 2465406 1800026 1561125 2118852 2719966 2681891 2190827
42335 2190827 1632739 970483 199045 -290999 -276539 -83141 -27742 -13371 13839 -158270
42325 -158270 -400550 -127031 697602 1171259 779268 414250 1134932 2423324 2808299
42316 2808299 2006933 1264931 1468089 2011238 1905830 1095607 159627 -545828 -831755
42307 -831755 -363722 834232 1885049 1826976 819872 -25014 -47542 295719 314596 86489
42297 86489 184482 726449 1190731 1147242 769887 501624 496261 570575 496537 129993 -567143
42286 -567143 -1353534 -1679972 -1174831 -150612 667073 912552 787373 549200 244184
42277 244184 25064 214081 766957 1099641 815820 270323 16688 12607 -130779 -335863
42267 -335863 -97328 662458 1296141 1155123 292033 -689862 -1240684 -1200883 -757809 -264140
42257 -264140 -43571 -215954 -604535 -829531 -661805 -374487 -486079 -915750 -782912 379013
42247 379013 1553354 1340881 59403 -477933 397555 1154893 462882 -657860 -417823
42238 -417823 980807 1844829 1716751 1765552 2519680 3030037 2664814 2105210 1899662 1469915
42228 1469915 448533 -218693 364233 1430384 1478247 337074 -740160 -805917 -147354
42219 -147354 442159 576485 333306 -128036 -734245 -1300800 -1288806 -169543 1606008
42210 1606008 2488207 1523628 -108233 -363938 926842 1925276 1551616 798732 674590
42201 674590 536826 -301993 -773143 402500 2259665 2565341 936127 -723285 -911113
42192 -911113 -147138 359758 364517 394957 805413 1542238 2338367 2825463 2763358 2244964
42182 2244964 1502929 752931 425944 976707 2018930 2372462 1634769 898722 1047297
42173 1047297 1292895 647551 -130391 221142 1015969 541602 -853411 -954409 763955
42164 763955 2117856 1536128 266534 97088 743820 978385 815565 891606 821187 -39619
42154 -39619 -927549 -485909 1116858 2339125 2317018 1533385 702616 219632 520070 1705626
42144 1705626 2786691 2460526 828264 -602172 -784011 -165311 262777 108988 -427838
42135 -427838 -940881 -907278 -35054 1190851 1820424 1542198 1039640 1060207 1566627 2024864
42125 2024864 2125329 1922709 1523998 945707 232886 -427067 -760062 -639300 -278947
42116 -278947 -58796 -122053 -326862 -573127 -837930 -867867 -333055 546961 1066162 989736
42106 989736 901881 1257600 1672048 1609441 1223451 990299 1016876 1211916 1566366 1751983
42096 1751983 1186022 171155 86148 1445478 2628646 1884000 -66785 -1016521 -431486
42087 -431486 214444 186513 513963 1728030 2486413 1579394 -67690 -666543 83416
42078 83416 1092691 1617240 1723033 1498651 964537 581801 856661 1434946 1385160 487881
42068 487881 -366630 -248150 729592 1568850 1470628 663902 117564 374524 893402 881280
42058 881280 518407 683781 1533436 2205810 2133873 1783072 1691561 1601794 1116731 519368
42048 519368 284314 336788 431613 735708 1352957 1732932 1271664 185969 -790293 -1231376
42038 -1231376 -1055768 -266047 724838 1052994 435243 -235273 -80710 493827 577153 234813
42028 234813 147664 231321 -112213 -595512 -264614 821663 1424257 911506 78049 -177502
42018 -177502 52314 343005 729426 1298122 1756972 1895861 1824584 1438771 442392 -739878
42008 -739878 -981291 63393 1317772 1748362 1672082 1879075 2228458 2056365 1425395
41999 1425395 959457 749819 374046 -153124 -334557 -105103 -49824 -589345 -1466772 -2109011
41989 -2109011 -2105417 -1380312 -294144 492333 621540 409515 311033 258959 -47550 -462306
41979 -462306 -548383 -271418 -14945 -711 -164462 -478802 -905240 -1152819 -995645 -705697
41969 -705697 -657279 -683154 -431873 -169836 -443134 -991938 -878606 128045 1096781 1159057
41959 1159057 504107 -153801 -415297 -131435 787237 1927213 2297455 1373177 -103657
41950 -103657 -931006 -789410 -279888 66218 193014 117113 -205351 -555704 -521850 -42424
41940 -42424 449346 522711 153953 -368849 -691834 -563705 -40101 449378 465743 13922
41930 13922 -532975 -882406 -962989 -731810 -207129 301771 376016 21948 -274543 -176418
41920 -176418 87963 124249 -40799 -22878 393718 1034925 1595485 1910678 1967460 1834823
41910 1834823 1663677 1638494 1807773 1979763 1876561 1430495 894823 636681 848397 1449800
41900 1449800 2136491 2427532 1869154 547148 -613456 -530138 772379 1937963 1762781
41891 1762781 661986 70240 475551 831119 194739 -809385 -858255 161594 962087
41882 962087 548194 -625957 -1380521 -1109039 -96218 956624 1383107 941971 133504
41873 133504 -201110 76037 158346 -489443 -1158721 -820810 308489 975515 580616 -173904
41863 -173904 -410289 -47176 547917 1094189 1279924 850742 203356 190559 903475 1370783
41853 1370783 980624 416470 478992 744140 329296 -602207 -1150787 -1066283 -754449 -256011
41843 -256011 608383 1305140 1075240 322918 245734 981532 1417090 1060278 736592 989540
41833 989540 1155659 710821 272634 393168 465532 -182281 -1060983 -1402142 -1380530 -1396610
41823 -1396610 -1036876 -1420 739296 205361 -726711 -339936 1261457 2106857 1067988
41814 1067988 -808302 -1903773 -1679923 -438555 1301647 2695058 2895738 2057104 1217623
41805 1217623 859905 473059 -160728 -346250 299926 1035228 1140488 1000504 1216323
41796 1216323 1429344 997417 260703 109267 623493 1086551 1156178 1149577 1237509 1173653
41786 1173653 911662 825274 1136155 1583855 1802424 1689468 1337222 887337 495088 221634
41776 221634 -16729 -220933 -144850 422917 1309694 2079277 2406641 2236016 1777232 1456706
41766 1456706 1577908 1876835 1762482 1176791 772473 969465 1350508 1400414 1307453 1453325
41756 1453325 1594900 1301107 862921 936501 1462884 1788746 1786448 1956838 2331979 2202671
41746 2202671 1287937 407913 474240 1307492 1934273 1730377 908814 167286 153146 994739
41736 994739 2084558 2573035 2272779 1767995 1477151 1094023 309320 -404930 -343417 340585
41726 340585 747803 450078 36462 256178 1019025 1553570 1381545 835246 573386 777868
41716 777868 1028125 973593 868893 1184254 1830106 2182251 1932352 1498362 1400231 1606990
41706 1606990 1781872 1821803 1775158 1521679 1001900 551679 481402 456870 -92768 -943773
41696 -943773 -1103385 -84454 1373153 2155780 1933338 1165105 366884 -209590 -452420
41687 -452420 -394835 -237530 -88347 149677 408353 289588 -355988 -964450 -831336 37769
41677 37769 1064886 1837939 2221833 2043850 1367825 885912 1219213 1888677 1855174 1089442
41667 1089442 581528 640718 429560 -301511 -342415 1087772 2654827 2513998 965320
41658 965320 -6794 407228 970170 503900 -557152 -1187112 -1191668 -968084 -694418 -410610
41648 -410610 -296200 -328699 -186929 91855 -42311 -693751 -1049113 -470852 466045 707745
41638 707745 103838 -604796 -860328 -664408 -115385 686363 1310217 1246501 608526 86092
41628 86092 72574 263689 264147 164241 217806 240791 -215392 -1056803 -1410866 -567361 935283
41617 935283 1628348 725760 -946794 -1945655 -1762615 -941010 -47156 744921 1250301
41608 1250301 1298774 1178698 1300788 1431171 1092118 676169 1059278 1964915 2016503 877809
41598 877809 -23415 306471 860303 422186 -291411 149260 1371581 1695913 768381
41589 768381 -72486 -35094 205633 97579 150244 698054 1027685 527980 -226439 -310635
41579 -310635 285615 845501 849862 254954 -615351 -1052422 -406027 1021493 2035653 1906726
41569 1906726 1173224 730947 685499 576204 228457 -168637 -475858 -612189 -454407 -134930
41559 -134930 -105964 -493433 -733502 -318118 415421 780979 806145 1180556 2140791 2950079
41549 2950079 2729643 1552987 457665 359466 1067757 1509852 942705 -281493 -1291815
41540 -1291815 -1705459 -1680846 -1280558 -447672 437862 704469 286519 -107268 42609 465003
41530 465003 705228 784061 911277 1031111 1050198 1120190 1303266 1293927 839333 150678
41520 150678 -393728 -640990 -526257 29532 772706 1118899 886637 593549 618731 586811
41510 586811 142873 -183137 308762 1227021 1460697 764663 87725 159307 574818 664928
41500 664928 565986 802737 1238841 1202445 614250 326946 1072159 2473232 3466979 3483719
41490 3483719 2808318 1897230 883484 -106503 -688966 -686009 -509188 -616680 -829132 -684538
41480 -684538 -276965 -144502 -391689 -543560 -318061 49357 356432 726564 1185824 1499169
41470 1499169 1619583 1762463 1846838 1465605 674982 170774 289050 449058 100319 -333133
41460 -333133 -87485 789667 1624516 2174170 2748745 3349252 3410556 2612598 1468062 792982
41450 792982 803149 1006024 959091 866456 1161200 1611717 1420169 509537 56180 952365
41440 952365 2200498 2012735 431963 -507002 397301 1878980 2185472 1503271 1241282
41431 1241282 1742201 2090866 1801856 1356260 1119981 916797 830168 1383539 2545194
41422 2545194 3328453 2853612 1364430 -137336 -932719 -1006307 -705075 -293524 144829
41413 144829 500108 548625 298817 265326 914944 1856772 2232889 2039144 2236711 3191945
41403 3191945 3924021 3570348 2734139 2441136 2479279 1928290 854012 211383 262658 298126
41393 298126 -90805 -559161 -870801 -1181236 -1392387 -1232732 -1037565 -1373249 -1796039 -1223356
41383 -1223356 175318 807089 -5943 -800618 -69311 1442110 1801121 658833 -401514
41374 -401514 -181527 672898 844218 119784 -561903 -455009 137154 376271 -28885 -502010
41364 -502010 -391989 180432 580092 625218 791805 1323616 1654723 1141253 89853 -457691
41354 -457691 31196 963878 1418770 1259607 1121778 1382946 1592556 1148396 195011 -578223
41344 -578223 -833335 -736190 -314258 618366 1751311 2254465 1857520 1295557 1182707 1082047
41334 1082047 364200 -563109 -752421 -166889 213726 -291200 -1279903 -1830208 -1426939
41325 -1426939 -394163 330206 102167 -541645 -410150 660738 1432795 1073808 383069
41316 383069 378677 683094 548009 558433 1654462 3036775 2943857 1384384 235393 460715
41306 460715 1032116 1010670 943817 1493216 2205137 2493126 2561430 2532690 1862605 492709
41296 492709 -522648 -459715 -20966 -109619 -463915 -446933 -291960 -503478 -723079 -239608
41286 -239608 860862 1915348 2592268 2873358 2681766 2229446 2159715 2644062 2907391
41277 2907391 2309734 1286411 581561 253919 115195 352226 915926 1107408 674034
41268 674034 502485 1214237 1907688 1511382 650910 746251 1739369 2213052 1557861 592670
41258 592670 39139 -292345 -620928 -656674 -256181 239444 543569 634387 421322 -98264
41248 -98264 -447523 -205450 218378 203438 110355 782497 1925157 2225457 1333696 529978
41238 529978 898641 1855944 2193400 1786721 1426933 1444888 1376300 871228 241160 -24423
41228 -24423 135358 422978 637716 835985 1089002 1319104 1482824 1687847 1899529 1789217
41218 1789217 1273635 926557 1203438 1461909 699201 -687961 -1010068 429404 2226175
41209 2226175 2726945 2044976 1403020 1303496 1334914 1166731 735980 -97224 -1170970 -1694510
41199 -1694510 -1106669 127789 1224916 1995806 2396082 1998438 844567 11995 261100
41190 261100 883213 979236 945717 1357068 1408429 243868 -1005366 -602356 885213 1290690
41180 1290690 253832 -420312 82323 492951 61833 -86937 830774 1735414 1590621
41171 1590621 1129098 1370675 1848496 1654063 1070024 834584 736013 207538 -441614 -556284
41161 -556284 -287656 -197033 -233594 1342 429522 682388 696053 578709 371624 305266
41151 305266 630193 927455 510062 -177915 230920 1846666 2857331 1949044 200473
41142 200473 -551142 -210078 -33944 -552764 -1196413 -1484100 -1393093 -882986 -39639 619430
41132 619430 780476 866055 1242717 1485674 1202781 927875 1288143 1877594 1899641 1401537
41122 1401537 960150 674526 393271 413671 992365 1609693 1610614 1128819 590027 -101134
41112 -101134 -1028536 -1603946 -1404491 -1020236 -1100396 -1267912 -996462 -738980 -998887 -1129301
41102 -1129301 -416610 462644 573669 494047 1233186 2133137 1834678 787145 605058
41093 605058 1226959 1078766 72061 -74573 1043174 1556205 394145 -927673 -810254
41084 -810254 116024 604516 959515 1889674 2591133 1890470 454627 35844 923095
41075 923095 1727208 1544976 955050 766297 878153 697097 35289 -677605 -840529 -337938
41065 -337938 215088 198066 -56931 330905 1302460 1643507 702079 -497724 -520460 703253
41055 703253 1994877 2332784 1610205 486407 -53031 490928 1386118 1383826 485970 77513
41045 77513 832906 1656173 1542342 1283955 2021994 3054607 2723634 991786 -501593
41036 -501593 -805940 -561432 -493485 -452841 -224172 -9389 282063 1098296 2176752 2465540
41026 2465540 1619694 623874 368547 499766 318697 -27487 -56258 26506 -280731 -784448
41016 -784448 -867286 -502772 -195156 -25969 470558 1421984 2248932 2373748 1879051 1310347
41006 1310347 1135164 1493394 2198608 2861960 3173327 3091478 2671136 1883090 866687
40997 866687 157630 217233 791576 1196636 1224184 1233974 1302169 964730 102856 -585906
40987 -585906 -523930 -112416 -4324 -405 478321 1139509 1097331 389296 115134 758049
40977 758049 1388369 1103854 397267 330263 988727 1596553 1728578 1582982 1342463 1060592
40967 1060592 998520 1345483 1744543 1758086 1620924 1840776 2265589 2337324 2097830 2059308
40957 2059308 2171114 1882957 1254965 977768 1124611 931131 133217 -510532 -500340 -405871
40947 -405871 -758520 -1021140 -461262 625796 1386276 1590539 1582921 1489582 1240382 1049001
40937 1049001 1158847 1366146 1404492 1494801 1882312 2153384 1738965 880965 366576 406393
40927 406393 451944 97879 -427849 -672834 -359622 572782 1820436 2633540 2388334 1322619
40917 1322619 367848 226795 834902 1604263 1940177 1674848 1232196 1187816 1548035 1823495
40907 1823495 1889767 2115026 2403407 2029562 982243 453564 1058838 1561836 704396
40898 704396 -519687 -149878 1631037 2636010 1928000 901688 674520 444706 -572795
40889 -572795 -1402737 -946929 13464 85062 -453931 -344445 347003 404282 -348398 -809980
40879 -809980 -627745 -766568 -1617118 -2044034 -1111026 393032 1085154 836804 555979
40870 555979 701497 972162 1142601 1285461 1269970 859525 347325 373766 966068 1392191
40860 1392191 1188241 749810 600967 640099 578664 661776 1301631 2219310 2629215 2270120
40850 2270120 1663375 1274817 997970 641535 359375 285034 229163 122927 319744 983176
40840 983176 1549372 1371625 662656 215436 339035 652439 823821 862432 661735 -68837
40830 -68837 -1212132 -2124062 -2347691 -2016144 -1385734 -507081 354090 541217 -199734 -1075247
40820 -1075247 -989983 128835 1225434 1370650 726901 119312 -21167 51832 68242 251083
40810 251083 851712 1432489 1196732 154798 -612987 -251610 760383 1315000 1094941
40801 1094941 626902 240610 -153717 -352198 119397 1105784 1800998 1882330 1865444 2056307
40791 2056307 2037210 1623595 1407669 1695264 1746567 929332 -54055 -72488 781095 1450217
40781 1450217 1500822 1425284 1551739 1685291 1804455 2107134 2259774 1581899 249728 -562736
40771 -562736 -137542 918214 1653616 1921111 2029456 1878912 1169001 172327 -382586
40762 -382586 -199234 254010 362479 56623 -189839 54685 644670 955723 594876 -77602
40752 -77602 -311278 230735 1236663 2175922 2637975 2355414 1351594 139851 -586523
40743 -586523 -563432 -25157 734756 1472123 1767369 1293981 431530 68554 570604 1365704
40733 1365704 1727737 1546360 1163011 896881 914320 1141486 1193318 872896 751013 1515273
40723 1515273 2633487 2644241 1189700 -276239 -502312 -115078 -237263 -400771 612938
40714 612938 2346745 2877487 1601026 188454 187437 1020090 1228780 650000 243801
40705 243801 414396 671238 722280 838537 1054486 913743 362389 211767 1104825 2335300
40695 2335300 2419997 1003593 -395855 -74646 1727287 3137410 3079824 2435517 2359913
40686 2359913 2494360 1883915 911581 834406 1633398 1933817 1277198 865286 1433746 1934242
40676 1934242 1356123 499365 552603 983596 517842 -485242 -494644 604122 1247490 683153
40666 683153 -19421 89926 497425 547216 649251 1170773 1348424 518023 -493201 -507160
40656 -507160 119272 81563 -804280 -1465366 -1342620 -973563 -720028 -194297 659149 1026639
40646 1026639 429745 -336000 -229531 568665 992376 681375 507532 1361143 2848874
40637 2848874 3534380 2462412 264212 -1435065 -1692349 -1050584 -566887 -492538 -376162
40628 -376162 -126958 -209635 -755412 -1190188 -1016659 -463878 -89077 -144841 -563505 -1132325
40618 -1132325 -1427752 -1031599 -151382 389712 166822 -229403 -26698 651560 1094824
40609 1094824 1095602 1033327 946031 278973 -1150493 -2452026 -2418329 -901135 878328 1504536
40599 1504536 770525 -219368 -371839 197241 562566 390799 326014 817072 1245764 802246
40589 802246 -195855 -612627 -12975 842229 1122790 919180 819956 977622 1027383 738775
40579 738775 365599 313285 640666 992448 1035168 893622 992257 1419484 1691908 1343782
40569 1343782 547366 -106523 -270536 -14792 445946 840547 859591 533840 433238 960570
40559 960570 1571085 1358888 432372 -59300 484653 1238956 1134762 322823 -184900 32553
40549 32553 404333 305450 -201557 -615298 -557166 -2003 736018 1178354 1100004 833302
40539 833302 931759 1464027 1839771 1445538 338760 -782924 -1245197 -959987 -349305
40530 -349305 193908 644989 1134693 1599185 1836560 1777713 1437892 728093 -279390 -940044
40520 -940044 -463887 1002833 2197451 2043972 835593 -260194 -575260 -337173 68790
40511 68790 559880 996768 969771 321982 -406069 -453223 285907 1147002 1510992 1489158
40501 1489158 1602767 1950091 2088647 1831159 1694860 2142119 2692449 2445347 1443455
40492 1443455 793332 1199053 2030328 2285227 1955068 1838577 2304765 2864569 2910233 2418402
40482 2418402 1898652 1900142 2481190 3002135 2724440 1859139 1588009 2578122 3902144 4132567
40472 4132567 3238195 2555103 2919027 3695290 3860822 3287542 2608703 2429144 3045672
40463 3045672 4385190 5745137 6057593 4980392 3462738 2730051 2921403 3229459 3187767
40454 3187767 3161941 3513109 3919253 3880108 3492212 3261398 3323909 3345634 3224843 3410136
40444 3410136 4247117 5351402 6035649 6169642 6162081 6194516 6032639 5650786 5433907 5513746
40434 5513746 5468602 5064883 4800499 5223474 6113987 6878102 7406611 7949674 8417579 8457095
40424 8457095 8074696 7613337 7263035 7099144 7291329 7607599 7085575 5147283 2827807
40415 2827807 1760319 1915233 1594688 -1158 -1486637 -1305935 17298 691616 82770
40406 82770 -779445 -898697 -544994 -646153 -1541540 -2588471 -2835727 -2040500 -979185
40397 -979185 -539138 -619073 -445436 54521 15524 -935931 -1881061 -1867449 -1271109 -1099992
40387 -1099992 -1443297 -1518535 -994091 -364512 -35493 205851 680506 1302962 1698434 1531516
40377 1531516 772265 -115822 -484205 -310445 -353956 -1069413 -1791521 -1638689 -848091 -372798
40367 -372798 -357463 12688 1058404 1917868 1664854 462640 -769683 -1344327 -1120248
40358 -1120248 -288044 725948 1386232 1449672 1168714 924947 780108 526359 60322
40349 60322 -450215 -752358 -765808 -581433 -197926 549276 1563719 2182696 1798091 776294
40339 776294 141301 194363 172191 -391905 -792957 -270823 737591 1308447 1401298 1549242
40329 1549242 1651212 1182030 336752 -168576 -319478 -716029 -1323041 -1471780 -1149358
40320 -1149358 -1048595 -1144773 -537918 849510 1697758 1115350 -34072 -423857 44624
40311 44624 678577 1245440 1788841 1885514 1193785 325843 122074 301452 -166156 -1422377
40301 -1422377 -2378871 -2128032 -983042 57917 358337 16481 -393554 -323660 252957
40292 252957 835851 1046965 1093814 1314833 1527167 1270225 567844 4986 58001 663320
40282 663320 1402708 1849573 1827592 1588386 1606602 1933360 1928393 987286 -564770 -1662867
40272 -1662867 -1592673 -657999 220213 394137 10886 -255288 -53478 113784 -499693 -1742628
40262 -1742628 -2508255 -2021107 -727305 388459 900643 954554 662124 101825 -348260
40253 -348260 -312273 26366 179130 122691 362793 1207242 2311516 2967888 2660265 1483667
40243 1483667 254172 -15214 910925 2171542 2722924 2377220 1698030 1191817 980825
40234 980825 985553 986667 725581 344587 449918 1271090 2039794 1770374 484563 -860551
40224 -860551 -1483718 -1298203 -546392 444949 1237031 1585355 1719375 1864967 1730849 1063595
40214 1063595 415120 538310 1172681 1344329 874312 636623 1142280 1777891 1768388 1105051
40204 1105051 194876 -631265 -908021 -176027 1139491 1742812 996192 -186567 -612231
40195 -612231 -359355 -295926 -578428 -572669 -20390 625477 1001672 1204659 1305295 1156964
40185 1156964 799194 491101 234070 -217203 -754980 -855059 -285879 594392 1417058
40176 1417058 2158767 2676235 2472896 1412684 233425 -244531 -162852 -278716 -758128
40167 -758128 -1008114 -685558 -124707 398450 1061281 1798234 1967963 1326583 706828 943932
40157 943932 1620007 1812956 1712276 2311496 3585701 4273181 3736089 2817813 2376338
40148 2376338 2146856 1736074 1584880 2000597 2264907 1838968 1536924 2163054 2784589
40139 2784589 1990571 354509 -189899 702104 1341225 736842 -75477 -34272 338708
40130 338708 261656 161115 667652 1307937 1426964 1480164 2122346 2735267 2209553 759390
40120 759390 -284854 -242524 433872 1190368 1815436 2012069 1567125 914214 644865 562762
40110 562762 96164 -545962 -666631 -412168 -638818 -1369455 -1582607 -824853 105962 506532
40100 506532 698482 1050046 1122441 562505 -43598 -86703 36657 -248798 -501757 385
40090 385 798022 767522 -54870 -424759 176138 721005 214944 -849082 -1278592 -786820
40080 -786820 -86669 247632 305496 344271 367872 298660 199641 174016 208235 206649 131981
40069 131981 87661 222652 479933 529302 154752 -369271 -609757 -637135 -873382 -1188274
40059 -1188274 -781494 615698 1943296 1867696 391577 -1204821 -1893056 -1751066 -1350116
40050 -1350116 -974951 -631991 -305431 52277 454072 663734 371808 -322624 -940125
40041 -940125 -1193217 -1184875 -1027292 -699346 -333484 -178651 -203585 -205177 -324801 -850768
40031 -850768 -1445584 -1323437 -430886 321873 370816 270381 679027 1330250 1627388 1572451
40021 1572451 1405827 968348 216554 -210240 168136 733814 597117 -37182 -288563
40012 -288563 -33920 128876 122459 484573 1253094 1785235 1772432 1546627 1327404 1028227
40002 1028227 833033 1053979 1337105 922146 -159698 -999246 -1064598 -730276 -446385
39993 -446385 -217726 -31803 16615 127910 534853 866434 658481 353235 675106 1158235
39983 1158235 709821 -330150 -345129 995090 2044012 1695663 890854 690236 501916
39974 501916 -509166 -1669189 -1902999 -1453642 -1060471 -476479 654398 1385927 654721
39965 654721 -773440 -1228255 -546589 45098 53468 54757 157370 -158576 -654869 -380825
39955 -380825 715756 1615844 1835170 1882650 1973677 1665094 1033051 846425 1163892 1052485
39945 1052485 215358 -333033 108777 710815 345978 -748154 -1376573 -972656 -89357
39936 -89357 452147 468810 550420 1330409 2484743 2827505 1892176 875553 1096847 2012392
39926 2012392 2051563 1121036 652803 1099969 1191911 221251 -674278 -464350 70469 -166504
39916 -166504 -639886 -195998 861208 1265886 874772 768599 1403182 1941062 1559629
39907 1559629 483169 -464824 -695850 -190989 512071 753812 544993 588474 1079644
39898 1079644 1092509 -53220 -1401017 -1485386 -551150 -306279 -1376868 -2377962 -2031789
39889 -2031789 -998226 -684012 -1091747 -1039253 -155324 590905 532669 417091 1216071 2449558
39879 2449558 2606021 1184896 -474307 -745755 406184 1583698 1692933 951331 218875
39870 218875 -85222 -152318 -232057 -272991 -89798 280298 487875 220950 -377492 -852090
39860 -852090 -1043869 -1206492 -1332297 -863676 415123 1595295 1506814 254427 -841951
39851 -841951 -882164 -274437 131394 104067 -68692 -175910 -182778 -60588 175473 416390
39841 416390 542654 429540 26007 -300898 162955 1517751 2698342 2681183 2003847
39832 2003847 2066069 2970798 3262477 2098247 504166 -117316 250216 697278 832381
39823 832381 953666 1272504 1662554 1892072 1704344 1038489 393093 402917 860421 910733
39813 910733 444782 310732 713851 549529 -877650 -2470577 -2666213 -1391557 227162
39804 227162 1346622 1625087 792144 -748734 -1501626 -425638 1432427 2110005 1273089
39795 1273089 334307 216022 354391 29730 -572633 -991432 -1222661 -1424110 -1547121
39786 -1547121 -1526528 -1351554 -891207 -106572 673598 1173147 1601620 2106330 2206269 1535265
39776 1535265 731450 659350 1091880 1162145 787478 530724 358984 -173739 -689746 -326173
39766 -326173 705467 1297479 1236591 1330506 1603099 1050913 -330002 -979792 -72409 1117803
39756 1117803 1156213 437357 117109 260860 350267 619935 1427861 2021116 1447609 280214
39746 280214 -20608 719927 1213596 715587 -48517 -178016 269973 813803 1318847 1742389
39736 1742389 1760399 1208090 549407 451562 1014590 1686327 1877973 1507658 946741 517764
39726 517764 152619 -358153 -895842 -1072618 -748503 -156979 511097 1226929 1735125 1584539
39716 1584539 843118 304268 559781 1218230 1476304 1183619 893439 1055553 1584759
39707 1584759 2108614 2276933 1903041 1101940 260169 -310320 -627436 -883689 -1201876
39698 -1201876 -1575518 -1806641 -1519601 -622662 235008 198133 -665104 -1325854 -1093489 -354800
39688 -354800 247100 664591 1013066 981838 378050 -225255 -133349 480845 915687 1021907
39678 1021907 1244026 1706814 1937193 1563791 842519 417928 786222 1871806 2941042
39669 2941042 3191876 2628998 1975120 1516125 667057 -860090 -2162362 -2222481 -1412770
39660 -1412770 -1014007 -1450862 -1857586 -1349519 -30108 1248155 1599450 745425 -539839
39651 -539839 -920134 -31116 862781 471353 -727578 -1255216 -758600 -135329 229200
39642 229200 888700 1875996 2291554 1832032 1434831 1739422 2047925 1594893 825759 504587
39632 504587 437580 111163 -127318 327521 1055785 1121635 604776 449521 832497 849987
39622 849987 86164 -542453 -59202 1177385 2015280 2031468 1825272 1907933 1944782 1331890
39612 1331890 142096 -876944 -1133768 -689319 38176 649923 761278 158534 -680831
39603 -680831 -734384 308997 1358638 1258026 457265 320202 943974 1006152 18602 -707623
39593 -707623 -80270 1054075 1283319 739301 573000 1047471 1528684 1884076 2426303
39584 2426303 2727008 2027139 835501 567763 1328661 1589176 611436 -296139 173785
39575 173785 1316231 1615448 995618 570450 762728 983739 884173 719572 552298 135778
39565 135778 -379893 -530692 -374874 -415876 -633350 -417241 398832 1208422 1510028 1411882
39555 1411882 1107955 569739 -45305 -374805 -436524 -542009 -503317 206621 1270167 1518324
39545 1518324 591955 -382803 -443336 -137047 -339967 -665692 -259618 490450 446787 -368415
39535 -368415 -751986 -219647 372324 362919 295251 900716 1909301 2381016 1705648 31521
39525 31521 -1760537 -2408792 -1282151 774100 2228134 2588720 2642453 2961093 3151255
39516 3151255 2842881 2420580 2291385 2260814 2104784 1972162 1817693 1333805 877749 1386389
39506 1386389 2727369 3296892 2191666 691954 417296 990765 949477 186103 -155926
39497 -155926 242259 599882 681630 1084583 1804168 2044699 1698549 1594199 1956233 2001460
39487 2001460 1464732 1127794 1301290 1217469 672481 802851 2117078 3063498 2056149
39478 2056149 30190 -691141 378742 1489837 1426916 1003625 1325975 2000878 2011409
39469 2011409 1449276 1262118 1697398 2068976 2019402 2020920 2348519 2439562 1874538 1304161
39459 1304161 1520711 2044566 1752521 790190 550325 1467645 2234580 1954932 1711438
39450 1711438 2721810 4047252 3869186 2428746 1752057 2528154 3182973 2463087 1227451
39441 1227451 921892 1638360 2525648 3020740 2870025 1910260 614088 -23984 157249
39432 157249 148898 -561943 -1071147 -657501 -186570 -747911 -1789945 -1943539 -1097602 -341100
39422 -341100 -227840 -333794 -317204 -311700 -374422 -441092 -660047 -1003201 -894067 -67947
39412 -67947 624534 260790 -683421 -977050 -444346 -1872 -91734 -250120 -180888 -139615
39402 -139615 -196199 -105373 48287 -24705 -102659 237644 739195 856624 795278 1039852
39392 1039852 1122759 257283 -923883 -876407 429845 1238249 600824 -366023 -491109
39383 -491109 -229638 -342437 -286628 772230 2274699 2856170 2055659 494169 -1048600
39374 -1048600 -1882333 -1432697 -12393 986005 625688 -320251 -532502 -18215 192541
39365 192541 -233227 -644888 -615483 -369143 -80214 298606 529655 300474 -44971 157832
39355 157832 769279 920030 364487 -100353 119747 547920 500951 157365 80438 99279
39345 99279 -484922 -1583763 -2015114 -942929 859576 1819805 1472042 845005 862347
39336 862347 1171980 1027416 586765 526855 863557 1102540 1247124 1618846 1859271 1272973
39326 1272973 179973 -277026 147084 491307 292928 299897 969060 1543980 1365635 928738
39316 928738 795063 569894 -93569 -532559 -187401 280871 106812 -250240 -78845 167886
39306 167886 -255544 -891818 -860562 -430266 -355789 -322193 359399 1104543 862866 121207
39296 121207 198531 797483 312967 -1350314 -2336029 -1618111 -322640 320384 566217
39287 566217 931632 1021262 532697 75549 43625 -146057 -821595 -1220374 -777823 -160089
39277 -160089 -94592 -204167 52512 278075 -13951 -359293 -211803 -42910 -486593 -1086498
39267 -1086498 -1002279 -410435 -143687 -370519 -593504 -593092 -534561 -497636 -592597 -1056173 -1575655
39256 -1575655 -1191515 308627 1594579 1362855 95416 -761540 -778919 -572502 -376885
39247 -376885 107026 698705 817379 515843 400871 618080 865968 1219735 1904231 2435340
39237 2435340 2120007 1322365 1075506 1447479 1496113 945162 645975 1060005 1465372 1176158
39227 1176158 554456 234612 157123 -47782 -370002 -625881 -806644 -815496 -396596 313205
39217 313205 703415 509627 189028 155063 196969 41636 -42282 323932 962099 1320738
39207 1320738 1112058 554947 209289 572924 1445929 1783583 821427 -685741 -1198192
39198 -1198192 -471099 148690 -132695 -338044 505456 1486464 1077510 -348472 -866526
39189 -866526 200980 1382435 1364803 804311 939677 1471101 1158878 62092 -316769
39180 -316769 676526 1728404 1438019 330672 -42740 624802 1302743 1523756 1901991
39171 1901991 2538789 2424068 1183144 128457 440802 1294823 1152372 200977 -62908
39162 -62908 695275 1280191 1098049 1016700 1698167 2518044 2766755 2687736 2595575 2082194
39152 2082194 978285 170227 484027 1454173 2119653 2406309 2740648 2847294 2093670
39143 2093670 823787 267433 1023632 2406182 3389696 3571195 3117166 2359645 1644616
39134 1644616 1187289 913096 651438 468479 573360 974153 1491708 2029219 2556459
39125 2556459 2904683 2859494 2449303 1947041 1591993 1418299 1319802 1232237 1280943 1655725
39115 1655725 2232218 2572346 2603758 2950320 4002222 4968602 4737900 3573245 2894131
39106 2894131 3238488 3586960 3094279 2324941 2120549 2300545 2284940 2046047 1592418 513857
39096 513857 -929948 -1291795 164383 1907616 2026974 1013761 911217 2083814 2797220
39087 2797220 2091657 1136400 1179051 1809691 2072739 1945032 1772490 1324493 417417 -306497
39077 -306497 -171248 509387 974360 1089651 1184800 1285265 1217441 1122263 1200978 1202871 737088
39066 737088 -101710 -877566 -1359303 -1500364 -1128356 -160841 957277 1459642 994797
39057 994797 28312 -502581 -11350 1084603 1664118 1162119 335087 289721 973808 1367870
39047 1367870 1078478 812202 1122619 1645311 1919487 2061795 2168355 1921374 1346596
39038 1346596 1131528 1565604 1974496 1884660 1873809 2406236 2696711 1853950 462622 -235950
39028 -235950 -230334 -443354 -893499 -681171 188389 513821 -177195 -756275 -203889 875590
39018 875590 1227983 644534 -117030 -524485 -581227 -320545 231055 724597 761612 496837
39008 496837 485571 875595 1155642 877113 349741 312175 925229 1412534 984174 -58481
38998 -58481 -630992 -297760 258684 474385 813999 1749416 2546385 2201997 1220099 1087776
38988 1087776 1940195 2185399 947965 -447884 -349392 898661 1664026 1396947 994330
38979 994330 1058291 1088030 600556 18970 -13584 479100 1076963 1633119 2166772 2386768
38969 2386768 1892491 883698 255136 700026 1814189 2387623 1741390 571835 147502
38960 147502 748910 1361937 1042202 91171 -490183 -355809 -111861 -399436 -1157731 -1820541
38950 -1820541 -1895987 -1304495 -406242 262359 459101 430156 518770 748801 1016175 1446512
38940 1446512 2130907 2629481 2283930 1132043 55169 -204555 164694 475234 466330
38931 466330 456047 699552 973209 921941 617478 505685 734736 795017 186081 -628548
38921 -628548 -512754 789024 1935945 1495776 -115200 -1029680 -280675 1119729 1757885
38912 1757885 1625389 1679793 2198202 2494181 2125824 1533277 1311249 1484954 1776184 2088463
38902 2088463 2383646 2450144 2184999 1855055 1696835 1480460 930461 410489 568484 1262076
38892 1262076 1532507 954229 348510 593037 1295922 1490851 1255017 1508180 2251246
38883 2251246 2316741 1308121 512638 969738 1667616 962408 -831621 -1743529 -865834
38874 -865834 627128 1300594 1001879 265802 -586273 -1193693 -1054709 -365343 -121084
38865 -121084 -732390 -1331272 -1109428 -512681 -320081 -344925 -10106 469010 548401 468027
38855 468027 779473 1169580 921761 265301 60076 308323 243203 -130909 72540 983725
38845 983725 1537468 1143043 647506 996130 1864773 2323744 2126038 1655526 1195764 908296
38835 908296 1072331 1747705 2513681 2937704 2963388 2615464 1867389 1080152 927631 1493761
38825 1493761 2060740 2182269 2276363 2694974 2977294 2658500 2092853 1729102 1254904 339928
38815 339928 -374328 -60197 913915 1428293 1219852 1061450 1443971 2008841 2291110 2208538
38805 2208538 1797814 1212008 973071 1492840 2338098 2661684 2314008 1806697 1293137
38796 1293137 495730 -323728 -318107 721848 1911011 2398448 2312055 2291925 2688070 3467507
38786 3467507 4315119 4612189 3961873 2970876 2820310 3765206 4760609 4927501 4646229
38777 4646229 4694152 4990595 4881539 4215488 3468388 3049975 2997407 3163413 3330311 3323329
38767 3323329 3236301 3274454 3281893 2917098 2418303 2483948 3089693 3237944 2411065 1463249
38757 1463249 1343191 1703897 1710717 1521700 1765952 2055006 1450590 268376 -96926 624833
38747 624833 1020284 232333 -578842 -12214 1337074 1695184 664217 -322734 -32829
38738 -32829 1192470 2292609 2766801 2663215 2025746 991171 57569 -344676 -396530
38729 -396530 -536196 -694202 -402630 342969 901638 873153 669401 818813 1085651 852341
38719 852341 225307 86654 853696 1734219 1666372 731714 113835 639318 1798403 2425924
38709 2425924 2059056 1279542 828951 802570 836124 723866 536798 334035 131928 86219
38699 86219 352334 793570 1157606 1463837 1803384 1879864 1368768 701888 686884 1205280
38689 1205280 1254824 659187 598293 1650448 2431782 1453349 -499853 -1393153 -841863
38680 -841863 -281522 -435731 -478862 37231 278888 -168286 -321766 542452 1614009 1910273
38670 1910273 1669287 1357884 586420 -695294 -1138561 226674 2049886 2288419 1185783
38661 1185783 732027 1448975 1752951 739694 -309539 87369 1590184 2836962 3163873
38652 3163873 2715130 1727329 529492 -349993 -729267 -947812 -1093224 -697024 350406
38643 350406 1292190 1499871 1347073 1444555 1580881 1193173 483331 244036 735433 1421188
38633 1421188 1768840 1766423 1671054 1692027 1904025 2130171 1997530 1435151 967261 1115737
38623 1115737 1627895 1744989 1214227 595642 488188 832069 1140124 1142588 992541 971108
38613 971108 1172646 1467869 1687739 1788007 1793787 1634961 1221219 755621 740427 1401853
38603 1401853 2206735 2292751 1459633 440571 -5576 -22525 -325872 -1060427 -1505211 -1116971
38593 -1116971 -391393 -195414 -521237 -565900 -14987 495789 437629 194202 320009 583075
38583 583075 446819 129678 372444 1259080 2030494 2145071 1883818 1763725 1911832 2193575
38573 2193575 2456409 2454939 2002484 1401057 1272700 1737137 2182244 2091464 1675005 1402766
38563 1402766 1334195 1265619 1183252 1183879 1240046 1420246 2046443 3182875 4187249 4266387
38553 4266387 3395545 2276062 1484384 1112790 1156916 1647378 2254798 2353376 1861033 1597493
38543 1597493 2288366 3435730 3770813 2829530 1499565 824995 838533 976543 1138325
38534 1138325 1637517 2326536 2569132 2183679 1732099 1635429 1604139 1274362 864943 770922
38524 770922 922853 971860 763797 294154 -371418 -775219 -236064 1128601 2119234 1884851
38514 1884851 1130654 1098602 1814100 2296922 2127487 1688343 1093497 159920 -544459 20064
38504 20064 1692080 2919931 2756342 1979235 1649762 1615651 1243064 712478 587607 737730
38494 737730 715969 787054 1547977 2707175 3198099 2570001 1525859 929817 841823 724539
38484 724539 211310 -535024 -1037905 -983531 -540720 -142539 70930 354913 809057 1078420
38474 1078420 888251 587924 753384 1356302 1712511 1318534 503478 110510 579041
38465 579041 1464591 1977768 1909579 1714451 1648132 1344770 563273 -201714 -421028 -345263
38455 -345263 -379598 -132705 900585 2050084 2111686 1211100 707554 1082946 1297328 638400
38445 638400 -162493 -305278 -128875 -117558 115089 843361 1282942 807366 268328 809566
38435 809566 1944999 2134179 983990 -308108 -613183 22973 930438 1636147 2014714
38426 2014714 2161140 2214843 2134436 1850603 1671161 1957484 2288424 1781771 508125 -402388
38416 -402388 -417063 -174302 81224 1133947 2977919 3957443 3077581 1738737 1564465
38407 1564465 1866437 1197672 188646 493272 1756490 2163091 1551912 1396590 1832881
38398 1832881 1386913 -61218 -666383 344543 1395859 1231494 705400 832871 1020102
38389 1020102 500851 -119945 -47247 356496 547495 826442 1332837 1325908 553919 62796
38379 62796 525647 1013517 580189 -161807 -266811 -48475 -123910 -184 946766 2061931
38369 2061931 2437058 2472816 2959270 3431314 3000009 2123420 1922116 2251204 2084994 1459698
38359 1459698 1396068 2044439 2483927 2415552 2593236 3316583 3756857 3220250 2169321 1552844
38349 1552844 1687114 2073722 2010535 1348499 773071 1037020 1848657 2212133 2026145 2237564
38339 2237564 2943167 2766547 1122849 -333363 -11448 1097626 1034921 15689 -179477
38330 -179477 667444 1032812 461117 250158 1053658 1909722 2185696 2565706 3387248 3733908
38320 3733908 3059252 2222838 2002736 1888247 1258245 567249 423445 541754 551901 913673
38310 913673 2066914 3403387 3942302 3460974 2363238 1111437 296855 425105 1033565
38301 1033565 908776 -154411 -752884 156096 1604322 1937276 1054094 234955 249881
38292 249881 716406 1043164 1058281 836884 627486 791602 1265453 1379230 744203 -77866
38282 -77866 -364351 -225732 -145329 -13106 549520 1248868 1400884 1002781 716483 849529
38272 849529 1081857 1184220 1315950 1546100 1683895 1712060 1905561 2367053 2782028 2755458
38262 2755458 2202391 1411422 862574 869447 1257032 1544357 1516408 1337699 1064960 540838
38252 540838 -55896 -158289 328926 700487 463893 128072 384133 998550 1235890 996621
38242 996621 751040 596497 202675 -382964 -642972 -381559 3005 158887 210200 413323
38232 413323 738950 919873 738537 280410 -32954 100588 286383 -222525 -1322932
38223 -1322932 -1766665 -619918 1398443 2659214 2414004 1276910 235875 -173078 49506
38214 49506 452393 456844 111641 238612 1269252 2359652 2423214 1656019 1118929 1117432
38204 1117432 1082634 908793 1176007 1894558 2211921 1766633 1324181 1563083 2089902 2214063
38194 2214063 1958389 1713531 1517189 1262441 1084032 983216 588923 -124805 -395758
38185 -395758 344573 1420219 1624305 823940 109641 316670 1052601 1406925 1144769
38176 1144769 848568 1074936 1671224 1957340 1479156 524447 -124015 53458 808031
38167 808031 1357489 1132757 348035 -185780 77480 786620 1141718 939511 759926 987562
38157 987562 1186017 851535 323276 319750 830490 1144885 902558 489875 376002 612601
38147 612601 1045688 1501838 1664145 1232120 361577 -380060 -588371 -341325 -19952 -17684
38137 -17684 -387538 -511380 449164 2317285 3661191 3510558 2769319 2911261 3711963
38128 3711963 3600751 2134361 651079 218388 334123 196161 -8130 152099 334832
38119 334832 22597 -557645 -815582 -527213 287313 1504148 2475065 2331970 1279793
38110 1279793 712970 1409308 2499916 2908461 2797049 2714998 2395486 1605395 1274875
38101 1274875 2309509 3858169 4275680 3503231 3021221 3544929 4223032 4274196 4078168
38092 4078168 4248060 4719700 5269133 6071371 7178725 8030206 7997960 7120960 6018976
38083 6018976 5318198 5275598 5705513 6162252 6308575 6086841 5576269 5006552 4886295 5506988
38073 5506988 6212694 5987883 5020834 4609366 5024275 4815736 3209045 1781188 2231507
38064 2231507 3659799 3978432 3169095 2915025 3476910 3391843 2308403 1640331 1896191
38055 1896191 1725255 528854 -150913 881838 2441073 2867569 2459677 2458491 2856058
38046 2856058 2837082 2482803 2467624 2700010 2636026 2388629 2299205 2003860 1168055 569881
38036 569881 1135032 2347557 2924775 2707245 2591050 2894262 3117468 3132269 3285701 3408549
38026 3408549 3018158 2504351 2797404 3721599 3984684 3110725 2141535 1944957 1985984 1472247
38016 1472247 768747 798329 1620916 2438166 2723481 2689768 2753063 3010766 3242119 3159512
38006 3159512 2677479 2055763 1721645 1916460 2572217 3422353 4070888 4133290 3605596 2959729
37996 2959729 2560148 2155211 1340551 361332 -62620 315949 988803 1406885 1545500
37987 1545500 1665951 1890159 2156973 2378082 2580622 3015982 3974611 5267841 6137565
37978 6137565 6059276 5433892 5043310 5005803 4803378 4239137 3772062 3839347 4326545 4798828
37968 4798828 4885859 4430151 3644234 3121983 3313134 3995095 4604482 4974334 5301260 5513419
37958 5513419 5260143 4559120 3907012 3632663 3585701 3548719 3529591 3568426 3660168 3922394
37948 3922394 4437927 4905650 4880932 4404802 3969284 3836596 3844494 3892563 4085808 4306773
37938 4306773 4201640 3798712 3664615 4179769 5009312 5517439 5422670 4884493 4234783 3806924
37928 3806924 3814808 4230637 4841266 5392063 5604924 5289080 4675081 4374094 4653652 5004221
37918 5004221 4820840 4231329 3781516 3624788 3621330 3942144 4841354 5989820 6757244 7063147
37908 7063147 7287944 7485588 7388150 7047110 6750152 6460104 6037227 5739386 5727200 5514744
37898 5514744 4903997 4901287 6319280 7934273 7809978 6283235 5597445 6386968 6782265
37889 6782265 5694934 4692688 5330970 6650767 7005058 6708434 6982011 7597308 7601704
37880 7601704 7394599 8003242 8982883 9093673 8601253 8843994 9745372 9823074 8737439
37871 8737439 7887907 8199446 9101375 10060467 11329871 12577286 12505559 10798735 9070629
37862 9070629 8828848 9580328 9993013 9993137 10523387 11812514 13060065 13660605 13845028 14086658
37852 14086658 14478643 14813534 14975184 15154572 15675672 16521239 17204536 17431403 17676907
37843 17676907 18574831 19894054 20802659 21088651 21349982 21935215 22533383 22984417 23652714
37834 23652714 24708491 25832224 26968300 28584886 30778692 32892294 34521431 36217109
37826 36217109 38681330 41934153 45808479 50566269 56341499 62547699 68551408 74477516
37818 74477516 80714643 87142724 93576871 100456729 108171322 116000923 122682779 127957415
37810 127957415 132726810 137676507 142532963 146830372 150731947 154805874 159396719 164394297
37802 164394297 169335614 173714805 177508772 181353810 185862095 190877684 195838799 200731441
37794 200731441 206071779 211928055 217639206 222759750 227726541 233189253 239042094 244539776
37786 244539776 249198310 253259614 257379415 262123274 267701432 273958993 280588644 287423860
37778 287423860 294477840 301688046 308848759 316024095 323944670 333713356 345966838 360347301
37770 360347301 375740401 390738658 403515322 411216737 410040016 396838930 371361798
37763 371361798 337033767 299290219 262845178 230151124 201746634 177329260 156360457
37756 156360457 138185818 122150678 107760015 94725892 83010199 72894200 64727780
37749 64727780 58308112 52656649 46801636 40795538 35598522 31858605 29145214 26547239
37741 26547239 23690010 20909515 18712956 17367071 16752117 16274656 15190040 13442009
37733 13442009 11941689 11490921 11626156 11156036 9723675 8116469 7063724 6569482 6556580
37724 6556580 7212606 8271144 8794024 8276036 7328359 6699199 6249604 5514919 4639577
37715 4639577 4026749 3632742 3370193 3617568 4434849 4832366 3891392 2229008 1250159
37706 1250159 1240597 1356136 1269067 1510802 2170246 2565789 2467579 2503993 3027677 3574780
37696 3574780 3735516 3618701 3253576 2557851 2102014 2753464 4223956 5113210 4780584
37687 4780584 4009530 3438685 2692372 1650955 1133068 1429297 1499121 675806 -82952
37678 -82952 179644 759255 628177 327438 917533 1889458 1842931 720485 -250765 -459776
37668 -459776 -253454 208496 884019 1002867 -63887 -1351590 -1404704 -604774 -559553 -1294894
37658 -1294894 -1167528 180891 1005895 324243 -462242 82390 1207464 1443925 873247
37649 873247 480118 323318 -183969 -911170 -1247883 -1199780 -1190965 -1250343 -1240052 -1281944 -1170140
37638 -1170140 -166467 1686933 2940419 2576449 1644721 1714177 2432604 2230469 976252
37629 976252 143558 386636 670585 131839 -674723 -900172 -573295 -100720 405279 769292
37619 769292 588741 -62490 -504144 -440330 -356055 -558294 -612559 -185013 334758 603821
37609 603821 1009257 1938710 2937184 3256506 2834071 2147503 1473270 854547 493441 620173
37599 620173 1142306 1787848 2360201 2582712 2085117 930973 -184081 -640019 -503096
37590 -503096 -177226 102020 125189 -352603 -1060862 -1183249 -476005 131072 -234300 -1051409
37580 -1051409 -1145948 -374622 389165 735158 1153182 1944785 2604950 2511591 1590014 178375
37570 178375 -1182836 -1812391 -1396674 -508372 -37521 -121654 -240770 -220129 -323181 -449032
37560 -449032 -228533 33095 -409585 -1370238 -1741293 -1249850 -1015167 -1754777 -2584376 -2429663
37550 -2429663 -1613203 -1068322 -871237 -638597 -596303 -1024323 -1247434 -497086 618588
37541 618588 817399 67732 -472654 -274574 132267 484107 1110659 1766039 1559972 498912
37531 498912 -179103 218599 874906 898093 581927 449302 140646 -697878 -1313634 -858867
37521 -858867 111080 417579 131012 317930 1064247 1188025 210909 -688819 -379705 533633
37511 533633 625877 -335850 -1260360 -1355520 -918202 -442275 145977 934686 1402797 1040908
37501 1040908 250947 -93509 143293 319897 202450 356639 1054731 1595179 1320829
37492 1320829 716824 727562 1348254 1699810 1324616 631747 102227 -209225 -293151 66174
37482 66174 975069 2221403 3367153 3783896 2965667 1356371 404799 938148 1871051
37473 1871051 1623505 497143 203539 1087476 1576502 864035 328998 1211908 2429064
37464 2429064 2246985 1056955 696411 1547337 2126878 1557417 787021 880232 1384783
37455 1384783 1189487 223697 -552923 -547646 -182542 -70089 -91249 242569 690083 292632
37445 292632 -1113072 -2114275 -1406037 175013 615057 -362578 -949106 -183458 565454
37436 565454 47783 -648381 26737 1266554 1021281 -737914 -1992942 -1778634 -1297699
37427 -1297699 -1653631 -2257871 -2127658 -1369634 -642459 -189682 -34293 -271440 -660948
37418 -660948 -697984 -450540 -531422 -978518 -1103346 -774676 -810938 -1608891 -2398800 -2474855
37408 -2474855 -2204286 -2110514 -1889863 -1192423 -532215 -421064 -310547 467067 1248004 832866
37398 832866 -491327 -1077878 -221032 921966 1190842 1092966 1719147 2728975 2644338
37389 2644338 1053993 -645083 -1132792 -862147 -1078352 -1788418 -1834018 -799062 360554
37380 360554 782643 645727 254901 -598901 -1643981 -1709884 -424688 699114 275141
37371 275141 -693614 -240164 1428488 2147478 1040067 -420790 -901796 -881247 -1157932
37362 -1157932 -1358020 -911305 -240964 20260 30558 140679 222082 295778 819241 1604634
37352 1604634 1534213 232544 -1042058 -1169854 -781758 -940987 -1227897 -600593 554457
37343 554457 853012 108600 -399424 110451 933355 1070228 474226 -145492 -139431 586832
37333 586832 1470082 1753702 1364928 1005816 1051685 975266 417135 74840 629633 1413497
37323 1413497 1269561 381145 81195 928336 1991916 2117914 1134892 -201751 -835595
37314 -835595 -114515 1513031 2712904 2725860 2220086 2091047 2066286 1439109 564931 394072
37304 394072 897715 1244472 1305088 1665350 2263223 2360013 1893228 1573126 1570413 1385539
37294 1385539 1087271 1312033 1881883 1873775 1335825 1402405 2252552 2553259 1649392 741426
37284 741426 884651 1252944 673021 -298320 -315916 554282 1089009 877700 612205 627004
37274 627004 454244 -125563 -639563 -672198 -280463 397321 1244664 1830073 1632820 758601
37264 758601 -33287 -121304 452031 1171101 1460440 1056015 288823 -158786 -36254 203344
37254 203344 162379 88632 300210 507353 298268 -103672 -252966 -326083 -788478 -1434354
37244 -1434354 -1569028 -1067152 -466866 -33739 453248 906518 790837 82542 -376004
37235 -376004 74564 1045863 1701876 1766107 1516501 1186581 837601 543311 295067 -22733
37225 -22733 -215264 293729 1595524 2679715 2401266 970561 -266166 -585923 -598914
37216 -598914 -919362 -1049615 -336022 642374 720768 -61235 -456144 85461 604344 172934
37206 172934 -716267 -1008143 -585571 -75375 274295 574246 557815 -55663 -605903 -16298
37196 -16298 1561649 2595565 2007119 400054 -893050 -1295236 -1087750 -614370 67191
37187 67191 980413 1980360 2595392 2228264 936649 -177025 -80054 761742 960069 216767
37177 216767 -360419 -164909 35773 -259098 -174982 905991 1790072 1029175 -740166
37168 -740166 -1612153 -1132644 -580036 -684927 -744431 -229549 286936 351347 473336 1064767
37158 1064767 1613685 1638749 1501055 1474636 921364 -615812 -2208126 -2574191 -1919671
37149 -1919671 -1598693 -2066352 -2285563 -1368175 131860 1015481 908970 423141 176857
37140 176857 151083 -31215 -496845 -932389 -982905 -741399 -637757 -775882 -691806 -58097
37130 -58097 655531 736160 341802 433171 1406965 2346123 2053824 541713 -937857 -1231794
37120 -1231794 -330969 855552 1463845 1372866 1111505 1121740 1150825 583965 -577208 -1466842
37110 -1466842 -1381655 -696878 -299724 -412214 -600892 -746406 -1157771 -1656990 -1473489 -461815
37100 -461815 353905 62698 -896141 -1461851 -1437056 -1452216 -1772320 -2015766 -1960317 -1793651
37090 -1793651 -1515145 -866063 -19719 364471 42283 -443674 -568014 -466982 -479104 -546844
37080 -546844 -474693 -421349 -727080 -1430575 -2204944 -2622176 -2395360 -1621586 -839305 -502351
37070 -502351 -363980 157550 936941 1097568 307481 -484480 -148439 1135818 2024773
37061 2024773 1529806 32102 -1159463 -1084520 -72132 552022 -98216 -1418257 -2099751
37052 -2099751 -1807211 -1334836 -1099383 -533161 574073 1176535 319788 -1304629 -2170009
37043 -2170009 -1880535 -1335162 -1151996 -942312 -215070 831202 1646368 1913151 1640081
37034 1640081 1061715 504027 72051 -432166 -1042487 -1378074 -1208008 -874298 -696636
37025 -696636 -429413 84029 242940 -499241 -1592923 -2112116 -2147342 -2409445 -2765652 -2460300
37015 -2460300 -1668170 -1390542 -1665895 -1371087 -208132 589209 213280 -427016 -274646
37006 -274646 255588 314511 183889 520218 901917 544154 -139854 -119519 520194 834560
36996 834560 703905 785064 942502 335946 -816259 -1207331 -575323 -251760 -906168 -1340142
36986 -1340142 -577331 312544 -56790 -983080 -790679 352392 713670 -105346 -577128
36977 -577128 120551 798932 387992 -305667 -162852 287945 -35888 -720087 -610791 -20461
36967 -20461 -309848 -1416200 -1719791 -721497 -18133 -771688 -1790937 -1387274 36369
36958 36369 737217 232066 -419906 -603639 -860435 -1517239 -1985336 -1861053 -1657048 -1876473
36948 -1876473 -2173048 -2025730 -1603700 -1315150 -966377 -85649 1095400 1613634 844201
36939 844201 -690853 -1695045 -1249765 323211 1724337 1921998 1109023 255765 -117208
36930 -117208 -285635 -500403 -473774 14280 536573 575985 373265 636127 1453549 2035320
36920 2035320 1704375 779833 185523 354535 832082 958605 656335 385680 525877
36911 525877 1039274 1621163 1894096 1558910 736609 97195 141169 343325 -301343 -1668297
36901 -1668297 -2259671 -1127236 684467 1431309 871254 224617 304179 767632 1113240
36892 1113240 1317398 1346476 997099 450340 157450 10927 -485927 -1043994 -625651 914911
36882 914911 2222760 2128328 1150033 597227 816507 1098229 881425 316388 -151610 -247210
36872 -247210 -76179 -100686 -572925 -925030 -354980 843660 1400285 835120 131401 137166
36862 137166 371026 181986 4655 387620 734907 327915 -161163 342555 1344234
36853 1344234 1387933 397441 -182621 394012 1316878 1774817 1952146 2105126 1929320 1344023
36843 1344023 836162 589844 285557 107909 786705 2122899 2659271 1572125 -105469
36834 -105469 -943144 -888711 -732910 -650674 -306359 167114 305111 106247 -75969 -106739
36824 -106739 70319 654967 1417227 1495988 584127 -250179 124801 1259747 1849543 1683868
36814 1683868 1619308 1803031 1347270 24543 -973248 -549598 891095 2103392 2398244
36805 2398244 1913011 1115209 563465 678613 1250437 1523780 1152822 693270 795304
36796 795304 1332717 1756849 1914755 2008168 2048422 1904287 1710174 1707668 1784248 1647671
36786 1647671 1395472 1434928 1828293 2168896 2188880 2086581 2119965 2241737 2330569 2469979
36776 2469979 2727019 2853795 2508981 1742101 1070284 1048277 1787988 2805617 3307035
36767 3307035 2813228 1662875 780660 793972 1470487 2137807 2464353 2602505 2766024
36758 2766024 3042149 3512814 4087808 4202356 3249460 1565823 486045 976079 2519296
36749 2519296 3761048 3941283 3221706 1985267 599605 -261254 -9748 876813 1072760
36740 1072760 74123 -990246 -828204 248698 826325 402261 -14832 531438 1568785
36731 1568785 1894185 1235689 581423 822026 1562108 1658465 785608 -36743 277467 1440992
36721 1440992 2133203 1651119 620646 -38376 -234929 -450996 -856754 -1173243 -1164002 -873267
36711 -873267 -556315 -595238 -1148160 -1667472 -1310135 -209576 339272 -377498 -1257962 -882241
36701 -882241 302355 595456 -391948 -1264467 -1085470 -594553 -645921 -812126 -415745 188871
36691 188871 424457 660065 1372794 1847846 1073493 -435937 -1070037 -317590 688980
36682 688980 931452 660520 488715 363739 -4105 -416782 -480443 -205587 98104 213398
36672 213398 50861 -363697 -739326 -725724 -450780 -462501 -936746 -1343268 -1152952 -525041
36662 -525041 -6631 175698 230160 356851 411967 3903 -1060090 -2361729 -3112162 -3019341
36652 -3019341 -2610457 -2327714 -1751568 -426671 916875 1015427 -106326 -1084947 -1178297
36643 -1178297 -1120016 -1589313 -1996842 -1546241 -528932 341110 1075700 1912106 2368460
36634 2368460 1935043 1229157 1278101 1909000 1998920 1233014 505314 488988 813228 882615
36624 882615 670721 421256 233648 193079 372937 559907 459638 204649 151505 242903
36614 242903 168596 53286 278866 715185 926299 1065250 1623266 2278356 2096076 1116537
36604 1116537 608005 1247467 2071428 1888386 855253 -78185 -517644 -615726 -382243
36595 -382243 110013 306628 -177831 -817825 -860339 -468893 -427380 -902376 -1231585 -875065
36585 -875065 -503 805221 968270 272463 -773535 -1173680 -533757 385353 701594
36576 701594 572271 632473 713750 124214 -934445 -1317285 -528763 536591 847920 523536
36566 523536 354903 552026 557928 -74450 -1091357 -1850523 -1980691 -1654047 -1283322 -1053606
36556 -1053606 -848733 -564848 -233605 189662 786272 1286479 1188973 565155 238386 673105
36546 673105 1153601 747767 -255166 -695849 -197854 395237 316449 -207707 -610063 -841948
36536 -841948 -1113259 -1259171 -950768 -401939 -369239 -1246814 -2351109 -2464962 -1288775
36527 -1288775 -23120 40695 -684779 -619239 526474 1072199 -112242 -1628454 -1450122
36518 -1450122 43694 685311 -173109 -890411 -296555 634469 611834 -25651 -256314
36509 -256314 -107992 -248390 -617121 -622684 -247452 19735 37292 -4348 -144177 -467353
36499 -467353 -654546 -407850 -56636 -70102 -217126 106639 888325 1487408 1543176 1352383
36489 1352383 1359550 1637987 1806501 1272922 -147291 -1666002 -2074652 -1188289 -166016
36480 -166016 16021 -290002 -351836 -311928 -573341 -667106 39857 961577 967446 245481
36470 245481 99207 843241 1330316 913046 504540 1026207 1955568 2288622 2066750 1981795
36460 1981795 2077738 1843964 1273230 909955 932855 925158 587921 127348 -125599 -68115
36450 -68115 230550 603500 806046 755063 726939 1034805 1519650 1634346 1077467 162846
36440 162846 -457515 -323382 505106 1478235 1972587 1841687 1504787 1369555 1319001 1005392
36430 1005392 502172 263957 419966 556238 434622 542255 1469362 2907625 3810265
36421 3810265 3633475 2945276 2593770 2729062 3004459 3305546 3696979 3915888 3613759
36412 3613759 3018663 2657235 2429527 1753903 744060 325930 830720 1390211 1288981
36403 1288981 1005506 1120284 1078746 171251 -916026 -902563 43575 482399 -98246 -657454
36393 -657454 -396691 180754 473205 776401 1379675 1769710 1590174 1461914 1881689 2106720
36383 2106720 1276309 80479 37510 1296747 2345795 2009703 763034 -185477 -290501
36374 -290501 201035 861683 1350511 1435752 1158630 835016 699830 686212 643346 578165
36364 578165 575413 637941 695967 655057 396702 -126985 -744974 -1142715 -1179591 -1074042 -1173964
36353 -1173964 -1512373 -1675535 -1268613 -506149 -56626 -153603 -235949 164963 593064 384366
36343 384366 -87980 157860 1064493 1433832 784692 162948 441615 871294 298518 -992957
36333 -992957 -1784272 -1664232 -1107424 -322571 660817 1090765 150129 -1498164 -2227053
36324 -2227053 -1651237 -955393 -829800 -635753 -126057 -323379 -1650003 -2612196 -1779042
36315 -1779042 -66270 545450 -58442 -181846 884466 1833563 1461678 372044 -195261
36306 -195261 -208606 -525860 -1255804 -1497727 -781112 51135 -81449 -891486 -923531 470419
36296 470419 2065746 2341241 1614956 1505609 2369348 2672183 1394028 -332221 -984417
36287 -984417 -861153 -1102494 -1399875 -538946 1077420 1415371 -322148 -2433937 -2947995
36278 -2947995 -1806292 -195316 1037045 1478861 827414 -468370 -1064941 -278517 826019
36269 826019 857210 44561 -224715 638004 1926641 2770227 2811564 2027970 806229 5584
36259 5584 84519 359973 -44840 -817982 -984240 -517417 -273186 -447250 -370366 81660
36249 81660 185996 -209230 -234245 509409 1161510 991527 551872 653016 1087987 1270261
36239 1270261 1367136 1792064 2155979 1790034 959662 560371 809251 1138900 1238805 1313080
36229 1313080 1356970 1045065 436321 54974 112933 237791 83485 -310064 -800168 -1222916
36219 -1222916 -1164694 -295460 918566 1446600 900342 20569 -298649 -25788 243731
36210 243731 122592 -315841 -811444 -1078389 -878306 -270183 274667 258103 -319379 -939112
36200 -939112 -1098741 -821472 -579504 -672527 -794813 -453433 230445 552960 190601 -354442
36190 -354442 -574449 -696448 -1094011 -1455210 -1277179 -853625 -892952 -1294959 -1233362 -492167
36180 -492167 205453 392482 484569 869434 1190771 1011173 509128 32406 -429639 -845943
36170 -845943 -832975 -300645 154411 98282 -39914 213867 396881 -202519 -1245368 -1685415
36160 -1685415 -1278251 -811872 -773916 -697809 -143772 429134 303952 -432274 -1038407 -1165912
36150 -1165912 -1237879 -1669316 -2073017 -1634843 -293689 870155 802135 -196011 -855193
36141 -855193 -603266 -129023 -99742 -139738 345951 1009931 1067098 576891 320034 536238
36131 536238 659496 360965 46109 94681 286741 309077 302754 530631 859267 929496
36121 929496 655146 316524 264104 620813 1170365 1556600 1709444 1908062 2207685 2112835
36111 2112835 1289318 350351 262897 1038015 1732346 1811134 1727414 1910817 1980528 1458127
36101 1458127 651999 240740 374428 715961 1051493 1371352 1625634 1846740 2226965
36092 2226965 2653050 2551061 1756442 1153843 1679412 2886826 3369892 2629094 1651170
36083 1651170 1419518 1707090 1832214 1891488 2480743 3541670 4249055 4017947 3079303
36074 3079303 2040596 1345516 1217923 1659305 2294661 2561895 2306038 1993473 2152743
36065 2152743 2747706 3228584 3064592 2176086 1063360 554452 1076923 2021966 2238399
36056 2238399 1456572 790249 1332327 2627129 3249834 2718366 1967055 1819228 1877409
36047 1877409 1381708 485896 11009 262111 690258 626563 -41302 -830805 -1044741 -364608
36037 -364608 713497 1272921 1004978 509618 360266 382273 271497 356456 1036822 1859887
36027 1859887 2013811 1573698 1382550 1684253 1755136 1117941 330347 145042 471211 671615
36017 671615 535463 479091 905698 1671708 2174877 1904097 991459 165604 -33566 116022
36007 116022 -40860 -610350 -1078063 -1074730 -732863 -324078 -85129 -402756 -1496455 -2713910
35997 -2713910 -2796797 -1286203 734411 1702969 1146856 -81411 -878631 -901437 -631724
35988 -631724 -656815 -937759 -914318 -411963 -48935 -307340 -609179 -108307 816504 901598
35978 901598 -58457 -715024 -78593 1056690 1328673 680621 133432 178606 336162 142406
35968 142406 -230996 -402237 -263645 71434 458279 770561 944016 1005124 1028750 1132295
35958 1132295 1406135 1639539 1326893 363427 -497991 -498704 27522 198826 21122 223318
35948 223318 763435 860251 664535 1294348 2685005 3148621 2053927 1210713 2117494
35939 2117494 3382145 2808268 866434 -146485 327450 769276 526143 645206 1521364
35930 1521364 1994755 1472168 1003631 1388605 1898633 1828973 1769895 2223148 2317961 1207787
35920 1207787 -286925 -755083 -174221 423809 691814 1117056 1716802 1747950 808806
35911 808806 -517332 -1259961 -949269 24893 736451 630432 197325 327285 983527
35902 983527 1244257 818909 583890 1167809 1936291 2038501 1619295 1218162 754374 40458
35892 40458 -355710 178861 1153639 1536623 1166894 694541 408923 82310 -228954 -201869
35882 -201869 20236 22693 4648 552562 1476429 1797492 1150019 426725 658948 1775897
35872 1775897 2785209 2827413 1870447 660678 82158 332846 777872 819473 631568
35863 631568 641867 669273 268899 -287392 -219770 536800 1110990 897903 314582 86724
35853 86724 349634 764335 1055386 1108333 896255 609479 592338 922481 1267060 1297879
35843 1297879 1027727 645134 263501 -77373 -382655 -720286 -1060894 -1146327 -801249 -310247
35833 -310247 -123555 -226613 -222227 -50829 -155245 -799500 -1642477 -2173231 -2227883 -1911818
35823 -1911818 -1366797 -848880 -728743 -1087608 -1447917 -1195160 -288870 609875 832906
35814 832906 519120 564842 1548394 2829177 3163856 2276691 1230873 933778 895157 69916
35804 69916 -1528320 -2805470 -2933490 -2026300 -683657 416307 645579 -54067 -821116
35795 -821116 -749116 -19301 541028 779110 1140847 1489366 1252407 795070 1236195 2520476
35785 2520476 3104943 2266656 1355923 1725208 2619288 2482091 1468281 1066617 1666961
35776 1666961 2105347 1630116 904730 742299 971746 1030714 856025 694283 598773 525688
35766 525688 539964 651272 745764 800137 857845 802906 558835 465828 950211 1809061 2362709
35755 2362709 2347606 2063366 1590229 627015 -616740 -1152070 -425884 721190 1005995
35746 1005995 351161 -83447 528126 1662382 2176564 1675401 856228 585869 883779
35737 883779 996172 444159 -304871 -469028 -24243 329210 219049 36197 165924 394026
35727 394026 443193 531531 815690 727849 -328675 -1794681 -2333612 -1529688 -462300 -301604
35717 -301604 -991431 -1724373 -2083451 -2094007 -1651886 -748405 -50869 -340606 -1275568 -1567443
35707 -1567443 -723091 164950 -60666 -943046 -1088547 -190693 621162 543935 242026 680049
35697 680049 1492881 1405668 133887 -1017971 -806168 304730 786835 108924 -630340
35688 -630340 -326930 609019 995998 678673 630335 1268777 1681950 999382 -252299 -888014
35678 -888014 -646277 -222519 -26166 213705 647775 937290 853920 619290 469374 411955
35668 411955 538882 1007975 1543485 1538709 920977 401206 562883 1130541 1403864 1021638
35658 1021638 102848 -917191 -1404819 -996170 -163038 222976 64865 98090 552233
35649 552233 661649 18708 -542345 -257791 187374 -309660 -1442790 -1944647 -1538992
35640 -1538992 -1136839 -1150098 -957111 -301011 48819 -393740 -881474 -540842 320369 827343
35630 827343 940222 1357534 2226854 2787978 2430973 1515591 832923 593969 370667 -4131
35620 -4131 50328 1065055 2457165 2912015 2003478 799750 423526 612830 415621 -179345
35610 -179345 -302391 282238 796707 734051 543730 681925 832354 581784 194722 144154
35600 144154 365658 510341 549594 645971 746936 738707 733231 857996 1046594 1305482 1794884
35589 1794884 2326940 2243311 1254777 46166 -437947 -52225 607922 1033822 1144130
35580 1144130 1052569 924441 896997 863020 598152 300919 511040 1150385 1269108 332185
35570 332185 -832844 -1163575 -940019 -1230450 -2043027 -2199461 -1162514 72208 322671
35561 322671 -315366 -842466 -668976 -78579 319806 236600 -77674 -107664 346496 948191
35551 948191 1352072 1659398 1949097 1742598 676350 -518088 -654723 248372 918081
35542 918081 632161 67015 -39333 -6797 -318938 -584854 -362976 -273797 -1116005 -2303966
35532 -2303966 -2438935 -1346717 -361734 -411289 -889242 -825908 -252720 189742 304215 298294
35522 298294 157213 -208339 -420862 33569 930099 1379614 953631 249639 37839 200708
35512 200708 -42393 -982644 -1965042 -2216251 -1774018 -1295793 -1145054 -1063532 -729871 -224319
35502 -224319 227143 620465 1001797 1197636 1093394 1007568 1321284 1766177 1606289 701635
35492 701635 -97477 7640 681395 931216 487608 62982 144142 217361 -328317 -1019085
35482 -1019085 -799615 362455 1198706 785321 -193036 -406801 322529 945174 749976
35473 749976 177250 -102126 -144703 -301273 -405642 -78501 440701 497913 55130 -161126
35463 -161126 234168 608087 199707 -668984 -892998 -79582 842424 793305 -89857 -728672
35453 -728672 -537164 30735 418260 765590 1363152 1859124 1712157 1167793 983160 1188921
35443 1188921 957281 -39300 -906273 -679437 348029 1056864 916604 381153 90734
35434 90734 248904 698941 1124232 1183204 802255 290881 -73202 -365127 -652046 -693814
35424 -693814 -460439 -508014 -1124279 -1450201 -419503 1507004 2591536 2013061 853002
35415 853002 513066 1040684 1580224 1706684 1579100 1314082 960209 771889 894650 1052460
35405 1052460 1027847 1057034 1226041 986831 11240 -919230 -796591 103737 580057 262488
35395 262488 -25089 274593 708558 818897 854252 984762 768797 94529 -202892 429695
35385 429695 1104367 685834 -266332 -53120 1641739 3060859 2670666 1125020 193376
35376 193376 462923 1040620 1159299 1053322 1169295 1348993 1158428 527480 -272514 -934175
35366 -934175 -1137681 -654911 226497 727492 460792 31431 264646 1024368 1383081 912993
35356 912993 176967 -181670 -229128 -342207 -532253 -567299 -426509 -248424 -67685 79579
35346 79579 33383 -191474 -229646 169394 702707 854939 472828 -265142 -1124710 -1694996
35336 -1694996 -1392225 -169918 1044428 1288737 786687 533934 782054 790111 185840
35327 185840 -350693 -183069 280386 324953 127027 444283 1354715 2065784 2023088 1584614
35317 1584614 1348053 1258913 813050 -17468 -543552 -225596 554742 998098 1016908 1267843
35307 1267843 1934649 2206506 1515585 683128 906007 1868572 1966393 562105 -1035608
35298 -1035608 -1346004 -606489 -142181 -436028 -736298 -392021 262681 509320 171292
35289 171292 -334060 -595355 -611268 -649894 -849607 -1062111 -1112855 -1064468 -1056189 -1017895 -788246
35278 -788246 -383877 140189 893697 1782483 2180866 1649309 870845 1030207 2150454
35269 2150454 2919541 2444939 1303558 440740 -57127 -462601 -530973 13683 701165
35260 701165 866081 540384 77182 -594034 -1529950 -2124321 -1850855 -1235956 -1091333 -1155360
35250 -1155360 -616503 301358 568378 115163 24865 714759 1187538 602996 -459717
35241 -459717 -950605 -721036 -266948 231433 876841 1484148 1714146 1585006 1389602 1252207
35231 1252207 1096708 921244 853135 994617 1304787 1568418 1549324 1290420 1058393 841388
35221 841388 338398 -222270 91482 1568786 2978947 3075937 2443615 2507061 3084736 2634162
35211 2634162 977323 -92219 524012 1690476 2017611 1772179 1703345 1465515 643668
35202 643668 98616 621927 1185721 335271 -1280172 -1629847 -302338 1018381 1137811
35193 1137811 736166 831001 1323122 1635288 1642246 1353029 553501 -671100 -1712162 -2127112
35183 -2127112 -1992752 -1401684 -313366 896797 1495125 1278696 759327 287110 -279932
35174 -279932 -864076 -978499 -563671 -206619 -169471 2366 524352 891440 856662 1020960
35164 1020960 1782503 2489492 2418882 1900048 1603650 1360410 713010 136227 494792 1469945
35154 1469945 1723416 731132 -589725 -1301487 -1505748 -1599301 -1383386 -544361 611855
35145 611855 1554962 2201014 2591838 2380282 1416251 527657 753838 1793363 2182160
35136 2182160 1304719 285509 273639 700693 270818 -846101 -1144596 -96666 1028483
35127 1028483 1126170 798539 1051345 1457808 904345 -383053 -983331 -374257 437325
35118 437325 592063 468472 629295 756719 360309 -254882 -512802 -467324 -421321 -163190
35108 -163190 577686 1284445 1152546 260019 -584340 -1043478 -1432462 -1706000 -1267453 -137799
35098 -137799 551980 -107675 -1488123 -2110013 -1392263 -112943 730047 863525 455517
35089 455517 -478815 -1933002 -3440566 -4264952 -4153316 -3614379 -3289987 -3235609 -3033008
35080 -3033008 -2516197 -2095393 -2246133 -2837644 -3169064 -2712640 -1727886 -1026782 -1101867 -1607406
35070 -1607406 -1851462 -1695872 -1633491 -1906444 -1995074 -1364141 -416345 -131372 -787963 -1589730
35060 -1589730 -1701398 -1194469 -720288 -612078 -632148 -398500 211778 967256 1428304 1327471
35050 1327471 906751 689672 850116 1080803 1173857 1333591 1662809 1721327 1014923 -280108
35040 -280108 -1473156 -2117111 -2263916 -2081365 -1622568 -1011166 -535752 -414284 -564515
35031 -564515 -655152 -393977 131759 420285 95618 -494855 -584045 -14058 480593 291851
35021 291851 -224277 -365548 -118314 23590 -15024 154937 598256 881104 725009 289235
35011 289235 -229110 -750510 -1049844 -901432 -554647 -503599 -703822 -631829 -259249 -277676
35001 -277676 -1049550 -1962649 -2236484 -1843567 -1207021 -499148 237466 698820 651124 403453
34991 403453 421931 641015 593481 68339 -710332 -1345417 -1402972 -630550 561109 1211278
34981 1211278 896461 339765 397872 868382 992534 701544 448270 135930 -645639 -1414623
34971 -1414623 -1101456 213208 1088705 717656 -10004 -69270 192611 21873 -244750
34962 -244750 149770 851228 818848 -25080 -775270 -1036049 -1253742 -1525390 -1261175 -350714
34952 -350714 338218 111193 -635028 -1083139 -975281 -538537 6041 469762 691680 799754
34942 799754 1027086 1113784 522134 -547610 -1139883 -906605 -638332 -893212 -1004642 -288150
34932 -288150 585257 548306 -100817 -181363 420645 658176 170045 -200773 -82993 -398799
34922 -398799 -1733920 -2962736 -2569056 -719453 1043064 1849063 2191097 2594174 2644946
34913 2644946 1803159 542259 32818 806252 2152788 2910652 2617451 1774426 1149829
34904 1149829 1053793 1281704 1500133 1525416 1393958 1351821 1637477 2077862 2081349 1320962
34894 1320962 265907 -320574 -268453 41332 446349 1094447 1746157 1741627 991865 354844
34884 354844 507047 940101 730447 -16539 -257757 489180 1458973 1681287 1170218 676121
34874 676121 568226 470755 13591 -497778 -466001 125761 630218 597567 334484 331950
34864 331950 454128 148712 -683749 -1517408 -1856588 -1600224 -814009 272038 1018712
34855 1018712 850724 178386 92383 779093 1065237 179187 -825174 -413409 1144979
34846 1144979 2043195 1416788 370366 232706 830741 1130088 855358 648357 934374
34837 934374 1401951 1619092 1590840 1521242 1402765 1130108 842652 820846 1012631 971161
34827 971161 476236 -28519 -1620 343453 314718 -106385 -124404 526486 877947 102703
34817 102703 -975386 -771712 842492 2265563 2245141 1295336 693609 859215 1230282
34808 1230282 1169719 472948 -612826 -1443268 -1431111 -825676 -618558 -1260001 -1937651 -1680008
34798 -1680008 -752805 -246850 -524931 -862385 -618149 -34231 321648 345414 333380 480127
34788 480127 699825 762803 494353 8025 -258738 280 476749 551594 118910 -277885
34778 -277885 -247124 -69839 -182064 -514082 -697644 -647385 -518457 -286150 132851 412914
34768 412914 53001 -764678 -1085101 -332859 823891 1285695 989736 898025 1446659 1740301
34758 1740301 808855 -791469 -1407358 -318864 1335150 1949918 1288017 469183 405412
34749 405412 825798 933078 563776 336745 772687 1604532 2079397 1752502 783805 -424301
34739 -424301 -1532970 -2155418 -1877456 -759749 423473 899518 752131 629762 720186
34730 720186 615525 213612 12598 221293 280930 -223089 -761781 -611046 70690 630704
34720 630704 986204 1447462 1764309 1373191 559109 296389 712155 758935 -112062 -914408
34710 -914408 -494839 786714 1603680 1420612 833373 413562 68137 -465844 -1164827
34701 -1164827 -1821001 -2104961 -1549555 -2510 1839702 2812181 2356528 991235 -269967
34692 -269967 -746152 -466592 -18060 68826 -59644 159731 693357 749813 49051 -465296
34682 -465296 46365 922897 962790 244024 -280673 -577472 -1321410 -2028652 -1280114 812242
34672 812242 2230275 1921365 1284770 1703569 2306599 1722632 607910 512887 1232077
34663 1232077 1308938 563571 100376 142720 -128965 -679563 -549186 187176 314579 -356186
34653 -356186 -594828 17376 351357 -107986 -255547 531183 1094707 542264 -58872 455156
34643 455156 1178717 576253 -933680 -1638524 -1115083 -441434 -265116 -294106 -468452 -1078376
34633 -1078376 -1740683 -1625521 -776056 -55565 210521 436992 683994 518691 14875
34624 14875 -192910 66343 393499 712243 1255706 1732629 1617119 1228398 1339007 1732444
34614 1732444 1473326 684687 574145 1391672 1898925 1433878 1011213 1551106 2362447
34605 2362447 2392497 1830298 1376162 930069 191147 -305370 -37437 289742 -274190 -1177611
34595 -1177611 -975419 482004 1746759 1751323 1041533 836301 1672654 3165247 4432283
34586 4432283 4610382 3548190 2157919 1629626 2223300 3202873 3851095 4027410 3786539
34577 3786539 3073914 1981904 907423 272575 249554 698708 1173645 1162646 614232
34568 614232 48769 -116124 -72741 -127746 -73408 421427 1056542 1133701 449184 -522342
34558 -522342 -1229910 -1424336 -1114934 -589507 -308575 -379862 -353989 107852 726687 1162205
34548 1162205 1543926 1886619 1637560 659631 27782 688265 1783591 1672979 374472
34539 374472 -514862 -296688 113113 231229 938968 2531459 3492579 2551931 777413
34530 777413 117508 652431 871573 260628 -34384 761529 1766564 1752741 850193 250964
34520 250964 586926 1177336 948371 -158266 -1017956 -753463 6501 -76285 -1134287
34511 -1134287 -1913241 -1689744 -1258776 -1419648 -1584552 -897279 152776 493864 241244
34502 241244 343377 831160 841356 260477 -49900 275894 733653 1147751 1839016 2339205
34492 2339205 1455459 -770818 -2534918 -2510948 -1459170 -757602 -501263 -110632 247788
34483 247788 164537 119491 713853 1295962 751151 -637731 -1454945 -1118481 -312829 419880
34473 419880 1143474 1526508 867700 -441162 -825901 369763 1781530 1883578 1065050
34464 1065050 816596 1428460 1669008 674604 -820869 -1451501 -854912 74735 419004
34455 419004 356235 788923 1915051 2674707 2034955 452514 -631217 -584149 -66456
34446 -66456 245831 442146 642748 508154 49061 50393 920712 1793140 1624900 693530
34436 693530 110438 191489 227333 -272416 -948563 -1220802 -896411 -138255 658121 1024225
34426 1024225 931808 1002212 1734747 2764946 3410178 3614632 3692142 3506850 2775849 1908200
34416 1908200 1545879 1431076 824482 -12751 -22170 795233 1101722 342036 -153805 913875
34406 913875 2795999 3659780 2898818 1422975 123864 -832684 -1361095 -1158684 -256006
34397 -256006 773855 1357288 1362600 1043563 824104 984731 1289704 1173823 575154 195904
34387 195904 537630 1108913 1136713 677070 367162 386554 404607 366176 551036 905088
34377 905088 1053378 1016065 1211977 1635240 1689343 1070140 290565 67895 548016 1304535
34367 1304535 1820726 1901481 1836746 2058160 2370027 1858733 131965 -1671500 -1960166
34358 -1960166 -692507 602635 848914 467467 195030 -8213 -293078 -179783 627098
34349 627098 1372149 1148918 241509 -312773 -200605 -27824 -237856 -650751 -983917 -1087589
34339 -1087589 -736434 80818 719879 491587 -291983 -672002 -471725 -478076 -1038869 -1474298
34329 -1474298 -1302859 -1093134 -1419497 -1776419 -1393081 -534644 -45590 462 210349 676923
34319 676923 897399 814279 910438 1175256 999304 353119 66273 507573 939588 755268
34309 755268 436392 537235 593192 29733 -570848 -314766 388153 395618 -227649 -283930
34299 -283930 502425 987315 522425 -67114 -64254 -54308 -569978 -747308 336650 1808769
34289 1808769 1972298 728493 -413221 -603738 -511542 -772007 -951049 -559819 -2599
34280 -2599 179334 220097 578230 1044138 1094676 782111 662262 1032671 1680872 2214415
34270 2214415 2317613 1898587 1268237 944323 1052503 1214320 1209845 1298526 1587963 1625107
34260 1625107 1101438 466823 226718 91750 -396531 -788307 -284300 775820 1102739
34251 1102739 287347 -636615 -808379 -640067 -710576 -623763 82454 740687 481901 -186053
34241 -186053 -65938 741637 989094 425698 217360 813865 982822 -123353 -1308930
34232 -1308930 -1051488 125766 536589 -30116 -223585 514073 1171746 961859 397642
34223 397642 106221 -128849 -494647 -462869 220854 787097 532705 -91123 -308840 -236215
34213 -236215 -358125 -399754 243800 1311435 1899700 1719154 1309932 1141974 1211639 1368063
34203 1368063 1385087 927373 81909 -381685 31303 701139 791091 520239 554129 598733
34193 598733 -87287 -1017038 -820702 617557 1836661 1937076 1591385 1423238 919605
34184 919605 -156345 -697062 116926 1183609 949523 -187423 -487825 454698 1181770
34175 1181770 568514 -794022 -1742694 -1960215 -1746812 -1236197 -482523 178462 424662
34166 424662 345735 180069 -94617 -567315 -989388 -931984 -320591 431701 851398 812638
34156 812638 485357 29205 -491396 -900707 -862275 -248311 568106 1081775 1274783 1533738
34146 1533738 1945310 2108764 1800557 1376577 1199928 1037031 450169 -437865 -1033424
34137 -1033424 -1052606 -809500 -698151 -710985 -584242 -228631 123426 173556 -88102 -348416
34127 -348416 -360004 -271576 -384731 -644835 -647116 -171339 542381 1076287 1161305 766427
34117 766427 155963 -225684 -282801 -514448 -1211567 -1630583 -812571 801020 1643246 1219663
34107 1219663 908667 1899638 3342162 3526986 2179510 502795 -538305 -840039 -410696
34098 -410696 777634 2170031 2857174 2581440 1844820 1076624 383115 -57439 -165527
34089 -165527 -351696 -866800 -1008188 -57171 1188152 1176836 -37642 -710010 -41965
34080 -41965 681065 360222 -62486 704859 1972740 2059643 928633 140302 374321 594958
34070 594958 -96965 -1136931 -1516996 -1090426 -253138 856771 2100136 2801191 2283955
34061 2283955 853804 -306586 -288380 770333 2021892 2713402 2597405 1828297 735106
34052 735106 -287759 -887560 -966728 -760878 -524662 -160872 592339 1577362 2161301 1961291
34042 1961291 1352423 993004 1068085 1300974 1502865 1696973 1762687 1385330 492477 -501957
34032 -501957 -1025882 -834085 -153478 559522 1011616 1272008 1527302 1669668 1365603 596781
34022 596781 -196438 -694369 -1056077 -1403031 -1360682 -640416 206590 284092 -457130 -1130314
34012 -1130314 -1047176 -372322 415626 1100024 1574678 1685946 1512042 1352482 1209735 754133
34002 754133 29982 -370037 -185248 20883 -296614 -865942 -1183285 -1349197 -1614986 -1589241
33992 -1589241 -825430 90832 100092 -715059 -1142991 -666815 -206532 -576885 -1199362 -1127589
33982 -1127589 -605753 -610658 -1226701 -1503088 -898957 18886 516871 615243 728245 936501
33972 936501 1084811 1265979 1673395 2059424 1843265 922393 40697 51078 946082 1905128
33962 1905128 2239276 1967840 1482323 1093388 1039200 1384656 1557374 599433 -1434650
33953 -1434650 -2846743 -2079066 89549 1309703 695663 -197877 158367 1189067 1502464
33944 1502464 1106748 1038571 1483295 1662453 1286320 827431 447863 -145675 -740112 -647066
33934 -647066 122131 715649 689257 465298 352316 100040 -255513 -97069 731832 1419500
33924 1419500 1239983 431864 -380615 -913409 -974796 -319498 715046 1203569 861612
33915 861612 556398 990803 1642186 1705420 1315585 1004356 681688 134107 -126062 353022
33905 353022 826377 244327 -1009885 -1543088 -1002295 -417827 -423185 -452184 -85448 32052
33895 32052 -668351 -1528424 -1517565 -713699 -119195 -238754 -541705 -346041 281594 714521
33885 714521 621724 353625 367971 465978 26711 -903288 -1322752 -539536 748806 1346388
33875 1346388 1214178 1317370 1891508 1942208 831611 -595082 -1161484 -968398 -994795
33866 -994795 -1467524 -1603238 -1008572 -432713 -682515 -1397815 -1576089 -1039081 -590378 -634682
33856 -634682 -466311 548853 1724487 1849361 935591 184364 213640 375268 108692
33847 108692 -122254 139354 363400 -5378 -372541 110159 963968 904959 -215951 -1126168
33837 -1126168 -872184 90119 718353 520636 -304924 -1188488 -1460458 -854612 134711
33828 134711 804075 1030687 1022609 622267 -312344 -1082121 -780755 234316 617321 -16610
33818 -16610 -531860 -54155 775269 957477 613921 489976 655229 579730 130960 -288425
33808 -288425 -438150 -470686 -511951 -434821 -73841 531513 1097685 1305694 1169592 1045954
33798 1045954 1031024 673711 -196210 -729670 -13363 1413600 2038160 1421976 682830
33789 682830 703871 1001886 829641 317005 -106429 -427171 -460658 491156 2467059 4086485
33779 4086485 3975035 2470304 1043879 467754 390992 340949 264040 243912 335878 531996
33769 531996 522537 -86627 -973934 -1212080 -686780 -539731 -1405777 -2105225 -1225787 693725
33759 693725 1886638 1807676 1445071 1400498 1140122 316077 -465537 -582006 -120168 645576
33749 645576 1612930 2403274 2428773 1786199 1345784 1585380 1989441 1932335 1521119 1209345
33739 1209345 1156893 1338580 1766094 2230799 2283087 1833716 1386759 1332350 1353689 888688
33729 888688 -70665 -948979 -1191382 -683354 272168 1191498 1685898 1621996 1067093 213749
33719 213749 -574514 -888131 -670757 -318241 -192215 -282486 -523959 -1015338 -1578526 -1598099
33709 -1598099 -856062 -106853 -152153 -684438 -793138 -338360 15951 -32635 -102046 88365
33699 88365 463156 1117141 2211381 3243254 3295787 2251800 1023070 363093 152848
33690 152848 34865 -10227 15618 -51868 -85476 340316 1214924 1915975 1991931 1592248
33680 1592248 1035362 585128 664122 1455205 2213756 1947470 956055 599035 1241360 1716476
33670 1716476 1402211 1414954 2683049 4061178 3829140 2283421 1251289 1399054 1587454
33661 1587454 906036 -76551 -422505 -66286 498345 924721 965475 393530 -582950 -1303427
33651 -1303427 -1389398 -1109020 -816499 -509733 -192577 -169804 -584622 -1009691 -892028 -182611
33641 -182611 781285 1768260 2654529 3120301 2808127 1820097 719007 -55440 -504149
33632 -504149 -718435 -555977 50163 701561 888161 686070 649196 924614 981497 497450
33622 497450 36433 352711 1322514 2108551 2194259 1703124 851774 -254660 -1288328
33613 -1288328 -1813094 -1867478 -1910278 -2092462 -2099692 -1770314 -1285887 -691445 91493 662193
33603 662193 358258 -625619 -1125757 -468562 637504 1141151 927521 558851 399823
33594 399823 576612 1167085 1797599 1681035 757204 165627 791350 1956694 2442538
33585 2442538 2168247 1789366 1259299 190771 -718957 -241233 1337776 2258401 1719772
33576 1719772 851963 739359 885486 500823 80565 509207 1422676 1722099 1251572
33567 1251572 796591 688744 561111 429011 873952 1894196 2520093 2065016 1113697
33558 1113697 716922 1002651 1146904 574537 -305848 -667817 -296896 150229 -94879
33549 -94879 -1032266 -1926085 -2198885 -2034790 -1923638 -1865995 -1424309 -500849 373867 666731
33539 666731 432314 101977 -32664 89876 443728 828720 855162 416331 57239 414977
33529 414977 1301697 1836797 1593757 1094632 936280 989622 908896 913304 1359354 1850567
33519 1850567 1629039 815478 391595 755454 1124935 781571 147508 -5640 175571
33510 175571 -31188 -630720 -826048 -221646 610761 930340 663177 266868 177745 547380
33500 547380 1159849 1461033 1019176 132077 -339400 44526 732482 819131 91473 -749250
33490 -749250 -826702 43300 1146962 1529773 974698 244991 146096 497794 456040 -199412
33480 -199412 -697905 -409812 224009 343191 -137718 -512401 -246170 545579 1446816 2063324
33470 2063324 2057626 1386242 564355 247288 461182 644211 474959 158347 -173841 -680870
33460 -680870 -1154758 -865868 335510 1314596 862679 -641100 -1587558 -1095203 145276
33451 145276 1014602 1172410 920837 587711 410814 482653 454598 -219076 -1424901 -2294786
33441 -2294786 -2314790 -1967998 -1836134 -1669535 -988586 -109136 218404 -81909 -397427 -348407
33431 -348407 -54856 356513 817716 978104 492592 -311585 -634620 -141654 715646 1270370
33421 1270370 1179089 583675 102175 317097 876893 700541 -319265 -648597 795750
33412 795750 2675317 2836829 1338381 109029 -69037 -128990 -258272 674241 2553640
33403 2553640 3331504 2197590 1229183 2139389 3359738 2585293 641937 154159 1312861
33394 1312861 1824309 823730 60648 780126 1871414 1999124 1590521 1571349 1646153
33385 1646153 1086288 222220 26543 802399 2046211 3082207 3299848 2375574 800905
33376 800905 -318046 -393166 198265 988270 1986074 3023701 3352707 2514231 1081871
33367 1081871 1551 -413371 -456967 -459239 -624782 -1036226 -1465116 -1506764 -1131270 -750438
33357 -750438 -608844 -532400 -354325 -68070 508873 1583222 2733867 3055255 2205311
33348 2205311 791163 -426687 -1149893 -1301343 -876363 -211355 222749 395692 492949
33339 492949 261536 -539294 -1197185 -754953 325503 595970 -83391 -272591 540809
33330 540809 921416 -76203 -1134122 -734772 394905 591582 -13773 83946 1198103
33321 1198103 2098436 2018715 1442101 885801 262931 -401765 -701998 -458860 142020 922356
33311 922356 1574090 1549601 875957 543395 1137159 1704601 1133014 5661 -322673 53221
33301 53221 -70366 -806209 -1121761 -899837 -1198961 -2235902 -2842749 -2329189 -1329435 -434995
33291 -434995 446913 1010246 529431 -537615 -636664 503459 1276181 763235 92561
33282 92561 206856 147650 -976802 -1968653 -1265216 562472 1817532 2151879 2265963
33273 2265963 2088382 1183461 275795 399597 979977 664117 -282663 -353773 623028 1277590
33263 1277590 1072391 883681 996171 550590 -482990 -719131 428656 1636247 1721642
33254 1721642 1290910 1276787 1249889 487278 -392014 -275044 690160 1460337 1673480 1706896
33244 1706896 1616044 1151810 558758 331802 336514 54026 -422846 -439032 231937 1089269
33234 1089269 1518880 1217276 252140 -767953 -924223 -38668 813933 557531 -394300
33225 -394300 -682205 163561 1279702 1790733 1709184 1423985 1090180 785229 664370 679805
33215 679805 571101 312640 201337 397116 727959 1000117 1150572 1077443 674484 47221
33205 47221 -585741 -1098408 -1280521 -756066 417325 1354752 1233493 421502 4356 305391
33195 305391 675864 694455 629515 578554 144308 -644945 -960996 -259689 912185 1676939
33185 1676939 1804817 1510321 935620 378414 406984 1085576 1583998 1237757 560703 470065
33175 470065 866820 832416 88169 -582323 -456780 273637 1013189 1600698 2264191 2972229
33165 2972229 3223505 2620962 1524033 827599 926789 1212882 988514 558632 710774
33156 710774 1300684 1349067 666430 256454 629452 829963 -37078 -1273466 -1658715 -1325246
33146 -1325246 -1319955 -1750533 -1706540 -911047 -194945 -169471 -469871 -591031 -625188 -838162
33136 -838162 -1125892 -1153542 -652877 388851 1421920 1494694 366450 -851008 -974306
33127 -974306 -351418 -201775 -686849 -925818 -786090 -1098328 -1854029 -1820874 -610868 362905
33117 362905 -27497 -841003 -564167 585642 1185434 795451 295796 359351 772019 1147993
33107 1147993 1320000 1070530 347851 -261621 -44665 838446 1509322 1489838 1059222 584949
33097 584949 160363 -114512 -144486 -188480 -618587 -1247122 -1414166 -857508 -55596 400674
33087 400674 403708 211581 57941 -22664 -165455 -462095 -684425 -447883 166782 510099
33077 510099 222099 -171021 26153 707354 1254689 1480553 1629901 1691804 1452436 1105385
33067 1105385 1029601 973402 260828 -1052245 -1979503 -1834238 -1043375 -438093 -280484 -343830
33057 -343830 -495749 -767757 -1089013 -1283320 -1224883 -860524 -221374 526706 1182050 1606926
33047 1606926 1585512 850543 -364676 -1101286 -663331 290779 424119 -454081 -1087714
33038 -1087714 -571649 406840 680364 249827 31721 360335 606638 253638 -361887
33029 -361887 -583065 -251640 269939 648225 887555 1145711 1439495 1629118 1617677 1409756
33019 1409756 986272 381619 -19055 354484 1443187 2246693 1899555 895943 563999
33010 563999 1310230 2123228 2038171 1367479 1026709 1229554 1483343 1535088 1640662 1950715
33000 1950715 2174864 1988347 1472537 1016041 892668 1000618 1028322 902351 930266 1273211
32990 1273211 1431450 731462 -630796 -1579455 -1438736 -744681 -433260 -656300 -868201
32981 -868201 -739940 -406639 25749 618437 1195244 1284936 685695 -141884 -435596 129429
32971 129429 1078574 1553183 1207194 630640 618490 1071535 1099570 335397 -448082 -411304
32961 -411304 197802 535420 402616 294998 445128 570345 541098 604848 857363 1085124
32951 1085124 1230589 1446214 1591450 1292394 661019 299354 329710 108818 -685122 -1363282
32941 -1363282 -1229774 -695739 -602947 -830030 -505317 501095 1235969 989651 183209
32932 183209 -381684 -505473 -421764 -201584 151060 371385 220741 -108579 -293931 -369565
32922 -369565 -481491 -375204 324468 1377905 1999786 1764379 1083401 702874 987557
32913 987557 1694665 2197457 2020581 1443158 1371783 2185454 2963176 2532521 1145736 258929
32903 258929 579274 1268090 1354674 947290 505419 -122162 -1091087 -1762808 -1541261 -1007501
32893 -1007501 -1150386 -1762945 -1693359 -608226 533759 870924 591116 296297 206824
32884 206824 274874 455531 586062 462607 194776 78143 103393 46274 -29213 115119
32874 115119 389404 552538 685443 832201 510698 -505915 -1264487 -708972 501862
32865 501862 711763 -155677 -408142 648222 1557234 1161193 454934 710898 1259860
32856 1259860 787715 -276759 -497604 156146 462037 117537 -19862 240417 42745
32847 42745 -897857 -1761267 -1978842 -1854401 -1582060 -903513 -82433 17888 -665611 -1016491
32837 -1016491 -347473 570931 720121 218801 -190495 -313682 -406502 -434908 -192366 138003
32827 138003 155703 -182639 -600652 -975170 -1424767 -1996019 -2468658 -2465360 -1792011 -780419
32817 -780419 -99510 17646 46155 294733 261821 -412947 -858620 27005 1701287 2438776
32807 2438776 1777622 1097887 1348292 1636886 891203 -354663 -958311 -996119 -1321908
32798 -1321908 -1920981 -1994636 -1401996 -870728 -838814 -1019591 -1116059 -1191555 -1304443 -1378994
32788 -1378994 -1392351 -1207809 -466841 773700 1626692 1362638 585709 580600 1588370 2587135
32778 2587135 2775513 2380524 1857921 1194791 387336 -107233 78236 610026 778936
32769 778936 202748 -948490 -2098684 -2524142 -1884650 -704895 16194 -130752 -581064
32760 -581064 -586518 -34076 663642 1097289 1049272 511015 -176229 -441040 -61381 494887
32750 494887 554165 -1296 -634057 -786587 -496986 -360200 -892997 -1960893 -2910949 -3246135
32740 -3246135 -2954382 -2152874 -840579 696317 1663999 1531327 832379 599531 1065440
32731 1065440 1524273 1462136 1158353 1045705 1126784 1260194 1439639 1515795 1208792 706031
32721 706031 654442 1160376 1407551 814125 -49 -110230 311438 365660 -61760 -151228
32711 -151228 436338 952316 720996 148187 41169 446171 765877 737414 689196 904180
32701 904180 1249226 1520602 1766945 2086285 2333562 2235491 1732648 1097344 710263 707630
32691 707630 796117 477597 -384927 -1221604 -1186759 -73618 1335233 2005921 1661327 869573
32681 869573 231208 -176962 -487077 -599543 -423000 -297106 -628604 -1089769 -762317 599387
32671 599387 1891004 1782726 349169 -976859 -1073511 -197223 737388 1304620 1565038
32662 1565038 1422389 683645 -373990 -1115258 -1257639 -996319 -470219 285038 805247
32653 805247 380300 -896115 -1927999 -1956376 -1524408 -1524953 -1829646 -1639313 -817644 3314
32643 3314 462999 744844 873875 610230 93703 -222680 -360665 -736497 -1265546 -1470336
32633 -1470336 -1494039 -1798506 -1659291 466078 4264648 6762724 5597178 2103568 -373907
32624 -373907 -531842 201459 551517 968316 2032555 3044052 3053656 2233812 1443034 1132397
$$ [...]
##END NTUPLES=NMR SPECTRUM
##END=
