##TITLE=31Pdec_SR102_2_2
 CDCl3, 24 sc
 8.2.2022
##JCAMPDX= 6.0         $$ Bruker NMR JCAMP-DX V2.0
##DATA TYPE= NMR SPECTRUM
##DATA CLASS= NTUPLES
##ORIGIN= UXNMR, Bruker Analytische Messtechnik GmbH
##OWNER= root
$$ XWIN-NMR		Version 3.5
$$ Tue Feb  8 12:01:47 2022 Russian Standard Time (UT+4h)  she@DPX200
##.OBSERVE FREQUENCY= 81.013821
##.OBSERVE NUCLEUS= ^31P
##.ACQUISITION MODE= SIMULTANEOUS
##.ACQUISITION SCHEME= undefined
##.AVERAGES= 24
##.DIGITISER RES= 16
##SPECTROMETER/DATA SYSTEM= spect
##.PULSE SEQUENCE= zgpg30
##.SOLVENT NAME= CDCl3
##.SHIFT REFERENCE= (INTERNAL, CDCl3, 0, 248.564)
##AUDIT TRAIL= $$ (NUMBER, WHEN, WHO, WHERE, WHAT)
$$ ##TITLE= Audit trail, XWIN-NMR		Version 3.5
$$ ##JCAMPDX= 5.01
$$ ##ORIGIN= Bruker BioSpin GmbH
$$ ##OWNER= she
$$ F:/spectra/data/she/nmr/P31/1/pdata/1/auditp.txt
$$ ##AUDIT TRAIL=  $$ (NUMBER, WHEN, WHO, WHERE, WHAT)
(   1,<2022-02-08 11:59:36.93 +0400>,<she>,<DPX200>,
      <created by zg, POWCHK disabled, PULCHK disabled
       configuration hash MD5:
       00 E9 B6 7A A2 85 ED C7 34 08 36 98 17 FE 4E 26
       data hash MD5: 32K
       DF 7F 84 9B D9 7A F1 86 65 46 09 77 C3 81 CB 9C>)
(   2,<2022-02-08 11:59:53.37 +0400>,<she>,<DPX200>,
      <Start of raw data processing
       efp BC_mod = 2 LB = 1 FT_mod = 6 PKNL = 1 PHC0 = -9570.025 PHC1 = 620.4737 SI = 64K 
       data hash MD5: 64K
       C6 C6 3E E6 B2 9F B2 AF 4A 8D E7 3E 46 65 EA DA>)
(   3,<2022-02-08 12:00:42.46 +0400>,<she>,<DPX200>,
      <pk PHC0 = 173.1022 PHC1 = -401.6001 
       data hash MD5: 64K
       76 70 BA 1B FF 89 9A B3 43 26 C9 3A AE BF F5 1C>)
(   4,<2022-02-08 12:00:50.07 +0400>,<she>,<DPX200>,
      <abs ABSG = 5 
       data hash MD5: 64K
       C1 E2 82 95 71 78 89 35 E7 0D CE 0E 45 2F 3D EA>)
$$ ##END=
$$ 
$$ hash MD5
$$ 19 20 39 6E 6D 1C 36 97 C7 89 2C FD 02 33 D1 14
##$RELAX= 
##$RELAX= 
##$RELAX= 
##$RELAX= 
##$RELAX= 
##$RELAX= 
##$RELAX= 
##$RELAX= 
$$ Bruker specific parameters
$$ --------------------------
##$DU= <F:/spectra>
##$EXPNO= 1
##$NAME= <P31>
##$PROCNO= 1
##$TYPE= <nmr>
##$USER= <she>
##$AMP= (0..31)
100 100 100 100 100 100 100 100 100 100 100 100 100 100 100 100 100 100 
100 100 100 100 100 100 100 100 100 100 100 100 100 100 
##$AQSEQ= 0
##$AQ_mod= 1
##$AUNM= <au_zg>
##$AUTOPOS= <>
##$BF1= 81.014009
##$BF2= 200.13
##$BF3= 200.13
##$BF4= 200.13
##$BF5= 200.13
##$BF6= 200.13
##$BF7= 200.13
##$BF8= 200.13
##$BYTORDA= 1
##$CFDGTYP= 0
##$CFRGTYP= 5
##$CHEMSTR= <none>
##$CNST= (0..31)
1 1 145 1 1 1 1 1 1 1 1 1 1 1 1 1 1 1 1 1 1 1 1 1 1 1 1 1 1 1 1 1 
##$CPDPRG= <waltz16>
##$CPDPRG1= <>
##$CPDPRG2= <waltz16>
##$CPDPRG3= <>
##$CPDPRG4= <mlev>
##$CPDPRG5= <mlev>
##$CPDPRG6= <mlev>
##$CPDPRG7= <mlev>
##$CPDPRG8= <mlev>
##$CPDPRGB= <>
##$CPDPRGT= <>
##$D= (0..31)
0 1 0 0 0 0 0 0 0 0 0 0.03 2e-05 3e-06 0 0 0 0 0 0 0 0 0 0 0 0 0 0 0 0 
0 0 
##$DATE= 1644307176
##$DBL= (0..7)
120 120 120 11 120 120 24 19 
##$DBP= (0..7)
150 150 150 150 150 150 150 150 
##$DBP07= 0
##$DBPNAM0= <>
##$DBPNAM1= <>
##$DBPNAM2= <>
$$ [...]
##$SUBNAM3= <"">
##$SUBNAM4= <"">
##$SUBNAM5= <"">
##$SUBNAM6= <"">
##$SUBNAM7= <"">
##$SUBNAM8= <"">
##$SUBNAM9= <"">
##$SW= 501.771253377433
##$SWIBOX= (0..15)
0 1 3 0 0 0 0 0 0 0 0 0 0 0 0 0 
##$SW_h= 40650.406504065
##$TD= 32768
##$TD0= 1
##$TE= 0
##$TE2= 300
##$TE3= 300
##$TEG= 300
##$TL= (0..7)
0 120 53 12 22 120 120 120 
##$TP= (0..7)
150 150 150 150 150 150 150 150 
##$TP07= 0
##$TPNAME0= <>
##$TPNAME1= <>
##$TPNAME2= <>
##$TPNAME3= <>
##$TPNAME4= <>
##$TPNAME5= <>
##$TPNAME6= <>
##$TPNAME7= <>
##$TPOAL= (0..7)
0.5 0.5 0.5 0.5 0.5 0.5 0.5 0.5 
##$TPOFFS= (0..7)
0 0 0 0 0 0 0 0 
##$TUNHIN= 0
##$TUNHOUT= 0
##$TUNXOUT= 0
##$USERA1= <user>
##$USERA2= <user>
##$USERA3= <user>
##$USERA4= <user>
##$USERA5= <user>
##$V9= 5
##$VALIST= <valist>
##$VCLIST= <CCCCCCCCCCCCCCC>
##$VD= 0
##$VDLIST= <DDDDDDDDDDDDDDD>
##$VPLIST= <PPPPPPPPPPPPPPP>
##$VTLIST= <TTTTTTTTTTTTTTT>
##$WBST= 1024
##$WBSW= 4
##$XGAIN= (0..3)
0 0 0 0 
##$XL= 0
##$YL= 0
##$YMAX_a= 6407
##$YMIN_a= -5249
##$ZGOPTNS= <>
##$ZL1= 120
##$ZL2= 120
##$ZL3= 120
##$ZL4= 120
##$ABSF1= 248.5645
##$ABSF2= -253.2056
##$ABSG= 5
##$ABSL= 3
##$ALPHA= 0
##$AQORDER= 0
##$ASSFAC= 0
##$ASSFACI= 0
##$ASSFACX= 0
##$ASSWID= 0
##$AUNMP= <proc_1d>
##$AZFE= 0.1
##$AZFW= 0.5
##$BCFW= 0
##$BC_mod= 2
##$BYTORDP= 0
##$COROFFS= 0
##$CY= -3
##$DATMOD= 1
##$DC= 0
##$DFILT= <>
##$DTYPP= 0
##$F1P= 0
##$F2P= 0
##$FCOR= 1
##$FTSIZE= 65536
##$FT_mod= 6
##$GAMMA= 0
##$GB= 0
##$INTBC= 1
##$INTSCL= 5.30512e-09
##$ISEN= 30
##$LB= 1
##$LEV0= 0
##$LPBIN= 0
##$MAXI= 10000
##$MC2= 0
##$MEAN= 0
##$ME_mod= 0
##$MI= 50
##$NCOEF= 0
##$NC_proc= -6
##$NLEV= 6
##$NOISF1= 182.463
##$NOISF2= 159.3651
##$NSP= 0
##$NTH_PI= 0
##$NZP= 0
##$OFFSET= 248.5645
##$PC= 4
##$PHC0= -9396.923
##$PHC1= 218.8736
##$PH_mod= 1
##$PKNL= yes
##$PPARMOD= 0
##$PSCAL= 0
##$PSIGN= 0
##$REVERSE= no
##$SF= 81.014009
##$SI= 65536
##$SIGF1= 159.3651
##$SIGF2= -187.1042
##$SINO= 113.3802
##$SIOLD= 16384
##$SREGLST= <1H.CDCl3>
##$SSB= 0
##$STSI= 65536
##$STSR= 0
##$SW_p= 40650.406504065
##$SYMM= 0
##$S_DEV= 0
##$TDeff= 32768
##$TDoff= 0
##$TI= <>
##$TILT= no
##$TM1= 0
##$TM2= 0
##$TOPLEV= 0
##$USERP1= <user>
##$USERP2= <user>
##$USERP3= <user>
##$USERP4= <user>
##$USERP5= <user>
##$WDW= 1
##$XDIM= 65536
##$YMAX_p= 466059951
##$YMIN_p= -2901913
$$ End of Bruker specific parameters
$$ ---------------------------------
##NTUPLES= NMR SPECTRUM
##VAR_NAME=  FREQUENCY,     SPECTRUM/REAL,   SPECTRUM/IMAG
##SYMBOL=    X,             R,               I
##VAR_TYPE=  INDEPENDENT,   DEPENDENT,       DEPENDENT
##VAR_FORM=  AFFN,          ASDF,            ASDF
##VAR_DIM=   65536,         65536,           65536
##UNITS=     HZ,            ARBITRARY UNITS, ARBITRARY UNITS
##FACTOR=    0.620285442955139, 1,           1
##FIRST=     20137.2065510759, 0,            0
##LAST=      -20513.1999529892, 0,           0
##MIN=       -20513.1999529892, -2901913,    0
##MAX=       20137.2065510759, 466059951,    0
$$ Real data points
##PAGE= N=1
##DATA TABLE= (X++(R..R)), XYDATA
$$ [...]
40776b45172P0652p7578j2044J60069J40606n9338j26374L8471J67946Q5957k1337
$$ -245172 -174520 -252098 -264142 -104073 36533 -22805 -149179 -110708 57238 143195 121858
40765A21858L9427J31592L8341j54295j77382K5839K41030K68209J04684j20752
$$ 121858 161285 292877 331218 176923 -459 25380 266410 534619 639303 518551
40755E18551k65810k49217j07680K9285P3401N7826N4545O8400N3310j1966q9939
$$ 518551 252741 3524 -104156 -74871 -1470 56356 110901 179301 232611 220645 130706
40744A30706r4743L8545K31862K71334O1468j82153j73111M0635J36694N74j15957
$$ 130706 35963 74508 306370 577704 639172 457019 283908 324543 461237 461811 345854
40733C45854j2925J47545J28871k117k4804N7696N8346m9857r5918j6171M2593
$$ 345854 332929 480474 609345 607228 582424 640120 698466 648609 552691 536520 579113
40722E79113j5306o9155J0691J28837Q5092j25503k72402j72894P8592K28707
$$ 579113 563807 494652 505343 634180 719272 593769 321367 148473 227065 455772
40712D55772J62855k466j11946j41724j32862p2777M4253J15008L1814j32581
$$ 455772 618627 616161 504215 362491 229629 156852 201105 316113 347927 215346
40702B15346j80124l5783J67784K58033J77364j7057j97021k19491o0865J11713
$$ 215346 35222 -561 167223 425256 602620 585563 388542 169051 108186 219899
40692B19899J21830J4855k7904K8757N2008j7204j00442j64409k49346k87085
$$ 219899 341729 356584 328680 357437 409445 392241 291799 127390 -121956 -409041
40682d09041j28560J75866L52794K60755O0792o0110j11013j32716n8502J01022
$$ -409041 -537601 -361735 -8941 251814 312606 252496 141483 8767 -49735 51287
40672E1287J63200N1055m3733K4687R0353l8985k22672j90058M0144K19178K31895
$$ 51287 214487 265542 221809 246496 336849 297864 75192 -114866 -74722 144456 376351
40661C76351J33663n8654l15141m23743j99647J70864L08166J53289Q06J4843
$$ 376351 510014 451360 136219 -287524 -487171 -316307 -8141 145148 145954 160797
40651A60797L9330n3831j52216j53557j41214j62809r0475J21289K60644J49381
$$ 160797 200127 146296 -5920 -159477 -300691 -463500 -553975 -432686 -172042 -22661
40641b2661n8907q8003P0497J87280J43273M4494J2976M0589O9919Q4889P9396
$$ -22661 -81568 -169571 -99074 88206 231479 275973 288949 329538 399457 484346 563742
40630E63742K6236p6246j74729k09410j66706p2202L8110J16234R8425l7305j87969
$$ 563742 589978 513732 339003 129593 -37113 -109315 -71205 45029 143454 106149 -81820
40619h1820j72307M7733K36231J25450j98721l41583j13388K03311K59328J13128
$$ -81820 -254127 -206394 29837 155287 -43434 -385017 -498405 -295094 -35766 77362
40609G7362M9746Q6750P422j75638j85313L2132J64653L5919r6004K0231J86928
$$ 77362 127108 213858 221280 45642 -139671 -107539 57114 93033 -2971 17260 204188
40598B04188Q1306j83967k06032Q2008L05704K04158l3747j05153j5354R571j16621
$$ 204188 285494 101527 -104505 -22497 283207 487365 453618 348465 333111 342682 226061
40587B26061k44808k05326R37K14235K59764J01065j14547j90829q2810P2347
$$ 226061 -18747 -224073 -223136 -8901 250863 351928 237381 46552 -36258 36089
40577C6089J29614Q1393Q185m7025j00527j57708j73042q7424R4233K56197K43632
$$ 36089 165703 247096 255281 208256 107729 -49979 -223021 -310445 -216212 39985 283617
40566B83617M0877j56333j47046Q709O5356m4011r5608P0086K57350J79317r6468
$$ 283617 324494 168161 21115 29824 95180 51169 -44439 25647 282997 462314 365846
40555C65846k22168o7358J24973J34622N0756K7371m496j55688k84528j68663
$$ 365846 143678 76320 201293 335915 386671 414042 409546 253858 -30670 -199333
40545a99333J01466J90749j902j89997j04713J52679K80081J51930q8336k18831
$$ -199333 -97867 92882 90980 -99017 -203730 -51051 229030 380960 292624 73793
40535G3793j36473O2269J51127J1541j83907j60549O3909J68532m913j95645j06345
$$ 73793 -62680 -411 150716 162257 -21650 -182199 -118290 50242 45329 -150316 -256661
40524b56661J45478K08993K7241j01677J1278J81438J42958p2527j87288m0705
$$ -256661 -111183 97810 125051 23374 34652 216090 359048 286521 99233 58528
40514E8528K06861K53573J5562k42662k09713O2962K04809K8268k08075j83906
$$ 58528 265389 518962 534524 291862 82149 145111 349920 378188 170113 -13793
40504a3793K3940J08937K8160J4892J37214J78540K0534j53852j61696p2551j6871
$$ -13793 10147 119084 147244 162136 299350 477890 498424 344572 182876 110325 93454
40493I3454K6289P7158P937k27343l85938k23489J13114K50431J05005l1600N4992
$$ 93454 119743 196901 204838 -22505 -408443 -631932 -518818 -268387 -163382 -194982 -139990
40482a39990K16170K03434K8912p8902J2842J92586K42596P0543j83900k75448
$$ -139990 76180 279614 308526 229624 242466 435052 677648 748191 564291 288843
40472B88843j25980O3453N9932q2272j00039P8077K03834P1312j68850k17783
$$ 288843 162863 226316 286248 203976 103937 182014 385848 457160 288310 70527
40462G0527l5468J45763J52962L1645j01140j76856j43339K761J19417L9956j52920
$$ 70527 35059 180822 333784 365429 264289 87433 -55906 -53145 66272 106228 -46692
40451d6692j67923Q3276L11475K37737j9272j42466o3409K8518L3209L0250N2788
$$ -46692 -214615 -131339 180136 417873 398601 256135 192726 221244 254453 284703 337491
40440C37491L7775K0313J16760K56023J91738r8495k69129m9484L43646M51909
$$ 337491 375266 395579 512339 768362 960100 861605 592476 542992 886638 1338547
40430A338547J41146k73295m27405k74065n0352M684j24301k43086j87982l0722
$$ 1338547 1479693 1206398 778993 504928 454576 459260 334959 91873 -96109 -126831
40420a26831L3062k6422m7346M2312J12301P7417N2341J20929J42772j5667k09307
$$ -126831 -93769 -120191 -167537 -125225 -12924 64493 116834 237763 380535 364868 155561
40409A55561k01367j9967J03778Q5562M0057K1196m3265j44038j49940m0533J2866
$$ 155561 -45806 -65773 38005 123567 163624 184820 141555 -2483 -152423 -192956 -180090
40398a80090j03557k56150k34825l3252J44674J36470J0756j9055J42102L43154
$$ -180090 -283647 -539797 -774622 -807874 -663200 -526730 -515974 -535029 -392927 -49773
40388d9773L79402K72179K31635L37573M23990L48946K13634J93713K86063L58297
$$ -49773 329629 601808 833443 1171016 1595006 1943952 2157586 2351299 2637362 2995659
40378B995659L50414L11090L23672M75913P80852J062345J090751R15184Q60686
$$ 2995659 3346073 3657163 3980835 4456748 5237600 6299945 7390696 8305880 9166566
40369I166566J108539J523321J985660K578051L328757M188474N387094P123383
$$ 9166566 10275105 11798426 13784086 16362137 19690894 23879368 29266462 36389845
40361C6389845Q452758P297394K623797l671541q124465r027374p578332n790285
$$ 36389845 44842603 52139997 54763794 51092253 42967788 33940414 26362082 20571797
40353B0571797m405479l209185k217761j641791j289505q61872n25416n45523
$$ 20571797 16166318 12957133 10739372 9097581 7808076 6946204 6420788 5875265
40345E875265o63040m70631j42377j36851l70448l59701q5049k6451l11711m83977
$$ 5875265 5212225 4741594 4599217 4462366 4091918 3732217 3647168 3620717 3309006 2825029
40335B825029k77984n5660j95846m92908n01574j95723N1057J415k01414k83853
$$ 2825029 2547045 2491385 2295539 1802631 1301057 1105334 1156391 1157806 956392 672539
40325F72539j51541O5487J81562J34941J1869q1764j15196r0929q575P3104M2593
$$ 672539 520998 586485 768047 902988 914857 833093 717897 626968 618393 691497 734090
40314G34090j10619k38553k13520p9181L7730O1069k8884j74740j95230L2550
$$ 734090 623471 384918 171398 92217 129947 191016 162132 -12608 -207838 -175288
40304a75288K96464K32546j18908k80323l7411K09605Q5295j55095q1440J72162
$$ -175288 121176 353722 234814 -45509 -82920 126685 211980 56885 -24555 147607
40294A47607J56503j11119j95638P441J48378O6076R897J21061J87615P0227n9982
$$ 147607 304110 192991 -2647 4794 153172 219248 229145 350206 537821 608048 548066
40283E48066p6669r9690j74424j30969N0596J03547q4186k38807j42706K1888
$$ 548066 471397 371707 197283 66314 116910 220457 136271 -102536 -245242 -223354
40273b23354K5323k8687L5001J04804J2106j13947o0823Q0639Q1257j8059J221
$$ -223354 -198031 -226718 -191717 -86913 -74807 -188754 -249577 -168938 -87681 -105740 -104519
40262a04519J37142J88289J07113K5080k8275j28783k05273r1929J48018K42348
$$ -104519 32623 220912 328025 353105 324830 196047 -9226 -101155 46863 289211
40252B89211J08022l8859m7095m1075j46527k47856j97498q1025o2296r0233N721
$$ 289211 397233 358374 311279 270204 123677 -124179 -321677 -402702 -464998 -555231 -549510
40241e49510J85107K10075K2027j23369j8652J73011J51620o1187j45801K5163
$$ -549510 -364403 -154328 -132301 -255670 -274322 -101311 50309 -10878 -156679 -131516
40231a31516J84336Q4767j10313q4725J30379K10546M9185j00909n4717L4128
$$ -131516 52820 137587 27274 -57451 72928 283474 332659 231750 177033 211161
40221B11161k4845j35531j05104J9710M6963l3124n4285L3955R8131M9076m1456
$$ 211161 186316 50785 -54319 -34609 12354 -20770 -75055 -41100 57031 106107 64651
40210F4651p5858l9644L9939J14369Q9926p5781k44238k17527j7687J16077N7820
$$ 64651 -11207 -50851 -10912 103457 193383 117602 -126636 -344163 -361850 -245773 -187953
40199a87953m9121m7710J387j8229m3618M6681J78325J64213J276j20844r9617
$$ -187953 -237074 -284784 -283397 -301626 -345244 -298563 -120238 43975 45251 -75593 -175210
40188a75210j3699O6052J51038J92204R0729p9151r5437N0722O9761j73834l71955
$$ -175210 -188909 -122857 28181 220385 311114 231963 136526 187248 257009 83175 -288780
40177b88780j98324J76624L21412J61135j951j7713m2766j42162j28238Q0836
$$ -288780 -487104 -310480 10932 172067 170116 152403 109637 -32525 -160763 -79927
40167g9927K67593K38088P4878p4070k04053l04917k59421o1050R5246R8356O5322
$$ -79927 187666 425754 500632 426562 222509 -82408 -341829 -402879 -307633 -209277 -143955
40156a43955O2762k6794j83312j31852J88640L76755J43282j72469j03125J78881
$$ -143955 -81193 -107987 -291299 -423151 -234511 142244 285526 113057 9932 188813
40146A88813J28871k68583m53547j71793J56513J17278j14709j37553P4432K36505
$$ 188813 317684 49101 -404446 -576239 -419726 -302448 -417157 -554710 -480278 -243773
40136b43773K17579J42429J11740O7558l3776p6354O8405K77267K18398k02997
$$ -243773 -26194 116235 227975 295533 261757 185403 253808 531075 749473 546476
40126E46476n67736l98285J39148L80355R7324j88853o5764J28177l9636k88215
$$ 546476 -21260 -419545 -280397 99958 197282 8429 -57335 70842 31206 -257009
40116b57009j12401K76432K62264j16630k33939M7134J91857k4242j71829j5663
$$ -257009 -369410 -92978 169286 52656 -181283 -134149 57708 33466 -138363 -154026
40106a54026Q2937p1657r3302K18660L86381M9754l43723k38339J35593K00358
$$ -154026 -71089 -142746 -236048 -17388 368993 418747 75024 -163315 -27722 172636
40096A72636k9032r9366O7509J60901J04670R9507J45516N1065j47868k35347
$$ 172636 143604 44238 111747 272648 377318 476825 622341 673406 525538 290191
40086B90191k07453k01052j43025R6229L13973K07381q1730j28081J08735K48883
$$ 290191 82738 -118314 -261339 -165110 148863 356244 274514 146433 255168 504051
40076E04051J27355m745K5719N7882m5749j55560j31612l9775M525j4252p6529
$$ 504051 631406 626661 652380 710262 664513 508953 377341 337566 342091 327839 251310
40065B51310j41291r9203P4267J73791K8245j70686j17720J03490J41145l8110
$$ 251310 110019 10816 85083 258874 287119 116433 -1287 102203 243348 205238
40055B05238j05210N3464J48778J012j57083p6417J29340K01546Q5696j06128
$$ 205238 100028 153492 302270 303282 146199 69782 199122 400668 486364 380236
40045C80236k64371k76978p3544J95602K38710J0534j86255j17696O6530Q1694
$$ 380236 115865 -161113 -234657 -39055 199655 210189 23934 -93762 -27232 54462
40035E4462j04753k87238k91057j02343J62708L25492K75557Q9847n9474j09052
$$ 54462 -50291 -337529 -628586 -730929 -568221 -242729 32828 122675 63201 -45851
40025d5851j04478n3606M2893P3607m3451j49418l7651J76508J85445j8627j24504
$$ -45851 -150329 -203935 -161042 -87435 -130886 -280304 -317955 -141447 43998 25371 -99133
40014i9133r574R7305M1382l7832l2030m4657r8740l3937J28912J05423j49880
$$ -99133 -108707 -11402 29980 -7852 -39882 -84539 -183279 -217216 -88304 17119 -132761
40003a32761k55818k928K53660J57612o2326j2850J69899P3799k47163l48159
$$ -132761 -388579 -391507 -137847 19765 -42561 -55411 114488 188287 -58876 -407035
39993d07035j29697M3278k7475j18651l9876R7642J77542K44812K54935M9957
$$ -407035 -536732 -493454 -520929 -639580 -679456 -581814 -404272 -159460 95475 145432
39983A45432k60807k89630M6687L04177J43841j57999j74327o09k6418k34347
$$ 145432 -115375 -405005 -358318 -54141 89700 -68299 -242626 -243235 -269653 -504000
39973e04000k30603P5612L17970K71666J56795J79723J79408j0561j89466j16420
$$ -504000 -734603 -658991 -341021 -69355 87440 267163 446571 436010 246544 130124
39963A30124M3482j8329k18850k27640m8902n297j43129j32393J29298K85303
$$ 130124 173606 155277 -63573 -291213 -340115 -345412 -488541 -620934 -491636 -206333
39953b06333J16811o4488M9519K14795N5640k47631k10569J55611L35048R8439
$$ -206333 -89522 -154010 -104491 110304 165944 -81687 -292256 -136645 198403 296842
39943B96842j98562k12645o3682m336j2191M3801J05766N3405n5208q8849n3230
$$ 296842 98280 -114365 -178047 -182383 -194574 -150773 -45007 8398 -46810 -135659 -188889
39932a88889k1260J7526Q0991R3486J2297o1433m2891k0446j00801j99980j53878
$$ -188889 -210149 -192623 -111632 -18146 -5849 -67282 -110173 -130619 -231420 -431400 -585278
39921e85278K7840J69257J54123K7440r6128j27783l8679J14513K09455J58360
$$ -585278 -557438 -388181 -234058 -206618 -302746 -430529 -469208 -354695 -145240 13120
39911A3120j0691j70412j69625N2080L38905L82068O8919k82147k56080R5151
$$ 13120 2429 -167983 -337608 -285528 53377 435445 504364 222217 -33863 61288
39901F1288K86457N6655k90398l42870j17768P4736J00763P2861O6614L1898m0079
$$ 61288 347745 404400 114002 -228868 -346636 -271900 -171137 -98276 -31662 236 -39843
39890c9843p1266l4858K262j0888n1490p0270l1156O9462J69138J68396M5552
$$ -39843 -111109 -145967 -143705 -154593 -206083 -276353 -307509 -238047 -68909 99487 145039
39879A45039r9776j52872q9009L3112J15724P5383n3406j01354K1469J49526Q2686
$$ 145039 45263 -107609 -196618 -163506 -47782 27601 -25805 -127159 -105690 43836 126522
39868A26522p7789p0771Q0133R4016o4668r4905J05904K16233K5099j82193q8420
$$ 126522 48733 -22038 58095 152111 87443 -7462 98442 314675 339774 157581 69161
39857F9161J20486O6117k03124l04928j01300J81015L19681K68357M9432k21025
$$ 69161 189647 255764 52640 -252288 -353588 -172573 147108 415465 464897 243872
39847B43872k91957n9617J98803J61060q3925k15938j73860j11044j1017K18254
$$ 243872 -48085 -107702 91101 252161 168236 -47702 -221562 -332606 -343623 -125369
39837a25369L69698J50030k57942l52930o9170J43014O7875n54J03201Q7759j86791
$$ -125369 244329 394359 136417 -216513 -285683 -142669 -74794 -75348 27853 115612 -71179
39826g1179l20240j6912L38193K55919o3212q4620J62101J74491j34231k86306
$$ -71179 -391419 -408331 -70138 185781 122569 37949 200050 374541 240310 -45996
39816d5996n0150J89771Q6730j29480p7438J68830K52568Q6276j16586k25604
$$ -45996 -96146 93625 180355 50875 -26563 142267 394835 481111 364525 138921
39806A38921k78118k47490n1189J96436K34145L6434j03841K877J61871J11340
$$ 138921 -139197 -386687 -437876 -241440 -7295 29139 -74702 -71825 90046 201386
39796B01386o4437q2695Q2427J69705M4526j27369j84529j99127k65618k69079
$$ 201386 136949 54254 136681 306386 350912 223543 39014 -160113 -425731 -694810
39786f94810p0590K01583K71499Q7159j16990j27879L1583K03674K65278J69111
$$ -694810 -765400 -563817 -292318 -205159 -322149 -450028 -418445 -214771 50507 219618
39776B19618m8829k49013k79663j46323j0952K2502L0708J12679K01731J58932
$$ 219618 170789 -78224 -357887 -504210 -515162 -492660 -461952 -349273 -147542 11390
39766A1390J8011j6473J32008K47310R1130k29276l55355j60218P2234O2592p2092
$$ 11390 29401 12928 144936 392246 483376 254100 -101255 -261473 -189239 -126647 -198739
39755a98739m9257J12680J48796L9j08496n6458J5648O909J4139Q5734J04803
$$ -198739 -247996 -135316 13480 13519 -94977 -151435 -135787 -128878 -114739 -29005 75798
39744G5798M4518N2365J37485Q6123j29738j98741K6519K14835O9278j67608j20209
$$ 75798 120316 172681 310166 396289 266551 67810 94329 309164 378442 210834 90625
39733I0625R0343R1800q0349r1372N7413M7597j42903j80802K8510J79740Q5554
$$ 90625 180968 272768 192419 101047 158460 206057 63154 -117648 -89138 90602 176156
39722A76156q3436j62816j85141j35975N6575K21643Q8320j92474j64888J81615
$$ 176156 92720 -70096 -255237 -391212 -334637 -112994 -24674 -217148 -382036 -200421
39712b00421L28142P3547j26825M0272K05162o011k89819j90936J24485J95641
$$ -200421 127721 201268 74443 114715 319877 313866 24047 -166889 -42404 153237
39702A53237K7078o6930r6742k54669l50684n3585M11655M70505R2876j55268
$$ 153237 180315 113385 16643 -238026 -588710 -642295 -230640 239865 332741 177473
39692A77473j3126J47936M6303o3712O8604K18116R2176j75892k82662k07669
$$ 177473 164347 312283 358586 294874 363478 581594 673770 497878 215216 7547
39682G547j00343K8520J96446K48657P6347j29513j30055o831k954j15323j32289
$$ 7547 -92796 -64276 132170 380827 457174 327661 197606 190775 187821 72498 -59791
39671e9791m360J02388R6800N6317L1415j6778o5338k6104O7669O3572o2770j40913
$$ -59791 -64151 38237 135037 191354 222769 205991 140653 114549 182218 245790 183020 42107
39659D2107o9288J6454m1679j69657j76917n3948J8364m3755r1152L2084K35155
$$ 42107 -27181 -10727 -52406 -222063 -398980 -452928 -434564 -478319 -569471 -537387 -302232
39648c02232K76927Q9882j09469p4954J75185L78457L12351J0293k88109l59088
$$ -302232 -25305 64577 -44892 -119846 55339 433796 746147 756440 468331 109243
39638A09243j78718P1069J74054P6087r1867j79361j55769o8538N3142J73959
$$ 109243 -69475 1594 175648 251735 159868 -19493 -175262 -243800 -190658 -16699
39628a6699J93490L6661j95782k79517j11830J63419L07686K14095k4704k04700
$$ -16699 176791 213452 17670 -261847 -373677 -210258 97428 311523 286819 82119
39618H2119j59993Q3221K75889J74211j51065l47027k03896O9950J32911k9599
$$ 82119 -77874 5347 281236 455447 304382 -42645 -246541 -176591 -43680 -73279
39608g3279j27623j2967J30795J01764l0991q4332m5298k4872l4195J194N8500
$$ -73279 -200902 -213869 -83074 18690 -12301 -96633 -141931 -166803 -200998 -199804 -141304
39597a41304M0686l3911m6815J0850K4923k4048k0836N7931P8009o990m5960M8794
$$ -141304 -100618 -134529 -181344 -170494 -145571 -169619 -190455 -132524 -54515 -61505 -107465 -58671
39585e8671J25390M5310o2277j1383J11346P0803j42836l04024k76389j28868
$$ -58671 66719 112029 49752 38369 149715 220518 77682 -226342 -502731 -631599
39575f31599M4314K03656K75559J94300M3169k7438j5906k6898n0256N059Q9016
$$ -631599 -587285 -383629 -108070 86230 129399 101961 86055 59157 8901 13960 102976
39564A02976O6029k2336j2398O6403K2541j27772j40641L7119J54132O6772n2085
$$ 102976 169005 146669 134271 200674 223215 95443 -45198 -8079 146053 212825 160740
39553A60740m8216j2296j9970K3965J01836m428k86338l59074m1271K67705J67987
$$ 160740 112524 100228 80258 104223 206059 201631 -84707 -443781 -485052 -217347 -49360
39542d9360j03336p2156J94294K45156L2176l7749J71304K90786O0396k73379
$$ -49360 -152696 -224852 -30558 214598 246774 209025 380329 671115 731511 458132
39532D58132l55839j86124M021Q1913O0454m034l9036p441K8089J7933N9942K30420
$$ 458132 102293 -83831 -79810 2103 62557 58523 19487 12046 40135 58068 118010 348430
39520C48430L46799J65546k08526m03723k87139r7649l6415k2097O7757J83044
$$ 348430 695229 860775 652249 248526 -38613 -136262 -172677 -194774 -127017 56027
39510E6027K30835K00663R1824q1688j88152j03997N4740P4164r899k401N3786
$$ 56027 286862 487525 579349 497661 309509 205512 260252 334416 324517 322116 375902
39499C75902n2476k41552j96905O4923J58797j2990q0742J18067K20523k064j91459
$$ 375902 323426 81874 -115031 -50108 108689 95699 14957 133024 353547 351483 160024
39488A60024k3083J97093O8028j75731o9926K31901J78795k46391m70445k13749
$$ 160024 136941 334034 402062 226331 156405 388306 567101 320710 -149735 -363484
39478c63484J50431K23639P8006l3986o8198r8390j19165r5343j9980J33183L27101
$$ -363484 -213053 10586 88592 54606 -13592 -111982 -231147 -326490 -346470 -213287 113814
39467A13814L53918O6828k97112l27064K689K82561K27755k890j23556p8629K2187
$$ 113814 467732 534560 237448 -89616 -86927 195634 423389 420499 296943 218314 240501
39456B40501Q9311O5474n9021j69722j32973j11P0932P1597R5550Q7392o5155
$$ 240501 329812 395286 336265 166543 33570 33459 104391 175988 271538 358930 293775
39445B93775k20636j24371J23265J36292j40596l00568j03759J78415K54707K37831
$$ 293775 73139 -51232 72033 208325 67729 -232839 -336598 -158183 96524 334355
39435C34355K93160K50337n6976l62470l01616J8261J86856R7409m415Q339J0915
$$ 334355 627515 877852 820876 458406 156790 175051 361907 459316 454901 463240 474155
39424D74155n1066n5478L9725J13460J03602Q5768R8361R0523O0934N5165K1007
$$ 474155 423089 367611 407336 520796 624398 710166 808527 899050 959984 1015149 1036156
39413A036156j28231k91347k38953M6200K83590K44607M2565l6594R5378K38721
$$ 1036156 907925 616578 377625 423825 707415 952022 994587 957993 1053371 1292092
39403A292092J72922n8168j88541p3069J03287Q5264n8399m1684J36400J29396
$$ 1292092 1465014 1406846 1218305 1145236 1248523 1333787 1275388 1233704 1370104 1499500
39393A499500j79949l94371j77007J86142J88994j32750k89332q6330J71846K16415
$$ 1499500 1319551 925180 748173 934315 1123309 990559 701227 614897 786743 1003158
39383A003158J14118j4439j61642k33513q4284J37862Q4348k08485k59075J09449
$$ 1003158 1117276 1102837 941195 707682 623398 761260 845608 637123 378048 487497
39373D87497L95660J40959l46796m35286q1725J83505O9511j58541j86485n8454
$$ 487497 883157 1024116 677320 242034 160309 343814 413325 254784 68299 9845
39363I845K8827K5400j8833q6986j56242j67085j11576m4545K1899J15841J91298
$$ 9845 38672 64072 45239 -41747 -197989 -365074 -476650 -521195 -499296 -383455 -192157
39352a92157J57447L5604n5655q3210j12865j29518l0438J52514K19319Q8907
$$ -192157 -34710 894 -54761 -137971 -250836 -380354 -410792 -258278 -38959 49948
39342D9948n7249n4746k1619j55110l67902l60135m7898K90187L59744J84936
$$ 49948 -7301 -62047 -83666 -238776 -606678 -966813 -1014711 -724524 -364780 -179844
39332a79844k254q2059j12617j37786r7880L8274J77699K13019J57570J00977
$$ -179844 -182098 -264157 -376774 -514560 -612440 -574166 -396467 -183448 -25878 75099
39322G5099P7579M9330r374p5397j11764r3573k3287M0916J7156q5985j42488
$$ 75099 152678 202008 192634 117237 5473 -88100 -111387 -70471 -53315 -139300 -281788
39311b81788o8260N1283Q1832K3788l6687q8516j55398j55014L058J98127J99326
$$ -281788 -350048 -298765 -216933 -193145 -229832 -318348 -473746 -628760 -625702 -427575 -228249
39300b28249J2932r7835o589R2544J0655j40362j42612K857J24276J32614O4530
$$ -228249 -215317 -313152 -319741 -227197 -216542 -356904 -499516 -496659 -372383 -239769 -175239
39289a75239k6995p8802j2087J41245K04878Q1082r8667j69612j50686j28816
$$ -175239 -202234 -281036 -293123 -151878 53000 134082 35415 -134197 -284883 -413699
39279d13699q0105K0235O3525j2028n2448P3093K08136J41849l1487p8764k3449
$$ -413699 -493804 -473569 -410044 -422072 -474520 -401427 -193291 -51442 -82929 -161693 -185142
39268a85142l4826l8135J51837L66076K26942j99025l86211j28941J47597Q5076
$$ -185142 -219968 -258103 -106266 259810 486752 287727 -98484 -227425 -79828 5248
39258E248p1705J8195J71387M0634k04714j15454K54249L63552J1669l57282l23701
$$ 5248 -66457 -48262 123125 163759 -40955 -156409 97840 461392 473061 115779 -207922
39247b07922m9106O6835l1962j03428l3611P2819J34502J72173J70874P3201p3281
$$ -207922 -257028 -190193 -222155 -325583 -359194 -286375 -151873 20300 191174 264375 191094
39236A91094j29985o7059j2587n3693j12209q6921q016M5044Q5263J52904J76155
$$ 191094 61109 -5950 -18537 -72230 -184439 -271360 -279376 -234332 -149069 3835 179990
39225A79990N1899j56024k60078k04871j20188q3419q820J41280K15537R3011
$$ 179990 231889 75865 -184213 -389084 -509272 -592691 -601511 -460231 -244694 -151683
39215a51683r1115j12533L6555J69466J60474K9158j49687k62670j75087Q7352
$$ -151683 -242798 -355331 -318776 -149310 11164 40322 -109365 -372035 -547122 -459770
39205d59770K64619J72418j1326r926J07589O1984j19911j16158J24626K37230
$$ -459770 -195151 -22733 -34059 -43985 63604 125588 5677 -110481 14145 251375
39195B51375R443k66905k40582j729J23220N0417n6429r1774o3722L1743J65910
$$ 251375 260818 -6087 -246669 -248398 -125178 -74761 -131190 -222964 -286686 -254943 -89033
39184h9033K08954R7681l5527o5832o7019j25151j33615M887J36355P5838o7327
$$ -89033 119921 217602 182075 116243 49224 -75927 -209542 -204655 -68300 7538 -59789
39173e9789o3809N1455O8044j9018l9983m772q2527k33840k11520K1550K00319
$$ -59789 -123598 -72143 -4099 -23117 -63100 -67872 -150399 -384239 -595759 -574209 -373890
39162c73890J66760O8829M8734L4149j8691L1777K26220L16273J11027j78508
$$ -373890 -207130 -138301 -89567 -55418 -74109 -42332 183888 500161 611188 432680
39152D32680k09891J532J34078L3398j28621j62761r0916j6477L5841O2675J4657
$$ 432680 222789 224321 358399 391797 263176 100415 9499 -6978 28863 91538 106195
39141A06195j02492j61765p0166P1245Q8259j3899n9304K0492P4032j5399j09778
$$ 106195 3703 -158062 -228228 -156983 -68724 -82623 -141927 -121435 -47403 -62802 -172580
39130a72580k4191J42013J25926o0421r8807J35337L28709J85599j18501k24135
$$ -172580 -196771 -54758 71168 10747 -88060 47277 375986 561585 443084 218949
39120B18949j38205j31859j99516o4341K51389L30699J7660k53983r6969K10483
$$ 218949 80744 -51115 -250631 -314972 -63583 267116 284776 30793 -66176 144307
39110A44307J63376j50660j95889J19670K74140j2516l00555j46817J44017L431
$$ 144307 307683 157023 -38866 80804 354944 342428 41873 -104944 39073 42504
39100D2504m25539m34805J39486N97927L92317r7426k03600M3517J14992r3564
$$ 42504 -383035 -817840 -678354 -80427 311890 214464 10864 54381 169373 75809
39090G5809j69427M2156J93395Q2465j2705J10128J71672r7242m35847m22697
$$ 75809 -93618 -51462 141933 224398 211693 321821 493493 396251 -39596 -462293
39080d62293j01654J52740J99893J77983J35595J5773p7921J7639J90237J67276
$$ -462293 -563947 -411207 -211314 -33331 102264 118037 40116 57755 247992 415268
39070D15268m3318j53668m1611J18339J83347J89714J47390Q225j09931N100K75873
$$ 415268 371950 218282 176671 295010 478357 668071 815461 823686 713755 718855 994728
39059I94728L44209R2646j46867p5132J58595K34853J33492P9788J61726K33704
$$ 994728 1338937 1431583 1284716 1209584 1368179 1603032 1736524 1816312 1978038 2211742
39049B211742J49404o5165k48800k50953r7736j7847j77264l95305l29981J6464
$$ 2211742 2361146 2295981 2047181 1796228 1698492 1680645 1503381 1108076 778095 794559
39039G94559K31922N3022k59451l01296q3190M6732o8158k08258j30560R5439
$$ 794559 1026481 1079503 820052 518756 435566 482298 414140 205882 75322 170761
39029A70761J95379N3803j30403j01152Q4727R7885j78547m05248k47869R2373
$$ 170761 366140 419943 289540 188388 273115 371000 192453 -212795 -460664 -368291
39019c68291J55888o7327j53242K2235Q1063j60022l07457k9939L57897L74658
$$ -368291 -212403 -279730 -432972 -410737 -329674 -489696 -797153 -827092 -469195 -94537
39009i4537R7678n9837l6556p7064j75914j07970O7098O4104p6213k3259K11854
$$ -94537 3141 -56696 -93252 -170316 -346230 -454200 -387102 -322998 -399211 -422470 -210616
38998b10616K25815o6343k20281j439J87654k2040l23867k36366R6471J60684
$$ -210616 15199 -51144 -271425 -272864 -85210 -107250 -431117 -667483 -571012 -410328
38988d10328p0936j32381J22755K83537P8623j95509j79411K1871J14821J01062
$$ -410328 -481264 -613645 -490890 -207353 -128730 -324239 -503650 -481779 -366958 -265896
38978b65896J39138J59828K761k07103k08070n2632k2529j20973o4791J73974
$$ -265896 -126758 33070 35831 -171272 -379342 -431974 -454503 -575476 -640267 -466293
38968d66293K59793O7093p3391O3169K01031O1477j23834l0490J41914M357k82945
$$ -466293 -206500 -139407 -212798 -149629 51402 112879 -10955 -41445 100469 104826 -178119
38957a78119k18544J69713L06894m984k71425j15901J66430J72073Q465l3425
$$ -178119 -396663 -226950 79944 74960 -196465 -312366 -145936 26137 34602 1177
38947A177j0928r8133j52149J9370K01472O9482k17996k15649R3445K58463N3923
$$ 1177 -9751 -107884 -260033 -240663 -39191 30291 -187705 -403354 -309909 -51446 2477
38936B477k20896k28559k3211J37595J38095K9361r0800j19583j8422J07708J29812
$$ 2477 -218419 -446978 -470189 -332594 -194499 -165138 -255938 -375521 -393943 -286235 -156423
38925a56423Q5455R2210J11970J5973j38044j47078m177O0314n5229j64251j02612
$$ -156423 -70968 21242 133212 149185 11141 -135937 -140114 -79800 -135029 -299280 -401892
38914d01892K8773P3311P6731J55904K43242J61060r4586l07640k97865j23332
$$ -401892 -373119 -299808 -223077 -67173 176069 337129 242543 -65097 -362962 -486294
38904d86294J7683M2564O9502K09725L42942K38775q8720l27534k60737m0657
$$ -486294 -468611 -426047 -356545 -146820 196122 434897 346177 18643 -242094 -282751
38894b82751O9397N1650L4579N012j09537j85121m0124K16188K82720J09392n6574
$$ -282751 -213354 -161704 -127125 -122113 -231650 -416771 -456895 -240707 42013 151405 94831
38883I4831p5049n0573l3176P4507K16898J37848j97680m34216k87508O8038K81424
$$ 94831 19782 -30791 -63967 10540 227438 365286 167606 -266610 -554118 -486080 -204656
38872b04656K70954J69220L6323j12460j58469l4530Q1489j2176k05636k15412
$$ -204656 66298 235518 271841 159381 912 -33618 47871 35695 -169941 -385353
38862c85353q204J62750J36347K7051m135L1772K7906n6744j72548k34760j78286
$$ -385353 -393557 -230807 -94460 -67409 -71544 -39772 -11866 -68610 -241158 -475918 -654204
38851f54204k1173J27448J78361J52550J04324K0572j05744j66060m1560J95143
$$ -654204 -675377 -547929 -369568 -217018 -112694 -92122 -197866 -363926 -405486 -210343
38841b10343L14120J88201o6567k24598j60518O9845K89967L41536K11856K2106
$$ -210343 103777 291978 225411 813 -159705 -89860 200107 541643 753499 775605
38831G75605j20880k05007k26186j33403N4434J78899J16623m3038j21711r2413
$$ 775605 654725 449718 223532 90129 144563 323462 440085 397047 275336 182923
38821A82923n8298m8600j785P2939Q6397K5339l2751o3154j03395j24044n9444
$$ 182923 124625 76025 74240 147179 233576 258915 226164 163010 59615 -64429 -123873
38810a23873K7117q74j06439r6539O0743J61984J00680L4278Q2109J03627j9896
$$ -123873 -96756 -97630 -204069 -300608 -239865 -77881 22799 57077 139186 242813 222917
38799B22917j16157p629J25446L614k56481k83434m1374J14412N338j32848q2119
$$ 222917 106760 99131 224577 228191 -28290 -311724 -353098 -238686 -233348 -366196 -448315
38788d48315N0946J11891J41032J52379P481k53711k92315J4679K59318Q5348
$$ -448315 -397369 -285478 -144446 7933 15414 -238297 -530612 -515933 -256615 -171267
38778a71267k03775j01897K50687K56499j74923m66711k60353J13008K41036J91580
$$ -171267 -375042 -476939 -226252 30247 -144676 -611387 -871740 -758732 -517696 -326116
38768c26116J80054J23567j04686l11813k63605q7806l8309n3802Q5875L11535
$$ -326116 -146062 -22495 -127181 -438994 -702599 -790405 -828714 -882516 -796641 -485106
38758d85106L38760J16516j12502j58184l9049J41420K44619J21425j71776l00952
$$ -485106 -146346 -29830 -142332 -300516 -339565 -198145 46474 167899 -3877 -304829
38748c04829o8081K34021J99130q1817j72624J5764J28595m858r9701P5177L03819
$$ -304829 -372910 -138889 60241 -21576 -194200 -178436 -49841 -54699 -154400 -79223 224596
38737B24596K72312K6838j60433j76878r5012K5709J45384J69807P1795M942J12456
$$ 224596 496908 523746 363313 186435 91423 117132 262516 432323 504118 509060 621516
38726F21516K78647K54790K4940j27184J6083K89159L22043K3958k60801j88415
$$ 621516 900163 1154953 1179893 1052709 1068792 1357951 1679994 1703952 1443151 1254736
38716A254736J08547K03367K427j22257O6188K76492J60955j05224j01724J57012
$$ 1254736 1363283 1566650 1569077 1446820 1513008 1789500 1950455 1845231 1743507 1900519
38706A900519K62929P4598j09357p2265L9286N5783L3528K4534o8311k41401k90351
$$ 1900519 2163448 2238046 2128689 2056424 2095710 2151493 2185021 2209555 2141244 1899843 1609492
38695A609492j33942K2597J5010m1252j1166J0841r0450k14534k23762j70004
$$ 1609492 1475550 1498147 1513157 1471905 1460739 1471580 1381130 1166596 942834 772830
38685G72830j50197j14366p984O4381J0801o5977m3444R446k1620p6106k9510
$$ 772830 622633 508267 500283 564664 575465 509488 466044 475490 453870 377764 348254
38674C48254Q7192J43596R1876k7850j52601j79151l5304J48825J35459o4820
$$ 348254 435446 579042 670918 643068 490467 311316 276012 424837 560296 495476
38664D95476j72285q6919n8627k22142k90423j3759L31520K96268p3393l12837
$$ 495476 323191 236272 177645 -44497 -334920 -348679 -17159 279109 205716 -107121
38654a07121j96045M8105J50648J12393P3926J17163K19490K46527M2126l20136
$$ -107121 -303166 -255061 -104413 7980 81906 199069 418559 665086 707212 387076
38644C87076m90593k49141J65911L58857K72146J27545K1982r8674j73537r2906
$$ 387076 -103517 -352658 -186747 172110 444256 571801 593783 495109 321572 228666
38634B28666J8738o1943k51137k29417O3473L31463L55950K19460N9842q7541
$$ 228666 247404 185461 -65676 -295093 -231620 99843 455793 675253 735095 647554
38624F47554j52171m7602J00190M9040j57415j97684K2557K02380J18889n5341
$$ 647554 495383 447781 547971 597011 439596 241912 264469 466849 585738 530397
38614E30397q6800k7876j2541J5685J16946J35093n1595k45130j87650K6167Q7144
$$ 530397 443597 415721 403180 418865 535811 670904 619309 374179 186529 212696 299840
38603B99840o2640j80249r9768Q9276K33535K70179J84741O669j36308j25694
$$ 299840 237200 56951 -42817 46459 279994 550173 734914 741583 605275 479581
38593D79581k9854k3417j22149j58585m5287J00937J49186J18105P3149l793j29083
$$ 479581 449727 426310 304161 145576 100289 201226 350412 468517 541666 537873 408790
38582D08790j94778o7568K09686M13660L52184M1340l12011m67562l26578j4110
$$ 408790 214012 146444 356130 769790 1121974 1163314 851303 383741 57163 43053
38572D3053K20159K31169J03538J8679L8498Q5920R6546P8325K7322q6018k11346
$$ 43053 263212 494381 597919 616598 655096 741016 837562 915887 943209 857191 645845
38561F45845k24063j01022K0924L6404O862J4476P370q3095j86157k01842j62534
$$ 645845 421782 320760 341684 378088 384950 399426 406796 323701 137544 -64298 -226832
38550b26832j26594l0432J57579K58879J12105j15071j27790M5988J19899K2299
$$ -226832 -353426 -383858 -226279 32600 144705 29634 -98156 -52168 67731 90030
38540I0030m5899k2008o2061j57843p9814J80493L05321J43993o7089j39545j82015
$$ 90030 44131 22123 -39938 -197781 -277595 -97102 208219 352212 285123 145578 -36437
38529c6437k24649n4707K95496L70963j3535l44089j36824K94924L40308K6679
$$ -36437 -261086 -315793 -20297 350666 337131 -6958 -143782 151142 491450 518129
38519E18129j49255p7593o6108j54838o9539J61462J72026r7432k76362j77587
$$ 518129 368874 291281 225173 70335 796 162258 334284 236852 -39510 -217097
38509b17097l3193j9600j8166M5498O6752O4129J86664L36668K27175r9105k65103
$$ -217097 -250290 -269890 -288056 -242558 -175806 -111677 74987 411655 638830 539725 274622
38498B74622j62923p9141j15551k2157K22742K30000j31681m07812k40383Q0649
$$ 274622 111699 32558 -82993 -105150 117592 347592 215911 -191901 -432284 -351635
38488c51635J23458l0787m3372J04421J97765J94695J73477Q8457r1934k00328
$$ -351635 -228177 -258964 -302336 -197915 -150 194545 368022 456479 364545 164217
38478A64217j13631J2895M405n8117n2063n3610j25861j30706M366J05123P0639
$$ 164217 50586 63481 67886 9769 -42294 -95904 -221765 -352471 -348105 -242982 -172343
38467a72343O6742J59981J20952j20292k23389N83J89466K6639j70390J5168L41350
$$ -172343 -105601 54380 175332 55040 -168349 -167766 21700 48339 -122051 -106883 234467
38456B34467K97635k9948j46486n198J3035j30273q5612J63840K15810k9275j84381
$$ 234467 532102 502154 355668 350470 363505 233232 147620 311460 527270 497995 313614
38445C13614n6149O4312k6027j06714L665J16258N3970l3184J4885P2887j4103
$$ 313614 257465 321777 295750 189036 192701 308959 362929 329745 344630 417517 403414
38434D03414j60175k15392j64361j9978K10447L55513J87434j90986l89075k68457
$$ 403414 243239 27847 -136514 -156492 53955 409468 596902 405916 16841 -251616
38424b51616r9969p0333k2650J43306K16460O6228o7789L9514K21583K07882L2619
$$ -251616 -351585 -421918 -444568 -301262 -84802 -18574 -86363 -46849 174734 382616 415235
38413D15235j06249j61696j69211r1653M4185Q5322K1637N2035J96970J78944
$$ 415235 308986 147290 -21921 -113574 -69389 15933 37570 89605 286575 465519
38403D65519p5045j95095M2693K75982J24208j62526j35867P2210J0567k52246
$$ 465519 390474 195379 238072 514054 638262 475736 339869 412079 422646 170400
38393A70400k25026J28322K89536M6785j80778p0216J22309Q1100n4769l2468
$$ 170400 -54626 73696 363232 410017 229239 159023 281332 362432 307663 275195
38383B75195N5215J5122n3844J7373J00418m578j65695j17952O7863R5574m6782
$$ 275195 330410 345532 291688 309061 409479 404901 239206 121254 189117 284691 237909
38372B37909o9421J16059K34634Q7095j43939j86725o6855j0966q6349j31169
$$ 237909 168488 284547 519181 606276 462337 275612 208757 197791 111442 -19727
38362a9727k3500J29287J28337m9765k05757j65255r252M2871m1427o1422Q2854
$$ -19727 -43227 86060 214397 164632 -41125 -206380 -215632 -172761 -214188 -275610 -192756
38351a92756J99315J01130o8299m6368J16325J32903l4109r8145O4230J84559
$$ -192756 6559 107689 39390 -6978 109347 242250 208141 109996 174226 358785
38341C58785L9777j71044j46583M0962R9281k165m0400M5583R2486N6347P6201
$$ 358785 398562 227518 80935 121897 221178 219013 178613 224196 316682 373029 449230
38330D49230J46529O3440j93141l39790k09933n680N5076N5431J11299Q1100j33944
$$ 449230 595759 659199 466058 126268 -83665 -89345 -34269 21162 132461 213561 79617
38319G9617k56820j7675L07935K29739j64550k86624L1537K63923N0732k14391
$$ 79617 -177203 -194878 113057 342796 178246 -108378 -76841 187082 237814 23423
38309B3423n1590K93180K47778j43681k98155l8159J67641J8370j44192M0724
$$ 23423 -28167 265013 512791 369110 70955 32796 200437 218807 74615 115339
38299A15339L23257K52366r4586k58628j14551K8885J352j3847R1135J25154j9749
$$ 115339 438596 690962 596376 337748 223197 252082 253434 239587 330722 455876 436127
38288D36127j14471K9280J99485R6384j86259l05234j76778l0535j1418k8213
$$ 436127 321656 350936 550421 646805 460546 155312 -21466 -52001 -63419 -91632
38278i1632M102M5838Q4338J58897K05188J18503n80O1720K39027J94581j50136
$$ -91632 -87530 -41692 42646 201543 406731 525234 524654 586374 825401 1019982 869846
38267H69846m09772k63789Q3856K35303J60332J15048J62310J23241n5860k11088
$$ 869846 460074 196285 280141 515444 675776 790824 953134 1076375 1020515 809427
38257H09427k36416j82704p3056J21074K88440K22516n6065k36856r7035K11084
$$ 809427 573011 390307 317251 438325 726765 949281 893216 656360 559325 770409
38247G70409L60144K28239j2973j20943k7169J11486R9394m4728j00437K3239
$$ 770409 1130553 1358792 1345819 1224876 1197707 1309193 1408587 1363859 1263422 1286661
38237A286661J08071n7304l10502l16794o7949J16436Q1016R240M3168N5146n4361
$$ 1286661 1394732 1337428 1026926 710132 642183 758619 839635 848875 892043 947189 892828
38226H92828j23899j0707J24113N5256j41504k08077q2309O9957J28495J10393
$$ 892828 768929 758222 882335 937591 796087 588010 505701 575658 704153 814546
38216H14546L1964j16934k61247k68067j09383J03098K39198K33267R6459o6171
$$ 814546 846510 729576 468329 200262 90879 193977 433175 666442 762901 696730
38206F96730j13174l3695J9160m3687r7011j1263J14483J19170O8073J30193K38637
$$ 696730 583556 549861 569021 525334 428323 417060 531543 650713 718786 848979 1087616
38195A087616J65043o8822j64313p843J37648N0857j05286p3481Q0415J09038
$$ 1087616 1252659 1183837 1019524 1011681 1149329 1200186 1094900 1021419 1101834 1210872
38185A210872K699l0346N2782O0403r4502k43866k30048j10825o471O7113J01504
$$ 1210872 1213571 1183225 1236007 1296410 1201908 958042 727994 617169 610698 677811 779315
38174G79315J9473j49607j82655M6632L07012K70378l0472k46883j98920n9689
$$ 779315 798788 649181 466526 513158 820170 1090548 1060076 813193 614273 554584
38164E54584j8718k3004L4112R4563P1877K8386L2302j1856j78646k92723j44402
$$ 554584 535866 512862 546974 641537 713414 741800 774102 762246 583600 290877 146475
38153A46475J28245J61451j04943k98090j24254K18659L22144J11414j10385j10881
$$ 146475 274720 436171 331228 33138 -91116 127543 449687 561101 450716 339835
38143C39835k563j1203j32872j65995l3002R3937M6157q9599j04959J5849R5856
$$ 339835 337272 326069 193197 27202 -5800 88137 134294 44695 -60264 -44415 51441
38132E1441O6180N0457R2963M3838j38008j99802M3028L32453K66964j09618l48638
$$ 51441 117621 168078 261041 304879 166871 -32931 10097 342550 609514 499896 151258
38121A51258k17370M5576J48146J05786P1928Q5560J41375K77008M23929L83785
$$ 151258 -66112 -20536 127610 233396 305324 390884 532259 809267 1233196 1616981
38111A616981J39196j227K26556O83840J042702J191335J178469R04772K16505
$$ 1616981 1756177 1754950 1981506 2665346 3708048 4899383 6077852 6982624 7199129
38102G199129o98202j322301j333523r31088n47965l86372l39823k59589j56972
$$ 7199129 6500927 5178626 3845103 2914015 2366050 1979678 1639855 1380266 1223294
38093A223294j46462k64476l89508l61220j67823L6752J16389Q4604K2878l9577
$$ 1223294 1076832 812356 422848 61628 -106195 -69443 46946 131550 154428 114851
38083A14851r4571r2788j7992L5556l0099j66767k33980j75177n7016L2481M5836
$$ 114851 20280 -72508 -90500 -54944 -85043 -251810 -485790 -660967 -717983 -685502 -639666
38072f39666j8250q7746n1008R0121J68886O9080q2928r1016Q727Q139j34548
$$ -639666 -657916 -745662 -796670 -706549 -537663 -468583 -551511 -642527 -633800 -625661 -760209
38061g60209k27634j47598m085O8402R4414J26063J01989r763o6175O4997K59238
$$ -760209 -987843 -1135441 -1139526 -1071124 -976710 -850647 -748658 -758421 -824596 -759599 -500361
38050e00361K77140J13773o173Q969o550j47332k11041l969K74992K35747j37823
$$ -500361 -223221 -109448 -115621 -106652 -113202 -260534 -471575 -475544 -200552 35195 -102628
38039a02628m08024k60969Q2779K13125Q9744j405O2194J08438L7640J1739J53924
$$ -102628 -510652 -771621 -688842 -475717 -385973 -387378 -325184 -216746 -179106 -167367 -13443
38028a3443L03416K58161R7326N0817J43185J82282P4276m4984k6742Q2027J08619
$$ -13443 289973 548134 645460 696277 839462 1021744 1096020 1051036 1024294 1106321 1214940
38017A214940l4006k44384l21410j70759O3325J39455L1893j0714J74553L68220
$$ 1214940 1180934 936550 615140 444381 507706 647161 679054 668340 842893 1211113
38007A211113K35872j58090l63628j39930J99770K05988j11894l42926k54349
$$ 1211113 1446985 1288895 925267 785337 985107 1191095 1079201 736275 481926
37998D81926m5854J7494l1853k7811R4q1456j82704o6495K22946L24377R0682
$$ 481926 436072 453566 421713 393902 393996 312540 129836 63341 286287 610664 701346
37987G01346j40702m8927J58033Q5169j74904j66534J65844L36992O9441k79841
$$ 701346 560644 511717 669750 754919 580015 413481 579325 916317 985758 705917
37977G05917k95457j09011o9780j19007N1271L75538M33942R7946k56757k83628
$$ 705917 410460 301449 231669 112662 163933 539471 973413 1071359 814602 530974
37967E30974q6157L9088K5195J4728P4296J14305M2909j11773k24709j88061k4791
$$ 530974 444817 483905 509100 523828 598124 712429 755338 643565 418856 230795 206004
37956B06004J22845J54604J14776P7816K0553q3078j37245n7746M5543J7451o6133
$$ 206004 328849 483453 598229 676045 696598 613520 476275 418529 464072 481523 415390
37945D15390o160J54931J52398o5993k07274o8956J38772J04924j28974k60055
$$ 415390 409230 564161 716559 650566 443292 374336 513108 618032 489058 229003
37935B29003j63268k093O7729Q5854J38640J90590J54645M3512l8502l1157J4087
$$ 229003 65735 63642 131371 217225 355865 546455 701100 744612 706110 674953 689040
37924F89040J2150m0919o3600k248Q8874J14280N5155l0041j00847j58080j73045
$$ 689040 701190 660271 596671 594423 683297 797577 852732 822691 721844 563764 390719
37913C90719q3124R6813K24432J65901l4384j83226j51182q521Q5796R2416J11888
$$ 390719 307595 404408 628840 794741 760357 577131 425949 417428 503224 595640 707528
37902G07528J93645K31996J28245l2614r2727n0689k6326l6256J252M5154m7917
$$ 707528 901173 1133169 1261414 1228800 1136073 1085384 1059058 1022802 1024054 1069208 1021291
37891A021291k34247k72238j07415m1r9188j62176M9385L35760L48494J34540
$$ 1021291 787044 514806 407391 407350 308162 145986 195371 531131 879625 1014165
37881A014165J7713M9116j2413j96332k20556K3733K62501K61691J48030J26619
$$ 1014165 1031878 1080994 1068581 872249 651693 675426 937927 1199618 1347648 1474267
37871A474267J38522J9862j76115k40252j08432O4467J01557j6403j49515j48859
$$ 1474267 1612789 1632651 1456536 1216284 1107852 1172319 1273876 1257473 1107958 959099
37861I59099k7894N6950L8882L5851J06738Q9675j03988k20257j1321K91842K70987
$$ 959099 931205 988155 1027037 1062888 1169626 1259301 1155313 935056 923735 1215577 1486564
37850A486564K120m8005J88346K54501l1336k30609j9313K65487K12616J2549
$$ 1486564 1488684 1440679 1629025 1883526 1852190 1621581 1602268 1867755 2080371 2092920
37840B092920N6646K21605J12815k11039l31382j75221p8892j64808j64357O4651
$$ 2092920 2149566 2371171 2483986 2272947 1941565 1766344 1687452 1522644 1358287 1422938
37830A422938K79935K43889L6747j37120j85151q8142J17695K55290J54003o2753
$$ 1422938 1702873 1946762 1983509 1846389 1661238 1573096 1690791 1946081 2100084 2037331
37820B037331r2440R4330J98389O7018p9160l7443M5700m6774k11236j77329O0955
$$ 2037331 1944891 2039221 2237610 2304628 2225468 2188025 2233725 2186951 1975715 1798386 1859341
37809A859341K24923J44532k9938n5857R0862K11679J45471m1418j46567o8656
$$ 1859341 2084264 2228796 2198858 2143001 2233863 2445542 2591013 2549595 2403028 2334372
37799B334372J09245K56730L19079K85522J57841J6216q19J26171K43694K37559
$$ 2334372 2443617 2700347 3019426 3304948 3462789 3479005 3478186 3604357 3848051 4085610
37789D085610J81275J79198K08570K36400L19853M30535L71814Q8626j30614l8153
$$ 4085610 4266885 4446083 4654653 4891053 5210906 5641441 6013255 6101881 5971267 5933114
37779E933114J55558P8160k22009l63677k22508l3159O6296J69259K55782J48115
$$ 5933114 6088672 6166832 5944823 5581146 5358638 5325479 5391775 5561034 5816816 5964931
37769E964931r6644j65231O362J06703r996o7367J26988L21484K63138J41333
$$ 5964931 5868287 5703056 5709418 5816121 5806125 5738758 5865746 6187230 6450368 6591701
37759F591701K32625L97573L33008J14506P4756K66072M27145M18121L47960L07584
$$ 6591701 6824326 7221899 7554907 7669413 7744169 8010241 8437386 8855507 9203467 9511051
37749I511051K83728L18055M76166O68833P42825P21336P31111P51998O88613
$$ 9511051 9794779 10112834 10589000 11257833 12000658 12721994 13453105 14205103 14893716
37740A4893716O24542P19692Q99078R52171R23378J069275J402845J633521J647584
$$ 14893716 15518258 16237950 17137028 18089199 19012577 20081852 21484697 23118218 24765802
37731B4765802J701615J991265K353694K606649K892004L407147M015301M444041
$$ 24765802 26467417 28458682 30812376 33419025 36311029 39718176 43733477 48177518
37723D8177518M752867N290927O224437P381889Q589980R922854J1544150J3491577
$$ 48177518 52930385 58221312 64445749 71827638 80417618 90340472 101884622 115376199
37715A15376199J5734931J8333079K1409529K5005318K9021611L3259840L7384738
$$ 115376199 131111130 149444209 170853738 195859056 224880667 258140507 295525245
37708B95525245M0711280M1955369L9311654L1182855J7373548j14638j7574563
$$ 295525245 336236525 378191894 417503548 448686403 466059951 465945313 448370750
37701D48370750l1293698l9275865m1754938m0373504l6952964l2771832k8502138
$$ 448370750 417077052 377801187 336046249 295672745 258719781 225947949 197445811
37694A97445811k4438929k0741044j7587280j5141483j3331517j1768959j0092686
$$ 197445811 173006882 152265838 134678558 119537075 106205558 94436599 84343913
37687H4343913q401997p134806o442692n921356n134657m199251l572701l378324
$$ 84343913 75941916 68807110 62364418 56443062 51308405 47109154 43536453 40158129
37679D0158129l270189k958354k532909k180419j891527j620215j465276j460101
$$ 40158129 36887940 33929586 31396677 29216258 27324731 25704516 24239240 22779139
37671B2779139j396461j134925r17850j034732j283929j175887o83267l55439
$$ 22779139 21382678 20247753 19329903 18295171 17011242 15835355 15152088 14796649
37663A4796649n33077q48424p90738m47530k90895m27030n17350l95730l02998
$$ 14796649 14263572 13415148 12624410 12176880 11885985 11458955 10941605 10545875 10242877
37654A0242877m15794n45628m93344l76724l72140l95318l01377j83531j85556
$$ 10242877 9827083 9281455 8788111 8411387 8039247 7643929 7342552 7159021 6973465
37645F973465j99675o8421O2057m7205k59248k08363R6508K34564J4337k51218
$$ 6973465 6773790 6705369 6767426 6720221 6460973 6252610 6349118 6583682 6598019 6346801
37635F346801k57653j16828l9935L2592J95335K71180R1792j33013j02461O8078
$$ 6346801 6089148 5972320 5932385 5964977 6160312 6431492 6523284 6390271 6287810 6355888
37625F355888K0185k49826l76541k17735o9030j86489m24065n02319l88103k39054
$$ 6355888 6376073 6126247 5749706 5531971 5462941 5276452 4852387 4350068 3961965 3722911
37615C722911j53730j30595j41491j26050k5099J01462J15910J9995k7041K3814
$$ 3722911 3569181 3438586 3297095 3171045 3145946 3247408 3363318 3383313 3356272 3380086
37605C380086J3784j45022k86677k43907j11132o1148m4351R1164K68890K39393
$$ 3380086 3393870 3248848 2962171 2718264 2607132 2545984 2501633 2592797 2861687 3101080
37595C101080l5827k91141l02168j38425N008O9906J15863J45499Q8142o1352
$$ 3101080 3065253 2774112 2471944 2333519 2338527 2408433 2524296 2669795 2757937 2696585
37585B696585j88721j78136m8482N8980L2905q4275j46944p4525O7172J56808
$$ 2696585 2507864 2329728 2281246 2340226 2373131 2288856 2141912 2067387 2134559 2291367
37575B291367J43581O7732M679P988N6635M9194p5434k05486j66506j903K7364
$$ 2291367 2434948 2502680 2507359 2515347 2571982 2621176 2545742 2340256 2173750 2171847 2199211
37564B199211j61013k61227N781L98667M01568m4616m09683k97120K4959O2647
$$ 2199211 2038198 1776971 1782752 2181419 2582987 2538371 2128688 1831568 1856527 1919174
37554A919174j83395k89012q6110J19161N3779j36863j67128k4594R7515J11041
$$ 1919174 1735779 1446767 1360657 1479818 1533597 1396734 1229606 1205012 1302527 1413568
37544A413568O2501l1209j58264j99636o3709J13116J27867L8819O6388J70544
$$ 1413568 1476069 1444860 1286596 1086960 1023251 1136367 1264234 1303053 1369441 1539985
37534A539985O4206k53141l44807L2491M62573M04089j9375k07374L0578K64909
$$ 1539985 1604191 1351050 1006243 1038734 1501307 1905396 1886021 1678647 1709225 1974134
37524A974134J71486k0788n976R9761N0989n5067J5582J60795Q7558j63241k42999
$$ 1974134 2145620 2124832 2118856 2218617 2269606 2214539 2230121 2390916 2478474 2315233 2072234
37513B072234n3032R4863l6652k80067l60429k70582j71809j07220j3534Q7644
$$ 2072234 2019202 2114065 2077413 1797346 1436917 1166335 994526 887306 873772 961416
37503I61416R3215j7930j41663j60099m7990R7131J16656m5181k32951k38990
$$ 961416 1054631 1036701 895038 734939 686949 784080 900736 855555 622604 383614
37493C83614p5452N4660P4159J21941K53546K79686P0412j73219j83226k7781
$$ 383614 308162 362822 436981 558922 812468 1092154 1162566 989347 806121 778340
37483G78340J1034j13268j65007k1196J59903K17116J89472J52343O9883o4744
$$ 778340 789374 676106 511099 489903 649806 866922 1056394 1208737 1278620 1213876
37473A213876j27655n1069L6652J0913m0671J8877J17135Q0933o3085j18672m1597
$$ 1213876 1086221 1035152 1071804 1082717 1042046 1060923 1178058 1258991 1195906 1077234 1035637
37462A035637j1323j29786k43168j71997K2233J34681R7229K4789J8223N0490
$$ 1035637 1024314 894528 651360 479363 501596 636277 733506 758295 776518 827008
37452H27008O1327N9815P7402P6711j6620j86168k86846j91027L4462J66482Q2051
$$ 827008 888335 948150 1025552 1102263 1085643 899475 612629 421602 456064 622546 704597
37441G04597q2695j09367R156P5453q565r5438k7063J16361J41700L7087k9394
$$ 704597 621902 512535 521691 597144 588579 493141 466078 582439 724139 761226 731832
37430G31832J5423N2155j4869j00131q3560L12L1250q607k8592J9140P9367Q1903
$$ 731832 747255 799410 784541 684410 600850 601162 632412 623805 595213 614353 693720 775623
37418G75623K2566m5989o4842k0842L0437K6226p392J2190P7802Q6942L0833M1633
$$ 775623 798189 752200 687358 666516 696953 723179 715787 727977 805779 892721 923554 965187
37406I65187J45825J43513p3669k45858p9781K36501K29997j33441l37696p1945
$$ 965187 1111012 1254525 1180856 934998 855217 1091718 1321715 1188274 850578 778633
37396G78633L05313L25311Q4517j2204P4079N1630j25405j93023q2374m0769j66531
$$ 778633 1083946 1409257 1493774 1481570 1555649 1607279 1481874 1288851 1206477 1165708 999177
37385I99177k26210p9371P0055L0915p9685j07835j44490k88146l70965k05783
$$ 999177 772967 693596 763651 794566 714881 607046 462556 174410 -196555 -402338
37375d02338P2262J87908J12239J1350n6829j27018j28771O447J27648M6747j24269
$$ -402338 -330076 -142168 -29929 -18579 -75408 -202426 -331197 -324750 -197102 -150355 -274624
37364b74624j16234O0902J37009K4277q1759o9225n4800r7058p9523J9644L9099
$$ -274624 -390858 -329956 -192947 -168670 -250429 -319654 -374454 -471512 -551035 -531391 -492292
37353d92292o0497q8334L6719J23639N8117K2242J40339J85965n5138l48349k92150
$$ -492292 -552789 -641123 -604404 -480765 -422648 -400406 -260067 -74102 -129240 -477589 -769739
37342g69739Q1678L38202K33602k8332j47896p3940N5629J14754O7412k3202m0577
$$ -769739 -688061 -349859 -116257 -144589 -292485 -366425 -310796 -196042 -128630 -151832 -192409
37331a92409L5725P1367j6345q6707J2117J53034R5678j06954j52288L9122J83529
$$ -192409 -156684 -85317 -101662 -188369 -176252 -23218 72460 -34494 -186782 -147660 35869
37320C5869O7880j28519j12981R6843K21026J04141j13757k01250j02309L3262
$$ 35869 103749 -24770 -137751 -40908 180118 284259 170502 -30748 -133057 -99795
37310i9795N4812K160L1741J58443K06251Q8676k5803J7713R1014J2788r7527
$$ -99795 -44983 -42823 -11082 147361 353612 442288 416485 434198 525212 538000 440473
37299D40473p378J83710J64231m8388j10290M7623P9890j45594k44035O1165M11433
$$ 440473 433095 616805 781036 732648 622358 669981 749871 604277 360242 421407 832840
37288H32840L17876r8205l18856j92202j9323J6032L6962J01605P9525k9192l1079
$$ 832840 1150716 1052511 733655 541453 522130 538162 575124 676729 756254 727062 695983
37277F95983R4842J05589r2846k48254j54106L0783O9619L2510J34958L34523
$$ 695983 790825 896414 803568 555314 401208 431991 501610 534120 669078 1003601
37267A003601L67549J49443j01834j72711r8037k7151Q067O7193J21936O5404
$$ 1003601 1371150 1520593 1418759 1246048 1148011 1120860 1128927 1196120 1318056 1383460
37257A383460q3305j40426k0080R7630K7741r7291j7778J89169J71024j17870
$$ 1383460 1300155 1159729 1139649 1237279 1265020 1167729 1149951 1339120 1510144 1392274
37247A392274k77070q6986J12001j4969k08598n3976K56275J82912k42548m00687
$$ 1392274 1115204 1028218 1140219 1125250 916652 862676 1118951 1301863 1059315 658628
37237F58628n3838K88061J95325m8420m173J85829R8807k13453k85637L2391L52173
$$ 658628 604790 892851 1088176 1039756 1035583 1221412 1320219 1106766 821129 853520 1205693
37226A205693L03629q58j75406n5335J41956J17134j12619k02184N8832L95519
$$ 1205693 1509322 1508464 1333058 1277723 1419679 1536813 1424194 1222010 1280842 1676361
37216A676361L89259R3412m4004J04758J44273j63090m56839l39531q690Q6541
$$ 1676361 2065620 2159032 2115028 2219786 2364059 2200969 1744130 1404599 1395909 1482450
37206A482450n3193q1810O2460J12384j3079r5099k3532N8694M8109j724o6271
$$ 1482450 1429257 1347447 1409907 1522291 1509212 1414113 1390581 1449275 1497384 1495660 1429389
37195A429389j60402j80283l3180J14206M0390j30244j01206O6234L1928k07061
$$ 1429389 1268987 1088704 1055524 1169730 1210120 1079876 978670 1044904 1076832 869771
37185H69771k65509l0288J26034k0453j73645n2401J35335R8290k6752K8276J44096
$$ 869771 604262 573974 700008 679555 505910 453509 588844 687134 660382 688658 832754
37174H32754L7330j86302j57532J53642L74037K75061M1316o2069j6464L2782
$$ 832754 870084 683782 526250 679892 1053929 1328990 1370306 1308237 1291773 1324555
37164A324555j4134j50858k74546k34250K725K37126K26788j1126k15216j97737
$$ 1324555 1310421 1159563 885017 650767 653492 890618 1117406 1106280 891064 693327
37154F93327k8790R8599P7025m9856j40943p4972J11650K16715P8773k13555l85747
$$ 693327 664537 763136 840161 790305 649362 574390 686040 902755 981528 767973 382226
37143C82226k60088N6602K68137J76799r9539k34488p6011J50826J49886k5681
$$ 382226 122138 178740 446877 623676 524137 289649 213638 364464 514350 488669
37133D88669q4267J7978J4433j92502l29789j95204J2886M5102M295R8598K18637
$$ 488669 404402 422380 436813 244311 -85478 -280682 -267796 -222694 -218399 -119801 98836
37122I8836J22145j03300j43245L6426J49953O5423k1833M3291J32444Q1359m2123
$$ 98836 220981 117681 -25564 10862 160815 226238 204405 247696 380140 461499 419376
37111D19376o3969L4286J01304J0992j78759k47798l9417K94133L86941J07502
$$ 419376 355407 389693 490997 501989 323230 75432 36015 330148 717089 824591
37101H24591k26421k53432n4399R435j48789k48742j05657J05370J40136K5137
$$ 824591 598170 344738 290339 299774 150985 -97757 -203414 -98044 42092 67229
37091F7229k4635Q6820K19245J66297p7530k43870q5472K46254L17967J103l08909
$$ 67229 42594 129414 348659 514956 437426 193556 108084 354338 672305 673408 364499
37080C64499k48297P681Q3136l948J7031J16577K9061k04374k45101k9998J22630
$$ 364499 116202 123883 207019 203071 220102 336679 365740 161366 -83735 -113733 8897
37069H897N3639k1466N1040J19554P0402M2915J25956J62550L0963j55510k62773
$$ 8897 62536 41070 92110 211664 282066 324981 450937 613487 644450 488940 226167
37058B26167k83447j88877N7803K72047J87060r4835j77366J4181J31583L0649
$$ 226167 -57280 -246157 -188354 83693 270753 175918 -1448 12733 144316 174965
37048A74965q934J23623J11669j64961k99503l8558K25931J06080j22144l9477
$$ 174965 166031 289654 401323 236362 -63141 -101699 124232 230312 108168 68691
37038F8691J73693J21099n0175N6190L02131K24423j35200k93091j37302k8857
$$ 68691 242384 363483 313308 369498 671629 896052 760852 467761 330459 301602
37028C01602j13315j45900k5515O3834P8149J50181J92325K676k35350j42718
$$ 301602 188287 42387 16872 80706 158855 309036 501361 504037 268687 125969
37018A25969J50343J24032k41949l83231r8653J33141K9797l2153J98067L08752
$$ 125969 276312 400344 158395 -224836 -323489 -190348 -160551 -192704 5363 314115
37008C14115o863k76038O072M47414L25652k35296m43782o8428K79184J50264
$$ 314115 307252 31214 37286 484700 810352 575056 131274 62846 342030 492294
36998D92294j38956j37468N5970Q6560m2564m9676J00450J30486p8085k44613
$$ 492294 353338 215870 271840 358400 315836 266160 366610 497096 419011 174398
36988A74398p5295K74923L59479L9302l23122l66016j83175p3170n1642O9109
$$ 174398 99103 374026 733505 772807 449685 83669 -99506 -172676 -224318 -155209
36978a55209K51228K59991P9170o8131j01816j22931r3574R8954K62875Q4094
$$ -155209 96019 356010 435180 367049 265233 142302 48728 147682 410557 494651
36968D94651k60064k30409J98284M04064R4435k29992j43178L1289r1930k22750
$$ 494651 234587 4178 202462 606526 700961 470969 327791 359080 267150 44400
36958D4400J2174K81512J07443k24416j48021J27976k5863m55704l83351K41584
$$ 44400 56574 338086 445529 221113 73092 201068 175205 -280499 -663850 -422266
36948d22266N66245J98105k14182j09810J47997N6463j56297n3183J98134J80608
$$ -422266 143979 342084 127902 18092 166089 222552 66255 13072 211206 391814
36938C91814k0801m9002M9465k3364k04876j82386J3206M8858j32111k34795j05434
$$ 391814 371013 322011 371476 348112 143236 -39150 -25944 22914 -109197 -343992 -449426
36927d49426R2835J97974K03723J06616q3146j91811n6213J58710J30868j18537
$$ -449426 -356591 -158617 45106 151722 68576 -123235 -179448 -20738 110130 -8407
36917h407k18527j225K47383K08499m8744k16992j44655N9745K00886J66756J099
$$ -8407 -226934 -228159 19224 227723 178979 -38013 -182668 -122923 77963 244719 245818
36906B45818j31020j06304J7806R4754Q5699N6124K1976m3906p5785K5602J80090
$$ 245818 114798 8494 26300 121054 206753 262877 284853 240947 165162 190764 370854
36895C70854J69647m5481k29123j78885J7202J39256J19958M7904q377m1642l4962
$$ 370854 540501 495020 265897 87012 104214 243470 363428 411332 402955 361313 326351
36884C26351K0420O7222M6072r580l3835m7450j09155j74549j35645j1828L7555
$$ 326351 346771 413993 460065 450485 416650 369200 260045 85496 -50149 -61977 -24422
36873b4422n2194j29799m1672J30983J87006J00750L4790N7759L3773j29347k80587
$$ -24422 -76616 -206415 -248087 -117104 69902 170652 205442 263201 296974 167627 -112960
36862a12960k19369L458J44399J00329K6048R0182K36698K62756Q2608j49999
$$ -112960 -332329 -328871 -184472 -84143 -58095 32087 268785 531541 614149 464150
36852D64150j97717j3938J76901J41597m4975q7977R4493K27770R3408j24010
$$ 464150 266433 252495 429396 570993 526018 438041 532534 760304 853712 729702
36842G29702j27460K6266N5932n4988o1922O8533Q1097r7354j87571j6905J88012
$$ 729702 602242 628508 684440 629452 567530 636063 717160 619806 432235 415330 603342
36831F03342J76062M4820p93op3385j32501m9581O1091L1428m3177J7867J19699
$$ 603342 779404 824224 823431 823425 750040 617539 567958 629049 660477 617300 635167 754866
36819G54866M0615j58323k18621j21562r0707j76623j88669o4591K9324K5541
$$ 754866 795481 637158 418537 296975 206268 29645 -159024 -223615 -194291 -168750
36809a68750O2444J79910K13184J03108K6473Q1299J07386k2317j74014j91540
$$ -168750 -106306 73604 286788 389896 416369 497668 605054 582737 408723 217183
36799B17183j44994j51264j38648q34J64007J80820O2319l9335o2533n3187k5196
$$ 217183 72189 -79075 -217723 -218557 -54550 126270 188589 149254 86721 33534 8338
36788H338M0487J08405J26087J02158N7105k9932j39311j70230p9880K9373N5230
$$ 8338 48825 157230 283317 385475 442580 412648 273337 103107 23227 52600 107830
36777A07830K7459P068k3537o8319n1589L7621P8911K6262J4000J01555J08839
$$ 107830 135289 142357 118820 50501 -1088 36533 115444 141706 155706 257261 366100
36766C66100p3619k09027n3138J87762J17926k02417l00277j5272K49559J55268
$$ 366100 292481 83454 30316 218078 336004 133587 -166690 -181962 67597 222865
36756B22865q3727r3086Q5377J38129P068p4907K492R0913O5510q672l5100j7290
$$ 222865 139138 46052 131429 269558 276626 201719 204211 295124 360634 351962 316862 299572
36744B99572J5523N9071P4466J9694l5557K0210J29381J04612o4371j47914l3128
$$ 299572 315095 374166 448632 468326 432769 452979 582360 686972 622601 474687 441559
36733D41559O9013l6305j71234m9860K22180K66426L7153p6496J36173L63523
$$ 441559 510572 474267 303033 253173 475353 741779 778932 702436 838609 1202132
36723A202132K66340p350j22615j10619k08641l18686j19586L11291M97648K82930
$$ 1202132 1468472 1461122 1338507 1227888 1019247 700561 580975 892266 1389914 1672844
36713A672844O9123J51606K82775J87143O7061J77702K67826j9592m31610l99653
$$ 1672844 1741967 1893573 2176348 2363491 2430552 2608254 2876080 2856488 2424878 2025225
36703B025225M1257K57017n697k62511j18730J18083J2637k66315k57716L9088
$$ 2025225 2066482 2323499 2317802 2055291 1936561 2054644 2067281 1800966 1543250 1582338
36693A582338K16836J20071j3740l2679o1900j66413j94338p8886j206r4939k15316
$$ 1582338 1799174 1919245 1905505 1872826 1810926 1644513 1450175 1371289 1370083 1275144 1059828
36682A059828j73945l2838J6297m9229q7377m1138k0165j22536k82502l34645
$$ 1059828 885883 853045 869342 820113 732736 691598 671433 548897 266395 -68250
36672f8250j91990N4282K08019J59002M88q2344l7569R971l9265j03817m3551
$$ -68250 -260240 -205958 2061 161063 161551 79207 41638 51609 12344 -91473 -135024
36661a35024J16935J91546O8312j37089k10589q8836P7200J15331L5670j6485
$$ -135024 -18089 173457 241769 104680 -105909 -194745 -117545 -2214 33456 16971
36651A6971J1222p29j42305k85193k17999N5256K84539K72283R1894m9836p5668
$$ 16971 28193 27464 -114841 -400034 -618033 -562777 -278238 -5955 85939 36103 -39565
36640c9565p4770j28267j92814j64688j8350J31362J27467k3152q2078J50881
$$ -39565 -114335 -242602 -435416 -600104 -618454 -487092 -359625 -382777 -464855 -313974
36630c13974M88572M70791m7494n94857n94222q3842L37358K75094l4614j50197
$$ -313974 174598 645389 597895 3038 -591184 -675026 -337668 -62574 -97188 -247385
36620b47385m186J35415J01398j5213p1899l1917P0483J66775J62638L1946j15900
$$ -247385 -251571 -116156 -14758 -29971 -101870 -133787 -63304 103471 266109 298055 182155
36609A82155j67282j52343j39431o5241J38275L07514J96875j16154k49856m1121
$$ 182155 14873 -137470 -276901 -342142 -203867 103647 300522 184368 -65488 -106609
36599a06609K06658J62594p1925j74897j04808r3673k03138j96554P6616L94676
$$ -106609 100049 262643 190718 15821 -88987 -182660 -385798 -582352 -505736 -111060
36589a11060M03358M7755l42437l88726n6352K95416K94988p460j99976n6254
$$ -111060 292298 340053 -2384 -391110 -447462 -152046 142942 135482 -64494 -120748
36579a20748J52695O5820k07488k30701R8617L68282K28335j37691l01414j48248
$$ -120748 31947 97767 -109721 -340422 -241805 126477 354812 217121 -84293 -232541
36569b32541O9780J23282L2568o1028q5157p9014j20636k03894j79371Q0614M18695
$$ -232541 -162761 -39479 -6911 -67939 -153096 -232110 -352746 -556640 -736011 -655397 -236702
36558b36702M59749P5136l61500l80778j023L13710K58322K0496n0871Q3465J58927
$$ -236702 223047 298183 -63317 -444095 -445118 -131408 126914 147410 96539 180004 338931
36547C38931J941k29775k42989J0788K40369J62426j16467k19506j7387J80459
$$ 338931 340872 111097 -131892 -121104 119265 281691 165224 -54282 -71669 108790
36537A08790P5891j78436k21173k7408Q9922j3702j24038m5913J09559J44748
$$ 108790 184681 6245 -214928 -242336 -152414 -166116 -290154 -336067 -226508 -81760
36527h1760O4875j445o236L1030R8719J31376J9412j87475k40109j6303K50285
$$ -81760 -16885 -18330 -24566 6464 105183 236559 255971 68496 -171613 -187916 62369
36516F2369K57907M1951j17936j13857r4044j50850j60860N33K47334L69072K50238
$$ 62369 320276 362227 244291 130434 36390 -114460 -275320 -274787 -27453 341619 591857
36505E91857l1039k67967k91981j26846M7669J13218J07182N9793r3007l04272
$$ 591857 560818 292851 870 -125976 -78307 34911 142093 201886 108879 -195393
36495a95393l15169M991L61419L68995Q9216r8003r2555j39316k81453k18276
$$ -195393 -510562 -505571 -144152 224843 314059 216056 123501 -15815 -297268 -515544
36485e15544J28108L49055J44883j73400j40277J73695L25746J72785l4878j30413
$$ -515544 -387436 -38381 106502 -66898 -207175 -33480 292266 465051 430173 299760
36475B99760j88868k30096j47973J8737P4411o799l0382P6122J48678R4152M0556
$$ 299760 110892 -119204 -267177 -248440 -174029 -180828 -211210 -135088 13590 107742 148298
36464A48298P8133J05068M7050r753k5399j02253k36142k23278L931J85797J02070
$$ 148298 226431 331499 378549 368796 343397 241144 5002 -218276 -214345 -28548 73522
36453G3522p8851p6052M9194J6089j92911k82682q2743K14527L07701J19354j61974
$$ 73522 -5329 -81381 -32187 -16098 -209009 -491691 -574434 -359907 -52206 67148 -94826
36442i4826k70485r8127J82323K81080J46362L4364J12770J73300l7407l49923
$$ -94826 -365311 -463438 -281115 -35 146327 180691 293461 466761 429354 79431
36432G9431l55420j2917K63917J83385o2802j40697k7123N8433P514q5787j11877
$$ 79431 -275989 -288906 -24989 158396 95594 -45103 -72226 -13793 -6279 -92066 -203943
36421b03943p1519k9883k9444m9684l2853L7396J08436J42350J57662J24926n3395
$$ -203943 -275462 -305345 -334789 -384473 -417326 -379930 -271494 -129144 28518 153444 100049
36410A00049l20223l73402m5948L35972L10072m7855k04706K3151J92998l8611
$$ 100049 -220174 -593576 -639524 -303552 6520 -41335 -246041 -222890 -29892 -68503
36400f8503l46847k48054J43524L08879R8287j34413j17412K7938R7804Q4585
$$ -68503 -415350 -663404 -519880 -211001 -112714 -247127 -364539 -336601 -238797 -154212
36390a54212N6376K0304m943J6458K1293p4279j60435m0245K06716K46068j9059
$$ -154212 -97836 -77532 -82475 -66017 -44724 -119003 -279438 -319683 -112967 133101 114042
36379A14042k54041j66342P4584J33135L0921O7274L04660M56930L25871P9190
$$ 114042 -139999 -306341 -231757 -98622 -67701 -427 304233 761163 1087034 1166224
36369A166224k1231K7745M7621j2297k7317P0196J79904K01244J85741K24840
$$ 1166224 1144993 1172738 1220359 1208062 1180745 1250941 1430845 1632089 1817830 2042670
36359B042670K60703J44267j15117k86027j77342R9418K19374m415m05056o11179
$$ 2042670 2303373 2447640 2332523 2046496 1869154 1968572 2187946 2183531 1778475 1167296
36349A167296m13221J0477K60434J47288r7388j36452J3476L5651j73646l18943
$$ 1167296 754075 764552 1024986 1172274 1074886 938434 951910 987561 813915 494972
36339D94972j64492Q1138Q5234r7983j51451j7528N7119k5794p6540J2924R2009
$$ 494972 330480 411618 496852 398869 247418 229890 287009 261215 184675 197599 289608
36328B89608N4961J9281N7877L8799q9678j28226L5325J67060L6041j91015k11223
$$ 289608 344569 363850 421727 460526 370848 242622 277947 445007 481048 290033 78810
36317G8810o7694k4147q2970j9510J47576J34054j03079k24337k4219K35628K18795
$$ 78810 11116 -13031 -96001 -115511 32065 166119 63040 -161297 -185516 50112 268907
36306B68907j1089j47199r3773j2685j5383m2239k2240K8086P4157J11388J33341
$$ 268907 257818 110619 16846 4161 -11222 -53461 -75701 -47615 26542 137930 271271
36295B71271J23033P0896k5478j31363j40172J6143J90848J24410j81639l72568
$$ 271271 394304 465200 439722 308359 168187 184330 375178 499588 317949 -54619
36285e4619j86329J65003K74689Q1278j25474j60164j11181o6339K7759J66835
$$ -54619 -240948 -75945 198744 280022 154548 -5616 -116797 -183136 -155377 11458
36275A1458K15676J34381M9044K087j23840l12927l17661m4798K08772J56662
$$ 11458 227134 361515 410559 412646 288806 -24121 -341782 -386580 -177808 -21146
36265b1146m7878p2153P9539J43933P0221L8178O0351l3676j94210j43042J24015
$$ -21146 -69024 -141177 -61638 82295 152516 190694 251045 217369 23159 -119883 4132
36254D132K22572l4732k89688j52537K11133L33104R8919j80210k46514j30564
$$ 4132 226704 191972 -97716 -250253 -39120 293984 392903 212693 -33821 -164385
36244a64385M9533K31021L27038K36141j4124k71667m07742l55881r1571K57025
$$ -164385 -114852 116169 443207 679348 665224 393557 -14185 -370066 -461637 -204612
36234b04612L81294J19041k46757k84492Q871K14549R7692j06451j07522L8863
$$ -204612 176682 295723 48966 -235526 -226655 -12106 85586 -20865 -128387 -89524
36224h9524J16016R0146N9955L5679k2057o4075m2896m3299j42855k24514j16978
$$ -89524 26492 116638 176593 212272 190215 126140 83244 39945 -102910 -327424 -444402
36213d44402J20429K32061R1763j37741j98273j4866K33039K91146J00642j14530
$$ -444402 -323973 -91912 -149 -137890 -336163 -351029 -117990 173156 273798 159268
36203A59268j01746R1419J78092L9815j15927r1157J2429J135q3427o1662O8267
$$ 159268 57522 148941 327033 366848 250921 159764 172193 173328 89901 28239 96506
36192I6506J40344R1045Q201o1136j50343k26184j89843m4417R3427J65056K16046
$$ 96506 236850 327895 336096 274960 124617 -101567 -291410 -335827 -242400 -77344 138702
36181A38702K65127K59866J71425K4071j48951k70514k07389M8124K51213J61690
$$ 138702 403829 663695 835120 859191 710240 439726 232337 280461 531674 693364
36171F93364j15703k69689k18214j37366q0126Q6916L03841K60196r3498l27215
$$ 693364 577661 307972 89758 -47608 -127734 -40818 263023 523219 429721 102506
36161A02506j16465K30783J97426j74949l57130j14418J96125J83117p2997k34233
$$ 102506 -13959 216824 414250 239301 -117829 -232247 -36122 146995 73998 -160235
36151a60235j74610l3303N2549P2965O3855M6043L1111P892n4185j39549j68124
$$ -160235 -334845 -368148 -315599 -242634 -178779 -132736 -101625 -93733 -147918 -287467 -455591
36140d55591r1756L5625J28264J58349J34772O2043j6614r654R2834J39471j551
$$ -455591 -547347 -511722 -383458 -225109 -90337 -28294 -44908 -54562 38272 177743 176192
36129A76192k08751k15010J9501K08046J11231j31609k07298o9332M5864K4085
$$ 176192 -32559 -247569 -228068 -20022 91209 -40400 -247698 -317030 -271166 -247081
36119b47081L8217K10864L39181J61483k25937m48363l14803j057K26883K77822
$$ -247081 -208864 2000 341181 502664 276727 -171636 -486439 -487496 -260613 17209
36109A7209J92084L0115j04773q9877M8542J00356o8384k95271k89484J0861L51567
$$ 17209 209293 239408 134635 44758 93300 193656 125272 -169999 -459483 -448622 -97055
36098i7055M29348J87360j45253k77265j40426M7672N5619o0141n7137R3982J23898
$$ -97055 332293 519653 374400 97135 -43291 4381 60000 -141 -57278 36704 160602
36087A60602j19570l80019l20264K06K20915J77342M0955j7435k9619m3008R373
$$ 160602 41032 -338987 -659251 -659045 -438130 -260788 -219833 -237268 -266887 -309895 -300522
36076c00522J27031J36322o5428k97715l03196q8186R9866R7087q536k8951R9562
$$ -300522 -173491 -37169 -102597 -400312 -703508 -791694 -691828 -594741 -603277 -632228 -532666
36065e32666K55741K55957N3778j70174j83289Q455J46868O0708j00936r1035
$$ -532666 -276925 -20968 32810 -137364 -320653 -312198 -165330 -104622 -205558 -296593
36055b96593Q1190J82485R2564o3820j18726m0005J07563K35026K35277O3053
$$ -296593 -215403 -32918 59646 -4174 -122900 -162905 -55342 179684 414961 478014
36045D78014j42945j60899K4637J76881J37444M8445J06642K38257K24749P0671
$$ 478014 335069 174170 198807 375688 513132 561577 668219 906476 1131225 1201896
36035A201896o20P9147J03084o4427k33188j50882J07467K16923L3846k31477
$$ 1201896 1201276 1280423 1383507 1319080 1085892 935010 1042477 1259400 1293246 1061769
36025A061769l00089j39903O8273J76946J87676J62933J19609L7471o8215j26530
$$ 1061769 761680 621777 690050 866996 1054672 1217605 1337214 1374685 1306470 1179940
36015A179940q1108K8287Q6333K8544p2512q7343N299P8546R219j57140k37389
$$ 1179940 1098832 1127119 1213452 1241996 1169484 1082141 1087440 1165986 1175205 1018065 780676
36004G80676j20259Q4921J54293J2780j63273j59547M633J16785P1283j1052j2258
$$ 780676 660417 745338 899631 912411 749138 589591 594224 711009 782292 771240 758982
35993G58982o909q9073j44249j1385J87384J44014j67081l78290k21369Q6990
$$ 758982 752073 663000 518751 507366 694750 838764 671683 293393 72024 159014
35983A59014J56560l6555j78374j08832j91j8297p0466j1315R6008R2842j6974
$$ 159014 315574 279019 100645 -8187 -8378 -26675 -97141 -108456 -12448 80394 63420
35972F3420r3847q6362o3387m3408L9787J66829J82818J3338j75826j67293Q903
$$ 63420 -30427 -116789 -180176 -223584 -183797 -16968 165850 179188 3362 -163931 -155028
35961a55028J12549L5192n2584K4935J63520J25638q8966k09449o0662J99498
$$ -155028 -42479 -7287 -59871 -34936 128584 254222 165256 -44193 -104855 94643
35951I4643K94274J58796m9386j77300j85451q7570P2908J87736J47476k3567
$$ 94643 388917 547713 498327 321027 135576 48006 120914 308650 456126 432559
35941D32559j67489j55635j2406J22309J21645j0328j13745k6576J78256K06096
$$ 432559 265070 109435 97029 219338 340983 330655 216910 190334 368590 574686
35931E74686q4328m09158l63702K7450L01067J53791j77704k70043o1829J48636
$$ 574686 490358 81200 -282502 -255052 46015 199806 22102 -247941 -309770 -161134
35921a61134J47861K7996k8133L472K2241j4487l2562L9752J37909J04770r1084
$$ -161134 -13273 14723 -13410 -9938 12303 -2184 -34746 5006 142915 247685 156601
35910A56601k41742j25367J69282L06813J37193j12884j77288r7716p1204j08031
$$ 156601 -85141 -210508 -41226 265587 402780 289896 112608 14892 -56312 -164343
35900a64343p1303L1258M9606k7701l1397J07028K28148J69580k9442k11683k68895
$$ -164343 -235646 -204388 -154782 -182483 -213880 -106852 121296 290876 261434 49751 -219144
35889b19144j79439K722J51377J63786Q2262K5409Q227l6948p9629j6379J08910
$$ -219144 -398583 -395861 -244484 -80698 1564 26973 35200 -1748 -81377 -97756 11154
35878A1154J18706j0373q4727K92J06546J11217R3075J16954O2936j31400k69141
$$ 11154 129860 119487 34760 35052 141598 252815 345890 462844 525780 394380 125239
35867A25239j78216k0052l8935j50094r1710J11212J79074M2587o6109j4787N7429
$$ 125239 -52977 -73029 -111964 -262058 -353768 -242556 -63482 -20895 -87004 -101791 -44362
35856d4362L8035J1121L1339P285o8053l8073J18038J64714k3685k09245j28196
$$ -44362 -6327 4794 36133 43418 -24635 -62708 55330 220044 196359 -12886 -141082
35845a41082J10780K12202J23115J3497n5234j55139k39594j52916Q7024K51223
$$ -141082 -30302 181900 305015 318512 263278 108139 -131455 -284371 -197347 53876
35835E3876J98652L6839n7934k9728P3419J55950R7041j23983l02280j89331J46468
$$ 53876 252528 289367 231433 201705 275124 431074 528115 404132 101852 -87479 58989
35824E8989L32415J65979j02569j16747R9409K09406N3163j59871j78025l5748
$$ 58989 391404 557383 454814 338067 437476 646882 700045 540174 362149 326401
35814C26401N3367J0923m5470j9064L2155J7945l0953j7321O1058R5797J3663
$$ 326401 379768 390691 345221 326157 358312 376257 345304 327983 389041 484838 498501
35803D98501j31634k26872k06285q2926P1319J63031J46746P2319J9360r966o7423
$$ 498501 366867 139995 -66290 -149216 -77897 85134 231880 304199 323559 313593 246170
35792B46170j37189j32419k7538J00756J81126J93682J04775r6712k68739k09941
$$ 246170 108981 -23438 -50976 49780 230906 424588 529363 432651 163912 -46029
35782d6029L0524J35115m7052k39172j18780J95206L03220Q9759j53085j59537
$$ -46029 -15505 119610 72558 -166614 -285394 -90188 213032 302791 149706 -9831
35772i831O727J29577J16218K6853k9584J7546J19823J25953j9676j57031j28441
$$ -9831 -3104 126473 242691 269544 239960 257506 377329 503282 483606 326575 198134
35761A98134k4131j7360n8269O577R3579q529k16212k09748M1385J91116N9394
$$ 198134 174003 156643 98374 104951 198530 190001 -26211 -235959 -194574 -3458 55936
35750E5936j12004r8638j8626j9410k709Q8188N9643j50965k23508M9520L24349
$$ 55936 -56068 -154706 -173332 -192742 -195451 -107263 -47620 -198585 -422093 -372573 -48224
35739d8224J95756j31354j57150J07676J99211j4965j73684q1774P332r3271j86423
$$ -48224 147532 16178 -140972 -33296 165915 150950 -22734 -104508 -97176 -190447 -376870
35728c76870r9996o731p6242j35046M0274L27980M31204K79028L3219j65192k56717
$$ -376870 -476866 -483597 -559839 -694885 -654611 -326631 104573 383601 416820 251628 -5089
35717e089j95908j6604J20179R8427j303l1869K3327P4786N7429l6525j57412
$$ -5089 -200997 -217601 -97422 1005 -298 -32167 -8840 65946 123375 86850 -70562
35706g0562j88431o5284P1212K4920j20930o4861K29292L94353J81124j51447
$$ -70562 -258993 -324277 -253065 -228145 -349075 -413936 -184644 209709 390833 239386
35696B39386k20127o9661k8526j58583j96387q725K05079K14818M0160j31652
$$ 239386 19259 -50402 -78928 -237511 -433898 -442623 -237544 -22726 17434 -114218
35686a14218j58222l5636J12990J42208N7360K5012J16760J57222r825k19136
$$ -114218 -272440 -308076 -195086 -52878 4482 29494 146254 303476 293651 74515
35676G4515j84553N5502J62937q859k05821j48498Q8682K14645J14201m1872m2137
$$ 74515 -110038 -54536 108401 99542 -106279 -254777 -166095 48550 162751 120879 78742
35665G8742J07723J95141N7145j97385k89138j14797J12684J44837K262j25557
$$ 78742 186465 381606 438751 241366 -47772 -162569 -49885 94952 97214 -28343
35655b8343j71629k04903k29729j77376o8337J2221Q5215K25447L45593K55806
$$ -28343 -199972 -404875 -634604 -811980 -880317 -868096 -782881 -557434 -211841 43965
35645D3965k2224k16049j55051K1926J00496O4598L1206N4643J11699J72448J83842
$$ 43965 21741 -194308 -349359 -327433 -226937 -162339 -131133 -76490 35209 207657 391499
35634C91499Q0224r6510j83776j04004N393k1523j35838j47469j1246R7419L0289
$$ 391499 471723 375213 191437 87433 92826 71303 -64535 -212004 -223250 -125831 -95542
35623i5542j06828p0506J87820M09752L29338K0930j89521j47412k7513k7966
$$ -95542 -202370 -272876 -85056 324696 654034 674964 485443 338031 310518 282552
35613B82552j10676j53573j54245j23045J8372K26442K43401j3944j94306M156
$$ 282552 171876 18303 -135942 -258987 -240615 -14173 229228 215284 20978 25134
35603B5134K89622J71037k38111l55072m2241K05681Q8319q4742k6394N1018p3432
$$ 25134 314756 485793 247682 -107390 -149631 56050 144369 59627 33233 84251 10819
35592A0819j67974J334J79881N2896j74957j20580J23354J75637O240j05049r5693
$$ 10819 -157155 -155821 24060 76956 -98001 -218581 -95227 80410 86650 -18399 -114092
35581a14092j20993j46425k1052J29305O1634r6937j2755K40109K46030n0663
$$ -114092 -235085 -381510 -402562 -273257 -211623 -308560 -321315 -81206 164824 114161
35571A14161k34263r8702O2921K755j10129o4451M8375Q1355Q0533Q8186J7618
$$ 114161 -120102 -218804 -155883 -153128 -263257 -327708 -279333 -197978 -117445 -29259 -11641
35560a1641r5446m0128J87033K73394O5427j65305j45887J5855R5762R5659Q5893
$$ -11641 -107087 -147215 39818 313212 378639 213334 67447 83302 179064 274723 360616
35549C60616O595j23989j02047R7365J58132q1631k92851j60134R1340Q6494o4980
$$ 360616 367211 243222 141175 238540 396672 315041 22190 -137944 -46604 39890 -25090
35538b5090j1464J75026J19553j71634k92592j01174J06242J42514J68183K55310
$$ -25090 -36554 138472 258025 86391 -206201 -307375 -201133 -58619 109564 364874
35528C64874J71478j73534m34212k74845J25685K93522N9807k80875l55784j01870
$$ 364874 536352 362818 -71394 -346239 -220554 72968 132775 -148100 -503884 -605754
35518f05754K20466L24022J96246Q4669J54289K56902J60586r0114k36341j76781
$$ -605754 -385288 -61266 134980 219649 373938 630840 791426 701312 464971 288190
35508B88190o5281m5423q9043j12234p3371N0996K19007K68340R4373j39817j81132
$$ 288190 222909 177486 88443 -23791 -97162 -46166 172841 441181 535554 395737 214605
35497B14605n3289q948j19804j80142n8397J15234J81490J36678K0704j40988
$$ 214605 161316 152368 32564 -147578 -205975 -90741 90749 227427 248131 107143
35487A07143k19998o8642J91245K31325j3477k06649r3512J37112J66932o254
$$ 107143 -112855 -181497 9748 241073 227596 20947 -72565 64547 231479 225225
35477B25225j57773j85632j43825o6033L4820R7128J06193J42865K00527J17514
$$ 225225 67452 -118180 -262005 -328038 -293218 -196090 -89897 52968 253495 371009
35467C71009j41116l15833j84250R3221J97790R0182l4716j16375k44689l52829
$$ 371009 229893 -85940 -270190 -176969 20821 111003 76287 -40088 -284777 -637606
35457f37606k19771J57312M53515L99845J06778j12598j24448n4303m1220m5729
$$ -637606 -857377 -700065 -246550 153295 260073 147475 23027 -31276 -72496 -118225
35447a18225M1954J68123J30673j04764k45524k2930L70051M57577J09660k96777
$$ -118225 -76271 91852 222525 117761 -127763 -150693 219358 676935 786595 489818
35437D89818m19335l38212k55961j40640P5346K19134J24059m4500l3738Q9013
$$ 489818 70483 -267729 -523690 -664330 -588984 -369850 -245791 -290291 -324029 -235016
35427b35016J00990L9697Q4201J42516k5119l17382l52199m8316K44741K70305
$$ -235016 -134026 -94329 -10128 132388 107269 -210113 -562312 -610628 -365887 -95582
35417i5582J54119P3292p331j19980j35621q431P9809M403r4044o0244K1679N453
$$ -95582 58537 131829 124498 4518 -131103 -139534 -59725 -55322 -149366 -209610 -187931 -182478
35405a82478o4418o2836o162J0012j1721k048M9975J10070J53452J37731K7176
$$ -182478 -246896 -309732 -315894 -305882 -317603 -319651 -269676 -159606 -6154 131577 158753
35394A58753j05901j34138p0989n7621j15074r9463L6762J47504J36344P9719
$$ 158753 52852 -81286 -152275 -209896 -324970 -424433 -387671 -240167 -103823 -24104
35384b4104J9727j18122k78632k23149R0009L27212K17514n2401j41292m8709
$$ -24104 -4377 -122499 -401131 -624280 -534271 -207059 10455 -41946 -183238 -231947
35374b31947p143m3677Q348J48463J96976J19011N9714N5118j0450j34613j54890
$$ -231947 -239090 -282767 -274419 -125956 71020 190031 249745 304863 294413 159800 4910
35363D910l2534O6820N3972N1539J43629J95485P4390r8779r9898O2821J36856
$$ 4910 -27624 39196 93168 144707 288336 483821 558211 459432 359534 422355 559211
35352E59211k9962k58185k43642M5276L04265K80628R6628L5298J01365M8002
$$ 559211 529249 271064 27422 72698 376963 657591 754219 789517 890882 938884
35342I38884j70199k84058j52348n961n3643j28900k275J97649K07841Q4457N9878
$$ 938884 768685 484627 332279 326318 272675 143775 141500 339149 546990 631447 691325
35331F91325Q8982m4625k46342j87371J20378K68726O6484j96797k36410j39236
$$ 691325 780307 735682 489340 301969 422347 691073 757557 560760 324350 185114
35321A85114o7660L4157J97274K18154r758k08698q3181K06872K61791J3802k27683
$$ 185114 117454 151611 348885 567039 557281 348583 265402 472274 734065 747867 520184
35310E20184k43914j31073n6010l5811j6874O03o041j4650K6175J33506K36206
$$ 520184 276270 145197 89187 53376 36502 37105 31064 16414 42589 176095 412301
35299D12301K01648o960k13933k04233j8532R6828N3687Q766L0360l4215k16487
$$ 412301 613949 606989 393056 188823 170291 267119 320806 329572 359932 325717 109230
35288A09230k56633j4375K21437J41379r1652j14683N0538R3129k3189m0858P6858
$$ 109230 -147403 -161778 59659 201038 109386 -5297 45241 138370 115181 74323 151181
35277A51181P1525j08838j71256J8000J80165P1778j42879j89679p9776K2502
$$ 151181 222706 113868 -57388 -39388 140777 212555 69676 -120003 -199779 -177277
35267a77277Q8246J44336J11900l3221j11192J3237J82852J77337M5861k6049
$$ -177277 -89031 55305 167205 133984 22792 36029 218881 396218 442079 416030
35257D16030m1805j20319k06196j37787N2644J72498J66880J35105Q8713l9444
$$ 416030 374225 253906 47710 -90077 -37433 135065 301945 437050 525763 486319
35247D86319j60360q9812J23517K06013O3013q4103o0570R695m6703j62679j61181
$$ 486319 325959 236147 359664 565677 628690 544587 484017 493712 447009 284330 123149
35236A23149k8854R6586J08996p588j92777k92191j61638J09864K27931O1662
$$ 123149 94295 190881 299877 292289 99512 -192679 -354317 -244453 -16522 45140
35226D5140j66833j95750o1685M6420J02993J82896K14211P8179j01467o2454
$$ 45140 -121693 -317443 -379128 -332708 -229715 -46819 167392 245571 144104 81650
35216H1650J86341L24373J52482j56956l21450k61560o9865J34816K12383N0702
$$ 81650 267991 592364 744846 587890 266440 4880 -64985 69831 282214 332916
35206C32916k40051l38982r4483K25882K50294k0874k53521k41863j10644m5505
$$ 332916 92865 -246117 -340600 -114718 135576 114702 -138819 -380682 -491326 -536831
35196e36831l8961Q102R6444J64673K08644K32793J53719r3422l66289l92872
$$ -536831 -575792 -567690 -471246 -306573 -97929 134864 288583 195161 -171128 -564000
35186e64000j00333K46008L31639J57228J790M7789J72956J51893m3380k28824
$$ -564000 -664333 -418325 -86686 70542 72332 120121 293077 444970 401590 172766
35176A72766k41427j02696L9626P3398J6981k3640J1427N9771L1716m0038l3117
$$ 172766 -68661 -171357 -131731 -58333 -41352 -64992 -53565 6206 37922 -2116 -35233
35165c5233P3732J54673J25871O0915M3051K6459m8565j23247j36382j50482j95929
$$ -35233 38499 193172 319043 379958 423009 449468 400903 277656 141274 -9208 -205137
35154b05137j18364J86384M79621M13321L8399k20721j45242J7120k8235k15953
$$ -205137 -323501 -137117 342504 755825 794224 573503 428261 445381 417146 201193
35144B01193k93942j85470J133J60842K26643J53285P321n5906j6305l0996j43889
$$ 201193 -92749 -278219 -277086 -116244 110399 263684 271005 215099 198794 167798 23909
35133B3909j61039K2562J87344J03491j00020j36209R598J15598Q2836o991j08651
$$ 23909 -137130 -114568 72776 176267 76247 -59962 -50364 65234 148070 141079 32428
35122C2428k20596k37787o6174J52466J85236N0035l1177J2758M9248J9838Q966
$$ 32428 -188168 -425955 -492129 -339663 -154427 -104392 -135569 -122811 -73563 -53725 -44759
35111d4759M2046O3518R6574J70782J41267j10467l41856k00026J81140K70574
$$ -44759 -2713 60805 157379 328161 469428 358961 17105 -182921 -1781 268793
35101B68793p1805l47484j63819J99266K70623P8394k1719M3672M2179j00878
$$ 268793 196988 -150496 -314315 -115049 155574 233968 212249 255921 298100 197222
35091A97222j91163r6577Q5142J90821J43278k0559j39838n3421J39177J20587
$$ 197222 6059 -90518 -5376 185445 328723 308164 168326 114905 254082 374669
35081C74669j64353l11960l1063L23046K07241k53739l83782M6257M57909L04404
$$ 374669 210316 -101644 -132707 190339 397580 143841 -239941 -193684 264225 568629
35071E68629j67769l32171o0946K11906J70406m0950j67918j91763j89970j12241
$$ 568629 400860 68689 7743 219649 390055 349105 181187 -10576 -200546 -312787
35061c12787Q2778K14117O8220k23600k65985N6520L56348K47383j14682k62386
$$ -312787 -230009 -15892 52328 -171272 -437257 -380737 -24389 222994 108312 -154074
35051a54074p6665J10527O5628m7149k4135M3357k160p1780j181J33841J31312
$$ -154074 -230739 -120212 -54584 -101733 -125868 -82511 -84671 -156451 -157632 -23791 107521
35040A07521q957j03632o6659K6435R7938J17022N1263p0152j20472n9269m9508
$$ 107521 98564 -5068 -71727 -45292 52646 169668 220931 150779 30307 -28962 -78470
35029g8470k05419l36735j86598J43012K69695L8229k81489l50813j47363N7979
$$ -78470 -283889 -620624 -807222 -664210 -394515 -356286 -637775 -988588 -1135951 -1077972
35019a077972J0833k49713l83733j10113L73599N22392J35196l17152k98463Q0764
$$ -1077972 -1067139 -1316852 -1700585 -1810698 -1437099 -914707 -779511 -1096663 -1395126 -1314362
35009a314362K94456J66658j1179l7666k1667l3099L4340J67734J80873N5902
$$ -1314362 -1019906 -853248 -864427 -902093 -923760 -956859 -922519 -754785 -573912 -518010
34999e18010o237L5511n988j35160q8084J82640L29509J42612r5722o0655J21037
$$ -518010 -524247 -488736 -494724 -629884 -717968 -535328 -205819 -63207 -158929 -219584 -98547
34988i8547J31877l3428j43991j23214o4699m074N6493K4182j35024k37393j05719
$$ -98547 33330 -98 -144089 -267303 -332002 -336076 -279583 -255401 -390425 -627818 -733537
34977g33537J43838K45217J22802q2538k17960j94640N153K38217K63949N4968
$$ -733537 -589699 -344482 -221680 -304218 -522178 -716818 -711665 -473448 -209499 -154531
34967a54531j14556m0767J38482K02157J52759P7638m8507j95242j66527P6221
$$ -154531 -269087 -309854 -171372 30785 183544 261182 212675 17433 -149094 -72873
34957g2873K36929J19234l8642O182M8934j57341l48161j46032K16290K01642
$$ -72873 164056 283290 244648 250830 299764 142423 -205738 -351770 -135480 66162
34947F6162j30003k10224O2453J57351j47005l62033j13415K50999K62714M0585
$$ 66162 -63841 -274065 -211612 -54261 -201266 -563299 -676714 -425715 -163001 -122416
34937a22416l2487N4148O7833M74j2643j6680j04349j54578m3545P7690M2427
$$ -122416 -154903 -100755 -32922 -32448 -45091 -61771 -166120 -320698 -364243 -286553 -244126
34926b44126o418J01243J77654j3479k49486j26821K55913L94047J46878q3378
$$ -244126 -250544 -149301 28353 14874 -234612 -361433 -105520 288527 435405 352027
34916C52027k3157R2969o520j83300j69839j456J00906P6067J0146o3811j32978
$$ 352027 328870 421839 415319 232019 62180 60724 161630 237697 247843 184032 51054
34905E1054r8973Q0234K32067J52095j06794k90808k48966n1869J31039J48401
$$ 51054 -47919 32315 264382 416477 309683 18875 -230091 -281960 -150921 -2520
34895b520n3041l15079l26340J5480L74538L41840j1336k19479p8566J00919J7274
$$ -2520 -55561 -370640 -696980 -681500 -306962 34878 23542 -195937 -274503 -173584 -156310
34884a56310j58519r0254J76133K92632J34436o8551j08483k7763N9544J23420
$$ -156310 -314829 -405083 -228950 63682 198118 129567 21084 -6679 52865 176285
34874A76285J34081M6588n6083j4985J26634J14457j33619l48631k69821r14J64964
$$ 176285 310366 356954 300871 285886 412520 526977 393358 44727 -225094 -226008 -61044
34863f1044J24956K76p4648l3133J20285K33214R0282k54496m17306j75877J70450
$$ -61044 63912 64188 -10460 -43593 76692 309906 400188 145692 -271614 -447491 -277041
34852b77041K07096r208j08772j1149L3432n9804r9620k6556k3440j35423j53834
$$ -277041 -69945 -79153 -187925 -199074 -165642 -225446 -325066 -351622 -375062 -510485 -664319
34841f64319L874J43554J55911J91672L17504L28531J07914j22938j42199o0272
$$ -664319 -660445 -516891 -360980 -169308 148196 476727 584641 461703 319504 259232
34831B59232q3209j70097j58335l6541J13932K56680L00102R5123k62815l91311
$$ 259232 176023 5926 -152409 -188950 -75018 181662 481764 576887 314072 -77239
34821g7239j33482J45987P2820j82412k14299j9377R2930O0641Q3386J59663P7082
$$ -77239 -210721 -64734 8086 -174326 -388625 -408002 -315072 -254431 -171045 -11382 65700
34810F5700j31139j61505N3724K06965R6349r4172j30306m6734J3238K3216J590
$$ 65700 -65439 -226944 -173220 33745 130094 35922 -94384 -141118 -127880 -104664 -103074
34799a03074o0668p9198R1672L79000M66582K03740j54424k77504j65919o2749
$$ -103074 -163742 -242940 -151268 227732 694314 898054 743630 466126 300207 237458
34789B37458r6365j78811j72795k7779J82887K78621J22181j69819k87047r5955
$$ 237458 141093 -37718 -210513 -238292 -55405 223216 345397 175578 -111469 -207424
34779b07424J63205J68350q4163k96093k31047M7446K79501K74041P4520j06077
$$ -207424 -44219 124131 39968 -256125 -487172 -439726 -160225 113816 188336 82259
34769H2259j14988m713P5149O5104R66q5068j44922q0117J05328J97560L4906
$$ 82259 -32729 -37442 37707 102811 103777 18709 -126213 -206330 -101002 96558 131464
34758A31464j88717j52525R4198J89120K9013q8823L812P3545n7603j69012n4659
$$ 131464 -57253 -209778 -115580 73540 102553 13730 17542 91087 33484 -135528 -190187
34747a90187O1275q9997k89696j48131K11493K90396q261k40386j26702P5587
$$ -190187 -128912 -218909 -508605 -656736 -445243 -154847 -163108 -403494 -530196 -454609
34737d54609P8876K0670J32861K74792J48668j91985l88251k69717k2506J26818
$$ -454609 -375733 -355063 -222202 52590 201258 9273 -378978 -648695 -671201 -544383
34727e44383J51405J12381J9505j02916j53845o9967P0160J37724J00233J7936
$$ -544383 -392978 -280597 -261092 -364008 -517853 -587820 -517660 -379936 -279703 -261767
34717b61767m9558o0804L1428K15745L44104K38054p5284l22552k67772O246J91574
$$ -261767 -311325 -372129 -340701 -124956 219148 457202 381918 59366 -208406 -202160 -10586
34706a0586J16126q3423j66410p2923N8080R8689P1708P4609J31015J70898J44499
$$ -10586 105540 22117 -144293 -217216 -159136 -60447 11261 85870 216885 387783 532282
34695E32282R2225O2078P662j41278l13755l22203j07341J47172K36951J84598
$$ 532282 624507 686585 694247 552969 239214 -82989 -190330 -43158 193793 378391
34685C78391J43898J34063M1003j36000k25375j24350M5310J07403N8927L2741
$$ 378391 522289 656352 697355 561355 335980 211630 256940 364343 423270 456011
34675D56011Q4235J08827j1431k17970k87225q4091K23927L20916J31148r8513
$$ 456011 540246 649073 637642 419672 132447 48356 272283 593199 724347 625834
34665F25834j65638j56943j88072j43198O2081J76299m7045l42755k32797K04795
$$ 625834 460196 303253 115181 -28017 34064 210363 163318 -179437 -412234 -207439
34655b07439L83112J01735j50264m142K06258M3597k91578l05833q606J54548
$$ -207439 175673 277408 127144 123002 329260 372857 81279 -224554 -233160 -78612
34645g8612J5698j49080j17404K7191J42541J94157J70476R8572J01306J92315
$$ -78612 -62914 -211994 -329398 -302207 -159666 34491 204967 303539 404845 597160
34635E97160J29092k24727n30913l68995R2241K71946J5312k23344j07703J44391
$$ 597160 726252 501525 -29388 -398383 -306142 -34196 -18884 -242228 -349931 -205540
34625b05540K13186J34453P4942J0400j10227j62642o2855M2707K1735k2338K9897
$$ -205540 7646 142099 217041 227441 117214 -45428 -108283 -65576 -43841 -66179 -36282
34614c6282R1127O1654K6491N7541M6589m9007l8149J66601K83136N5640k75527
$$ -36282 54845 116499 142990 200531 247120 198113 159964 326565 609701 665341 389814
$$ [...]
##END NTUPLES=NMR SPECTRUM
##END=
