##TITLE=31Pdec_SR-75-TFAA3
 CDCl3, 24 sc
 10.7.2023
##JCAMPDX= 6.0         $$ Bruker NMR JCAMP-DX V2.0
##DATA TYPE= NMR SPECTRUM
##DATA CLASS= NTUPLES
##ORIGIN= UXNMR, Bruker Analytische Messtechnik GmbH
##OWNER= root
$$ XWIN-NMR		Version 3.5
$$ Mon Jul 10 16:13:32 2023 Russian Standard Time (UT+4h)  she@DPX200
##.OBSERVE FREQUENCY= 81.013821
##.OBSERVE NUCLEUS= ^31P
##.ACQUISITION MODE= SIMULTANEOUS
##.ACQUISITION SCHEME= undefined
##.AVERAGES= 24
##.DIGITISER RES= 16
##SPECTROMETER/DATA SYSTEM= spect
##.PULSE SEQUENCE= zgpg30
##.SOLVENT NAME= CDCl3
##.SHIFT REFERENCE= (INTERNAL, CDCl3, 0, 248.564)
##AUDIT TRAIL= $$ (NUMBER, WHEN, WHO, WHERE, WHAT)
$$ ##TITLE= Audit trail, XWIN-NMR		Version 3.5
$$ ##JCAMPDX= 5.01
$$ ##ORIGIN= Bruker BioSpin GmbH
$$ ##OWNER= she
$$ F:/spectra/data/she/nmr/P31/1/pdata/1/auditp.txt
$$ ##AUDIT TRAIL=  $$ (NUMBER, WHEN, WHO, WHERE, WHAT)
(   1,<2023-07-10 16:11:23.81 +0400>,<she>,<DPX200>,
      <created by zg, POWCHK disabled, PULCHK disabled
       configuration hash MD5:
       00 E9 B6 7A A2 85 ED C7 34 08 36 98 17 FE 4E 26
       data hash MD5: 32K
       8E 79 EF 91 D7 9B 53 2C 27 99 02 9E D2 92 A3 E6>)
(   2,<2023-07-10 16:11:25.90 +0400>,<she>,<DPX200>,
      <Start of raw data processing
       efp BC_mod = 2 LB = 1 FT_mod = 6 PKNL = 1 PHC0 = -10629.82 PHC1 = -76.51532 SI = 64K 
       data hash MD5: 64K
       A5 4D AE 83 5B 23 19 CA C3 95 07 35 6B 57 7F B5>)
(   3,<2023-07-10 16:11:41.01 +0400>,<she>,<DPX200>,
      <pk PHC0 = -13.99733 PHC1 = 0 
       data hash MD5: 64K
       33 7B 4F 14 7F 81 A5 B3 A4 C2 F9 E1 53 2C D3 77>)
(   4,<2023-07-10 16:12:00.57 +0400>,<she>,<DPX200>,
      <pk PHC0 = 4.200003 PHC1 = 0 
       data hash MD5: 64K
       5D FC A3 5B 86 FA 8F EB ED 4B 22 16 78 AD FC D1>)
(   5,<2023-07-10 16:12:05.43 +0400>,<she>,<DPX200>,
      <abs ABSG = 5 
       data hash MD5: 64K
       5A 97 C7 EA D7 F9 4D 5E 21 67 62 E1 25 F6 AC D4>)
$$ ##END=
$$ 
$$ hash MD5
$$ CF 28 E8 74 9D 5C 67 91 9E BA 92 8E 02 AE E2 F5
##$RELAX= 
##$RELAX= 
##$RELAX= 
##$RELAX= 
##$RELAX= 
##$RELAX= 
##$RELAX= 
##$RELAX= 
##$RELAX= 
$$ Bruker specific parameters
$$ --------------------------
##$DU= <F:/spectra>
##$EXPNO= 1
##$NAME= <P31>
##$PROCNO= 1
##$TYPE= <nmr>
##$USER= <she>
##$AMP= (0..31)
100 100 100 100 100 100 100 100 100 100 100 100 100 100 100 100 100 100 
100 100 100 100 100 100 100 100 100 100 100 100 100 100 
##$AQSEQ= 0
##$AQ_mod= 1
##$AUNM= <au_zg>
##$AUTOPOS= <>
##$BF1= 81.014009
##$BF2= 200.13
##$BF3= 200.13
##$BF4= 200.13
##$BF5= 200.13
##$BF6= 200.13
##$BF7= 200.13
##$BF8= 200.13
##$BYTORDA= 1
##$CFDGTYP= 0
##$CFRGTYP= 5
##$CHEMSTR= <none>
##$CNST= (0..31)
1 1 145 1 1 1 1 1 1 1 1 1 1 1 1 1 1 1 1 1 1 1 1 1 1 1 1 1 1 1 1 1 
##$CPDPRG= <waltz16>
##$CPDPRG1= <>
##$CPDPRG2= <waltz16>
##$CPDPRG3= <>
##$CPDPRG4= <mlev>
##$CPDPRG5= <mlev>
##$CPDPRG6= <mlev>
##$CPDPRG7= <mlev>
##$CPDPRG8= <mlev>
##$CPDPRGB= <>
##$CPDPRGT= <>
##$D= (0..31)
$$ [...]
##$SUBNAM3= <"">
##$SUBNAM4= <"">
##$SUBNAM5= <"">
##$SUBNAM6= <"">
##$SUBNAM7= <"">
##$SUBNAM8= <"">
##$SUBNAM9= <"">
##$SW= 501.771253377433
##$SWIBOX= (0..15)
0 1 3 0 0 0 0 0 0 0 0 0 0 0 0 0 
##$SW_h= 40650.406504065
##$TD= 32768
##$TD0= 1
##$TE= 0
##$TE2= 300
##$TE3= 300
##$TEG= 300
##$TL= (0..7)
0 120 53 12 22 120 120 120 
##$TP= (0..7)
150 150 150 150 150 150 150 150 
##$TP07= 0
##$TPNAME0= <>
##$TPNAME1= <>
##$TPNAME2= <>
##$TPNAME3= <>
##$TPNAME4= <>
##$TPNAME5= <>
##$TPNAME6= <>
##$TPNAME7= <>
##$TPOAL= (0..7)
0.5 0.5 0.5 0.5 0.5 0.5 0.5 0.5 
##$TPOFFS= (0..7)
0 0 0 0 0 0 0 0 
##$TUNHIN= 0
##$TUNHOUT= 0
##$TUNXOUT= 0
##$USERA1= <user>
##$USERA2= <user>
##$USERA3= <user>
##$USERA4= <user>
##$USERA5= <user>
##$V9= 5
##$VALIST= <valist>
##$VCLIST= <CCCCCCCCCCCCCCC>
##$VD= 0
##$VDLIST= <DDDDDDDDDDDDDDD>
##$VPLIST= <PPPPPPPPPPPPPPP>
##$VTLIST= <TTTTTTTTTTTTTTT>
##$WBST= 1024
##$WBSW= 4
##$XGAIN= (0..3)
0 0 0 0 
##$XL= 0
##$YL= 0
##$YMAX_a= 5881
##$YMIN_a= -5936
##$ZGOPTNS= <>
##$ZL1= 120
##$ZL2= 120
##$ZL3= 120
##$ZL4= 120
##$ABSF1= 248.5645
##$ABSF2= -253.2056
##$ABSG= 5
##$ABSL= 3
##$ALPHA= 0
##$AQORDER= 0
##$ASSFAC= 0
##$ASSFACI= 0
##$ASSFACX= 0
##$ASSWID= 0
##$AUNMP= <proc_1d>
##$AZFE= 0.1
##$AZFW= 0.5
##$BCFW= 0
##$BC_mod= 2
##$BYTORDP= 0
##$COROFFS= 0
##$CY= -3
##$DATMOD= 1
##$DC= 0
##$DFILT= <>
##$DTYPP= 0
##$F1P= 0
##$F2P= 0
##$FCOR= 1
##$FTSIZE= 65536
##$FT_mod= 6
##$GAMMA= 0
##$GB= 0
##$INTBC= 1
##$INTSCL= 6.047779e-11
##$ISEN= 30
##$LB= 1
##$LEV0= 0
##$LPBIN= 0
##$MAXI= 10000
##$MC2= 0
##$MEAN= 0
##$ME_mod= 0
##$MI= 50
##$NCOEF= 0
##$NC_proc= -9
##$NLEV= 6
##$NOISF1= 182.463
##$NOISF2= 159.3651
##$NSP= 0
##$NTH_PI= 0
##$NZP= 0
##$OFFSET= 248.5645
##$PC= 4
##$PHC0= -10639.62
##$PHC1= -76.51532
##$PH_mod= 1
##$PKNL= yes
##$PPARMOD= 0
##$PSCAL= 0
##$PSIGN= 0
##$REVERSE= no
##$SF= 81.0140089999694
##$SI= 65536
##$SIGF1= 159.3651
##$SIGF2= -187.1042
##$SINO= 113.3802
##$SIOLD= 16384
##$SREGLST= <1H.CDCl3>
##$SSB= 0
##$STSI= 65536
##$STSR= 0
##$SW_p= 40650.406504065
##$SYMM= 0
##$S_DEV= 0
##$TDeff= 32768
##$TDoff= 0
##$TI= <>
##$TILT= no
##$TM1= 0
##$TM2= 0
##$TOPLEV= 0
##$USERP1= <user>
##$USERP2= <user>
##$USERP3= <user>
##$USERP4= <user>
##$USERP5= <user>
##$WDW= 1
##$XDIM= 65536
##$YMAX_p= 356511939
##$YMIN_p= -92283009
$$ End of Bruker specific parameters
$$ ---------------------------------
##NTUPLES= NMR SPECTRUM
##VAR_NAME=  FREQUENCY,     SPECTRUM/REAL,   SPECTRUM/IMAG
##SYMBOL=    X,             R,               I
##VAR_TYPE=  INDEPENDENT,   DEPENDENT,       DEPENDENT
##VAR_FORM=  AFFN,          ASDF,            ASDF
##VAR_DIM=   65536,         65536,           65536
##UNITS=     HZ,            ARBITRARY UNITS, ARBITRARY UNITS
##FACTOR=    0.620285442955139, 1,           1
##FIRST=     20137.2065510682, 0,            0
##LAST=      -20513.1999529968, 0,           0
##MIN=       -20513.1999529968, -92283009,   0
##MAX=       20137.2065510682, 356511939,    0
$$ Real data points
##PAGE= N=1
##DATA TABLE= (X++(R..R)), XYDATA
$$ [...]
46157 -3926701 6911246 15594432 18778561 15718534 10152497 8743230 13593817 18699193
46149 18699193 17972385 13483930 10198318 6396155 -2375060 -12118845 -13441103 -6453016
46141 -6453016 -2310846 -6657421 -10977833 -5795927 5289473 11408151 8791155 2824314
46133 2824314 -537616 303862 3617901 5805928 4077588 475159 -228883 1153475
46125 1153475 -2544039 -13845190 -25126784 -29029407 -27854516 -26231162 -21400748 -9976312
46117 -9976312 1194976 2479218 -2743318 -1637693 8601060 16312420 12887969 4376989
46109 4376989 1216265 4864064 9995476 13388412 14975235 14682946 13133545 12313414
46101 12313414 12506329 12155251 12549100 17162490 23685878 23363964 13050703 1999998
46093 1999998 618498 7276186 12853413 14096302 14586858 15163935 12283457 6292119
46085 6292119 3906184 10069525 21626922 30407805 29779113 19011557 5190488 -364110
46077 -364110 7058356 18289146 19137040 7123913 -5756051 -7953425 -723796 6225828
46069 6225828 6315399 331887 -6919146 -10564889 -8263751 -1510107 6197439 12583506
46061 12583506 16499013 16185745 11468915 6526078 5404835 5624329 2567728 -555606
46053 -555606 3740108 12197555 10545268 -5840658 -21397635 -20042762 -7240161 -446317
46045 -446317 -3202248 -3321691 4396075 8999619 1162934 -12106617 -17483397 -11570654
46037 -11570654 -320940 10768480 18283791 18007096 9086750 -851740 -2063039 5913955
46029 5913955 14354494 16536940 14052043 11866777 11922338 13239601 14820687 15824824
46021 15824824 14347038 8462314 -956035 -9413501 -12199179 -9237804 -5180245 -3134073
46013 -3134073 -70979 8256601 19079780 24497607 22368151 19500970 21005298 22039690
46005 22039690 15618208 4780994 -96653 4816894 12301430 14581861 12672881 12416376
45997 12416376 15124708 16078800 11103423 1686444 -6721357 -10100170 -9090477 -7432583
45989 -7432583 -7991022 -10823275 -14433484 -17114769 -16748118 -11579167 -2818984 5107380
45981 5107380 8675449 8381332 6279418 2328945 -4310142 -11752817 -16170725 -15762356
45973 -15762356 -11939639 -7576950 -6103431 -10164819 -17469567 -19831792 -11818955 -59082
45965 -59082 2475133 -6765403 -15468819 -12956068 -4926292 -4268387 -10816201 -10615389 2883099
45956 2883099 16590906 13708516 -3623496 -16662959 -13924065 -3486461 1293208 -106972
45948 -106972 1258870 7389744 10251641 5434405 -58890 2088560 9640844 13707310
45940 13707310 11112145 7009984 6433314 8573817 9828424 8399388 4953962 1848525
45932 1848525 2425806 8018040 14571731 15201098 7882663 -1641929 -6584650 -6757119 -6894078
45923 -6894078 -8617058 -7808426 -1160378 7564547 10963604 7000703 1067793 -2080840
45915 -2080840 -4740139 -11014558 -17814166 -17131295 -7792404 1128569 1552303 -3929014
45907 -3929014 -7625198 -7359371 -5751208 -2567128 4374799 11797150 12987385 8729288
45899 8729288 7935424 13424310 14762433 2456204 -15745868 -21917425 -10367588 5542079
45891 5542079 10799276 5486077 26713 1964 2840279 6693091 13865194 23501625
45883 23501625 28000254 22199410 12546264 10550259 17389770 21286351 12831940 -1879492
45875 -1879492 -8378055 -1948638 7172309 7536417 -25696 -6338151 -7464957 -8062104
45867 -8062104 -11565040 -14127804 -12025924 -9574483 -13003373 -19114276 -18112949 -8123760
45859 -8123760 1276781 2829908 975703 2295150 3977553 -46621 -6718381 -7618806
45851 -7618806 -2814696 -721094 -4210609 -6752822 -4039926 -103582 1091278 1390754
45843 1390754 1945745 -573564 -6190775 -7862802 -1795373 5001564 4194457 -2229798
45835 -2229798 -6404161 -5783001 -3202297 -192348 2799024 3145104 -374487 -3917355
45827 -3917355 -4237539 -4054731 -6175453 -7461950 -5307838 -4181119 -7548063 -9496254
45819 -9496254 -4411898 1021333 -2331822 -9295368 -7790810 401246 2652633 -1684906
45811 -1684906 363809 11407305 16684164 8148051 -1644366 -204755 5390591 2951639
45803 2951639 -3161486 -485420 9562535 14086682 8735087 931610 -4130168 -7077337
45795 -7077337 -5712549 3181963 13023253 12156898 2017458 -2330563 5698184 13798278
45787 13798278 9489007 -1567474 -5816733 -2378215 -1215290 -4542006 -3061790 7702337
45779 7702337 18178724 17169483 6508370 -2980751 -5734510 -4634338 -2108175 3781335
45771 3781335 12460841 16763268 10832223 -881745 -7589552 -4533590 2606309 6161714
45763 6161714 6016221 8736203 18345315 29896873 33547141 25419342 12769362 5915565
45755 5915565 6096390 5479921 -649420 -7358278 -8033199 -3197207 2739519 8398917 13809053
45746 13809053 16429596 15038115 13717766 15428165 15715842 10485198 5629525 8928639
45738 8928639 15496876 13224530 1895644 -5757454 -3414724 1228557 1494623 1431743
45730 1431743 4764383 6301812 2419283 -372609 3275818 6705151 2305048 -4089842
45722 -4089842 -2045198 5234262 4802343 -5205854 -11445093 -4764032 6374284 7468575
45714 7468575 -2885353 -11839396 -9033686 661276 4141508 -1999379 -6388097 935798
45706 935798 13028989 14995546 5328928 -2828412 -1991912 632356 -1861696 -4674354
45698 -4674354 -1882124 2909009 5493072 10454733 20866651 27512688 21015162 8065728
45690 8065728 2388557 4543129 4366380 -194815 -1459250 2074685 3129880 528530
45682 528530 2805586 12985506 21595369 20306510 13138132 8393234 7026701 4846480
45674 4846480 694261 -2899084 -3723287 -1130512 3705069 6826819 4182337 -3171862
45666 -3171862 -9585599 -11266563 -9320050 -6700563 -5630461 -7350168 -10679135 -11854539
45658 -11854539 -9466832 -7492610 -9127158 -10662683 -7232455 -1446992 740713 -181977
45650 -181977 157135 436250 -3372448 -6891434 -947390 12206340 17801288 8142409
45642 8142409 -5968301 -8876811 1803337 15780614 22986026 20831811 12898478 5165721
45634 5165721 1705963 1997005 3679771 6448999 9517397 8133683 -466793 -9444751
45626 -9444751 -9155657 -1076700 4186676 3086850 2990931 7833446 10814184 6046500 -2008491
45617 -2008491 -6568493 -8047630 -9522263 -9666500 -6614212 -3183196 -2009736 -11969
45609 -11969 6518174 14684472 17593852 11794204 -513463 -13541682 -20759664 -19897120
45601 -19897120 -16093923 -15432274 -15989649 -12231072 -7015392 -8663676 -15164389 -14096994
45593 -14096994 -2585253 5909141 2346107 -2807727 3792885 16659464 19592834 9226017
45585 9226017 -2811917 -7972906 -8573411 -8279734 -5956246 -989860 3107063 3267480
45577 3267480 1075151 1105868 6352985 13875433 15092247 5439931 -5753897 -3433657
45569 -3433657 12067950 22153700 14243382 -1683500 -9808181 -11049811 -15926413 -23219087
45561 -23219087 -21935841 -10849078 -291143 4734681 8623232 11904749 8618943 -170767
45553 -170767 -3886586 1560179 6927391 4517355 -514921 -311115 3400418 4836651
45545 4836651 4734788 7230418 11199734 12434781 11165171 10648776 10635031 8358759 4429892
45536 4429892 2033279 1072785 -1512110 -5387211 -5787285 -564832 5485831 6219117 2014923
45527 2014923 -1240428 -508071 897294 -344083 -1528772 1643489 6966993 7934105
45519 7934105 3806367 891394 2039982 1753780 -4349755 -11527363 -13100600 -10626307
45511 -10626307 -10014587 -10983689 -7886552 430929 8414987 11341004 9965394 8046429
45503 8046429 9273727 15197420 22153112 22660922 14559053 5653763 3585158 4657662
45495 4657662 371055 -7646060 -8449114 2844886 18947221 30004528 31490947 22781819
45487 22781819 7312649 -4380862 -1632356 12515042 22487623 19010134 9097392 3516149
45479 3516149 3025080 2919434 2871900 3924741 1990425 -6080346 -13912210 -13003065 -6730262
45470 -6730262 -6641447 -14324098 -17569547 -8652020 2696405 2066020 -9572146 -17759121
45462 -17759121 -14526956 -6860668 -3507638 -2591327 1914246 8421231 10960486 10096855
45454 10096855 10762110 10799979 2952723 -10015476 -13899067 -2395959 12011963 14275055
45446 14275055 5773411 -1745083 -3938892 -4649102 -4097244 1249269 8857419 11602395
45438 11602395 8777532 5475433 1544007 -7742414 -19358544 -22833254 -16114594 -10294217
45430 -10294217 -13685613 -20577128 -21434354 -16029106 -9997131 -5177831 -442775 2584478
45422 2584478 1223912 -3484337 -8197734 -11156774 -11987173 -10745396 -8994037 -8014376
45414 -8014376 -5084442 3041819 12200236 13903158 8579819 6952822 13753670 19065825
45406 19065825 12972718 1073270 -3748615 354863 4035595 2173712 -85425 3350746
45398 3350746 11658291 19702937 23599700 22988348 20730606 19612038 17680651 10317049
45390 10317049 -554326 -5132021 1004387 8294625 6117962 -476410 2105504 14201143
45382 14201143 20903129 14018362 3810237 2672404 7183699 5952296 -1133552 -3074578
45374 -3074578 4482582 12850944 14135139 11980808 13002178 15024434 12341063 8106573
45366 8106573 10787608 18924178 20870017 12894822 6306016 9679916 14369601 8463793
45358 8463793 -2983951 -5763016 274389 2186050 -2561779 -1128641 11899063 23139721
45350 23139721 20118861 8766836 1427148 -632081 -1401830 2276811 13318665 22271081
45342 22271081 17381999 2511741 -8276001 -10431232 -10231564 -9877869 -5779121 -329258
45334 -329258 -641121 -4851175 -3753139 2407179 3217073 -2988174 -4751032 2445881 6834708
45325 6834708 -124924 -8319351 -4738543 5774157 8752104 1989628 -4324594 -5264752
45317 -5264752 -5776999 -8782297 -10528039 -9034957 -7463249 -6677223 -2251298 7967106
45309 7967106 18849353 23440999 20008895 12312582 5682227 2999098 2023324 -2068217
45301 -2068217 -8626178 -9218909 1151963 13517688 13782256 1487318 -9193005 -8865632
45293 -8865632 -4293640 -6215145 -13933606 -18731782 -17014196 -12453261 -8139087 -3973607
45285 -3973607 -915675 -1424295 -5044601 -8092905 -8387102 -6871518 -4472673 -828483
45277 -828483 3411051 6020550 5666976 3069147 -77094 -1524833 1046088 7373896
45269 7373896 13441444 15711827 15343280 15215584 14566984 10729867 4755385 402983 -1561316
45260 -1561316 -2787547 -1997098 3310312 9861037 10712282 5674610 2086407 3060486 3177323
45251 3177323 -698569 -3302124 -1261505 -689331 -6613110 -12637597 -10925000 -5982815
45243 -5982815 -6920087 -10720313 -6755662 3749803 7210958 -1100169 -8461380 -2843502
45235 -2843502 10460931 16953005 10444046 -3456700 -15356387 -17936352 -8923950 5851369
45227 5851369 15393634 13814722 5414012 -2280629 -6186238 -6418164 -3358024 55063
45219 55063 -1598170 -8772256 -13409056 -7785957 5659266 17258709 20500689 16351059
45211 16351059 9806251 5239930 3382495 1238014 -3079402 -5858131 -2357051 4747097
45203 4747097 7783619 5270607 3330400 5174093 7840311 10577597 15510755 17105610
45195 17105610 4407974 -19454108 -33537617 -25174858 -7791646 -570752 -2189012
45188 -2189012 -128055 4647922 1999515 -5018853 -3672982 4463858 4239771 -6867905
45180 -6867905 -13670652 -8465740 -1520658 215476 5399534 19038286 28413579 21775915
45172 21775915 7487884 289774 -554156 -4803353 -11956879 -13908981 -10949475 -10200491
45164 -10200491 -11586066 -8998106 -3320824 -1682792 -4830516 -6794637 -6402867 -7924373
45156 -7924373 -10312946 -6874949 2943742 10989139 11194084 4987105 -4013307 -11864717
45148 -11864717 -11461637 1324018 17465375 21784844 12556211 3088555 886339 -1937396
45140 -1937396 -11669002 -19847424 -17371214 -10848055 -11623023 -15877664 -10690425 3238923
45132 3238923 10354604 3305579 -6223947 -4834535 4701763 9744417 5014191 -3809661
45124 -3809661 -9753899 -11016888 -9184547 -6203902 -3295063 -107777 4512934 9173880
45116 9173880 9376777 3317504 -3487218 -3564297 2715820 7022508 4090670 -1202765 -1054459
45107 -1054459 3851513 5359987 50382 -5482516 -4557174 -502369 -767835 -3991829
45099 -3991829 -1694811 6460368 9059990 39919 -9248105 -4733732 8907261 13682683
45091 13682683 4148388 -5022248 -668506 11309674 16804921 12605676 5776732 694423
45083 694423 -3155131 -4358942 -823569 3608109 3002546 -662184 -125300 4380567 4249655
45074 4249655 -3761132 -11822629 -12510150 -8061611 -3682664 1253457 9354075 17647515
45066 17647515 19980311 14182780 2948672 -8927468 -15056384 -10560172 313045 4774481
45058 4774481 -3789792 -15661629 -16565608 -6469422 1656492 283397 -4617551 -5045466
45050 -5045466 -2018633 -1417382 -4683175 -8167732 -8621276 -5939231 -2163732 383546
45042 383546 1302831 2717730 5647243 6699072 2316627 -4115853 -4944707 694902 4448565
45033 4448565 510429 -5850998 -6627821 -3287579 -3518960 -8107010 -9417847 -3934545
45025 -3934545 1606508 531341 -3634767 -3559286 -541965 -2537789 -10620586 -15818777
45017 -15818777 -11762274 -3039918 3375229 8135166 14213082 17460226 12248828 3685843
45009 3685843 2868275 9361503 9891407 -1726818 -14091698 -14238869 -5230943 629952
45001 629952 -884291 -4912109 -8592511 -12821229 -15773861 -14507311 -11649929 -11790444
44993 -11790444 -12693740 -8820284 -1762346 2583272 5543497 12653903 19329040 13332748
44985 13332748 -4901901 -17782640 -13200048 -411510 5013593 2321526 1484548 5329942
44977 5329942 7137922 2687622 -4771093 -10088040 -10230775 -5135262 261484 -1169066
44969 -1169066 -8749381 -12480943 -7592109 -2953052 -6047694 -8007117 2899943 18987342
44961 18987342 21220997 7642725 -4114150 -4502552 -3913373 -10880111 -16287586 -10336017
44953 -10336017 -568735 1282721 -280788 6840423 19984554 24398160 15848364 5783397
44945 5783397 3938051 8917618 16944757 26741857 32609392 25269474 5651798 -11897295
44937 -11897295 -16591751 -13352957 -11816734 -11394803 -5717420 3982945 9536590 7443265
44929 7443265 1925157 -2451566 -4813690 -5647794 -6104701 -8718454 -13761403 -16291294
44921 -16291294 -12162588 -5358411 -3244372 -5938647 -7634769 -7912411 -12855078 -22737904
44913 -22737904 -27461622 -19764649 -6671672 -919142 -4522397 -7688657 -2793923 6683697
44905 6683697 11860856 8568422 161737 -6943185 -8674757 -5577874 -1364582 565972
44897 565972 -347958 -2010515 -1733362 1380368 5205026 6389837 4554370 3469527 5927464
44888 5927464 8827361 6909722 789239 -3256044 -2302954 -922575 -4136005 -10281836
44880 -10281836 -13968034 -13064280 -9484973 -5268792 -1060249 2916744 6698625 10003713
44872 10003713 10536766 5707237 -1950021 -4651604 1673316 10842763 12846131 5122961
44864 5122961 -6234516 -14698712 -18268000 -17218260 -12029675 -4822668 596255 2093351
44856 2093351 1180531 600909 885822 350861 -1309947 -468321 6656945 16259243 17139991
44847 17139991 4057255 -12014801 -15470039 -7375651 -4235725 -12544544 -17364010 -4746149
44839 -4746149 15927385 25381086 22415092 21925488 27962557 26953910 11309487 -6227255
44831 -6227255 -10214841 -3336093 -15669 -6494367 -16492214 -22273542 -21647270 -16085448
44823 -16085448 -8679027 -3419608 -2143560 -2957119 -4230125 -7531508 -13319729 -16766596
44815 -16766596 -12568461 -2489560 6116163 8822941 7849425 7535533 9064020 10191346
44807 10191346 8411982 3691780 -1405151 -4080155 -3533018 -714893 2898653 5399758
44799 5399758 5400415 4869053 8365183 16201205 21460152 18786405 13054229 12169228 13546516
44790 13546516 7443882 -5955932 -13792448 -8590262 1132626 4425723 2961858 4316524
44782 4316524 7670394 6368379 204967 -4976529 -7369770 -9216655 -8362952 -100354
44774 -100354 11946525 16665573 10159617 1479726 -297087 2161258 639252 -5983651
44766 -5983651 -11364049 -11146802 -7116696 -2788941 500383 2741841 3992078 5032354
44758 5032354 6841568 8058049 4976780 -3473026 -11406375 -9956949 2493304 16215394
44750 16215394 19632135 12348615 4905882 5081207 9175004 9630756 6764412 7302851
44742 7302851 13004028 16914749 12150460 -73976 -13057729 -21663714 -24432047 -21882610
44734 -21882610 -16327844 -11869651 -11060981 -11923404 -11104687 -9308138 -9648550 -10408725 -4880187
44725 -4880187 8380448 19890742 19611582 10318134 3711975 4228905 4983987 1104027
44717 1104027 -2329531 -527029 1518645 -2062608 -6211043 -2493800 5378325 5537622
44709 5537622 -2954008 -7080960 957623 12155013 13955183 6850854 715335 431211
44701 431211 2824153 4588535 5847603 6557774 5227540 2141113 286489 1892356
44693 1892356 5661564 8045104 6886349 3874502 2748508 4166095 3979488 -1013045
44685 -1013045 -7419570 -9166945 -5752215 -1904989 143949 2428551 5168436 5100910
44677 5100910 1554339 -1105635 717424 5581200 9730087 10357238 6336123 357353
44669 357353 -807437 5431883 10268766 3227360 -10893309 -15140918 -2903232 12879241
44661 12879241 16856386 7905502 -5789326 -17948723 -24231616 -20824093 -10873067 -4490266
44653 -4490266 -5174733 -4138726 4847052 13961167 13194300 4940472 -2822060 -9330717
44645 -9330717 -16228999 -18351687 -12036718 -5762161 -8795704 -14739693 -10878560 239050
44637 239050 4126767 -2547790 -7712976 -3346063 5028494 10169758 11523568 9353864
44629 9353864 2620508 -4124495 -2919567 4870244 8119052 1977893 -4980139 -3520847
44621 -3520847 4706456 12032916 13716397 9041491 508960 -5714358 -5158391 -2024044
44613 -2024044 -3682078 -8161563 -6076611 4203293 13267481 14616942 12059056 10347228
44605 10347228 8267741 4939752 3828726 5776111 5836012 1491923 -2779077 -2756134 -3995
44596 -3995 2283149 2610724 -720770 -7503852 -11428939 -6868855 242076 -1095997 -9480976
44587 -9480976 -12783945 -8391563 -6907452 -12090840 -13225543 -4476230 3473427 534873
44579 534873 -7608015 -11551086 -12483022 -13459777 -9191269 2475585 10351944 5570730
44571 5570730 -2222413 819054 10786662 13938283 9176488 5955834 5290472 354260
44563 354260 -6906614 -7091488 -1038106 -400346 -9032490 -17560661 -18597580 -15243329 -12384515
44554 -12384515 -10461212 -9655329 -10342977 -8490309 -397351 7928185 6680423 -2478602
44546 -2478602 -8393287 -7951676 -9162255 -15050462 -17696584 -12440937 -5903662 -4270644
44538 -4270644 -4252828 -1963294 -1194824 -5543870 -9918633 -7479183 140264 5859591 6624569
44529 6624569 5077668 4734505 6608410 8213378 5295907 -2050124 -6586660 -3126182
44521 -3126182 1872697 -1212329 -8803446 -8077268 2059338 7632221 1342535 -6084402
44513 -6084402 -3659952 3225805 3947189 188827 522456 4636557 5123319 831190 -2370149
44504 -2370149 -1573771 1504470 6295379 12270381 14451972 8508348 -1168321 -5969539
44496 -5969539 -4090835 -266453 3041313 6584965 8659269 6791731 4014862 5507474
44488 5507474 9562655 9345605 2945605 -5570671 -13525321 -19436271 -17191909 -1824985
44480 -1824985 17707610 23627199 11876944 -1017555 -148501 8143376 7535077 -4872102
44472 -4872102 -17269125 -21254834 -19829854 -17557701 -13227306 -5676805 593908 617435
44464 617435 -4344444 -9527917 -13393374 -17575805 -21506945 -21165303 -14003217 -2946060
44456 -2946060 5694650 7775704 4611432 1136283 696755 1568569 -591101 -6654817
44448 -6654817 -12212260 -13293014 -11903604 -12814823 -16062473 -16992267 -13912961 -10555022
44440 -10555022 -9127095 -6505619 -1069317 2160971 -910432 -5368679 -4465466 -1359531
44432 -1359531 -3984938 -9853579 -7649970 4351450 13418307 10661920 3082495 289622
44424 289622 -371960 -5617712 -11735035 -10357606 -3230795 1037153 1411734 3390588 5915454
44415 5915454 2246088 -6422362 -10755841 -7655252 -2882442 1611529 9514506 16619551
44407 16619551 10446294 -9776968 -25967232 -23254613 -8599779 2025166 5029244
44400 5029244 6884119 9082721 8031886 4496048 1587264 -2409204 -8838697 -11294913
44392 -11294913 -4804479 2124232 -2777776 -16749121 -25550353 -23524346 -17126967 -10486848
44384 -10486848 -2246447 3340318 -1656242 -12618658 -13520466 39005 12734259 11191727
44376 11191727 823985 -6832269 -10966638 -15635202 -18015076 -14367526 -9740418 -10148762
44368 -10148762 -11311217 -6199189 1637409 3578203 696092 1838881 9360996 16932052
44360 16932052 20120358 20185694 18470205 14876036 10672705 6314905 -730357 -9484592
44352 -9484592 -11566109 -2361014 8795656 10015209 4198562 3064134 7331367 7030455
44344 7030455 547860 -2037242 2997973 6357283 2153626 -2244656 91705 3337723
44336 3337723 -1086537 -10628112 -16387099 -15804576 -12840814 -9914447 -6402124 -2249596
44328 -2249596 1846139 5688028 8707546 11027830 15585976 23453205 27418587 19252936
44320 19252936 4710876 121279 9796356 18575270 13901387 3685721 1852591 6223559
44312 6223559 4431616 -4532392 -9553717 -6025969 -1438292 -1233072 -828914 4764440
44304 4764440 12115071 14542847 10750275 4939689 1520569 1365591 1301687 -2357355 -7883579
44295 -7883579 -8103849 393439 10836237 13553326 7411826 -524667 -4264517 -2908318
44287 -2908318 1918512 6874200 7021453 822343 -6355547 -8612501 -7227879 -6923000
44279 -6923000 -7566328 -6182265 -4421684 -6093071 -8666641 -5471472 3632797 11304508
44271 11304508 12981751 11345261 10184022 10427814 12493113 15755119 15476991 7534062
44263 7534062 -3253870 -7143310 -2847459 1068589 -219177 -1411893 2536102 7913721
44255 7913721 8905496 6186638 4086426 4629180 8399761 15503470 21421439 18296231
44247 18296231 5987142 -3957167 -2237238 4856566 3794541 -7376588 -16793903 -14745462
44239 -14745462 -4287063 5344600 9326571 8133666 2717565 -6158423 -14964535 -18116296
44231 -18116296 -13440692 -5329457 -480921 -860051 -2770251 -2713157 -1053943 1319113
44223 1319113 6048498 13414424 18278299 15035098 5737061 -1493869 -2236246 119934
44215 119934 169384 -3442198 -8061360 -9891056 -7004291 -2357805 -2263491 -8138824 -12365606
44206 -12365606 -7932640 425569 2356541 -2606185 -5374070 -3378081 -4923731 -13656064
44198 -13656064 -19697457 -13777983 -1892287 3223587 -281495 -3685531 -2338450 -264831
44190 -264831 -424165 815622 6588577 12779086 12840996 7346994 4701682 10861276 20182220
44181 20182220 20182153 6691120 -9795725 -16675446 -14254260 -12036625 -13299531 -12497063 -7387554
44172 -7387554 -3394444 -3553155 -3721798 -1539901 -1125092 -4343911 -6356715 -5190743 -6634309
44163 -6634309 -13103292 -16851917 -12308405 -6268844 -6147733 -6379684 1840537 13963937
44155 13963937 18291045 14397079 12102896 14499956 15039116 10751302 5993280 2679089
44147 2679089 -1656776 -5227002 -2598818 4760844 9229208 9468717 11018632 13273419
44139 13273419 8706783 -1511453 -4399423 5989906 18257326 20003984 14287982 10867899
44131 10867899 10135139 6615655 2089401 3521749 10627798 15595788 14561311 11246604
44123 11246604 9006287 6102969 304696 -6455138 -9709740 -6785849 693973 7890078
44115 7890078 11493327 13213977 15745445 16293333 9922802 -331166 -4541162 169010
44107 169010 5000346 3381534 780070 3486535 5838017 -1169183 -13988387 -20249646
44099 -20249646 -15349023 -5048348 5861663 16314026 21784146 16812942 6297433
44092 6297433 2767103 9147783 14733222 12307967 8427233 10354442 13008931 8328083
44084 8328083 278385 -353792 7666753 15237064 17112147 17400628 20353507 24014727
44076 24014727 25118532 23546921 19320410 11018513 449374 -6059596 -4901520 59154
44068 59154 3655732 6451937 10714953 12682024 5948155 -7622054 -17195941 -15484637
44060 -15484637 -6735524 661105 4391994 6441144 5734379 30360 -6336807 -4851836
44052 -4851836 4995489 12649802 9544413 258036 -4109584 -153437 5539358 6265043
44044 6265043 1994624 -3330957 -6802082 -8178131 -9324037 -12040955 -14599999 -12179885
44036 -12179885 -3776148 3719342 3231984 -2223450 -3097416 2954384 7720458 4788395
44028 4788395 -1204322 -1628491 4604033 11213262 13159048 10676043 6681563 4018581
44020 4018581 4109071 5385855 4059686 -1474291 -8376919 -12882080 -13694434 -10640952 -3893463
44011 -3893463 2867114 3132511 -4022446 -10017157 -6823815 2045819 6783141 4869664
44003 4869664 1955655 712913 -2317225 -7929238 -11230083 -10438020 -10677876 -14506220
43995 -14506220 -15873531 -9551221 -627283 2668878 1370977 3058719 9168549 13171434
43987 13171434 10921281 5247015 -534820 -6589407 -12144961 -13723789 -11082476 -9488114
43979 -9488114 -12054619 -14158418 -9944361 -1025688 6003780 8196187 7494112 5212010
43971 5212010 676429 -5135001 -9686738 -12953389 -16748132 -19422134 -16359966 -7627680
43963 -7627680 -382748 -632962 -6198673 -10842636 -11840821 -9964593 -5581161 361893
43955 361893 3953061 2230741 -1953322 -4085891 -5538010 -10828485 -17964361 -18881580
43947 -18881580 -11242353 -2950413 -1525605 -4613811 -5127970 -1071290 4292233 8096518
43939 8096518 8889138 5250706 -1552354 -5869267 -3341813 3463118 8929331 11379241
43931 11379241 11984783 9776233 3356228 -4335075 -8498520 -8321741 -5538908 249802
43923 249802 8686987 13862471 10599926 4383379 5951194 15310145 20328399 13756387
43915 13756387 3014771 -1005494 2585512 7233170 8600992 6342189 1295730 -3755079
43907 -3755079 -4325065 227873 4575831 4167514 418178 -3489405 -7049565 -9456387
43899 -9456387 -7851852 -2842733 -117242 -1547871 -532847 7566804 15998333 15518455
43891 15518455 8484595 5212829 8561663 11047864 7094167 189245 -3710327 -4151402
43883 -4151402 -5565019 -11697163 -20983268 -25998785 -20126316 -7081981 865247 -1577071
43875 -1577071 -4628968 2359334 13990511 15676967 4425756 -7623569 -9813879 -3445980
43867 -3445980 4619830 9287340 6895501 -3013068 -12987895 -13100065 -4017989 2984460
43859 2984460 1642809 -2068990 -1797367 -759480 -3743511 -6873480 -3517007 4157370
43851 4157370 7472142 3062120 -4020438 -8025517 -7897960 -5056168 -469084 4586421
43843 4586421 7502799 6194674 1956823 -679397 1460637 5722033 6384989 2905168
43835 2905168 1439856 5452074 9621876 8121138 4243212 4598439 7549029 6432688
43827 6432688 1878303 527931 2060352 -1366067 -11048203 -17834554 -15626436 -9249934
43819 -9249934 -5112987 -3106428 -1914693 -3318723 -6197573 -4574296 3075514 10078369
43811 10078369 11627599 10603413 9239017 4587404 -2165515 -2161216 7650451 16658251
43803 16658251 14649572 5466121 -1633360 -5518968 -8977134 -9967724 -7680593 -8763883
43795 -8763883 -15814832 -18111757 -7342622 5251728 3434590 -7982056 -9310328 4342963
43787 4342963 17562938 19270848 15567885 14755347 15294567 14032508 13162853 13149266 9793268
43778 9793268 3268781 -387882 -747730 -4471272 -10845082 -8593674 5716057 17908938
43770 17908938 14143009 -809527 -12642680 -16467255 -16542681 -14349810 -8471524 -2003802
43762 -2003802 721065 2215997 7100472 11682951 8323057 -665171 -3687529 3945154
43754 3945154 13337218 14698394 9355822 4564699 2187384 -1042406 -4799362 -3906005
43746 -3906005 3033600 9346422 8592415 3943481 3715006 8386426 8955920 569988 -9083756
43737 -9083756 -10472023 -5797138 -4239257 -7385361 -8724125 -6171316 -4884280 -6578721
43729 -6578721 -6119820 -1845607 237211 -2617299 -3639743 2023277 7169154 2574875
43721 2574875 -7775628 -11154786 -4124536 2800576 -234315 -10076594 -16212325 -14753323
43713 -14753323 -12146859 -14732721 -18257038 -12253994 4732561 20196860 22655929 16542279
43705 16542279 14236211 17087736 15858149 9248891 7737082 14679051 17711059 7999225
43697 7999225 -3683039 -2209790 9171952 15072422 11359660 7690138 8869658 8344487
43689 8344487 1771308 -5651601 -8986259 -10195086 -10709714 -6598945 3326136 11763721
43681 11763721 11272839 3678732 -3628261 -6929227 -7676591 -8122136 -9155991 -10160447
43673 -10160447 -8674187 -2767407 4878952 8813148 8093737 7367355 8898593 8832294 4584700
43664 4584700 481674 933867 2369199 -1473310 -8608737 -10341692 -3922837 2569018
43656 2569018 160441 -10398530 -20382300 -22486137 -16024207 -5134145 4892248 10066985
43648 10066985 9465694 5646075 2175646 176610 -1782075 -4247517 -5218013 -3270432
43640 -3270432 -655102 -723317 -3096869 -4523663 -4327616 -4980017 -6321848 -4140207 2439175
43631 2439175 6839677 3586567 -2339266 -1523800 5875262 9911974 5769709 1161807
43623 1161807 4844165 13747944 17380393 11742708 3069617 -1044583 616185 3829359
43615 3829359 3772736 -1305563 -8327297 -11207891 -6971625 34981 2395768 -2245791
43607 -2245791 -9762920 -15464972 -17877050 -16614020 -10857603 -1909152 5941149 9527996
43599 9527996 9637001 7982417 4345132 -479935 -2012990 2912781 10005090 11791919
43591 11791919 8117383 6659764 11325425 16078246 14257988 8805642 6958539 8232772
43583 8232772 5839263 -579349 -2599546 3820377 10875367 10100850 4715392 3403846
43575 3403846 6162835 5443999 -190486 -3353392 -284679 3030268 1029541 -3019751
43567 -3019751 -4331026 -5526389 -10842167 -16343199 -14645189 -6887366 -1212850 -239367
43559 -239367 952890 3722139 2314764 -5280901 -11475278 -9551498 -3560853 -1650873
43551 -1650873 -4382965 -5959654 -3400118 1671444 7450720 12043665 11471222 3756871
43543 3756871 -6399615 -12323757 -13039130 -11412716 -7706027 -1307163 4150813 5158809
43535 5158809 5430412 9985077 14379564 10470064 2017084 1993458 12614704 21305408
43527 21305408 20755296 19097325 22631157 22273582 9402061 -5601407 -6009156 5926213
43519 5926213 11817172 3567269 -7152948 -7155130 2297185 10904849 11938595 6145951
43511 6145951 -720671 -2069797 3350381 9176889 9269183 5662308 3573819 2352687
43503 2352687 -958706 -2991814 816070 5061794 328571 -10208084 -12876237 -3797167
43495 -3797167 5852693 8377487 10190187 17511426 23390189 18318694 5446250 -4179879
43487 -4179879 -6046684 -4074164 -2741092 -4118305 -8706416 -13396339 -12410827 -5011421
43479 -5011421 2085339 4095259 4625390 8358816 13177207 14558930 12025637 6353063
43471 6353063 -3113503 -12970799 -14814882 -6484947 2464444 3408468 -211298 -1438999
43463 -1438999 -1012281 -869351 4495727 17711795 27005929 19996399 4356177 -1483273
43455 -1483273 3739504 2851106 -11185158 -22602009 -15785489 2256130 11763586 4531355
43447 4531355 -9897189 -17490782 -12893896 -2058528 4576411 2999531 -504784 586056
43439 586056 2423046 -2550057 -11212532 -12687969 -5384352 645451 343048 373151 4964779
43430 4964779 7293234 2015944 -4290321 -3884294 -332963 -1100734 -4922742 -5840457 -3715332
43421 -3715332 -1638316 1391149 5823830 5305765 -4247844 -13924892 -11928640 -1507889
43413 -1507889 3450420 -642020 -3451842 1202447 6904893 8036393 9268536 14734524
43405 14734524 17428678 8513338 -8297386 -19943534 -19011560 -9666835 -1021529 487191
43397 487191 -5518163 -12928347 -14048021 -8636275 -5179699 -9039111 -13297222 -8063325
43389 -8063325 3544073 7071983 -4712671 -22134663 -30130588 -23850123 -9722247 3752242
43381 3752242 11658254 12803122 9693798 7272934 7679054 7095621 1210393 -7408600
43373 -7408600 -11578682 -8744592 -3439084 90416 2877692 6606696 8449247 4974713
43365 4974713 -1115288 -3467283 -1455075 -2059265 -9822802 -18724746 -18777968 -9370533 -360904
43356 -360904 1438989 993096 5887674 13367344 14076557 6660620 -447995 -2570899 -4273361
43347 -4273361 -7841581 -6848448 1380674 6533027 -252309 -9739522 -6084402 8974346
43339 8974346 18522192 16071810 12570223 15544751 18124250 15263490 14815226 21929362
43331 21929362 25996849 16420643 1072892 -5301277 -3132970 -3237156 -5922640 -1940837
43323 -1940837 7639905 9607869 -640168 -10680197 -8477780 2367391 10067518 9329649
43315 9329649 3733355 -823570 -1246081 778683 1049519 -25237 4365833 16366730
43307 16366730 25256272 19981135 6485062 512604 4851427 7595349 3385311 626154
43299 626154 3583908 3165399 -6486437 -15797200 -14242042 -6132587 -1509945 -726473 882725
43290 882725 1234013 -3528032 -8515575 -6712089 -1684660 -2015289 -6411864 -6118329 -238121
43281 -238121 2958347 -181569 -4348356 -5718714 -6808115 -8566828 -6566298 891324
43273 891324 7479694 6360475 -693995 -5244512 -1467346 8269567 15987729 15778206
43265 15778206 9466495 3797390 2139360 2118431 1880700 3239336 6057711 5757384 1127242
43256 1127242 -1335124 2897037 7817181 5592661 -756066 -2073946 2946296 7838774
43248 7838774 10073494 12565832 14141198 9012197 -2154311 -9386433 -5159630 6645097
43240 6645097 15707947 14973829 5463002 -3755945 -1707941 12377315 25034955 23944341
43232 23944341 14767412 12798650 19612417 21109951 10840534 1347266 5357590 16694882
43224 16694882 19312475 8382604 -6465114 -14554255 -13434259 -7878925 -5414197 -10134725
43216 -10134725 -16916756 -15571002 -4342775 5974074 6060500 534557 212519 6885558
43208 6885558 13258967 14792701 14005850 14480037 17021283 20834960 23154823 19177517
43200 19177517 7963635 -2808014 -3790434 4659188 13137673 14843114 11517699 7940934
43192 7940934 5951837 5190788 5385123 5969317 6171691 6659909 8905617 12288242 13934410
43183 13934410 12046909 7769168 3401426 108747 -2241620 -3625563 -2555461 2820216
43175 2820216 10858606 15157354 11121308 3693683 3146669 11180726 16726939 9514421
43167 9514421 -6680411 -19166723 -21308264 -17169978 -13488877 -12161356 -10119956 -3617625
43159 -3617625 6274702 11465746 4416505 -9924256 -16088995 -6773844 6853425 10219105
43151 10219105 4355001 732690 2374895 1776845 -4525419 -11176764 -13946961 -13571488
43143 -13571488 -8848265 2917642 16283482 19532944 10273259 -390341 -3285845 -1081687
43135 -1081687 1678134 7421489 16853136 21126671 12958214 -655818 -6830839 -3798063
43127 -3798063 -267876 -839372 -1406581 1784229 6664768 9693853 9897150 7885281 4824106
43118 4824106 2277826 420089 -2001797 -3733178 -611065 7527528 13756467 12453978
43110 12453978 6738998 2538994 -182267 -3953140 -5991942 -1987845 4892247 7027827
43102 7027827 3497313 1135400 4912199 13049544 20496232 22075953 14974167 4065796
43094 4065796 820177 9470624 18893363 17408452 10138386 9141631 11389068 3825189
43086 3825189 -10882779 -13952737 -532667 9813847 2528087 -9886884 -8989624 1612391
43078 1612391 6503648 4881092 6819366 10570568 5460639 -4395586 -1184610 17584653
43070 17584653 30288114 20253441 -928854 -9999196 -1664730 9781086 12042296
43063 12042296 6854133 2856391 5324491 13034504 19851640 19646177 13102152 8147181
43055 8147181 10527254 16482104 18553295 15878536 13746378 14774705 16121823 15091907
43047 15091907 12271820 8487903 3465516 -1021263 -1078337 3617216 7270613 4233724
43039 4233724 -3977021 -10542892 -10912949 -6203890 -332799 3568259 4608459 4730475
43031 4730475 7595588 14296281 20312871 19609585 12109716 4207907 1278928 2884726
43023 2884726 6306391 10737701 15482716 17697735 15746219 12441076 11173325 10640526
43015 10640526 7263920 1470682 -2308658 -1189589 3678882 9018136 11191814 8396130
43007 8396130 4276309 6014282 14326197 19398513 13343363 2989250 1514613 9515948
42999 9515948 14482218 8892380 -1489511 -8408178 -9615328 -4545075 7239856 19413383
42991 19413383 21615473 13885043 8118461 10151226 11729400 6354307 322193 -509822
42983 -509822 -1659587 -6559145 -5639930 6436204 15162069 6420690 -7584866 -4547532
42975 -4547532 11998570 17406129 5273986 -3690415 3100608 10749808 3519048 -9934392
42967 -9934392 -12610299 -4894702 1461568 3836831 7573623 11777775 10832794 5938942
42959 5938942 3216443 3369583 3079204 3336242 7006901 11056390 10208453 6137945 4838534
42950 4838534 6749039 7047378 4157632 1158686 165834 951367 2923858 3548613 -1226298
42941 -1226298 -9193838 -9986074 885240 11416174 7473448 -5696659 -9376050 1489610
42933 1489610 11040271 6280811 -4796698 -6866295 571873 5161103 568811 -7389326
42925 -7389326 -12147531 -14026442 -14517766 -11024188 -1981925 7907812 13050899 14521012
42917 14521012 16559040 17750867 13148739 5173588 3454247 10228194 14573827 7862012
42909 7862012 -2834447 -6292702 -5436817 -10955293 -20264909 -18880205 -4224954 7874621
42901 7874621 6101054 -1223886 -1909823 2345426 4377667 5903409 10297522 10439769
42893 10439769 -841575 -14008579 -12520507 2814810 14000510 10425375 -195463
42886 -195463 -6666642 -7118453 -4002587 1856897 7580590 8228131 4994657 5056934 9510074
42877 9510074 10356002 4050733 -1078119 2704010 10611429 13427355 11132506 10176932
42869 10176932 11887748 12389594 11313042 11914424 13499878 11921488 8123185 8352255
42861 8352255 13550279 15703825 9319838 1114151 1844903 11166482 17705139 14343274
42853 14343274 6591610 3143658 4249231 4679658 3873830 5950708 11123180 14357263
42845 14357263 13275214 11149072 10686088 10710345 10656971 12189034 13938277 10946377 2717649
42836 2717649 -4042537 -4333099 -608645 3923938 10624823 18834567 21314259 13727905
42828 13727905 3178083 -285197 3848536 9345835 13089298 14496525 10984734 3330168
42820 3330168 279190 7311642 15369689 12436104 2576767 293814 8048494 13705692
42812 13705692 10591871 5665370 5125826 5559167 3884537 3810048 6845903 7811972 5092879
42803 5092879 5032664 9754422 10626188 1693022 -8829047 -9043985 914938 11462272
42795 11462272 16611200 17239310 15816239 14743130 16579753 20232801 20010182 13117482
42787 13117482 4741904 1609300 4093232 8304217 11850590 13744843 12601852 8632381
42779 8632381 4181819 216695 -3689897 -5303067 -2050856 1833443 -852904 -7152821
42771 -7152821 -5107279 7242590 14982200 6295370 -10043555 -16512037 -8625634 4746883
42763 4746883 15956172 22592764 22151313 14461050 7419587 10352991 22110395 32607816
42755 32607816 34239986 26071028 11152862 -2995445 -6133968 3459273 13213322 10621427
42747 10621427 -376876 -6598370 -4877574 -2976591 -4314515 -4230235 -858235 1977729
42739 1977729 3271381 5483107 6162314 -74308 -9939572 -13005110 -7231317 -2275738
42731 -2275738 -4163003 -7141848 -5021398 -656526 1261117 2116872 4122259 4649372
42723 4649372 1913888 -22963 2111275 4502420 2173436 -3224876 -6390527 -5201009
42715 -5201009 -671180 5736288 11190586 12139611 9161936 7013258 7433289 7031640 4592127
42706 4592127 4026315 6781271 8210098 5756949 3778239 5250450 6038716 3597835
42698 3597835 3816660 11165151 18865704 18602847 14510691 16402695 22915277 23759803 17374456
42689 17374456 13399583 15985747 17016628 10426928 2514672 1270268 3936893 3490262
42681 3490262 1634646 5924089 16095370 21840500 15345678 478689 -12134894 -15432939
42673 -15432939 -9962876 -972064 5970124 7687179 4192814 -1911627 -6631559 -6256386
42665 -6256386 -4170 8177056 12285610 10388397 6782184 6280767 7842746 6725359
42657 6725359 2155948 -1090109 214655 2922837 2697131 1275636 4020348 10715925
42649 10715925 13833078 8334179 -317668 -2127187 4443918 9826996 5190847 -6172231
42641 -6172231 -12350260 -6549385 5969443 15014213 16073305 11674790 5252854 -1647125
42633 -1647125 -6618119 -6333287 -1566214 1957576 1158943 445774 4461690 9306080 7481094
42624 7481094 -1411 -4125071 -1021077 3323936 3918292 4137810 7341373 8527680
42616 8527680 1834238 -8688069 -14130231 -13482526 -12815468 -13382162 -9677784 -94397
42608 -94397 8821012 11244939 8698665 5433992 3318244 3826024 8698083 14852053 14564224
42599 14564224 5697659 -3143528 -3470428 969488 -88422 -7501766 -10357013 -1160882
42591 -1160882 12727730 17112802 7820973 -4874933 -9139226 -5358693 -3614379 -8354735
42583 -8354735 -11323600 -3832761 8238948 10045262 -1314308 -10609031 -4216483 11192604
42575 11192604 17950783 11151509 2772134 2242135 3979332 -565510 -7201993 -4842788
42567 -4842788 6599043 14830549 13137252 10009754 14914701 21670015 15966069 -2663793
42559 -2663793 -17339918 -15285064 -3489942 3350662 3129747 5000106 11747236 15164836
42551 15164836 10307932 4179615 5397004 12268084 16861341 16055741 12669845 8966101
42543 8966101 5112508 2559318 3530064 7287756 10730498 12321860 12241909 9726526 4209220
42534 4209220 -1429191 -3012337 -785495 1045735 1198260 3259260 8638677 11913571
42526 11913571 7667392 -111744 -950864 8676105 19170801 18465784 6821573 -3183403
42518 -3183403 -1603735 7888172 13884593 10904706 3853841 649834 4240751 11572396
42510 11572396 17018995 16433677 10598349 5202649 5235659 9437429 12491021 11884868 9519146
42501 9519146 7449058 6107571 6278147 8317480 9809696 9102909 10304028 17539514
42493 17539514 24279179 18323874 855726 -9930652 -1456410 15603595 21651472 13406139
42485 13406139 3956581 2359572 5518400 8664238 11528119 12815957 9426572 4069790
42477 4069790 4597421 12454731 19524015 19434394 14798316 10633585 8058470 7198844 8544805
42468 8544805 8458572 1703222 -8090741 -9751406 -931622 7089876 7469751 9409299 21421689
42459 21421689 33217986 28950002 12658027 4328920 11793281 21983132 22422085 17171365
42451 17171365 15710241 17741974 17591280 16051560 18579153 24808428 27198332 20073427
42443 20073427 6421587 -4230652 -3813306 6612993 16695914 16868075 8826610 2952424
42435 2952424 5475441 12049217 14093697 7464164 -4848430 -14037584 -10527095 5917169
42427 5917169 21446300 21091846 7205959 -3306304 -1342846 5061855 7030130 8294672
42419 8294672 14215305 17852028 9338488 -6416088 -13863841 -6988918 4949994 11396789
42411 11396789 11170911 8688388 7472148 9045367 12658345 15187185 15172508 15626312 18600800
42402 18600800 20167528 16946100 14152672 18998495 28448917 32617096 28998849 23757610
42394 23757610 19544272 12788842 4217028 1033459 5319850 9873074 9350429 6666315
42386 6666315 4679830 1006979 -4072205 -3897301 4119390 12437950 14260281 12899155
42378 12899155 13713847 14487748 11761436 9865598 14739955 23880293 30669633 33901471
42370 33901471 35015074 31152208 20326411 9518658 8001714 15005656 22192383 25250451
42362 25250451 24760807 19683841 10214318 4016214 8205892 16423032 15239821 3341376
42354 3341376 -6842916 -7283848 -2675214 1252066 6021835 12893893 17452134 17397450
42346 17397450 17673248 22195798 26748562 24852272 15672167 3171865 -7155044 -9103406
42338 -9103406 -304471 12118073 17867235 16878844 17656017 21265905 19162058 10602972
42330 10602972 8044200 17098552 24647762 18767029 8973457 11653811 23617260 27156277
42322 27156277 17391944 7616572 7764123 13184706 17115894 20420748 24628570 26808885
42314 26808885 26324343 27235118 29554684 26974842 17807625 9655841 8113846 8749603
42306 8749603 5894353 2003633 1957631 4525283 6331344 8900621 14633175 20062023
42298 20062023 20325114 17385308 17221201 21070929 25319300 27955218 29447153 29007250
42290 29007250 25526544 21017724 18478188 17871942 18238389 20865472 25318556 25810387
42282 25810387 18421071 9430524 8515460 14724412 17458441 11602602 3482773 413596
42274 413596 2197242 5366794 8625426 11109838 11737972 13076737 19383541 28195107
42266 28195107 31128725 26205288 21243444 20852844 19440724 13594208 11360634 19036732
42258 19036732 27152808 22853891 10962925 7971471 17036287 24319248 21710747 18101218
42250 18101218 22791590 30882938 33230196 30639195 28885394 27351862 22501286 17356739
42242 17356739 17620907 21260877 21022273 16030145 12693552 14058187 15736765 14139856
42234 14139856 12835030 17482001 27369549 34829501 32883214 22797694 13270412 10831740
42226 10831740 12253503 9992117 4264885 3350071 10271233 16745006 15210635 10231273
42218 10231273 10904491 16846261 19818624 16297556 10484998 6866920 7556988 15199183
42210 15199183 29685128 42213044 41494848 27519613 11899146 3359219 385080 -494383
42202 -494383 1852275 7492056 11122006 9320244 6814136 9941670 17628594 23687199
42194 23687199 25019681 23327953 21400813 21464325 24686886 29003855 30041926 27118651
42186 27118651 24983818 26138434 25349925 17082686 5700386 1853986 8947871 18900869
42178 18900869 22878782 21884766 23883385 32674835 42735350 45263326 37542401 25068704
42170 25068704 15166086 10775083 11165397 15358173 21234924 23476647 18047755 9084359
42162 9084359 5779256 10548023 15632392 14711804 12688515 18322705 30264560 37256188
42154 37256188 32311636 20986099 13540011 13015646 14383994 13303626 11500983 12740111
42146 12740111 16771565 20224609 22047168 24043534 25813036 24209039 20323300 21430776
42138 21430776 30266665 36843964 29835965 14654956 9525296 20819176 32597715 27531127
42130 27531127 10375827 867037 7152505 17051371 16351641 6467739 -284923 3233119
42122 3233119 13484074 23870534 31388181 34793160 31453903 20632524 8433026 4162146
42114 4162146 9623895 15712619 13151905 4100873 -1261181 1939849 8647222 12339698
42106 12339698 12487586 11963427 11673067 10344849 6896011 1624497 -2547233 -400989
42098 -400989 9776024 21004153 24087314 20065038 19314261 26153265 32301592 30096532
42090 30096532 24264410 23451632 26600535 26785074 24049909 24092334 26328548 24372238 19114486
42081 19114486 20290130 30913705 39509744 34700634 21160286 13058689 15270345 19685601
42073 19685601 19392003 17686216 20061486 24398057 25042818 22592645 22554623 25433247 25333310
42064 25333310 19732067 14033968 13301248 15358370 16550889 18820799 24809446 30323545
42056 30323545 29293449 23405338 18786875 15315509 8513196 1197153 2505737 13368510
42048 13368510 23153789 24636840 23042557 25179813 28256275 26162030 20000696 15397727
42040 15397727 14616010 17353938 23881716 31200140 31789985 23269481 14166876 12618862
42032 12618862 14401503 10916848 4805206 7124471 20328107 33942398 38161860 33804064
42024 33804064 27192762 22005636 18817608 17940879 19838987 24519163 31040282 36675231
42016 36675231 38454553 37258381 37306700 39288031 38261186 31755636 24900358 22784114
42008 22784114 23032710 21890386 22037054 26628660 30725945 28332515 24484535 29616469
42000 29616469 43142534 53004561 51825681 44085409 36590042 31255793 28998914 31559551
41992 31559551 36220690 36242281 29975122 23613098 22471531 25185646 28347242 30972912
41984 30972912 32414710 31339968 28479628 25524356 21102300 13827604 8879570 13568400
41976 13568400 25645057 34825524 37715835 41499722 49245583 51900793 41593181 24375994
41968 24375994 11480610 4526574 -1249817 -3936318 3713220 20463880 34118326 35783185
41960 35783185 29757472 25342574 24113314 21255101 17238120 20469739 35029263 51002278
41952 51002278 53905245 42799342 32031205 33478449 43961033 53315034 57354850 57108427
41944 57108427 52379322 44620889 41127779 46638926 53778063 51473576 40835754 33022979
41936 33022979 33015991 35826692 37758491 40068440 41082399 36576839 30164768 31779294
41928 31779294 42396665 51151548 51649990 50186980 52607298 54022094 48863298 41784080
41920 41784080 40211168 43156638 45105977 44920214 43908274 40986478 36674295 36333931
41912 36333931 42515373 49122168 49754310 46826624 45899008 46355690 45262128 45795369 53287482
41903 53287482 65462386 74319368 76465894 75446035 75100588 76032849 77513196 78105837
41895 78105837 75186712 67531176 57650339 49358156 44599402 43810554 46357727 49435567
41887 49435567 50251865 50176003 52344347 55203424 54786310 53592645 58759586 69673524
41879 69673524 76812809 76165011 75001841 78785755 82375141 80173998 75334524 72199154
41871 72199154 69162432 66111129 68696744 76850721 79588064 71119287 61739170 61510875
41863 61510875 63841359 58891032 53220435 59410927 73461048 80602937 79347624 81548329
41855 81548329 90209734 95052130 91225013 86449419 87053989 90598438 94404626 98583400
41847 98583400 99183271 91437558 81413621 81147942 90241266 95687115 92122835 88119119
41839 88119119 89374994 90563370 88540312 88855187 92885092 92746249 86525554 84934194
41831 84934194 93999276 103909318 104951341 102569595 105491625 109914043 108192407 104163356
41823 104163356 106182430 111582006 111486443 106275079 103390472 103340218 100504802 95782927
41815 95782927 96366088 103426287 110600196 114590421 117692784 120172272 119905614 119810179 125686634
41806 125686634 135243781 138702750 132862247 126131064 126480083 131969689 136649423 138833090
41798 138833090 139591385 139304017 139895125 144802005 152364845 154744277 148458429 141038176
41790 141038176 141513661 148700914 155405759 160209617 166807421 173943598 175785783 173099092
41782 173099092 174409945 182441165 188100160 184195592 178147938 182530909 197107176 209587724
41774 209587724 212604330 210370558 207914600 203549419 195811093 189669200 190017369 194660568
41766 194660568 199568978 206336048 217829905 229738486 233651871 227792279 219110182 214928762
41758 214928762 216934496 223075948 231159641 240083555 250055935 261156340 270181896 271701901
41750 271701901 265475350 259878711 263184378 273076618 279609867 277767063 272707882 272764232
41742 272764232 280771155 292305671 300129962 300907505 298641553 299520608 303260142 304364332
41734 304364332 302900952 306293471 316450391 323750641 321021306 315600037 318014369 325564669
41726 325564669 328793773 328975150 335520830 348327792 356511939 355041913 350322677 348199649
41718 348199649 347815942 348313547 350127653 348575218 338228908 325307214 323121526 332678571
41710 332678571 340636408 339623562 336884668 338378328 338951379 335251960 334379295 340613565
41702 340613565 345878903 343232709 338635464 339054669 339562871 333517240 325849003 324135555
41694 324135555 324806994 320429047 313191562 308887686 304659423 295681064 287520712 288114046
41686 288114046 292910976 292208880 288502608 291248134 297721279 295561140 283633103 274112874
41678 274112874 272340699 270256736 263437225 259846099 265507348 273822944 276362230 274387264
41670 274387264 272457850 268913914 260232819 248603807 238332129 229561735 221421065 216830086
41662 216830086 217975247 220223017 216753740 208128423 202228317 204172660 209584885 209723873
41654 209723873 202546156 196297681 199641938 209481823 213858021 208093291 201062113 201167723
41646 201167723 203577645 199081120 189323064 182995380 181246654 178619959 175937735 179140341
41638 179140341 185585593 185424065 178822255 177580305 184758845 187059173 175972450 163612746
41630 163612746 165353547 176065571 177700844 165329127 151411419 145684934 144459557
41623 144459557 142309140 142734673 151090676 164050162 172882068 174250635 172734371 173702827
41615 173702827 177328310 179833104 178394148 173743856 168522507 164239327 160918141 159433593
41607 159433593 162022468 168828377 175240794 175336774 168537899 161061987 159506878 163845779
41599 163845779 168084991 167334974 162345707 156784629 152562119 149784554 149302933 152105526
41591 152105526 156915687 161315510 164440400 165617931 162531181 155992544 154389396 164858648
41583 164858648 179618368 181353473 166072862 150438139 149770188 158440482 161362341 156311441
41575 156311441 152718232 154465725 157597051 161653503 169071668 174502627 169113593 156415984
41567 156415984 149615284 150648361 146421642 131167898 118430166 121899517 135259244
41560 135259244 141420166 134470611 122951408 116616067 118403521 125640467 131975480 131164589
41552 131164589 124479763 120810352 124653974 128560120 122909907 108893860 96073970 90672590
41544 90672590 91596054 94803357 96651394 95422072 92861806 91182055 87364007 76705050
41536 76705050 63836138 60957325 70321868 78441644 75188319 68597072 70126137 74437926
41528 74437926 68361131 54583600 50159283 61661784 76266111 80316898 74902806 68913980
41520 68913980 66399084 65938184 65612490 63924442 60258697 57016365 57345537 59948077
41512 59948077 60752097 59653153 59834227 60301391 55783488 45395685 35360689 31411023
41504 31411023 33491895 38663566 43731419 44611859 39457645 33488914 34460398 42158478
41496 42158478 48744633 50422642 51225153 53277333 51754237 44006169 36669293 37717502
41488 37717502 45756654 52283066 51620446 44963988 37400067 33815666 35189704 37201496
41480 37201496 35422720 32199396 33638464 39332917 41577263 36752105 30731986 29918688
41472 29918688 33444818 37794931 42241959 45118731 41680726 31786668 23780041 24036817
41464 24036817 27703687 26780645 22803535 23699525 31255422 39369560 42673329 40138797
41456 40138797 32352058 22065528 15526908 16363720 19692425 18813165 15561625 16438060
41448 16438060 20395519 19714783 13224251 9392845 13883010 21793149 25442301 23377179
41440 23377179 18369049 12380947 7468569 6980281 11665310 17542109 20688072 21797571
41432 21797571 24026710 28699427 34409770 38029946 36427161 30229516 25249088 25873838
41424 25873838 28103044 25308308 20267300 22785772 33508018 40053480 34784425 27311273
41416 27311273 30432609 40197237 41217356 29242286 16896883 15516564 21184507 23252405
41408 23252405 19491341 16519075 19055204 25189458 31379646 36454556 39216628 36640001
41400 36640001 28304924 20393173 20074845 25385529 26093018 17682924 9339814 12164436
41392 12164436 23151049 29085364 25124115 19937745 20778875 23483338 22189685 19893586
41384 19893586 21625592 24114476 21664721 17761713 20433240 27833610 28847912 19308436
41376 19308436 8773984 7721654 14164304 17165989 10482349 -466550 -4464053 3234363
41368 3234363 14448810 16376035 7595590 1012798 7093681 19930312 26778829 26128796
41360 26128796 26417763 29924333 29697235 22638880 14436760 9627728 7182154 8191852
41352 8191852 16664630 28537392 31136195 20064370 7232714 5269254 12545652 20463440
41344 20463440 26310730 30289294 28480243 19307944 10504277 9350228 11804049 11475534
41336 11475534 12765703 22541103 34055990 33839682 22394279 13506468 13203997 13869210
41328 13869210 10916328 10720184 17351422 24197256 25010664 22817628 21691498 19366018
41320 19366018 14708621 13639202 20035991 27948882 30012732 27150243 23356488 17915089
41312 17915089 10486985 7218753 12565374 19991151 20249731 15262274 14297626 19038750
41304 19038750 22335660 20750277 18697387 19631753 21950459 24949913 30307686 35215375
41296 35215375 32384083 21244982 12154770 13621332 20448329 21314600 14984516 11273506
41288 11273506 15985569 22330907 20742116 12086706 5553278 5597334 7477937 6611523
41280 6611523 5832629 9165810 13278380 11741855 5627053 2524485 4748491 5653585
41272 5653585 142683 -7066972 -7440914 966219 12260357 18917680 17227919 9910637
41264 9910637 4982964 8330779 16295351 20233986 18913065 19377451 23817450 24842602
41256 24842602 18848029 14781664 21172673 31557109 32762213 22933305 11506897 5114644
41248 5114644 3705343 7464067 16132706 22589075 18476853 6929672 -391267 460379
41240 460379 2758709 3149935 6826182 15452311 21434627 19818729 16258335 16951404 19221852
41231 19221852 18704285 17777306 19160633 18259798 10807506 2836401 3552511 11275971 15474471
41222 15474471 11731405 6754165 7896495 13895581 17724584 15007885 8246969 3990480
41214 3990480 5540633 8631968 7103908 2568681 2876253 9508188 13738869 9543727
41206 9543727 3161225 3228269 7405109 6976290 409987 -6446712 -10668857 -13612119 -13876684
41197 -13876684 -8593689 -1535420 -305302 -3861034 -1854554 10296880 23293710 25260382
41189 25260382 15484210 2681379 -5752939 -8400085 -7271096 -5254961 -4903326 -6921814
41181 -6921814 -10170851 -13535353 -16213706 -16573494 -13673807 -9980131 -9321028 -11802465
41173 -11802465 -13801382 -13002828 -10250313 -6970373 -4669313 -6135154 -12098862 -17045315
41165 -17045315 -14077619 -4325549 4255756 7693431 8996161 10108720 9255900 8046042
41157 8046042 11638467 17900999 16407046 4693377 -4082850 1167721 12134024 12474905
41149 12474905 621066 -10819307 -14334723 -13117068 -9445684 -1582439 6599098 6424184
41141 6424184 -1421896 -5455058 -733880 3843280 1450961 -1011897 4389534 12446235
41133 12446235 13778094 9985775 8455999 8417687 4565809 -120910 1342851 5524377
41125 5524377 2697046 -5009601 -4564721 6348016 13630631 8395034 374578 1232679
41117 1232679 6893550 7716662 6079123 10163855 17024874 16457290 8368039 2189073
41109 2189073 309166 -3871124 -10767261 -11937448 -6091115 -4013339 -11130304 -17411233
41101 -17411233 -13430864 -6092827 -7122435 -13304644 -11048031 2626024 15915814 19015062
41093 19015062 14498683 9046577 3984008 -1855123 -6580719 -7894640 -7829665 -10322461
41085 -10322461 -15284765 -17990568 -14083387 -3842350 8095301 16280575 17746673 12620649
41077 12620649 3224412 -5791465 -8044585 -505575 11054412 16041617 10976068 3960330
41069 3960330 4618424 13154440 22235693 25554218 20796593 8664429 -5829543 -14698959
41061 -14698959 -15038115 -12614636 -12715721 -12191910 -6821097 -809619 41184 -393457 4626937
41052 4626937 10435115 7110954 -1667506 -1642959 8173456 11177379 -1195077 -15106227
41044 -15106227 -15350369 -7139189 -4089010 -5320816 -13923 11715344 18542685 16371378
41036 16371378 12539739 11144464 7248718 -1383265 -7943461 -6975899 -2929404 -2565004
41028 -2565004 -4088605 359687 13347719 27478475 32740375 27432331 20316435 20011609
41020 20011609 23524706 20484027 9338934 1473767 4847114 11667355 10297343 2862045
41012 2862045 620175 5916733 10215381 8641532 5425614 4626154 5551797 8148806
41004 8148806 13077193 15392044 8444376 -3948897 -9607375 -5016563 417172 878688
40996 878688 3282933 13299373 22871540 21157817 10697944 3151611 3579534 7245406
40988 7245406 8571627 6184391 2003348 944020 7731130 18824419 22764593 14961040
40980 14961040 6388269 9366866 20012482 25103243 22636708 23162817 30840772 35673606
40972 35673606 28696839 15412070 8188826 11343542 19336007 25757170 28730697 29135504
40964 29135504 27727533 24432825 19203073 13727920 11817815 16052330 23739736 28294554
40956 28294554 25615001 18174413 12605246 13745327 20205711 24956402 21696807 11858238
40948 11858238 3639573 2960509 7827376 13086434 16983806 19852182 20084365 16479897
40940 16479897 12439459 12549659 15878025 17261736 14651779 10955581 9126979 9372399
40932 9372399 10622833 11132274 8686676 3957832 2002251 6069622 11803786 12715353
40924 12715353 9490387 7717473 7890168 4986609 -2165155 -8476510 -10255709 -8218417
40916 -8218417 -2244972 8678409 19340117 19935091 9154861 -1690796 -2687346 2843309
40908 2843309 5700870 3755728 942113 -1751018 -6583578 -12677359 -16002097 -15016025
40900 -15016025 -11597539 -7326651 -2715669 1114146 3392462 4959616 5979411 4728194
40892 4728194 1336963 -356388 2004284 5419628 6342384 5856272 6221642 6330287 5402323
40883 5402323 6909498 12524407 15652704 8361621 -6998674 -19704806 -22647262 -16414360
40875 -16414360 -4222216 9355172 16586438 12733564 4012961 960641 3890863 3991763
40867 3991763 -1181111 -4441541 -3082249 -3813838 -8656339 -8364001 1671671 9972228
40859 9972228 4849978 -6453227 -7674089 2387125 9454145 5623197 -1913748 -5244292
40851 -5244292 -6498080 -10200360 -14593616 -15848425 -14208274 -11629657 -8686769 -6800338
40843 -6800338 -7964692 -9853209 -7565668 -2816145 -3783578 -11678741 -15439750 -6243508
40835 -6243508 9409997 18716935 19166938 17620350 17170274 14814223 10448853 8545238
40827 8545238 10284375 11739950 10623244 8117052 3918894 -3330318 -10402651 -12080276
40819 -12080276 -10254307 -11973696 -16664957 -14817849 -3441628 6502588 4632276 -4476283
40811 -4476283 -9119573 -6710658 -3696969 -3435689 -3126142 -1058185 895789 1440541 353404
40802 353404 -4012717 -11718360 -17204732 -14840505 -7588387 -3591687 -4926476 -6753385
40794 -6753385 -7074870 -9106857 -12889014 -13043329 -8007698 -4032084 -5642171 -8441916
40786 -8441916 -6689166 -3094175 -4969185 -13289067 -21071148 -21775281 -15518046 -7498062
40778 -7498062 -3015297 -3701761 -6881190 -8687599 -7769151 -4712319 889880 9117217
40770 9117217 15810103 15012839 6933599 -890942 -2427388 758204 3951631 5327110
40762 5327110 5325571 4830010 6728806 14121659 23384456 24544302 13617927 -317173
40754 -317173 -6267322 -5088048 -5175381 -8311681 -8657230 -4388566 -1029995 -1705316 -1879364
40745 -1879364 3017206 10407989 14482183 13370732 9482659 5601769 3038934 1511064
40737 1511064 -692165 -4518501 -7638729 -6868422 -3581731 -3083318 -7028870 -9924908
40729 -9924908 -5781952 4108439 12784697 15550533 13733505 11273267 10119057 9551119
40721 9551119 8463612 6933721 5521446 4098881 2460347 1651221 2987840 5521064
40713 5521064 6469398 4970340 3223582 2620519 1205823 -2753632 -6639837 -5750185 1109442
40704 1109442 10205381 16144960 15459153 8910618 1735006 -786425 369366 -977241
40696 -977241 -7116295 -12586330 -12340627 -8956993 -7133148 -5723275 -1445320 3429998
40688 3429998 4415883 2920058 3212346 3655890 -329597 -5974908 -5321307 2336746 9505374
40679 9505374 12410635 13955351 13843295 7254753 -3394736 -7168378 -775229 4855835
40671 4855835 1419394 -3624946 -4792 8160466 9251624 2047369 -4517978 -5351068
40663 -5351068 -2512693 2078218 7102658 7897593 2160160 -3033964 -236175 5273519
40655 5273519 3361176 -2200049 2564137 18252518 27549504 19380272 3826924 -4696590
40647 -4696590 -6820721 -10601110 -14800173 -12738064 -6720688 -5180597 -7651599 -4962621
40639 -4962621 5053649 13050939 12216745 7741528 7735624 11677395 13648810 12479595 12235663
40630 12235663 14309926 14891101 11145988 5741217 3027950 3239454 3296390 2106178 1451055
40621 1451055 1257455 -1806798 -8297237 -12133931 -7567970 1895815 7168752 5467466
40613 5467466 2079907 -158721 -5146219 -13997377 -19155244 -14294812 -4267219 2019584
40605 2019584 3843538 5664399 6194770 944001 -6169166 -5459407 2896013 7133393
40597 7133393 1547924 -4788678 -3043118 1249373 -2294351 -12469229 -19508231 -19820696
40589 -19820696 -17394184 -13224195 -4213848 7301932 12984833 10002689 5428712 6191369
40581 6191369 10780939 13694481 12703968 9054913 5271749 5099174 10977990 19469127
40573 19469127 23760793 22334720 19918380 18423557 13807823 5056735 -860224 1831139
40565 1831139 9143544 13205511 11937010 8089742 3827598 1393386 3656679 8359647
40557 8359647 7855842 976148 -1963718 5519775 13259954 8526721 -3242096 -6204115
40549 -6204115 891921 3755599 -3373657 -9517885 -6607803 -1574360 -2070016 -3993504
40541 -3993504 -1900256 58135 -2551546 -4135493 1497782 9453612 11737731 10086421
40533 10086421 10947622 13889400 14627717 13446060 10996686 2684849 -11620690 -19360001
40525 -19360001 -10534856 4012622 5022206 -7181586 -13523333 -5251933 4562077 2652011
40517 2652011 -6420885 -11036410 -9483661 -7790135 -8911559 -11806218 -15659587 -19276584
40509 -19276584 -20746403 -21034391 -22617503 -22741328 -15595070 -3905646 478317 -7598349
40501 -7598349 -18188220 -19307607 -11361727 -2794566 1729100 2222936 -1460068 -8171641
40493 -8171641 -13385212 -14396297 -13652128 -12603708 -7903623 1222342 8133609 7562215
40485 7562215 3487156 1895056 1664010 -486313 -2232189 -612412 1441996 2083368
40477 2083368 7548538 21902017 35557626 35943793 25478867 16578291 12279238 5634420
40469 5634420 -3654106 -7474396 -5144532 -5587862 -10016461 -7294200 6891418 19449450
40461 19449450 17500088 6392280 346359 2511763 4066893 -1404192 -10910490 -16821530
40453 -16821530 -13334217 -1442266 8997563 7246952 -4646423 -12493685 -8357036 -514931
40445 -514931 539669 -2918475 -3558141 -3584302 -9864718 -19241700 -20947845 -12068394 -189171
40436 -189171 8176203 11993805 10013611 1660179 -6159656 -4087508 5992884 12180918
40428 12180918 9413360 4799265 3396579 76045 -8934310 -17043708 -17745123 -15277828
40420 -15277828 -15596727 -13983862 -2875634 12345435 17584987 9596331 466806 478517
40412 478517 5713999 6963670 3701557 2634469 5755642 6784278 654784 -7760692
40404 -7760692 -8338390 1031159 9900234 7645523 -1849467 -4264789 5523312 15265395
40396 15265395 11234181 -4061354 -16870433 -20052783 -17428565 -13522682 -9215160 -7209244
40388 -7209244 -11307945 -17972056 -18111737 -10835887 -6292124 -9986331 -13512623 -8157394
40380 -8157394 394218 596055 -7251824 -12341603 -9430827 -3357431 1188812 4370077
40372 4370077 5388916 1535929 -5116213 -8361180 -7234052 -6772965 -7424523 -2834300
40364 -2834300 7840353 14617074 10235670 1596491 -152426 4691114 7110235 3783978
40356 3783978 -280041 -1494682 -1131840 714347 6028762 12172562 11942746 3752631
40348 3752631 -3898403 -2286041 6627416 12782217 9668171 865499 -3917173 1931152
40340 1931152 15299853 25247952 23123439 11222493 -256622 -4392914 -2725821 465557
40332 465557 4278045 9100643 12207080 9840035 2723630 -4098580 -7281651 -8563173
40324 -8563173 -11430327 -16321476 -20387685 -20920232 -17561119 -11564741 -4633978 939104
40316 939104 2575984 -495998 -5921787 -10222409 -11612999 -9876174 -5098452 1000312
40308 1000312 4007968 1209187 -2994722 -508656 10291764 21625721 25047331 19575827
40300 19575827 10096132 2275393 658874 6211245 12744179 11350694 2107843 -4553184
40292 -4553184 -2640257 222876 -4730838 -12502448 -11617404 -2012116 5042537 3057534
40284 3057534 -3609157 -8910345 -10723811 -7693272 -105403 5702843 3036087 -4594156
40276 -4594156 -7512184 -4050344 -570945 1773106 7557949 13672139 10135362 -1991834
40268 -1991834 -8497893 -3795900 159435 -5290896 -11230111 -8890516 -6609578 -13921572
40260 -13921572 -21366008 -14601772 101156 4448913 -2610623 -4613478 4226885 10326080
40252 10326080 3418234 -9533151 -18726670 -24630654 -29317419 -27740771 -17093277 -5535253
40244 -5535253 -2195044 -4677063 -4544664 -399420 2114131 356185 -2146830 -1909251
40236 -1909251 21855 634807 -315558 120327 2839964 2487008 -6529906 -18474703 -18467430
40227 -18467430 -2288286 13575110 11909920 -840445 -3507048 9213180 20607053
40220 20607053 17789788 7944384 3118616 2854970 965066 -1091316 1916925 8361255
40212 8361255 12098219 11121983 7181459 1274046 -4509974 -5152859 1523994 10882696
40204 10882696 17323064 19722832 18150005 11709724 3713800 1707840 6836400 9791436
40196 9791436 3055455 -9084024 -17848391 -20020658 -15392539 -3186975 11464466 16582791
40188 16582791 8539162 199243 3310007 10436349 6737523 -6939132 -16856219 -17707579
40180 -17707579 -16239970 -15900674 -12884727 -7481422 -5334322 -6079524 -3468126 1976405
40172 1976405 3235684 1041261 4008474 11913963 13480829 5613969 69049 3709954
40164 3709954 6498789 -531295 -8042702 -2566922 11000347 15639937 6283228 -5747368
40156 -5747368 -10389866 -8943510 -6451283 -4409989 -3132570 -3688007 -4988425 -3873384
40148 -3873384 707120 7126315 13915423 19167838 18895412 11273935 1409570 -3526952
40140 -3526952 -3101830 -2266747 -2445314 -456533 3845360 5885301 3804142 1349523 1193670
40131 1193670 1091957 -603629 -1106617 1321756 2516257 -2389724 -11528678 -17870326
40123 -17870326 -16503589 -7955080 3174252 10410244 9412087 2925228 -1314867 -695648
40115 -695648 -1539697 -8317900 -14166342 -9967403 527785 4838829 485760 -1755061
40107 -1755061 3915091 8414718 2786422 -6849906 -8998705 -4027182 -283018 1978281
40099 1978281 9671768 21677398 28133249 26343839 24461813 25702327 21852900 9311828
40091 9311828 -386297 3386782 12389712 9976945 -5124071 -17803381 -17894585 -11190296
40083 -11190296 -8011095 -10483465 -14383825 -16384552 -15512587 -12102166 -8587300 -8271910
40075 -8271910 -11241252 -13956631 -13946087 -12389098 -11489823 -11814463 -12520750 -11879010 -7850833
40066 -7850833 -773708 5019416 5096598 59143 -5599711 -8567363 -7986067 -3753854 2480908
40057 2480908 6295688 4939712 1536945 385679 -157567 -4449317 -10613034 -11883272
40049 -11883272 -7312118 -4110070 -7284665 -13010015 -15068610 -12724110 -9004886 -5458655
40041 -5458655 -2173878 22038 756612 1773540 4956705 9624723 13140677 13751636
40033 13751636 12592399 12780319 15014495 14438422 6297880 -4102233 -4225388 8133663
40025 8133663 17808250 11126487 -5049274 -14241514 -14092340 -14234050 -14294942 -3285819
40017 -3285819 16802007 26494833 16280845 2101006 2309436 12779947 17582871 13003938
40009 13003938 6938060 3372831 1966091 5988392 15899505 20572514 10194880 -5952842
40001 -5952842 -10020354 -1164736 5564577 4546792 5696519 12897594 14826211 4724770
39993 4724770 -6242652 -5691068 1895603 4914522 3030736 3699976 6927402 6133275
39985 6133275 1007313 -2120739 -1840224 -3278696 -7638631 -9633008 -7505949 -6909422
39977 -6909422 -10726858 -12413031 -5597947 4667606 7565991 1170625 -6032511 -8400215
39969 -8400215 -10191662 -16071899 -21268839 -17976286 -8261200 -2699772 -6041265 -11299708
39961 -11299708 -10200155 -3369483 3297491 7097729 8520772 6681899 532795 -6917079
39953 -6917079 -10476626 -8633532 -4443683 -1382481 -776574 -1797748 -1535211 2696093
39945 2696093 8325593 7879407 -1485781 -11550950 -11406395 -734793 10324119 13305420
39937 13305420 8248011 -158729 -6791775 -6602885 1914819 11571982 10875824 -2645338
39929 -2645338 -17534108 -20697346 -12106948 -3627537 -4534185 -11783120 -15266755 -10187304
39921 -10187304 -1554344 3830913 6601201 12253568 20793566 25063801 21160350 14344549
39913 14344549 10500691 7288580 -233247 -9605890 -13933777 -12201734 -9253303 -7219290
39905 -7219290 -4575476 -2794675 -5812299 -12169126 -15036947 -11586746 -6123628 -2798827
39897 -2798827 -1452915 -1925313 -6055468 -13280831 -19503194 -21925123 -20594780 -15503358
39889 -15503358 -8098705 -4787335 -10831829 -20431180 -21913748 -14305238 -9001272 -12199224
39881 -12199224 -16182448 -12971483 -6394038 -3597162 -3519320 -2014662 -941346 -3404879
39873 -3404879 -6195232 -5749815 -6078570 -11659954 -17417704 -15477753 -8016841 -3525342
39865 -3525342 -3301938 -1692003 2425416 4730445 5043616 7629100 11742173 11506666 6182611
39856 6182611 1485230 -662173 -4649048 -11317474 -14436092 -10499212 -4555596 -2617598
39848 -2617598 -4679470 -8277984 -12342317 -14316366 -10342513 -2217685 2472694 1498036
39840 1498036 2437613 10457337 18166442 15218631 3673057 -4318500 -2259927 4315865
39832 4315865 6616887 1777267 -6925476 -14184931 -16188035 -13271375 -9518310 -8008262
39824 -8008262 -7857306 -7910554 -10206187 -15641930 -18980580 -14180766 -3910970 2373500
39816 2373500 511907 -4016013 -5491627 -5676268 -8231808 -10296929 -5951208 3313419
39808 3313419 7838903 1412604 -10408208 -16706384 -13794760 -7786698 -5273097 -5810443
39800 -5810443 -5509613 -4329604 -5582627 -9616158 -12568969 -11747504 -8257156 -3493779
39792 -3493779 2685033 8457640 9074053 2798563 -5176490 -8157058 -4980697 1034733
39784 1034733 6775755 9322639 5333837 -3631737 -8035191 -80113 14066137 19161211
39776 19161211 9056286 -6611299 -15331547 -14428443 -8331622 -496174 6810654 9965011
39768 9965011 7244984 1874008 -2537252 -6616928 -11315240 -13122748 -8593816 -1004711
39760 -1004711 3115177 2434918 676830 -207880 -969297 -231100 4903485 12663442 16342264
39751 16342264 11943273 2662189 -5097403 -7269653 -3728283 2359344 6552850 6943990
39743 6943990 5240355 2285763 -4140253 -13061271 -16163695 -7156661 7289475 14387438
39735 14387438 11728604 7605858 5392052 -594734 -10651468 -13544434 -2704724 10470581
39727 10470581 9563686 -5295063 -17883033 -15883997 -3095048 7807542 9199027 4582705
39719 4582705 3302044 9371885 16375767 16332872 11298989 9047091 8704151 1965973 -9551975
39710 -9551975 -11996808 -950512 8096618 1426759 -12826758 -19260179 -18437395 -19027142
39702 -19027142 -16582171 -1490225 16777139 17190151 447888 -8267150 3568177 17019736
39694 17019736 11207440 -6317625 -13824074 -7176433 -515412 -2339323 -6979148 -7863672
39686 -7863672 -6259736 -5666742 -6206339 -6227031 -4550742 -933455 2889728 4327162 4002984
39677 4002984 5259573 8106024 9146194 9506824 15175826 25428758 29481085 21255007
39669 21255007 9653910 5952806 7918468 5958645 -1000772 -6802925 -10694631 -16321267
39661 -16321267 -20142924 -13687546 1618884 13527800 15831497 15768821 20017180 22728632
39653 22728632 15101990 1104819 -5033406 3799187 18881263 25877708 20376931 10760425
39645 10760425 6902386 9539531 12487235 11914014 8570804 2702597 -5976044 -12538343
39637 -12538343 -9592165 536507 4633040 -4378602 -16711977 -19665383 -15283804 -14189402
39629 -14189402 -17374236 -16379710 -9263197 -3894894 -4698939 -7136038 -7355693 -7552089 -9115329
39620 -9115329 -9329026 -7798074 -7974886 -9452781 -6992617 -446404 2862597 -106581
39612 -106581 -2362636 1594589 6200286 3676429 -3697832 -7711680 -6221250 -3671917
39604 -3671917 -2763278 -2630451 -3214682 -4607524 -3023121 5986004 19570351 28015847
39596 28015847 24882033 13630324 2953099 -2138329 -3278097 -4351325 -6138333 -6390190
39588 -6390190 -4736909 -4776819 -9012144 -14041740 -14921954 -12918896 -13510217 -16929318 -17222185
39579 -17222185 -12265988 -7977466 -9138843 -12099818 -11270749 -7706579 -5696166 -5091703
39571 -5091703 -3431588 -2634281 -6398197 -12000457 -11654998 -3108441 6489359 9245224
39563 9245224 5327743 1146246 1417895 5265067 8899419 10000581 8852731 6141880
39555 6141880 1645889 -3725774 -6721769 -5794185 -5236500 -10916700 -21693473 -29569254
39547 -29569254 -29087912 -21925653 -11733676 -764224 6762321 5623076 -2112001 -7075578
39539 -7075578 -6067168 -7960278 -19209410 -31074838 -30937164 -20292555 -10248519 -3878333
39531 -3878333 3687803 10298250 7348257 -3317249 -8184263 -2385015 2698298 -957644
39523 -957644 -4125323 3672987 15215816 15641911 4489054 -5642271 -8444912 -8793889
39515 -8793889 -9812571 -7938928 -2393397 1490507 1463150 1670241 3339982 882921 -7876189
39506 -7876189 -15217317 -13733061 -7554058 -6221048 -10412534 -10995629 -2166009 10082644
39498 10082644 14686081 8261428 -891646 -1837061 6507427 14081250 12768572 7792965
39490 7792965 10470801 20696536 25061718 15707478 3069463 2625178 13971656 21989754
39482 21989754 17046307 5015309 -3845158 -7514704 -9608828 -10423938 -6955878 317008
39474 317008 6248532 7327816 5968264 7078681 11731934 15560934 13380463 4734933
39466 4734933 -5484287 -11416878 -10452950 -3881936 4375601 9187553 7131162 201476
39458 201476 -4944835 -3594040 2235479 7142864 8629101 7920693 6759777 6564362 8976868
39449 8976868 13326673 14621961 8362972 -2714197 -10474127 -10078350 -3553571 4753716
39441 4753716 12045086 16388279 16834471 15266059 14287043 12747671 7729667 1484491
39433 1484491 790441 7346192 14319340 15817397 14720854 16257716 17739075 11317280
39425 11317280 -3683084 -17121469 -19136123 -11885393 -6821567 -10344270 -15753502 -12984056
39417 -12984056 -4181839 -2156143 -11047913 -17422335 -8425516 8245276 14253971 6480005
39409 6480005 -1267391 -1559151 -1880370 -6128547 -4905226 6289791 14353931 7780796
39401 7780796 -2972475 -436431 12328642 16668729 7061547 -2988170 -4307741 -4361697
39393 -4361697 -11245216 -19248978 -18666340 -11375006 -8346639 -15291958 -25905743 -27886650
39385 -27886650 -14469351 7619191 22419341 20533268 9027744 1414768 1284137 2655225
39377 2655225 2923710 5526057 10644947 13441386 12680048 12256010 13057473 11989607 9960620
39368 9960620 11562920 15586657 15657357 11998102 12059459 16965171 18520882 13405466 8728255
39359 8728255 8334026 5431274 -4061746 -12029598 -10717881 -4872059 -1937957 548625
39351 548625 7140953 12363077 8531672 -329062 -4327747 -2774215 -1889879 -1788857 2008545
39342 2008545 7159749 7239899 4262536 5917920 10906927 10051501 3166983 1428206 8975656
39333 8975656 14600926 8593781 -2060809 -4048431 3205062 8030832 3325444 -5198671
39325 -5198671 -7982184 -3224212 2892392 5050991 4645362 5777464 7790011 5871832
39317 5871832 -781871 -6805100 -9122206 -11760405 -17623215 -21341733 -17317429 -9995008
39309 -9995008 -7432821 -8409023 -6119574 -2184021 -4840797 -13054232 -15300126 -7457828
39301 -7457828 169127 -799013 -4455346 -2068515 3518060 4020534 -948733 -6080266
39293 -6080266 -10190984 -14279950 -14689515 -8825932 -4238458 -10157733 -21016265 -20872742
39285 -20872742 -6443408 6203280 3571753 -6494360 -6457309 6910159 20185142 22710134
39277 22710134 18433984 16261950 16418423 12237726 2180480 -6582390 -7776474 -4487728
39269 -4487728 -4214590 -7720067 -8221222 -2568962 2421351 -731394 -8208970 -9012918 -685296
39260 -685296 6136880 1614217 -10526907 -18694563 -17910019 -12970093 -9585123 -9049600
39252 -9049600 -11666489 -18553584 -27034839 -29246324 -20129303 -5011999 4529075 2082089
39244 2082089 -8222643 -16664480 -16301337 -7706281 1986601 5053647 288602 -5844538
39236 -5844538 -6437350 -1775790 1901626 390260 -4093024 -6433156 -4405783 -438684
39228 -438684 1095262 -1942465 -7159278 -9748952 -7613240 -3558904 -1500836 -1987520
39220 -1987520 -3352185 -5829747 -11277877 -18395180 -20897962 -12668581 4935142 21598565
39212 21598565 25642472 15019126 -35607 -7803076 -7420818 -6413766 -7400391 -5062278
39204 -5062278 1845633 4913493 -1081513 -7501934 -3133422 9147560 17014493 16276259
39196 16276259 12945348 10114617 5012874 -633928 336818 8136113 13309341 10221095
39188 10221095 3997721 449821 -1672029 -4408630 -5909913 -6654487 -11194415 -18409256
39180 -18409256 -18977542 -8682658 3845101 8545702 5174572 -1974800 -11119735 -18506847
39172 -18506847 -17080006 -7506061 -823635 -2128532 -2605725 3012363 4312222 -6098252
39164 -6098252 -14742134 -6234113 9771568 11436285 -1756775 -10661264 -8575816 -7878968
39156 -7878968 -13337662 -13029055 -2376455 4827158 -485859 -7537831 -5518159 -1641475
39148 -1641475 -5709575 -11281673 -7954937 -936560 -1697772 -7501932 -7200234 -1811017
39140 -1811017 -2083556 -7916468 -7155735 3481430 11132040 5283298 -7577052 -13864385
39132 -13864385 -9922095 -3288285 -1543642 -4877094 -7919541 -6206527 -1189301 1367216
39124 1367216 -1058924 -3987690 -2346561 2113432 3898091 1717556 -1808124 -6193169
39116 -6193169 -12399833 -17195243 -15545983 -9335910 -6354720 -8394426 -7603065 1105791
39108 1105791 10371262 9484963 -682018 -8794968 -7557606 -528939 5507140 8428124
39100 8428124 9077408 7550869 5220601 6470998 13402369 20774960 21065966 13807503
39092 13807503 5504745 752569 -1710073 -3870932 -4936576 -4818516 -5998032 -8911290
39084 -8911290 -9831145 -6799819 -3649831 -4127101 -5773919 -4354460 -1016762 463411
39076 463411 999851 4496696 9958982 11441113 6264360 -1523297 -6494856 -6940414 -4513302
39067 -4513302 -2021304 -1394892 -1539377 306547 2996031 856856 -7608243 -14815471
39059 -14815471 -13685367 -8221275 -7483963 -12301436 -15806829 -14251823 -8618599 1496732
39051 1496732 15052062 22671297 15108543 -906201 -7975409 -1493672 4777835 159321
39043 159321 -9103583 -13418198 -14473230 -17487203 -19444286 -15399153 -8946658 -6900279
39035 -6900279 -9577640 -14154799 -20654250 -26660478 -24401677 -13136197 -6348983 -14080490
39027 -14080490 -24543353 -18165576 3174096 16454155 7877637 -11012853 -21075832
39020 -21075832 -17470181 -8105078 604968 8782219 17884019 26012460 28022468 19823334
39012 19823334 4309732 -8950215 -13828799 -14688656 -17584872 -18001957 -7034716 11033919
39004 11033919 19218490 9968576 -3343164 -4192289 5290394 9187841 196573 -12591467
38996 -12591467 -17893515 -15379695 -11573099 -9190859 -6330454 -3443549 -4605970 -10692812
38988 -10692812 -16181028 -16036435 -12820394 -12846732 -16899469 -19447787 -16784404 -11227775
38980 -11227775 -6645343 -4450217 -5171850 -9107558 -13367399 -12913950 -7283331 -2317600
38972 -2317600 -2627476 -6244857 -9288804 -11757151 -15706644 -21391041 -27720663 -32850029
38964 -32850029 -32909852 -25364057 -14977114 -9545261 -7794363 -515388 12637888 18529702
38956 18529702 10002217 -870219 188847 8218272 7756094 -3105198 -11565892 -9842870
38948 -9842870 -2543158 4195894 8414128 8041939 2835882 -206206 4826155 10398242
38940 10398242 4678750 -8026788 -11362813 -2531531 2816970 -4593388 -14500095 -15725481
38932 -15725481 -12298897 -11329327 -8844800 99869 8421531 7401563 1792229 1581972
38924 1581972 5278843 4487511 241604 1291519 8380670 12768994 10296192 6145861
38916 6145861 4742117 4296740 3165409 3755393 7518148 11513295 11977788 8011799 1736454
38907 1736454 -2423378 -659128 4428490 4211936 -4899269 -14457671 -14316325 -6477384
38899 -6477384 -1085380 -1598084 -2933750 -2653033 -3731286 -5577021 -2467423 6081341
38891 6081341 12036816 9948001 4258702 1573085 2030263 2491204 2196538 548309 -5172654
38882 -5172654 -14478073 -20634697 -18600067 -12438480 -9427706 -10044018 -9570594 -6883299
38874 -6883299 -5070124 -4661918 -2859712 270153 619986 -3699329 -9346196 -12047447
38866 -12047447 -10124898 -3472821 6121842 12497211 8535536 -4503754 -15074592 -12977666
38858 -12977666 -801634 9477472 9267279 -263993 -11929129 -18346471 -15766122 -7066724
38850 -7066724 -662646 -2007800 -6252859 -3963231 5729820 13311052 11705253 4894348
38842 4894348 377393 -1260050 -3838826 -7050821 -7502994 -6193139 -7431722 -10222336
38834 -10222336 -8005848 813984 8376843 7234799 79218 -4963923 -5418850 -5418117 -7131851
38825 -7131851 -7312049 -3807169 -748786 -3529421 -10652997 -14753397 -12143408 -7720935
38817 -7720935 -7978928 -11729408 -11993261 -6445959 -719448 462564 71629 2280144 3546939
38808 3546939 -2674382 -13828936 -19030984 -13773792 -6583682 -6822086 -11793401 -12152179
38800 -12152179 -6272642 -1714807 -3310842 -7063043 -7405406 -4380924 -512006 4383093
38792 4383093 10639838 14524975 12275115 6945359 5416811 8429568 9533280 5712031
38784 5712031 2922412 6870983 13353802 14066092 9045083 6031517 8210032 10060081
38776 10060081 6804146 1344089 -873290 1663904 7950012 16622848 23035647 20013916
38768 20013916 7051864 -5570192 -7818512 -1935556 2233974 842446 -1653543 -1696840
38760 -1696840 -802039 -622911 -293269 286731 -550988 -3131938 -6301172 -10302506 -15623032
38751 -15623032 -19403464 -17635397 -10848378 -3353783 2542329 7077591 9145667 7553547
38743 7553547 5118953 5089318 4303397 -2565232 -12135161 -14566319 -8258064 -3028949 -5204799
38734 -5204799 -8663572 -6046822 -440540 1329380 90926 459183 667869 -4190409
38726 -4190409 -11289277 -11947139 -4598652 2154747 1396085 -3450624 -4729318 -906382
38718 -906382 2730068 1595917 -3126341 -6799811 -6607502 -3231734 1846856 7887641
38710 7887641 12291506 9893018 -544644 -10863321 -10832496 -1529015 4935992 1075804
38702 1075804 -6874029 -8776140 -3320132 3837795 9143957 12094531 11085046 5347199
38694 5347199 -768371 -1698891 1676019 3207944 -39332 -4422718 -4363828 2414505 12567718
38685 12567718 17487905 9641336 -7011030 -16826010 -9156582 7544547 15636774 10197094
38677 10197094 2138369 85543 81678 -3265474 -5826096 -1620896 5745324 8449728
38669 8449728 7144144 8591796 12175518 9274069 -1736289 -9729029 -6045158 2037927
38661 2037927 1722833 -6029060 -8548017 -2240153 600454 -9504747 -23617645 -26132839
38653 -26132839 -16120930 -7105338 -8141658 -14663983 -18074258 -15930543 -11053253 -7360599
38645 -7360599 -8285474 -13506138 -16274451 -10100455 1100254 6223842 1383235 -6126221
38637 -6126221 -9531962 -9895826 -9206187 -5183236 2355840 7727494 7208519 4083348 1712632
38628 1712632 -1005471 -3150939 128031 7358726 8498079 651529 -4106808 3265910
38620 3265910 12662127 9639656 -1529641 -4891525 2037344 6506181 2297055 -2989717
38612 -2989717 -3996848 -5940273 -12427644 -17281887 -14378440 -6651059 -389824 2198481
38604 2198481 1277490 -2841484 -7310492 -8317446 -6667062 -5672685 -3804209 2289252
38596 2289252 7687803 2630107 -12127321 -23919041 -25269511 -22189693 -21650985 -21352680
38588 -21352680 -17442086 -12808831 -11147165 -10632380 -9314853 -9180765 -9618664 -5316343
38580 -5316343 3420002 7150150 1223513 -5398936 -3480836 2347311 2142664 -3485877
38572 -3485877 -6071339 -2536362 3884269 11282864 18083662 18624181 9582028 -2224412
38564 -2224412 -7443855 -6536182 -6054121 -6650555 -4483549 -872183 121924 855410 5749484
38555 5749484 10430863 7578298 1862067 4920266 14784663 15447992 1167732 -12974959
38547 -12974959 -12069545 -1023942 5909049 5746919 6146613 10129906 12372370 8856289
38539 8856289 1846846 -4668648 -8891309 -10537043 -9888138 -7233128 -1684712 7273985
38531 7273985 15778656 17054971 9639457 649928 -1932362 3056358 12009593 21431322
38523 21431322 27506372 26069599 18148835 11726669 12692103 16907727 16058954 8470943
38515 8470943 -700163 -6873556 -8226067 -3619375 5093697 10603947 6752075 -2934947
38507 -2934947 -9018031 -7716903 -3152457 763378 3993829 6046824 4780786 690960
38499 690960 -3198589 -6348214 -10101740 -12359449 -9910324 -6402454 -9422941 -17493839
38491 -17493839 -19146642 -9384129 1558863 2181610 -5060615 -10048450 -10030957 -9349904
38483 -9349904 -8924217 -6116597 -2748304 -3370940 -6045903 -3966023 3140642 7799500
38475 7799500 6469775 4264811 5379337 6259616 2145269 -5476725 -11824982 -14444530
38467 -14444530 -12589662 -5826674 2919699 6992861 2766506 -5798458 -12001102 -13000348
38459 -13000348 -9863060 -4931305 -1270955 -711926 -539227 3191898 7599352 5184412
38451 5184412 -2669777 -2976356 11058930 26871288 27180075 13350960 2871176 4953009
38443 4953009 10384202 7910369 227641 -2190975 3419723 9517963 8570270 1067380
38435 1067380 -6344669 -8236456 -5674328 -4294900 -6707105 -8526749 -4385673 3793263
38427 3793263 8360190 5180006 -2477218 -9016476 -11775019 -11434854 -10913151 -13513363
38419 -13513363 -18448928 -19242029 -11451463 -1050696 1284273 -5346517 -10301285 -6043939
38411 -6043939 2572828 7373816 8523740 11247558 15605333 16636918 12984953 9103425
38403 9103425 8506897 9342408 7925642 3859839 183687 -352883 1922118 4650108 6930535
38394 6930535 10369278 15441114 18634937 16274877 10203422 5819860 4816706 4347696
38386 4347696 3561612 5330681 9700643 11431193 7682499 3337937 4061141 7767223
38378 7767223 8213950 4558415 1831553 3050404 6138702 8783959 11582320 14927257
38370 14927257 16311322 13049756 6111533 -594818 -4335231 -5825382 -7239601 -8800309
38362 -8800309 -8602229 -6046353 -3712910 -4402977 -7752469 -11457907 -13897574 -13098567 -5936826
38353 -5936826 7007521 17792666 18437249 11473028 6801419 7863455 8487217 5172885
38345 5172885 3843349 9459594 16122596 14547636 5160578 -2829617 -3003076 2728549
38337 2728549 7902197 6621858 -2463994 -13340183 -16677752 -10430334 -2971687 -2119434
38329 -2119434 -5725114 -7725632 -7837052 -8519455 -7593209 -2591482 1282895 -2690826 -10693835
38320 -10693835 -12587310 -7570016 -5069199 -8824141 -10853953 -5084363 2544984 3452734
38312 3452734 -1281580 -4482022 -3687138 -1947339 -1004990 361908 2529307 4061880
38304 4061880 4132256 3260711 2515161 3589611 7759827 12855748 13558532 7483625 -424863
38295 -424863 -2439961 3092726 9317375 7983144 -1308792 -9609428 -7680683 3188684
38287 3188684 11890797 10568097 3648906 412324 2105750 2493996 -786110 -3123925
38279 -3123925 -1660657 565761 1609185 4642298 10997786 15203161 12032562 3919469
38271 3919469 -3810698 -10899044 -19248514 -25341915 -23170677 -14422818 -8938246 -13061082
38263 -13061082 -22203177 -27219754 -24496180 -16975633 -8177577 549595 7362364 8934150
38255 8934150 4675919 -262980 200492 5447054 8760697 6315889 1753039 -98340
38247 -98340 200789 12155 506628 3792270 6858894 4621890 -2492023 -10088316 -17070533
38238 -17070533 -23869775 -25048734 -13938583 3850255 12210911 4386946 -8067119 -11692137
38230 -11692137 -7785962 -5730041 -7923143 -10417844 -12238735 -14227971 -13311731 -7882882
38222 -7882882 -4965776 -11296029 -20119956 -18553961 -6896962 1636220 1032760 -450821
38214 -450821 3612757 7289415 4052570 -1531507 -1971453 1381579 3324501 5300806
38206 5300806 11821441 20498296 24420157 22290848 18749714 16314549 13839318 11411841
38198 11411841 9915853 6815647 -668804 -8659337 -9973533 -4848716 -1504689 -4769238
38190 -4769238 -10574914 -13405350 -12569796 -8525357 49480 10898570 15777946 9707949
38182 9707949 -813205 -4999973 -1200862 2624288 573057 -5242097 -10694844 -15343480
38174 -15343480 -19379982 -19533529 -12663604 -2080597 3753439 1113 -8810344 -13236694
38166 -13236694 -8756937 4136 5178465 4275062 1265922 269262 1495341 4000410
38158 4000410 8477570 14457292 17691226 14644236 8523281 6495126 10575260 15046290
38150 15046290 14010845 8223883 2647561 -138001 -1587640 -3617551 -5862672 -6640512
38142 -6640512 -5269132 -2613206 590806 4932673 10258687 12693315 7075049 -5395678
38134 -5395678 -14822154 -11996149 909343 12651325 15002735 8853631 -177274 -6744183
38126 -6744183 -6802001 -163485 6407576 4654356 -4227750 -9807850 -6433340 -871016
38118 -871016 -1613913 -6392425 -6470234 672762 9374914 13916421 12799007 7005703 -509719
38109 -509719 -5254486 -5949112 -6785386 -10376262 -11766167 -5541584 4271769 8924500 7343464
38100 7343464 5555385 5121037 1609771 -4715382 -6069171 2163817 15186898 25550411
38092 25550411 29423341 24930357 12615871 -97265 -3811776 77175 615630 -4900013
38084 -4900013 -5373716 5117924 14567227 10594504 1397239 4280971 18330930 24925461
38076 24925461 15495759 3226620 2719286 10973857 16002040 14721754 13028189 13596018
38068 13596018 12988814 9619357 7423937 10280532 16562103 20818760 19694181 15556945
38060 15556945 13958893 17009115 20680042 20751386 19469863 21936534 26797186 26676879
38052 26676879 19312538 11986821 11360506 14393775 14467306 12034757 12489418 16104090 17904160
38043 17904160 17529909 21495552 32815310 44426788 47441712 42129680 35913648 32832589
38035 32832589 30197728 25111470 19356803 16673983 18759483 25243447 34309877 41581961
38027 41581961 41722330 34124388 24844870 19925391 18739774 17269770 15817122 18406594
38019 18406594 24985172 29738092 28651055 24162247 20301596 17674975 16022819 17099109
38011 17099109 20544495 20621186 12990210 2913053 354995 6816697 12968140 10972265
38003 10972265 3876403 -281966 428281 978545 -2275471 -6614383 -6564702 24223 10043302
37994 10043302 17744010 18863059 13285648 4597550 -2618577 -5027356 -1298462 7096875
37986 7096875 15108760 16385439 8872757 -2245097 -9289928 -9928041 -8403516 -8739103
37978 -8739103 -9462016 -6985628 -1891732 1791822 2965762 4892793 9063261 11745497
37970 11745497 9710967 6270684 7273445 12769234 17387040 18368453 18089650 18074247 15943009
37961 15943009 10545929 5506562 4465636 6169501 7156636 6039295 2337849 -4862557
37953 -4862557 -12926279 -14107875 -3710294 12104652 22000859 21674541 15504495 8041422
37945 8041422 526773 -4646327 -3614677 2657395 7739643 8082739 7040340 8075062
37937 8075062 9173799 7460900 4561981 3025073 1385166 -2238757 -4702267 -1514595
37929 -1514595 5747622 11039257 12141248 12363727 13982806 14827854 12397404 7189589
37921 7189589 412262 -7913323 -16453602 -21371438 -20555238 -16952089 -14534588 -12194094
37913 -12194094 -5326384 6221078 15446782 15799276 9376328 4226231 4034217 4476187
37905 4476187 1271038 -2266509 5834 6891918 10240202 6091719 -115895 -2145556
37897 -2145556 -1879118 -4953527 -10608118 -11867959 -5609779 2476241 4159512 -3252433
37889 -3252433 -15695818 -26122767 -28930521 -23986781 -17495725 -16067046 -18886418 -18786841
37881 -18786841 -12157150 -3961510 -704943 -2248748 -4065039 -4344495 -4330869 -3834880 -1595678
37872 -1595678 898458 1098264 453760 2224931 4087054 -284817 -10040825 -14754842
37864 -14754842 -8291360 839716 438386 -7736141 -10347199 -1935451 7587700 7869707
37856 7869707 1959535 -1017860 -778191 -4518579 -12823268 -16522852 -10046376 -429264
37848 -429264 2149526 -1923787 -3961026 -816024 1037498 -3343020 -8990823 -8527451
37840 -8527451 -3614774 -2367390 -6830995 -10003691 -6512141 139980 4245441 6447576
37832 6447576 10560262 15382308 15726871 10535726 4872750 3840381 8135345 14818437
37824 14818437 18811094 15339585 5889083 96363 5147318 13995705 12294039 -1594523
37816 -1594523 -12403525 -7793428 5878228 13878335 12203102 8010804 5614398 1743145
37808 1743145 -6113532 -14733218 -19596830 -18919828 -13093454 -4998449 -565896 -3833107
37800 -3833107 -11247135 -15533350 -15065660 -14474405 -16101410 -16509565 -12543512 -5772705 750993
37791 750993 5947757 9320304 9711103 6993850 2525876 -2312423 -5606233 -4368564
37783 -4368564 1533872 6557773 5719773 2164983 2476863 6063538 6855158 4441764 3922822
37774 3922822 4298605 -1503614 -11742471 -13110605 161102 14912517 16077659 6913498
37766 6913498 1965295 6423697 13804574 19403888 23648248 24117635 16672171 5544500
37758 5544500 1711330 8438775 16392536 15573284 5703614 -6567467 -14334710 -13310213
37750 -13310213 -4747735 3178094 3149809 -1406846 -857934 6062961 10548676 7889612
37742 7889612 3991020 4416873 6034966 4574489 2301642 2179880 1726322 -736975 -609505
37733 -609505 4743017 8614275 4438182 -2709101 -3719243 -325535 -1420164 -6807919
37725 -6807919 -6653858 2040329 9825824 9152844 4621403 3830439 6055870 6459864 5498676
37716 5498676 6804836 9252308 8234804 3536708 52305 773700 3651453 5682711
37708 5682711 6206364 5487179 3481335 1330978 1460949 4456244 7499773 7665171 5822096
37699 5822096 5444362 7669270 9387865 7225117 2053250 -2435297 -5090337 -8281266
37691 -8281266 -12687003 -14789838 -12720785 -11411161 -16182357 -22236113 -18059579 -2019637
37683 -2019637 11465300 8619698 -5259209 -12365646 -6126424 969386 -3828072 -15366722
37675 -15366722 -18488813 -9447300 -201748 -1155595 -7966357 -9570710 -3639916 2116597
37667 2116597 1810474 -1667983 -2222758 1614583 6561927 9401963 9623453 8845921 9313945
37658 9313945 11820941 14169689 13371611 10319401 9773420 13766527 17636253 15775813
37650 15775813 9346714 4232305 2465853 607705 -3029266 -4820536 -1834128 2893790
37642 2893790 4658101 3770744 4037699 6501644 9012130 11132619 14758171 19180685
37634 19180685 20028947 15554242 10799192 12101052 18874666 24153724 23028851 17581055
37626 17581055 12929622 11198734 10906761 10055644 7502846 2788755 -2523389 -4072298
37618 -4072298 1367659 10823086 17309321 18072282 17014721 17009996 14202851 4458181 -7577731
37609 -7577731 -12270879 -7707820 -2686259 -5308550 -13334780 -18304032 -15312574 -5899838
37601 -5899838 5258273 12975320 13471238 7657718 1469644 2144 2264277 4018503
37593 4018503 4146600 5103176 8051090 10733208 10157022 5312928 -2394879 -9741568 -13447646
37584 -13447646 -12789497 -9503745 -4702604 1184373 4463772 -463475 -11682973 -16892336
37576 -16892336 -7031194 10275129 19042950 15163622 9066237 7923490 6065004 -2492999
37568 -2492999 -11597656 -10990410 -1095962 8210692 10447669 7145615 2050974 -2122007
37560 -2122007 -2097049 3986994 12328886 16450177 15120630 12760717 11695552 9324518
37552 9324518 4465320 1288637 3639090 8803678 10560213 6909045 2024901 1246282
37544 1246282 5989953 13008837 17143757 15221700 8644215 2346629 546711 3144622
37536 3144622 6112544 5314730 343381 -5047071 -6744957 -4800707 -3281568 -5136040
37528 -5136040 -8567426 -9614267 -6858754 -1923085 3122428 6300827 4945472 -1946103
37520 -1946103 -10306430 -13446929 -9380892 -3172200 -479318 -1199498 -1516976 105352
37512 105352 2014371 2931306 2693422 -201669 -7407960 -15493663 -15992842 -4600366 11689127
37503 11689127 20996213 19584333 14208149 11555882 10994470 9918086 10294317 14694897
37495 14694897 19854408 20649649 18420050 18720651 21821222 22489298 19295072 16601231
37487 16601231 15945770 13410607 8515051 7501492 12610564 15683654 9846950 1604740
37479 1604740 2202457 10587739 15045059 11088321 7765724 13460868 23233527 25308342
37471 25308342 16052725 3721618 -1531803 1906671 7363486 9092549 8720040 10490239
37463 10490239 12455919 8303840 -1393487 -7251903 -4576896 -1713115 -7879331 -18242744
37455 -18242744 -20248975 -11699176 -2739626 -679319 -2363343 -2855681 -3141972 -6044946
37447 -6044946 -10359497 -12057248 -8195795 672334 9083203 9919300 3365798 -1276659
37439 -1276659 1236478 2716948 -5211563 -14438586 -11109960 175143 530996 -13375832
37431 -13375832 -22213240 -12977620 2290728 6773770 2531708 966460 2091164 -1640043
37423 -1640043 -9204461 -13409728 -14045310 -15802291 -17575018 -15486237 -11998299 -10723016
37415 -10723016 -7254988 2768051 11714626 9781155 2577352 3740540 12349427 14006918
37407 14006918 4756257 -2635640 339120 6192943 6818121 6975216 13674589 22069049
37399 22069049 21465621 9796273 -5030063 -14328634 -14557642 -8080734 -1715401 -1073084
37391 -1073084 -4298255 -5020374 -1586150 1973104 3642755 4969372 5082115 1706326
37383 1706326 -1200905 3411088 12814937 15100771 6384456 -2798766 -3369936 129571
37375 129571 -86112 -2107654 -474210 2506287 1499880 -957637 2045568 10394985
37367 10394985 17392714 19714787 19831603 19802463 18736643 15836601 11614674 6898274
37359 6898274 3253564 2280427 2638231 1246302 -1144300 -778565 1082142 -1765038 -9123299
37350 -9123299 -11556814 -4430828 3435512 2528713 -3334996 -4394621 -8145 3308724
37342 3308724 4042708 6011192 9869403 13237020 16301403 19298494 18380122 12271366
37334 12271366 8011176 10429458 11546591 2416623 -9472501 -9126661 2344618 8720566
37326 8720566 3007859 -5197151 -8401087 -10720252 -14232049 -12129467 -3136324 1742555
37318 1742555 -3512588 -8411495 -2430366 7878079 10164416 5565169 3741119 5610353
37310 5610353 4667473 1010985 469825 1989026 -1181059 -8255712 -11120106 -8550103
37302 -8550103 -8337119 -12702320 -12997770 -3784803 7564465 11770352 10434014 10730946
37294 10730946 13467338 14602832 14372936 15722148 15603943 7749525 -4786643 -9688701
37286 -9688701 -2668005 3672565 -3769929 -19024644 -24327670 -14851111 -4204970 -3098268
37278 -3098268 -4616593 2215190 13968048 18307543 12026752 2667179 -4281676 -8745656
37270 -8745656 -8895502 -2507436 4808984 4725657 563471 4110289 15672332 20752471
$$ [...]
##END NTUPLES=NMR SPECTRUM
##END=
