##TITLE=31Pdec_SR-75-TFAA3-V3
 CDcl3 24 sc
 1.9.2023
##JCAMPDX= 6.0         $$ Bruker NMR JCAMP-DX V2.0
##DATA TYPE= NMR SPECTRUM
##DATA CLASS= NTUPLES
##ORIGIN= UXNMR, Bruker Analytische Messtechnik GmbH
##OWNER= root
$$ XWIN-NMR		Version 3.5
$$ Fri Sep  1 14:56:40 2023 Russian Standard Time (UT+4h)  she@DPX200
##.OBSERVE FREQUENCY= 81.013821
##.OBSERVE NUCLEUS= ^31P
##.ACQUISITION MODE= SIMULTANEOUS
##.ACQUISITION SCHEME= undefined
##.AVERAGES= 24
##.DIGITISER RES= 16
##SPECTROMETER/DATA SYSTEM= spect
##.PULSE SEQUENCE= zgpg30
##.SOLVENT NAME= D2O
##.SHIFT REFERENCE= (INTERNAL, D2O, 0, 248.564)
##AUDIT TRAIL= $$ (NUMBER, WHEN, WHO, WHERE, WHAT)
$$ ##TITLE= Audit trail, XWIN-NMR		Version 3.5
$$ ##JCAMPDX= 5.01
$$ ##ORIGIN= Bruker BioSpin GmbH
$$ ##OWNER= she
$$ F:/spectra/data/she/nmr/P31/1/pdata/1/auditp.txt
$$ ##AUDIT TRAIL=  $$ (NUMBER, WHEN, WHO, WHERE, WHAT)
(   1,<2023-09-01 14:55:43.26 +0400>,<she>,<DPX200>,
      <created by zg, POWCHK disabled, PULCHK disabled
       configuration hash MD5:
       00 E9 B6 7A A2 85 ED C7 34 08 36 98 17 FE 4E 26
       data hash MD5: 32K
       8E 56 1E 25 B1 0C E2 8F CB 18 C3 35 8E B7 1B 40>)
(   2,<2023-09-01 14:55:45.53 +0400>,<she>,<DPX200>,
      <Start of raw data processing
       efp BC_mod = 2 LB = 5 FT_mod = 6 PKNL = 1 PHC0 = -10616.97 PHC1 = -13.31499 SI = 64K 
       data hash MD5: 64K
       5E 0D BD 0E 52 1E 01 88 6D 5F 9F C8 D5 A7 C4 D8>)
(   3,<2023-09-01 14:56:03.59 +0400>,<she>,<DPX200>,
      <pk PHC0 = 2.332886 PHC1 = 0 
       data hash MD5: 64K
       3F D0 A7 B3 FF F1 E1 36 8B CA D2 3A F8 E5 A3 A6>)
$$ ##END=
$$ 
$$ hash MD5
$$ 45 E8 90 3F A5 63 F8 6B 6A F6 F6 CD 6C D2 4B 95
##$RELAX= 
##$RELAX= 
##$RELAX= 
##$RELAX= 
##$RELAX= 
##$RELAX= 
##$RELAX= 
##$RELAX= 
##$RELAX= 
$$ Bruker specific parameters
$$ --------------------------
##$DU= <F:/spectra>
##$EXPNO= 1
##$NAME= <P31>
##$PROCNO= 1
##$TYPE= <nmr>
##$USER= <she>
##$AMP= (0..31)
100 100 100 100 100 100 100 100 100 100 100 100 100 100 100 100 100 100 
100 100 100 100 100 100 100 100 100 100 100 100 100 100 
##$AQSEQ= 0
##$AQ_mod= 1
##$AUNM= <au_zg>
##$AUTOPOS= <>
##$BF1= 81.014009
##$BF2= 200.13
##$BF3= 200.13
##$BF4= 200.13
##$BF5= 200.13
##$BF6= 200.13
##$BF7= 200.13
##$BF8= 200.13
##$BYTORDA= 1
##$CFDGTYP= 0
##$CFRGTYP= 5
##$CHEMSTR= <none>
##$CNST= (0..31)
1 1 145 1 1 1 1 1 1 1 1 1 1 1 1 1 1 1 1 1 1 1 1 1 1 1 1 1 1 1 1 1 
##$CPDPRG= <waltz16>
##$CPDPRG1= <>
##$CPDPRG2= <waltz16>
##$CPDPRG3= <>
##$CPDPRG4= <mlev>
##$CPDPRG5= <mlev>
##$CPDPRG6= <mlev>
##$CPDPRG7= <mlev>
##$CPDPRG8= <mlev>
##$CPDPRGB= <>
##$CPDPRGT= <>
##$D= (0..31)
0 1 0 0 0 0 0 0 0 0 0 0.03 2e-05 3e-06 0 0 0 0 0 0 0 0 0 0 0 0 0 0 0 0 
0 0 
##$DATE= 1693565742
##$DBL= (0..7)
120 120 120 11 120 120 24 19 
##$DBP= (0..7)
150 150 150 150 150 150 150 150 
##$DBP07= 0
##$DBPNAM0= <>
##$DBPNAM1= <>
##$DBPNAM2= <>
##$DBPNAM3= <>
##$DBPNAM4= <>
##$DBPNAM5= <>
##$DBPNAM6= <>
##$DBPNAM7= <>
##$DBPOAL= (0..7)
0.5 0.5 0.5 0.5 0.5 0.5 0.5 0.5 
##$DBPOFFS= (0..7)
$$ [...]
##$SUBNAM2= <"">
##$SUBNAM3= <"">
##$SUBNAM4= <"">
##$SUBNAM5= <"">
##$SUBNAM6= <"">
##$SUBNAM7= <"">
##$SUBNAM8= <"">
##$SUBNAM9= <"">
##$SW= 501.771253377433
##$SWIBOX= (0..15)
0 1 3 0 0 0 0 0 0 0 0 0 0 0 0 0 
##$SW_h= 40650.406504065
##$TD= 32768
##$TD0= 1
##$TE= 0
##$TE2= 300
##$TE3= 300
##$TEG= 300
##$TL= (0..7)
0 120 53 12 22 120 120 120 
##$TP= (0..7)
150 150 150 150 150 150 150 150 
##$TP07= 0
##$TPNAME0= <>
##$TPNAME1= <>
##$TPNAME2= <>
##$TPNAME3= <>
##$TPNAME4= <>
##$TPNAME5= <>
##$TPNAME6= <>
##$TPNAME7= <>
##$TPOAL= (0..7)
0.5 0.5 0.5 0.5 0.5 0.5 0.5 0.5 
##$TPOFFS= (0..7)
0 0 0 0 0 0 0 0 
##$TUNHIN= 0
##$TUNHOUT= 0
##$TUNXOUT= 0
##$USERA1= <user>
##$USERA2= <user>
##$USERA3= <user>
##$USERA4= <user>
##$USERA5= <user>
##$V9= 5
##$VALIST= <valist>
##$VCLIST= <CCCCCCCCCCCCCCC>
##$VD= 0
##$VDLIST= <DDDDDDDDDDDDDDD>
##$VPLIST= <PPPPPPPPPPPPPPP>
##$VTLIST= <TTTTTTTTTTTTTTT>
##$WBST= 1024
##$WBSW= 4
##$XGAIN= (0..3)
0 0 0 0 
##$XL= 0
##$YL= 0
##$YMAX_a= 4324
##$YMIN_a= -5781
##$ZGOPTNS= <>
##$ZL1= 120
##$ZL2= 120
##$ZL3= 120
##$ZL4= 120
##$ABSF1= 0
##$ABSF2= 0
##$ABSG= 0
##$ABSL= 0
##$ALPHA= 0
##$AQORDER= 0
##$ASSFAC= 0
##$ASSFACI= 0
##$ASSFACX= 0
##$ASSWID= 0
##$AUNMP= <proc_1d>
##$AZFE= 0.1
##$AZFW= 0.5
##$BCFW= 0
##$BC_mod= 2
##$BYTORDP= 0
##$COROFFS= 0
##$CY= -3
##$DATMOD= 1
##$DC= 0
##$DFILT= <>
##$DTYPP= 0
##$F1P= 0
##$F2P= 0
##$FCOR= 1
##$FTSIZE= 65536
##$FT_mod= 6
##$GAMMA= 0
##$GB= 0
##$INTBC= 1
##$INTSCL= 6.047779e-11
##$ISEN= 30
##$LB= 5
##$LEV0= 0
##$LPBIN= 0
##$MAXI= 10000
##$MC2= 0
##$MEAN= 0
##$ME_mod= 0
##$MI= 50
##$NCOEF= 0
##$NC_proc= -10
##$NLEV= 6
##$NOISF1= 182.463
##$NOISF2= 159.3651
##$NSP= 0
##$NTH_PI= 0
##$NZP= 0
##$OFFSET= 248.5645
##$PC= 4
##$PHC0= -10614.64
##$PHC1= -13.31499
##$PH_mod= 1
##$PKNL= yes
##$PPARMOD= 0
##$PSCAL= 0
##$PSIGN= 0
##$REVERSE= no
##$SF= 81.0140089999694
##$SI= 65536
##$SIGF1= 159.3651
##$SIGF2= -187.1042
##$SINO= 113.3802
##$SIOLD= 16384
##$SREGLST= <1H.CDCl3>
##$SSB= 0
##$STSI= 65536
##$STSR= 0
##$SW_p= 40650.406504065
##$SYMM= 0
##$S_DEV= 0
##$TDeff= 32768
##$TDoff= 0
##$TI= <>
##$TILT= no
##$TM1= 0
##$TM2= 0
##$TOPLEV= 0
##$USERP1= <user>
##$USERP2= <user>
##$USERP3= <user>
##$USERP4= <user>
##$USERP5= <user>
##$WDW= 1
##$XDIM= 65536
##$YMAX_p= 315872460
##$YMIN_p= -204975456
$$ End of Bruker specific parameters
$$ ---------------------------------
##NTUPLES= NMR SPECTRUM
##VAR_NAME=  FREQUENCY,     SPECTRUM/REAL,   SPECTRUM/IMAG
##SYMBOL=    X,             R,               I
##VAR_TYPE=  INDEPENDENT,   DEPENDENT,       DEPENDENT
##VAR_FORM=  AFFN,          ASDF,            ASDF
##VAR_DIM=   65536,         65536,           65536
##UNITS=     HZ,            ARBITRARY UNITS, ARBITRARY UNITS
##FACTOR=    0.620285442955139, 1,           1
##FIRST=     20137.2065510682, 0,            0
##LAST=      -20513.1999529968, 0,           0
##MIN=       -20513.1999529968, -204975456,  0
##MAX=       20137.2065510682, 315872460,    0
$$ Real data points
##PAGE= N=1
##DATA TABLE= (X++(R..R)), XYDATA
$$ [...]
46262 3555769 600654 -1318008 -2089873 -1997711 -1433294 -575771 680278 2386441 4134710
46253 4134710 5113680 4668394 2841442 391936 -1720806 -2963380 -3466294 -3709938 -4003848
46244 -4003848 -4278875 -4298602 -3915230 -3094208 -1863258 -362394 1172064 2632123 4183436
46235 4183436 6016592 7967906 9564943 10517958 11060132 11707594 12691972 13646412 13844579
46226 13844579 12797651 10701713 8314441 6354435 5023814 4112755 3445594 3082781
46218 3082781 3140011 3603315 4378253 5389070 6553047 7739184 8799190 9550263 9692648
46209 9692648 8887163 7051201 4544742 1993736 -33994 -1180856 -1325765 -657371 341116
46200 341116 1187629 1731161 2099551 2368167 2463908 2411197 2456633 2833951 3558726 4585439
46190 4585439 6016077 7947178 10182747 12324151 14155028 15743910 17126059 18086784
46182 18086784 18381569 18024271 17196699 15963512 14275174 12258994 10320756 8829049
46174 8829049 7742668 6650911 5214839 3531112 2014115 927663 115229 -740633
46166 -740633 -1665605 -2359877 -2640352 -2740597 -3030057 -3525407 -3843000 -3609309 -2764052 -1448021
46156 -1448021 239183 2267939 4557428 6953738 9338853 11693767 14001600 16074433
46148 16074433 17509640 17906257 17205134 15822186 14428728 13612125 13692623 14660780 16113693
46139 16113693 17343161 17741504 17225183 16194244 15100334 14186415 13600821 13490447 13833273
46130 13833273 14336567 14666330 14703278 14468703 13917846 12989546 11836535 10859286 10466790
46121 10466790 10819447 11737578 12792719 13557077 13856146 13751749 13276597 12352504 11087630
46112 11087630 9988213 9648708 10278331 11692215 13657497 15981282 18296345 20091217
46104 20091217 21075899 21305327 20837947 19496271 17140927 14035393 10771906 7943768
46096 7943768 6023999 5394947 6197560 8094730 10336050 12145644 13071646 13082132 12466081
46087 12466081 11601557 10670246 9568756 8154322 6511686 4848571 3173119 1256608
46079 1256608 -1040599 -3528353 -5808132 -7534889 -8556125 -8952863 -9026882 -9135825 -9439208
46070 -9439208 -9848835 -10238059 -10558874 -10683029 -10313122 -9268958 -7815867 -6511113 -5693094
46061 -5693094 -5252901 -4923317 -4632120 -4486493 -4525276 -4614414 -4567161 -4306486 -3940391 -3725737
46051 -3725737 -3901391 -4451944 -5014974 -5085418 -4371999 -2990617 -1354030 104246 1153697
46042 1153697 1825917 2319825 2837725 3461402 4132474 4718178 5103993 5264877 5276339 5252488
46032 5252488 5267078 5333706 5425751 5451407 5205964 4433664 3008421 1040711 -1214162 -3499384
46022 -3499384 -5553991 -7022173 -7491330 -6711275 -4826452 -2438528 -418126 506524 175612
46013 175612 -911121 -1982385 -2544755 -2625868 -2619321 -3010501 -4179329 -6237456 -8903653
46004 -8903653 -11577040 -13648954 -14826613 -15208226 -15062660 -14491523 -13282602 -11183485 -8389838
45995 -8389838 -5633104 -3600418 -2336264 -1446349 -854482 -1023334 -2301780 -4355159 -6490040
45986 -6490040 -8348709 -10006262 -11510255 -12639143 -13100987 -12724033 -11470331 -9528649
45978 -9528649 -7420334 -5738699 -4679498 -4029637 -3688953 -3955185 -5154056 -7221448 -9859188
45969 -9859188 -12915960 -16346296 -19904759 -23193051 -26027395 -28498038 -30575111 -31859767
45961 -31859767 -31885517 -30591800 -28402561 -25894710 -23462048 -21229462 -19156793 -17178849
45953 -17178849 -15280513 -13469531 -11707105 -9918781 -8096656 -6336647 -4715222 -3159968
45945 -3159968 -1520760 233909 1985173 3663991 5382045 7265132 9227675 11059569
45937 11059569 12703305 14225548 15430778 15731833 14659311 12448255 9903444 7675178
45929 7675178 5835607 4133050 2383811 524463 -1427354 -3205352 -4253257 -4183795
45921 -4183795 -3320164 -2575153 -2711643 -3802418 -5369644 -6842616 -7818853 -8101285 -7714814
45912 -7714814 -6890238 -5917414 -4980956 -4161809 -3559007 -3332136 -3599462 -4302757 -5151427
45903 -5151427 -5684461 -5450061 -4239955 -2224186 142556 2385032 4218775 5536911
45895 5536911 6233106 6093256 4900129 2631686 -483363 -4104479 -7940197 -11803471
45887 -11803471 -15611257 -19354679 -22940015 -25948967 -27660422 -27528701 -25713909 -23036821
45879 -23036821 -20343003 -17964214 -15814945 -13881535 -12478308 -12035093 -12716775 -14251598
45871 -14251598 -16061298 -17542165 -18298579 -18221547 -17442465 -16256300 -15033861 -14065274 -13366075
45862 -13366075 -12630513 -11464087 -9752333 -7834801 -6295054 -5535159 -5527631 -5979745 -6716241
45853 -6716241 -7835176 -9452272 -11356810 -13022772 -13986997 -14189965 -13979998 -13866537 -14247096
45844 -14247096 -15205261 -16421930 -17289694 -17222213 -15942197 -13529322 -10259395 -6450509 -2452374
45835 -2452374 1283509 4214867 5885979 6159796 5275419 3667345 1780194 90751
45827 90751 -832068 -537317 942763 3045513 5077583 6619777 7576614 8050352 8295157
45818 8295157 8603329 8988677 9052133 8415602 7305229 6471934 6447721 7049190 7684789 7937283
45808 7937283 7679879 6824767 5309819 3395753 1723353 857448 783572 955386 864243
45799 864243 539090 508250 1324396 3119661 5516336 7839484 9396967 9700421 8628208
45790 8628208 6500327 3987793 1862882 703265 665849 1425343 2371780 3022357 3338682
45781 3338682 3630144 4140063 4773641 5228386 5300031 5019215 4579006 4213721 4088288 4186733
45771 4186733 4291727 4141160 3635790 2884461 2075929 1355159 804912 472397 371891
45762 371891 466957 653519 769561 674854 379900 96059 123707 674189 1767932 3214701
45752 3214701 4625934 5510993 5503453 4568865 2984697 1122484 -726498 -2352139 -3553469
45743 -3553469 -4126000 -3926681 -2975313 -1529446 -32616 1092447 1643015 1631388 1118238
45734 1118238 108808 -1404876 -3386214 -5763655 -8424837 -11145505 -13559849 -15268086
45726 -15268086 -16016015 -15811970 -14912959 -13689998 -12449467 -11340265 -10405588 -9666280 -9101204
45717 -9101204 -8577323 -7869450 -6755714 -5083544 -2832360 -229426 2234611 4053713
45709 4053713 5001501 5101578 4367379 2787969 621610 -1525795 -3092088 -3933558 -4210677
45700 -4210677 -4061314 -3569509 -2927908 -2359744 -1868972 -1272495 -519628 194287 692784
45691 692784 1047262 1456586 2005600 2628538 3234757 3783597 4262865 4638334 4819465 4714388
45681 4714388 4405101 4241086 4609736 5556789 6727419 7706168 8294663 8452977 8214135
45672 8214135 7830115 7817110 8564790 9907473 11291285 12369742 13217685 13917603 14203373
45663 14203373 13729552 12592920 11392708 10774789 11001276 11879719 12918270 13530987 13285793
45654 13285793 12115133 10302155 8271975 6452771 5264915 4978824 5400663 5830829
45646 5830829 5580238 4551491 3169124 1770406 296610 -1355329 -2941404 -4065369
45638 -4065369 -4657839 -5017012 -5349669 -5436949 -4827825 -3312510 -1226079 620536 1355519
45629 1355519 615976 -1121645 -2803916 -3526119 -3129283 -2197760 -1541670 -1637734 -2444716
45620 -2444716 -3649981 -5019859 -6463980 -7843208 -8965649 -9930952 -11290963 -13538235
45612 -13538235 -16390291 -18820000 -19901587 -19481762 -17986747 -15838973 -13279491 -10615688
45604 -10615688 -8365198 -7087927 -7115006 -8331500 -10077791 -11356049 -11392543 -10129431 -8136702
45595 -8136702 -6043763 -4099239 -2211711 -250759 1761394 3675928 5346723 6713638
45587 6713638 7766321 8463992 8759292 8698497 8383208 7769208 6612628 4737513 2306946
45578 2306946 -271751 -2660241 -4711070 -6363481 -7603422 -8541014 -9372923 -10189879 -10875387
45569 -10875387 -11209370 -11011451 -10188460 -8728467 -6688827 -4185212 -1438240 1146194
45561 1146194 3077975 4129583 4544053 4740801 4824162 4535036 3689202 2492580 1375516
45552 1375516 649730 361313 323364 214056 -234607 -1050072 -2068213 -3153536 -4231030
45543 -4231030 -5111329 -5542434 -5587227 -5764585 -6590572 -8029332 -9536267 -10570113 -10922330
45534 -10922330 -10648346 -9926915 -9036188 -8291926 -7883386 -7778361 -7778556 -7618708 -7066988 -6075739
45524 -6075739 -4891667 -3946027 -3573185 -3831918 -4568597 -5582977 -6723003 -7892941 -9035076
45515 -9035076 -10108815 -11067091 -11840292 -12357134 -12638290 -12908617 -13524711 -14608980 -15701076
45506 -15701076 -15926515 -14671130 -12096860 -8981417 -6153421 -4128502 -3088509 -2931646
45498 -2931646 -3301323 -3738097 -3914760 -3729294 -3241548 -2635955 -2198989 -2146794 -2413397 -2724296
45488 -2724296 -2931993 -3177369 -3673315 -4448489 -5385901 -6390866 -7354967 -7980447 -7822397
45479 -7822397 -6638210 -4701656 -2720885 -1395123 -996231 -1312071 -1906453 -2358733 -2290746
45470 -2290746 -1367150 498585 2900735 5070424 6409972 6918507 7052672 7201739 7359969
45461 7359969 7269521 6736931 5722474 4221914 2269715 142488 -1587318 -2395791 -2216566
45452 -2216566 -1394312 -262870 1041662 2333328 3241906 3574289 3659799 4020952 4687849
45443 4687849 5090332 4696918 3549925 2079142 601444 -835931 -2304015 -3940852
45435 -3940852 -5977703 -8525397 -11229579 -13290980 -13962466 -13025431 -10819207 -7973424
45427 -7973424 -5191274 -3086045 -1895095 -1231165 -275044 1599093 4365220 7523554
45419 7523554 10618067 13453800 15925970 17936661 19581723 21186081 22921460 24448643
45411 24448643 25110475 24488113 22734818 20527078 18862235 18712567 20439046 23375646
45403 23375646 26214602 28001528 28709718 28849388 28762137 28439257 27777208 26685475 24999603
45394 24999603 22589998 19630870 16560101 13675748 10923725 8205026 5778406 4174886
45386 4174886 3681289 3993836 4435251 4509600 4254811 4101118 4429740 5260273 6291634
45377 6291634 7157002 7632823 7709090 7574914 7534589 7827109 8432280 9047899 9301999 9018555
45367 9018555 8281452 7248016 5932860 4216437 2080980 -189149 -2086049 -3197911
45359 -3197911 -3497867 -3356470 -3247536 -3348455 -3352021 -2683483 -963750 1691073 4755289
45350 4755289 7572489 9551508 10287121 9720138 8204957 6279035 4293991 2309426
45342 2309426 315003 -1574668 -3175778 -4356040 -5018183 -5052266 -4420631 -3295778 -2073570
45333 -2073570 -1235489 -1145366 -1872246 -3162840 -4635908 -6031432 -7240358 -8127398 -8447888
45324 -8447888 -7992273 -6765576 -5044087 -3354478 -2347587 -2446096 -3463495 -4674901 -5393365
45315 -5393365 -5440696 -5041259 -4445290 -3820975 -3385138 -3377414 -3827322 -4421064 -4621002 -3937702
45305 -3937702 -2243108 34258 2102148 3380441 3937285 4326118 5066225 6335310 7972315
45296 7972315 9505096 10210238 9467686 7269599 4338006 1651730 -194402 -1303604
45288 -1303604 -2328719 -3973206 -6410589 -9071962 -11059816 -11803012 -11291909 -9811575
45280 -9811575 -7689541 -5324099 -3202543 -1711806 -1000932 -1090214 -1992468 -3634867 -5767963
45271 -5767963 -8064613 -10259492 -12146361 -13551642 -14417933 -14850959 -14994924 -14898542 -14535608
45262 -14535608 -13860952 -12795045 -11300028 -9610907 -8287538 -7836848 -8260253 -9066514 -9702971
45253 -9702971 -9876669 -9530238 -8732331 -7683326 -6689054 -5980688 -5560756 -5262550 -4908233
45244 -4908233 -4351263 -3438640 -2098458 -554092 617890 783837 -305607 -2346946 -4721905
45235 -4721905 -6863431 -8459072 -9503726 -10299502 -11313622 -12850774 -14837858 -17003676
45227 -17003676 -19176866 -21188369 -22499307 -22265941 -20041040 -16335037 -12315860 -8993822
45219 -8993822 -6772518 -5590018 -5158594 -5021319 -4670683 -3862408 -2787988 -1815967 -1048719
45210 -1048719 -183786 1178193 3097058 5147712 6707259 7410079 7321453 6670029 5502054
45201 5502054 3717753 1419347 -954805 -2935580 -4350340 -5227156 -5476022 -4895486 -3565567
45192 -3565567 -2074979 -1193105 -1303873 -2189640 -3293352 -4104899 -4379893 -4190440 -3839651
45183 -3839651 -3601839 -3433422 -2987404 -1991832 -577216 828085 1870004 2464134 2692327
45174 2692327 2636501 2315175 1689612 726798 -467964 -1589024 -2287082 -2393196 -1924181
45165 -1924181 -912647 616506 2458480 4138992 5112606 5056150 4013103 2371425 733645
45156 733645 -303494 -356874 682457 2661025 5097424 7201161 8253511 8107952 7173087
45147 7173087 5820331 3998100 1578831 -1115679 -3444154 -5109666 -6479850 -8171514
45139 -8171514 -10427598 -12933968 -15107491 -16444525 -16642698 -15563541 -13262147 -10127396
45131 -10127396 -6877014 -4196323 -2285588 -845665 440721 1518547 2114523 2148655
45123 2148655 1840852 1452721 1069129 673746 378092 516887 1442307 3129940 5003139
45114 5003139 6275482 6501078 5705491 4067121 1785058 -641389 -2356919 -2723676 -1871605
45105 -1871605 -483275 828463 1725182 1973781 1524805 758732 256714 186922 152443
45096 152443 -289315 -1214238 -2503663 -4113619 -5975909 -7834988 -9376715 -10382158 -10616452
45087 -10616452 -9755481 -7663119 -4672520 -1397543 1712200 4482307 6706524 7907529
45079 7907529 7530419 5422975 2154543 -1185019 -3637922 -4930731 -5412733 -5546066 -5584489
45070 -5584489 -5670688 -5964685 -6538463 -7269468 -7907613 -8109635 -7381685 -5261278 -1786456
45061 -1786456 2311182 6034434 8673952 9906271 9648830 8167130 6250419 4897120
45053 4897120 4611829 5065770 5497313 5410851 4928855 4591995 4872976 5843283 7238137
45044 7238137 8709420 9871965 10203073 9265040 7235682 5002251 3464527 2832502 2771998
45035 2771998 3022135 3523046 4045275 4132043 3515872 2306261 688084 -1259861 -3310158
45026 -3310158 -4965761 -5887187 -6328798 -6930286 -8107440 -9750903 -11414398 -12645023 -13211537
45017 -13211537 -13201364 -12924356 -12649426 -12461332 -12429503 -12822144 -13988922 -15985069 -18349951
45008 -18349951 -20261512 -20944294 -20087995 -18032311 -15548052 -13348178 -11760200 -10797032
45000 -10797032 -10360278 -10248672 -10104544 -9607462 -8777697 -7932353 -7247848 -6452538 -5045040
44991 -5045040 -2781197 111659 3144854 5880618 8036575 9430365 9986772 9829110
44983 9829110 9247224 8456424 7390465 5809973 3642274 1185023 -1021856 -2502286
44975 -2502286 -3089442 -3003464 -2732400 -2754354 -3300713 -4367067 -5869706 -7656725 -9389855
44966 -9389855 -10632010 -11181121 -11211194 -10996933 -10645570 -10227490 -9966933 -9991976 -9946895 -9213729
44956 -9213729 -7670721 -6004834 -5073754 -5063617 -5411684 -5430664 -4826806 -3707682 -2349288
44947 -2349288 -1013309 177516 1277083 2371989 3422180 4382686 5457674 6963842
44939 6963842 8779705 10127394 10176571 8839246 6764702 4569157 2303369 -279922
44931 -279922 -3196297 -6147005 -8818959 -11078400 -12930427 -14434806 -15615229 -16326793
44923 -16326793 -16276987 -15330317 -13746482 -11944742 -10050825 -7863909 -5293469 -2647166
44915 -2647166 -431096 980474 1441950 1021203 24146 -1116448 -2131373 -3015453 -3770910
44906 -3770910 -4232520 -4306393 -4198938 -4138352 -3941832 -3127667 -1452599 891529 3593208
44897 3593208 6427777 9071787 11035710 12041196 12328123 12354172 12219247 11524189 9760791
44888 9760791 6757375 2865318 -1097876 -4146002 -5637531 -5670767 -4957560 -4256499 -3882678
44879 -3882678 -3639874 -3083597 -1871964 -26832 2047686 3830054 5003022 5554451 5689144
44870 5689144 5756728 6156389 7054914 8132711 8809534 8862211 8702218 8910175 9586139 10286659
44860 10286659 10499386 9995531 8789120 7031273 5048965 3293964 2062684 1303546
44852 1303546 808434 559512 783730 1670413 3111493 4706477 5932907 6320892 5627985
44843 5627985 4016076 2068133 484837 -400922 -874586 -1564994 -2852859 -4535962 -6088194
44834 -6088194 -7200077 -7979435 -8637679 -9134190 -9240458 -8859387 -8109186 -7101432 -5818502
44825 -5818502 -4282218 -2680202 -1164267 394273 2247620 4335906 6152308 7129395
44817 7129395 7101962 6348583 5260894 4052206 2741214 1325082 -48398 -1059259 -1402496
44808 -1402496 -1043184 -250360 666595 1586723 2446485 2947619 2599680 1158874 -1052112
44799 -1052112 -3337616 -5099159 -6099348 -6404410 -6220607 -5742237 -4990943 -3760962 -1842375
44790 -1842375 629150 3121546 5080232 6305265 6899893 6933998 6321720 5062206 3463881
44781 3463881 2011261 1037327 595201 602385 985202 1663561 2524088 3511866 4698626
44772 4698626 6165049 7827862 9448859 10786897 11662948 11922833 11491885 10504320 9233837
44763 9233837 7799685 6046676 3837052 1382187 -865497 -2611284 -3842025 -4562259
44755 -4562259 -4650520 -4158041 -3643987 -3959875 -5555458 -8002872 -10234970 -11248734 -10613664
44746 -10613664 -8442661 -5079034 -933065 3464829 7484774 10636167 12772677 13995158
44738 13995158 14389718 13947836 12723363 10955806 8988262 7088917 5318678 3471033
44730 3471033 1139013 -1998934 -5805510 -9594508 -12503263 -14028886 -14272150 -13768853
44722 -13768853 -13152619 -12904194 -13246952 -14145808 -15387291 -16719940 -17974006 -19056782 -19829029
44713 -19829029 -20029405 -19391419 -17835674 -15472776 -12421854 -8777875 -4856061 -1326656
44705 -1326656 1110334 2203541 2208366 1544029 574437 -349289 -986310 -1532042 -2639498
44696 -2639498 -4862497 -8096761 -11670765 -14894109 -17395896 -19059942 -19882445 -19938407 -19352984
44687 -19352984 -18263942 -16879817 -15545695 -14611363 -14152848 -13828753 -13019974 -11173921 -8187748
44678 -8187748 -4579494 -1201675 1343973 2994966 3936023 4232678 3942384 3413641 3135086
44669 3135086 3256151 3485681 3489072 3174401 2595048 1873786 1319506 1305917 1792310 2137246
44659 2137246 1630843 161830 -1744185 -3386726 -4233613 -4031387 -2941545 -1573182 -592305
44650 -592305 -194271 -109286 -135075 -418608 -1090864 -1848327 -2172809 -1958485 -1724604 -2123483
44640 -2123483 -3326843 -4968304 -6616398 -8176272 -9807514 -11553718 -13128181 -14000402
44632 -14000402 -13621616 -11686828 -8423181 -4698658 -1654697 -9526 334818 6354
44624 6354 -431017 -778616 -1097503 -1475629 -1834404 -1820572 -954231 911508 3240354 5080666
44614 5080666 5796944 5536194 5017520 4960956 5667314 6920010 8138148 8700461 8280938
44605 8280938 6958687 5063525 2981148 1060246 -480434 -1685519 -2842974 -4222159
44597 -4222159 -5836246 -7495493 -9015810 -10280068 -11159705 -11536794 -11438859 -11043548 -10503726
44588 -10503726 -9869000 -9251490 -8951085 -9220512 -9862094 -10197353 -9576870 -7938629 -5847400
44579 -5847400 -4047546 -3031818 -2919101 -3490698 -4235818 -4548647 -4139176 -3287273 -2550948
44570 -2550948 -2177310 -1917829 -1485545 -1057977 -1152853 -2003571 -3188861 -3949718 -3823814
44561 -3823814 -2935542 -1747296 -641816 261652 1027913 1766478 2537106 3274811 3762624
44552 3762624 3728422 3008030 1611060 -330293 -2581969 -4770790 -6462695 -7399643 -7633697
44543 -7633697 -7361524 -6676363 -5578178 -4198376 -2889394 -2042140 -1850556 -2238597 -2933772
44534 -2933772 -3590339 -3906049 -3659999 -2642143 -624996 2466366 6347880 10456556 14269055
44525 14269055 17430993 19560902 20172127 19049353 16666595 13984021 11706142 9819494
44517 9819494 7900828 5744514 3567611 1693566 221777 -974005 -2078732 -3244007
44509 -3244007 -4530506 -5790256 -6643266 -6722921 -6002315 -4835999 -3700687 -2973614 -2902393
44500 -2902393 -3563677 -4729066 -5913929 -6738024 -7206298 -7522901 -7698705 -7519579 -6907700
44491 -6907700 -6148101 -5674983 -5691981 -6015190 -6217681 -5944636 -5213887 -4453706 -4167387 -4527457
44481 -4527457 -5325530 -6220433 -6851427 -6761101 -5541682 -3260800 -572748 1817225 3751005
44472 3751005 5553372 7468426 9330807 10728992 11300900 10895115 9662376 8073089
44464 8073089 6720626 6002140 5970977 6419483 6998812 7332756 7230093 6862661 6630080
44455 6630080 6800682 7341610 8044049 8631945 8735793 8001088 6391751 4288109 2171030
44446 2171030 301033 -1203477 -2137017 -2290808 -1749786 -917677 -194635 261514 436116
44437 436116 273716 -281668 -1104861 -1872663 -2305253 -2425207 -2534341 -2896273 -3445061 -3811186
44427 -3811186 -3571846 -2424233 -249779 2719980 5726577 7735498 8143948 7229510 5773164
44418 5773164 4321080 2976657 1783013 958924 666715 808413 1207712 1801802 2478501
44409 2478501 2902390 2775229 2231881 1747431 1618789 1695247 1623517 1163837 225730 -1150338
44399 -1150338 -2641373 -3632531 -3680207 -3057388 -2634784 -3074869 -4223689 -5386314 -6075274
44390 -6075274 -6298960 -6175720 -5561059 -4223685 -2236637 24332 2245457 4368623 6417677
44381 6417677 8298950 9834019 10871025 11315819 11197103 10799741 10595236 10851445 11324614
44372 11324614 11463360 10915310 9739003 8156498 6268776 4075299 1634331 -940015
44364 -940015 -3606940 -6370736 -9016222 -10914011 -11272779 -9785890 -7069565 -4320018
44356 -4320018 -2407909 -1322147 -507371 411397 1373913 2192533 2809916 3190885 3175543
44347 3175543 2584446 1394321 -245267 -2066555 -3703016 -4787724 -5146810 -4839753 -3968455
44338 -3968455 -2574636 -820241 866338 1999814 2365814 2049454 1237028 158935 -828925
44329 -828925 -1343672 -1251197 -740717 -69244 672623 1462998 2070785 1976694 658354 -1948223
44319 -1948223 -5211067 -8094728 -9831752 -10370512 -10154604 -9499758 -8249114 -6016036 -2704038
44310 -2704038 1182480 4684085 6916584 7607990 7156819 6148951 4909517 3608197
44302 3608197 2620415 2469605 3362048 4991042 6866561 8656408 10155396 11170858 11617985
44293 11617985 11579838 11103644 10045757 8270290 5901639 3231749 489112 -2111752
44285 -2111752 -4191363 -5359509 -5623649 -5474389 -5436032 -5532634 -5195101 -3701684 -839390
44276 -839390 2728605 5795718 7456997 7670133 7005884 6032848 5115063 4630416 4993969
44267 4993969 6335314 8340511 10508131 12430570 13805806 14420426 14302209 13765848 13120426
44258 13120426 12343115 11131974 9266015 6883805 4477539 2665324 1897907 2294958
44250 2294958 3710618 5834596 8094086 9581029 9450892 7597902 4774497 1879474
44242 1879474 -742829 -3175583 -5343824 -6890895 -7612966 -7737977 -7691924 -7738587 -7883310
44233 -7883310 -7983261 -7900756 -7656588 -7460619 -7490782 -7641171 -7623395 -7344978 -7055625 -7075487
44223 -7075487 -7500922 -8214809 -9021111 -9656482 -9812732 -9364723 -8606270 -8140813 -8452893
44214 -8452893 -9565800 -11090667 -12576001 -13810223 -14807263 -15531424 -15703432 -14953008 -13194063
44205 -13194063 -10861505 -8819991 -8031606 -9140214 -12127793 -16253356 -20372751 -23411617
44197 -23411617 -24661970 -23869504 -21264416 -17475155 -13186088 -8791835 -4483791 -639433
44189 -639433 2137784 3512995 3790151 3602211 3290359 2708719 1568952 -154596 -2108815
44180 -2108815 -3715573 -4472613 -4246076 -3317235 -2111689 -882823 374659 1831739 3690540
44171 3690540 5974296 8318657 10104222 10964582 11066389 10728860 9920191 8422066 6433602
44162 6433602 4647628 3596268 3157604 2852245 2425160 1943989 1461740 822193 -194690
44153 -194690 -1678130 -3565749 -5718789 -7937580 -9885495 -11057332 -10998364 -9733284 -7940646
44144 -7940646 -6490417 -5729819 -5348040 -4961592 -4619957 -4627463 -5088351 -5855723 -6815050 -7967840
44134 -7967840 -9240420 -10396725 -11171742 -11387658 -10981550 -10083168 -9056890 -8275748 -7785850
44125 -7785850 -7327237 -6748121 -6258141 -6156955 -6402757 -6595229 -6389996 -5851062 -5390110
44116 -5390110 -5421479 -6078501 -7166474 -8283515 -8993435 -9022754 -8433714 -7596031 -6865610
44107 -6865610 -6250742 -5476046 -4374800 -3063602 -1682917 -194665 1360292 2579755
44099 2579755 3025370 2872843 2967384 4083125 6230031 8709482 10649868 11424168 10848735
44090 10848735 9309561 7660294 6716181 6686113 7106375 7331002 7086053 6644945 6565205
44081 6565205 7201877 8364982 9461103 10033573 10122332 10045059 9948861 9732083 9316381 8762733
44071 8762733 8108175 7304733 6388614 5527924 4818548 4215529 3790377 3874026 4737065 6219360
44061 6219360 7871553 9406458 10820121 12117606 13164055 13845635 14154149 14007808 13162979
44052 13162979 11452834 9030640 6287129 3624755 1387357 -154407 -954447 -1291096
44044 -1291096 -1559081 -1960803 -2480747 -3067822 -3660999 -4070602 -4037388 -3439087 -2286653
44035 -2286653 -541301 1802296 4359926 6350773 7182448 6935079 6091824 4925811 3403049
44026 3403049 1619221 13654 -954184 -1156987 -759926 -39672 614996 718483 -3750
44017 -3750 -1295082 -2540221 -3342078 -3828666 -4315017 -4761605 -4729215 -3907850 -2591278 -1537288
44007 -1537288 -1370765 -2160035 -3507507 -4904799 -5959351 -6433916 -6259391 -5535717 -4412175
43998 -4412175 -2909930 -911411 1623400 4429733 6936504 8521792 8873354 8216001
43990 8216001 7190093 6401284 6006317 5729511 5270540 4661351 4248879 4396247 5172943
43981 5172943 6199000 6730216 6024392 3807973 455621 -3296469 -6803690 -9705493
43973 -9705493 -11822010 -13062353 -13500756 -13434928 -13233210 -13079702 -12889191 -12477627 -11789586
43964 -11789586 -10934074 -10007014 -8935262 -7579598 -6044181 -4847028 -4667206 -5806064
43956 -5806064 -7849754 -9875805 -11021361 -10902013 -9596550 -7376929 -4499472 -1140303
43948 -1140303 2589986 6519613 10173341 12698611 13264788 11694363 8651958 5143465
43940 5143465 1881011 -873329 -3089469 -4862759 -6479166 -8313893 -10510991 -12802492
43932 -12802492 -14662223 -15579855 -15236346 -13616330 -11090493 -8334570 -6035921 -4578262
43924 -4578262 -3909605 -3626683 -3221285 -2393863 -1243412 -183956 315526 -25955 -1099818
43915 -1099818 -2274043 -2606098 -1516612 665186 3015693 4921511 6476453 7974494
43907 7974494 9368921 10463166 11356009 12316378 13282490 13797302 13454296 12175731 10062397
43898 10062397 7253673 4040833 922639 -1583640 -3118960 -3510158 -2873175 -1803528
43890 -1803528 -1243668 -1902376 -3782046 -6324755 -8923834 -11206326 -12964423 -14046564
43882 -14046564 -14358588 -13879261 -12699611 -11166394 -9939096 -9644403 -10264168 -10897474 -10300657
43873 -10300657 -7798269 -3748752 775111 4672215 7263965 8359473 8185441 7328684
43865 7328684 6556249 6436025 6998397 7743141 7986025 7277820 5670642 3731211 2246493
43856 2246493 1720217 2027586 2566576 2769422 2467458 1829058 1078254 317123 -477416
43847 -477416 -1373326 -2379023 -3384716 -4247199 -4962514 -5706421 -6672015 -7917104 -9387223
43838 -9387223 -10980864 -12494707 -13568342 -13813874 -13028020 -11253722 -8711353 -5774299
43830 -5774299 -2929657 -525061 1557387 3858781 6846390 10469685 14217279 17475530
43822 17475530 19716360 20485665 19540006 17171760 14294439 12016089 11018725 11267623 12193969
43813 12193969 13102322 13536709 13472276 13248888 13262413 13644486 14209622 14674245 14881619 14841041
43803 14841041 14648936 14432222 14323381 14404809 14630048 14794858 14608884 13850746 12508676
43794 12508676 10770698 8839867 6758348 4456686 1993948 -281179 -1839220 -2274393
43786 -2274393 -1587661 -258901 983636 1597185 1532675 1131779 741326 475828 312601
43777 312601 256865 312541 371685 262512 -74679 -493459 -692387 -333043 794925 2577533
43767 2577533 4518806 5982850 6587471 6384704 5674070 4684340 3468286 2095722 893891
43758 893891 399289 968956 2408968 4031122 5104482 5258271 4550668 3354209 2249160
43749 2249160 1814034 2227710 3017421 3353239 2699000 1146701 -894662 -3230194 -5994270
43740 -5994270 -9259907 -12652907 -15452266 -17077214 -17423093 -16734640 -15289248 -13308289
43732 -13308289 -11056836 -8798618 -6626119 -4520389 -2623931 -1236958 -407384 307758
43724 307758 1497923 3403634 5844515 8415847 10528448 11464084 10820221 8973893 6833724
43715 6833724 5031410 3520551 1964586 234703 -1584351 -3412689 -5169439 -6661701
43707 -6661701 -7646761 -7934021 -7327817 -5618996 -2857548 367715 3090106 4522171 4519843
43698 4519843 3596667 2532220 1875934 1698403 1752064 1815491 1834701 1814068 1756552 1767564
43688 1767564 2092173 2977348 4560187 6862406 9703799 12559333 14711070 15729239
43680 15729239 15758269 15279446 14723478 14368014 14373145 14682522 14989716 15010402 14750264 14385460
43670 14385460 14008042 13685772 13654728 14177086 15227085 16554051 18034228 19678268 21245433
43661 21245433 22156807 21977503 20817218 19101278 17097624 14856272 12523818 10509969
43653 10509969 9309887 9228541 10224535 11899889 13641120 14879299 15297874 14856356 13725888
43644 13725888 12264102 10940789 10102979 9757194 9654883 9617186 9697734 9976264 10265057
43635 10265057 10141943 9336411 8080272 7054707 6941003 7908081 9411137 10480454 10361249
43626 10361249 9056517 7303976 5981809 5517522 5847130 6777866 8155868 9673153
43618 9673153 10786109 11039598 10381631 8996748 6924498 4082828 694076 -2523540
43610 -2523540 -4725936 -5467297 -4872080 -3458520 -1903291 -855309 -748621 -1662836 -3341071
43601 -3341071 -5345812 -7230066 -8653055 -9442733 -9616797 -9373569 -9054088 -9036936 -9554611
43592 -9554611 -10546638 -11694272 -12600537 -12934700 -12486867 -11254774 -9572472 -8054303 -7230368
43583 -7230368 -7163116 -7467374 -7723730 -7808004 -7805457 -7748537 -7599361 -7435809 -7427408 -7541755 -7472780
43572 -7472780 -7060794 -6680467 -6951680 -8028747 -9376301 -10334221 -10762792 -11059404 -11693925
43563 -11693925 -12835405 -14289481 -15635736 -16491171 -16769936 -16643592 -16176915 -15129228 -13268196
43554 -13268196 -10786763 -8219443 -5982151 -4163740 -2729240 -1705503 -1110751 -854200
43546 -854200 -756871 -544585 205364 1919404 4654010 7863815 10605914 12038612 11859021
43537 11859021 10422605 8469139 6644874 5251193 4434803 4450792 5527301 7501506
43529 7501506 9795589 11793103 13112536 13571634 13176557 12272606 11506470 11458725 12354146
43520 12354146 14125208 16539607 19149397 21338147 22681545 23236699 23331927 23092032 22250030
43511 22250030 20361414 17128978 12618733 7276735 1675701 -3833191 -9135141 -13975253
43503 -13975253 -17762685 -19940140 -20441737 -19606413 -17765232 -15182231 -12353581 -10031074
43495 -10031074 -8788953 -8685399 -9394243 -10507113 -11647746 -12512234 -13032524 -13478259 -14222664
43486 -14222664 -15318933 -16350239 -16784872 -16540719 -16177115 -16419992 -17427235 -18593036 -19162657
43477 -19162657 -18972148 -18474895 -18135321 -18018710 -17986027 -18020833 -18161456 -18235341 -17929916 -17212365
43467 -17212365 -16526012 -16376369 -16666839 -16542434 -15017002 -11777508 -7329460 -2431102 2406324
43458 2406324 6818307 10292215 12307263 12757622 12020320 10602932 8928674 7454691
43450 7454691 6669605 6740405 7270228 7566495 7112622 5767531 3744531 1619388 215397
43441 215397 143019 1347904 3236646 5249785 7150867 8773393 9797499 10021759 9742021
43432 9742021 9593118 9945508 10576053 10965737 10791854 10057159 8884612 7407049 5895223
43423 5895223 4806220 4498105 4857032 5310596 5306089 4783194 4150214 3823926 3862917 4052631
43413 4052631 4213737 4263738 3990066 2990156 1040180 -1521486 -3965293 -5765045 -6891246
43404 -6891246 -7496450 -7537078 -6900531 -5789808 -4724440 -4117643 -4009523 -4244464 -4719222
43395 -4719222 -5337119 -5864321 -6040037 -5838344 -5495138 -5246777 -5142748 -5175632 -5512228 -6453731
43385 -6453731 -8099559 -10094310 -11795319 -12737933 -12935616 -12748339 -12537001 -12479173 -12607887
43376 -12607887 -12857867 -13038079 -12894208 -12342335 -11671862 -11464134 -12214431 -13885553 -15696160
43367 -15696160 -16368383 -14790538 -10676411 -4715136 1865186 7886249 12536179 15409611
43359 15409611 16468992 15953757 14184619 11410666 7897492 4123837 725649 -1857319
43351 -1857319 -3617944 -4789583 -5485346 -5650742 -5342256 -4856181 -4451162 -4032411 -3271074
43342 -3271074 -2031284 -541056 871577 2021508 2719914 2548396 1064231 -1693457
43334 -1693457 -5058320 -8207318 -10717032 -12616859 -14045326 -15053771 -15741640 -16360301
43326 -16360301 -17076423 -17632863 -17409240 -15965687 -13534446 -10897993 -8768764 -7356761
43318 -7356761 -6528561 -6188165 -6304888 -6631068 -6649813 -5941418 -4531496 -2820933 -1260740
43309 -1260740 -156248 331232 162899 -562588 -1632088 -2777826 -3727494 -4273591 -4364085
43300 -4364085 -4101789 -3620273 -3002845 -2341855 -1779052 -1416046 -1284210 -1504768 -2353502
43291 -2353502 -3957601 -5957153 -7687233 -8754141 -9276497 -9528800 -9570559 -9356145 -8997654
43282 -8997654 -8647464 -8157103 -7083931 -5117578 -2424956 409242 2674460 3820863
43274 3820863 3701594 2681099 1413900 388553 -297340 -686713 -618855 200402 1800942
43265 1800942 3778066 5591032 6956120 7898535 8532284 8958072 9396870 10253730 11851792
43256 11851792 14043940 16165550 17459444 17574098 16671726 15148799 13356038 11561492
43248 11561492 10021771 8949082 8396380 8219671 8165622 8009980 7672460 7243824 6870338
43239 6870338 6574243 6227217 5749042 5287065 5126278 5448889 6251966 7454136 8955104
43230 8955104 10581789 12103669 13354870 14253018 14667585 14398635 13372713 11753454 9745631
43221 9745631 7381969 4660379 1853830 -493093 -1948044 -2540143 -2771902 -3352081 -4781908
43212 -4781908 -6927234 -8917611 -9671094 -8705097 -6423894 -3620597 -865553 1563745
43204 1563745 3450982 4701578 5612763 6760176 8446096 10379658 12008924 13077670
43196 13077670 13762152 14337506 14813765 14867375 14074695 12287928 9877187 7540061 5740602
43187 5740602 4346908 2931750 1407352 206728 -189310 270853 1292351 2600302
43179 2600302 4006369 5211224 5861633 5935474 5894346 6280393 7211630 8362181 9333665
43170 9333665 9891393 9924678 9447907 8737936 8267984 8290085 8515650 8379952 7674811 6827425
43160 6827425 6492438 6915216 7745572 8426967 8663555 8472872 7885688 6767577 5026341
43151 5026341 2923600 1039648 -126620 -481367 -256235 302157 1088285 2030946 2938988
43142 2938988 3510793 3506613 2929363 2041811 1167431 450031 -153054 -635877 -822082 -600143
43132 -600143 -218697 -165553 -698972 -1611223 -2492344 -3077629 -3240983 -2823250 -1724104 -160910
43122 -160910 1398461 2683923 3880697 5306441 6901069 8195395 8806165 8839177 8716970
43113 8716970 8656497 8419472 7616581 6204841 4608257 3340497 2590912 2256363 2330760
43104 2330760 3118569 4975056 7859067 11172372 14014224 15621291 15729767 14699517
43096 14699517 13304212 12256957 11809542 11769220 11863138 12008038 12206052 12283758 11884432
43087 11884432 10790716 9223931 7745095 6799625 6352088 5984589 5329520 4357057 3267056
43078 3267056 2211275 1161139 -56393 -1661418 -3741213 -6036723 -7994724 -9195876
43070 -9195876 -9675998 -9648071 -8985257 -7287984 -4540485 -1414282 1273460 3218258 4561722
43061 4561722 5368144 5474400 4817580 3648772 2383119 1401664 976188 1149779 1605118
43052 1605118 1811707 1412625 415026 -980269 -2588069 -4260661 -5874842 -7372762 -8690072
43043 -8690072 -9597515 -9775303 -9128449 -7872845 -6213947 -4137126 -1708943 575309 2059644
43034 2059644 2582936 2654802 2879494 3314666 3470484 2854829 1445522 -314446 -1900753
43025 -1900753 -3088133 -4001086 -4823283 -5493428 -5731914 -5362171 -4533025 -3564002 -2609477
43016 -2609477 -1589640 -511923 245584 166268 -827698 -2177784 -3197930 -3672763 -3779726
43007 -3779726 -3532480 -2636454 -996378 912435 2420022 3286450 3720223 3811986 3187974
42998 3187974 1360590 -1597277 -4777393 -6931443 -7422634 -6778155 -6184496 -6328785 -6818541
42989 -6818541 -6785141 -5836745 -4219786 -2245709 80042 2872788 6121967 9678619 13215083
42980 13215083 16113043 17666968 17585120 16146082 13763891 10621435 6928269 3352011
42972 3352011 864624 79851 823501 2326155 3766747 4727192 5293171 5756406 6200150
42963 6200150 6436679 6356979 6158712 6103391 6231168 6537856 7281788 8765147 10801540
42954 10801540 12741584 14169985 15326156 16653704 18149755 19419167 20247335 20809435
42946 20809435 21289894 21542452 21223396 20087085 18038862 15060198 11290876 7160326
42938 7160326 3263372 36219 -2397307 -4081088 -5044835 -5285016 -4792297 -3523518 -1482032
42929 -1482032 1013031 3209546 4304849 4041906 2836644 1292353 -255934 -1633759
42921 -1633759 -2479181 -2312462 -1012045 977271 3059157 5047021 7209884 9801544
42913 9801544 12654887 15232556 16946326 17381107 16383057 14181196 11470530 9162162
42905 9162162 7830944 7401043 7468423 7893092 8940084 10848062 13420161 16085892 18219220
42896 18219220 19328364 19120323 17602663 15135541 12292060 9663330 7783931 7049947
42888 7049947 7487655 8628312 9798894 10592886 10992620 11104410 10964550 10608986 10122803
42879 10122803 9534818 8824011 8126594 7775478 7976346 8530710 9011332 9128221 8783982
42870 8783982 7879935 6331482 4334647 2429317 1159198 711039 929044 1600619 2660245
42861 2660245 4182659 6269106 8911784 11881491 14748314 17103548 18827231 20128036
42853 20128036 21284938 22330824 22979921 22861865 21851012 20218316 18494559 17153800
42845 17153800 16343510 15846037 15292956 14466163 13437020 12414448 11440399 10256002 8542594
42836 8542594 6366321 4372394 3429231 3949413 5496645 7064027 7766001 7334534 6117077
42827 6117077 4776041 3962853 3996942 4588389 4897088 4111824 2151646 -194982 -1856045
42818 -1856045 -2214608 -1362560 202207 2046419 4058508 6353428 8934195 11419795
42810 11419795 13145484 13613660 12906280 11683034 10755878 10559670 10905389 11217929 11076610
42801 11076610 10544187 9942595 9377411 8623634 7464047 5943082 4203126 2248232 40733
42792 40733 -2253419 -4282890 -5758729 -6580694 -6743850 -6206281 -4832758 -2464571 798206
42783 798206 4281205 6915403 8034495 7973557 7645556 7547757 7451850 7080770 6724845 6961422
42773 6961422 7963305 9317428 10426322 10898209 10632658 9776396 8679499 7798876 7541900
42764 7541900 8089621 9212104 10225218 10323194 9131014 6890124 4058148 907365 -2319501
42755 -2319501 -5048735 -6529457 -6439779 -5190224 -3597115 -2379562 -1933858 -2331139 -3356438
42746 -3356438 -4612305 -5687310 -6249516 -6066724 -5121251 -3766050 -2616913 -2130543 -2261453
42737 -2261453 -2545481 -2511219 -2068028 -1595205 -1635211 -2376129 -3414617 -4126339 -4277402 -4190296
42727 -4190296 -4388061 -5277522 -7113232 -9874747 -12968570 -15329107 -16154620 -15507907 -14050749
42718 -14050749 -12371108 -10820051 -9783670 -9593779 -10049459 -10394644 -9993638 -8837830 -7260035
42709 -7260035 -5415868 -3296729 -1072447 896597 2366628 3320651 3817305 3956681 3974024
42700 3974024 4092223 4196363 3894169 3077344 2284653 2300242 3388028 5001318 6200060
42691 6200060 6285238 5135498 3124823 764973 -1669114 -4231024 -7031880 -9929886
42683 -9929886 -12554367 -14589467 -15934235 -16636405 -16857143 -16949981 -17376250 -18340184 -19518003
42674 -19518003 -20257596 -20062339 -18859429 -16897822 -14550294 -12234362 -10359261 -9162937
42666 -9162937 -8518120 -7910035 -6687203 -4476073 -1473122 1647541 4157258 5639895
42658 5639895 6006444 5306727 3684571 1507739 -622737 -2136404 -2822906 -2945049 -3061008
42649 -3061008 -3658486 -4795277 -6013146 -6675994 -6497077 -5769410 -5095397 -4926198 -5338691
42640 -5338691 -6134690 -7040394 -7800031 -8136053 -7702160 -6212414 -3766031 -1042831 1026842
42631 1026842 1993950 2314885 2948335 4477369 6614789 8493611 9353215 9007568 7859192
42622 7859192 6597700 5799830 5625081 5798841 5928116 5880183 5832641 5953566 6145940 6230737
42612 6230737 6326059 6838918 7990578 9485108 10766120 11490512 11613482 11156225 10178171
42603 10178171 8970399 7954443 7215736 6319351 4775227 2594703 257019 -1758795
42595 -1758795 -3245787 -4185065 -4630999 -4696731 -4485408 -3998646 -3235706 -2405146 -1898546
42586 -1898546 -1956295 -2373900 -2545282 -1803313 138879 2877062 5423780 6811554 6738433
42577 6738433 5642604 4202606 2881860 1915088 1477441 1670979 2402593 3400880 4342643
42568 4342643 4920733 4879433 4118980 2777488 1149215 -472856 -1846978 -2753941 -3049063
42559 -3049063 -2770353 -2115358 -1253597 -175687 1253349 3100647 5226617 7323270 9088817
42550 9088817 10376413 11179371 11494371 11254472 10436399 9211060 7938302 6996346 6610111
42541 6610111 6783360 7299085 7772122 7834188 7430340 6951734 6944589 7585270 8476475 9012334
42531 9012334 8879759 8136965 6934239 5388067 3737709 2386959 1651953 1579357 2078744
42522 2078744 3047394 4221144 5105917 5351819 5162165 5092900 5428894 5939079 6230641
42513 6230641 6108031 5530686 4455751 2890549 1027168 -731913 -1817461 -1642861 11252
42504 11252 2651731 5310486 7264282 8403000 8886992 8789205 8322778 8146948 9010519
42495 9010519 11057430 13706926 16194744 18030014 19022531 19252384 19166445 19459585 20617153
42486 20617153 22560902 24737607 26440981 27068639 26321563 24365368 21779281 19270593
42478 19270593 17418205 16558391 16624087 16955191 16486359 14437753 10919793 6830391 3218606
42469 3218606 787008 -200982 125011 1278292 2635967 3867599 5146528 6807315
42461 6807315 8775258 10454211 11261342 11214943 10901149 10882982 11240679 11680174 11925223
42452 11925223 11892084 11593998 11063992 10382207 9643209 8858447 7993407 7136144 6519319
42443 6519319 6301367 6392846 6559710 6634474 6561777 6304151 5808629 5070029 4188174 3399697
42433 3399697 3101945 3763432 5634304 8444575 11421810 13690726 14738086 14590587 13653959
42424 13653959 12432296 11357336 10776516 10971183 12062458 13834097 15684869 16884246
42416 16884246 17026369 16322705 15434425 14932788 14853315 14761129 14237402 13253007 12060810
42407 12060810 10838144 9580103 8340835 7418427 7161142 7589433 8280759 8673767 8504220
42398 8504220 7958917 7414626 7045590 6721285 6273826 5753657 5338876 5102751 5071449 5502456
42388 5502456 6839491 9192216 11960537 14186802 15327210 15609832 15672283 15968294 16516180
42379 16516180 17053606 17306949 17134885 16494424 15323072 13513887 11082093 8378387 6082589
42370 6082589 4914641 5284731 7128101 9982246 13225076 16346376 19092994 21390436
42362 21390436 23154665 24232448 24535078 24179077 23470848 22790521 22489174 22790240 23670110
42353 23670110 24816968 25753402 26024563 25314417 23533934 20973149 18372087 16648815
42345 16648815 16347947 17268842 18632480 19638628 19950569 19786418 19616235 19701676 19841343
42336 19841343 19588137 18767496 17720122 16937025 16508983 16094067 15445102 14794831 14595383
42327 14595383 14956229 15475055 15642586 15366724 15081842 15309034 16023389 16442032 15569305
42318 15569305 13078026 9649049 6430806 4242596 3278341 3293288 3796186 4169728 3974399
42309 3974399 3293831 2648063 2492866 2894948 3656510 4516022 5172057 5418755 5511700 6231936
42299 6231936 8272742 11533851 15175315 18338045 20663092 22203275 23149714 23755027
42291 23755027 24265922 24673431 24587702 23570756 21655303 19445759 17651778 16538876 15818504
42282 15818504 14994427 13770507 12183925 10466339 8857828 7546311 6724324 6637611 7501373
42273 7501373 9276467 11502765 13474191 14743597 15467076 16121627 16852474 17246184 16830389
42264 16830389 15641452 14122253 12545803 10773163 8624679 6321072 4469377 3714473
42256 3714473 4454016 6714366 10065153 13628664 16380946 17679837 17602786 16764381 15797373
42247 15797373 15020103 14524821 14359160 14428727 14313981 13479958 11797836 9698476 7684706
42238 7684706 5852396 4077884 2537654 1745323 2042152 3254740 4898951 6547399
42230 6547399 7971910 9167858 10394942 12043299 14263141 16741498 18921570 20389125
42222 20389125 21007789 20840634 20133878 19326612 18844842 18751134 18634203 17919878 16344834
42213 16344834 14190796 12103113 10650414 9979381 9823073 9785676 9604953 9220973 8697426
42204 8697426 8061357 7138100 5614456 3456567 1261085 -65385 -103814 791489 2129528
42195 2129528 3935541 6451490 9326610 11530251 12193279 11307035 9509392 7427182
42187 7427182 5392273 3610617 2341929 1882960 2458098 4095314 6535909 9304630
42179 9304630 11942070 14158670 15762895 16558323 16422290 15441420 13876673 12020799 10161304
42170 10161304 8620816 7668273 7309889 7230946 7048693 6692701 6558963 7241422 9000939
42161 9000939 11425258 13648017 14981868 15381834 15345864 15468988 16120106 17374213 19017125
42152 19017125 20581034 21570403 21825978 21654946 21515904 21560298 21502677 20900299 19508986
42143 19508986 17419867 14975807 12595025 10578786 8989663 7725036 6754933 6256851
42135 6256851 6459739 7396732 8902905 10816518 13012261 15181896 16772162 17355907 17053889
42126 17053889 16435768 15967882 15659953 15280495 14790978 14450571 14510996 14886045 15158633
42117 15158633 14911311 14033090 12682421 10989628 8923422 6527098 4174126 2411386
42109 2411386 1531934 1403111 1699949 2184141 2773075 3514730 4546037 5917470 7382673
42100 7382673 8506949 9078264 9282224 9383811 9398949 9223555 8935311 8765177 8863793 9307987
42090 9307987 10278685 11988715 14391018 17103914 19635182 21576891 22690612 23082103
42082 23082103 23315615 24053833 25403086 26765299 27476852 27469340 27182304 26987959 26925684
42073 26925684 26955430 27245284 28102440 29661751 31662647 33514922 34619953 34698604 33857483
42064 33857483 32415524 30766839 29373714 28667866 28774358 29368128 29918165 30090192 29911232
42055 29911232 29642367 29559166 29743732 29954990 29759185 28928412 27703966 26578354 25861229
42046 25861229 25569556 25682475 26310207 27556580 29333069 31367833 33333489 34963354
42038 34963354 36155984 37012218 37676980 38083324 37918621 36910724 35137864 33069904 31366225
42029 31366225 30588081 30914789 32010881 33253335 34228447 35007701 35876101 36845797 37563264
42020 37563264 37701824 37321883 36777143 36348378 36071123 35883657 35784225 35734038 35471694 34605230
42010 34605230 33012097 31117150 29656195 29083936 29208131 29418737 29264039 28780283 28273585
42001 28273585 27871925 27423151 26866175 26543333 26937896 28101619 29545181 30801604 31961715
41992 31961715 33521363 35796547 38618515 41494725 43877304 45340595 45752941 45356204
41984 45356204 44548594 43558252 42435846 41310862 40410375 39767884 39155489 38451089 37896966
41975 37896966 37818553 38185780 38581025 38504277 37632010 35981067 34033152 32564749 32094720
41966 32094720 32525531 33480722 34843564 36660635 38604750 39972437 40367438 40084214 39622128
41957 39622128 39070775 38234631 37203653 36485141 36538014 37317748 38264091 38641047 37990696
41948 37990696 36460606 34698696 33284100 32238720 31183838 29926911 28733038 28016491
41940 28016491 27931664 28324500 28965010 29766362 30856163 32447736 34534342 36718860 38535248
41931 38535248 40006121 41670574 43883252 46225108 47821384 48176342 47508053 46364303
41923 46364303 45230705 44559032 44816108 46199022 48397120 50860690 53275851 55602123
41915 55602123 57692278 59149378 59701225 59572990 59307669 59238177 59268155 59181575 59014085
41906 59014085 58986580 59119291 59085458 58562221 57690953 57106100 57508284 59238617 62170989
41897 62170989 65813240 69448267 72376038 74264153 75298341 75880474 76147948 75843500
41889 75843500 74642391 72548702 70032641 67911335 67042855 67866976 70046532 72614862
41881 72614862 74629456 75765283 76365862 77096523 78610586 81307982 85067829 89132868
41873 89132868 92478232 94525378 95552941 96390017 97713651 99613377 101719079 103641769
41865 103641769 105298710 106905393 108727775 110851315 113147233 115399029 117426212 119123925
41857 119123925 120476140 121597601 122751945 124267748 126380355 129120679 132326565 135724796
41849 135724796 138991426 141803901 143981483 145681983 147415090 149713019 152699367 156006455
41841 156006455 159136146 161844656 164146345 166044028 167395395 168069944 168174254 168095791
41833 168095791 168327875 169179019 170521591 171771865 172193540 171343501 169327136 166719876
41825 166719876 164294637 162734649 162397765 163206539 164791768 166850703 169411531 172735949
41817 172735949 176975771 181949244 187210652 192254421 196656295 200150638 202705666 204534536
41809 204534536 205972348 207332763 208903683 210998837 213833357 217255902 220685686 223429416
41801 223429416 225085458 225666256 225464241 224915419 224515149 224696116 225746654 227881054 231272851
41792 231272851 235813517 240850642 245421630 248920406 251475055 253611494 255647405 257490553
41784 257490553 258933896 260043130 261265725 263136321 265761822 268625333 271115122 273293068
41776 273293068 275871339 279290394 283121572 286670851 289935090 293529615 297710690 301861388
41768 301861388 305017738 306616367 306694010 305725656 304459734 303631994 303545520 303976672 304582991
41759 304582991 305261299 306013528 306682188 307059523 307188378 307377704 307948856 309062626 310694572
41750 310694572 312606180 314359770 315512865 315872460 315580551 315007152 314536230 314288677 313958133
41741 313958133 313029553 311255957 308832153 306046487 302922665 299323597 295256261 290923318
41733 290923318 286619902 282754630 279792828 277861464 276430243 274665522 272194383 269402998
41725 269402998 267008943 265507407 264973538 265092840 265241701 264727873 263160944 260616231
41717 260616231 257458073 254103092 250935426 248256718 246194259 244712256 243738314 243181826
41709 243181826 242813631 242280638 241335894 239975890 238297588 236315720 233978373 231252440
41701 231252440 228103788 224485163 220464196 216336059 212535453 209461974 207423571 206650141
41693 206650141 207210452 208875242 211121569 213322313 214959539 215704015 215362546 213837853
41685 213837853 211233256 208012200 204920893 202579115 201113490 200264353 199827803 199867728
41677 199867728 200486855 201550144 202738426 203810374 204751817 205740216 207036783 208854385
41669 208854385 211214650 213874112 216383742 218268019 219279242 219596906 219726035 220051463
41661 220051463 220480771 220630899 220337515 219825471 219394759 219155250 219121681 219326770 219676533
41652 219676533 219855491 219563691 218768753 217599238 216117603 214397077 212760100 211714639
41644 211714639 211574083 212186195 213001475 213351474 212782111 211328411 209512848 207960437 206932807
41635 206932807 206221151 205450892 204463563 203461881 202822596 202695758 202743361 202357434 201176078
41626 201176078 199279211 196876269 194053227 190976176 188083443 185756012 183891631 182082648
41618 182082648 180136820 178111556 175873147 173006156 169288334 164998263 160646186 156644861
41610 156644861 153342484 151050391 149745284 148894138 147855648 146446457 144971534 143755030
41602 143755030 142771219 141661161 139967491 137427710 134224489 130950258 128183959 126063560
41594 126063560 124312890 122604118 120752477 118605620 115970632 112792214 109356574 106222331
41586 106222331 103881348 102399206 101310736 99903313 97725776 94897877 91924644 89217791
41578 89217791 86829869 84639641 82718877 81435944 81154844 81834412 82973073 83993331
41570 83993331 84653660 85043241 85261927 85279519 85126083 85018980 85149319 85426405 85562309
41561 85562309 85356855 84792625 83921559 82817182 81623448 80490591 79417980 78271494
41553 78271494 77008607 75808522 74939544 74564634 74696621 75228718 75904814 76315634 76078994
41544 76078994 75129469 73840272 72806235 72412810 72516646 72509621 71761560 70127505 68110707
41535 68110707 66503709 65749547 65557782 65169296 64083749 62549358 61303638 60859955 61122571
41526 61122571 61657765 62165223 62599441 62962254 63134455 62894414 62013844 60363827 58019785
41517 58019785 55271378 52498385 50069959 48364777 47726600 48216084 49429814 50729129
41509 50729129 51719845 52483790 53386413 54737354 56566928 58565254 60224077 61188328 61543492
41500 61543492 61699725 61997702 62525387 63288452 64348064 65669317 66956044 67798397 67996676
41491 67996676 67705128 67302801 67153509 67406102 67931462 68452641 68757694 68775911 68513792
41482 68513792 68082248 67839558 68330609 69890296 72305876 74939917 77126007 78365120
41474 78365120 78275105 76641733 73660490 70018865 66581582 63939220 62242670 61385420
41466 61385420 61219812 61547497 61988466 62035522 61370053 60126605 58787517 57823523 57473174
41457 57473174 57781341 58658821 59853409 61033460 62040246 62993575 64075016 65320152
41449 65320152 66733407 68459488 70612106 72973251 75094049 76732226 78002128 79045009
41441 79045009 79762332 79998466 79802333 79289349 78296727 76369294 73145936 68726593 63729899
41432 63729899 59103225 55797062 54361934 54677354 56099693 57985193 60130267 62730269
41424 62730269 65945444 69523529 72833892 75278702 76708479 77452472 77936340 78290565
41416 78290565 78355692 78005575 77336393 76511109 75557014 74449156 73340472 72548594 72263054
41407 72263054 72358060 72560627 72751197 73047808 73659948 74752929 76423329 78675414 81357580
41398 81357580 84189000 86934904 89558038 92154045 94732159 97092165 98931443 100055722
41390 100055722 100480406 100368418 99934909 99430912 99143187 99289871 99873869 100709978 101660220
41381 101660220 102791487 104226567 105902950 107621697 109319026 111079213 112764987 113835808
41373 113835808 113842891 113161182 113009525 114548042 117938584 122293089 126417238 129515281 131345542
41364 131345542 132039085 131951349 131562310 131292682 131338652 131728803 132522557 133845452 135686083
41355 135686083 137739121 139529286 140680269 141050393 140692317 139795065 138675196 137743995
41347 137743995 137422693 138055483 139818532 142597094 145924777 149137823 151719226 153603015
41339 153603015 155225865 157266870 160164031 163688026 166982821 169182301 170075590 170130810
41331 170130810 169896628 169520203 168859602 167853061 166631635 165413766 164481184 164180653 164734213
41322 164734213 166024769 167690955 169402467 170887487 171739152 171482966 170003060 167783396
41314 167783396 165588040 163947834 163006830 162716441 162977345 163598637 164289020 164788279 164980205
41305 164980205 164849481 164361716 163427761 162002683 160213491 158339921 156588884 154859331
41297 154859331 152786543 150073616 146773831 143257806 139989702 137387003 135784825 135327103
41289 135327103 135782192 136525485 136834789 136301063 134996047 133254850 131302908 129103239
41281 129103239 126553593 123772160 121127207 118995697 117544980 116727865 116375847 116228587
41273 116228587 115943344 115202491 113886703 112178093 110511576 109359058 108905343 108848249 108603791
41264 108603791 107828615 106719328 105713484 104942969 104121638 102980551 101657544 100558929
41256 100558929 99928262 99680831 99642579 99824284 100398536 101456129 102833305 104143501 104929552
41247 104929552 104846815 103866536 102399764 101103442 100331110 99688704 98272990 95507221 91741754
41238 91741754 87980778 85087013 83350055 82735623 83297808 85196699 88384408 92399590
41230 92399590 96498903 99977039 102384794 103476530 103002619 100694058 96618997 91556492
41222 91556492 86818841 83528053 82059725 82195939 83651049 86263180 89745034 93513564
41214 93513564 96902666 99471982 101071979 101746137 101696713 101272662 100824262 100513231 100301856
41205 100301856 100103066 99851260 99415795 98555767 97072077 95036168 92871642 91223591
41197 91223591 90703228 91605923 93700881 96238410 98263639 99101795 98704183 97636098 96763149
41188 96763149 96870363 98400416 101355040 105338991 109736979 113979126 117751237 120994470
41180 120994470 123719402 125865142 127382941 128431003 129402786 130710246 132544455 134840406
41172 134840406 137420043 140149418 143029312 146197985 149785970 153664268 157368993 160436738
41164 160436738 162897032 165346562 168447552 172406859 177023504 182145474 187865264 194207862
41156 194207862 200804045 207057213 212625361 217641404 222491822 227526238 233010661 239171438
41148 239171438 246070535 253422007 260652877 267201118 272740443 277195487 280706596 283600356
41140 283600356 286190099 288442543 289933207 290291223 289646621 288505974 287250853 285940381
41132 285940381 284553052 283132385 281590063 279609950 276954512 273739988 270227328 266460876
41124 266460876 262342119 257983480 253683906 249467189 244861349 239289461 232594215 225110451
41116 225110451 217355687 209771229 202655044 196149896 190262253 184975079 180334650 176334889
41108 176334889 172724040 169063156 165066675 160823375 156579508 152322370 147701985 142428916
41100 142428916 136666525 130920676 125578259 120690878 116215706 112272657 109025904 106440513
41092 106440513 104355073 102743644 101676385 100969391 100064715 98386796 95752168 92407663
41084 92407663 88828656 85571834 83129567 81656530 80795902 79894396 78443938 76342173
41076 76342173 73875459 71592002 70073412 69552873 69668616 69728801 69280407 68319932 66960422
41067 66960422 65135066 62807305 60352537 58508089 57892241 58608373 60233532 62063596
41059 62063596 63445546 64124977 64403183 64846491 65695781 66556049 66717150 65758897 63816991
41050 63816991 61351071 58797760 56456345 54544521 53189474 52323252 51652415 50812286
41042 50812286 49630050 48317968 47436651 47585264 48973939 51181139 53305057 54423634
41034 54423634 54067852 52447156 50319936 48559158 47656226 47532301 47814738 48266975 48906150
41025 48906150 49777854 50803578 51929734 53297862 55123754 57434239 60007049 62527545
41017 62527545 64713610 66343982 67324301 67765719 67890377 67791729 67331718 66300612 64634066
41008 64634066 62470501 60074796 57748824 55765360 54332791 53601378 53638237 54299245 55137433
40999 55137433 55577037 55283446 54370685 53282515 52554682 52634097 53678361 55361520 56984629
40990 56984629 57961869 58202489 57955985 57405700 56617445 55857295 55693656 56594216 58447235
40981 58447235 60563462 62172176 62946274 63118522 63138313 63235646 63348866 63435975 63659755
40972 63659755 64094928 64361503 63817358 62167871 59701427 56893522 54037658 51407783
40964 51407783 49508579 48791678 49092946 49558377 49201786 47496186 44557918 41034385 37868187
40955 37868187 35903498 35457934 36242767 37740365 39608214 41686504 43741243 45366604
40947 45366604 46160888 45926178 44705854 42738750 40438881 38319509 36729969 35527615
40939 35527615 34070307 31734653 28567886 25370293 23040675 21864973 21473329 21338418
40931 21338418 21122786 20631066 19757707 18642127 17694087 17272422 17398068 17888443 18660516
40922 18660516 19729745 20974283 22102842 22885192 23286388 23373149 23252763 23165570 23485380
40913 23485380 24471583 26018006 27694927 29026713 29727055 29748482 29203486 28267602 27143709
40904 27143709 26099397 25487640 25646854 26717715 28528191 30631675 32470706 33614104
40896 33614104 33970922 33803985 33485747 33236492 33100973 33040909 32862177 32101339 30282514
40887 30282514 27477741 24505519 22411540 21752213 22368708 23630714 24709434 24817371
40879 24817371 23619616 21584342 19738056 18892269 19128381 20022976 21161164 22264762
40871 22264762 22967278 22772204 21378262 18998254 16312352 14112534 12925354 12825106
40863 12825106 13505633 14547231 15675109 16793179 17793461 18380987 18131646 16747389
40855 16747389 14280861 11146062 7924111 5123497 3051371 1823447 1418587 1689453
40847 1689453 2346763 3003954 3322771 3193567 2814996 2568578 2728022 3218676 3659945
40838 3659945 3683523 3231798 2550656 1926840 1487922 1258397 1331459 1910291 3189023 5238852
40828 5238852 7985651 11198586 14449139 17165798 18874511 19455784 19142340 18243099 16895985
40819 16895985 15098587 12914677 10570613 8347713 6451173 5036343 4325118 4573281
40811 4573281 5787489 7435073 8558900 8400664 7056057 5493261 4819301 5445215 6902827
40802 6902827 8389327 9450409 10217557 11108983 12328303 13595247 14340923 14184118 13186946
40793 13186946 11606031 9485692 6670258 3235088 -286067 -3244467 -5366884 -6783343
40785 -6783343 -7628635 -7770269 -6957739 -5165275 -2792033 -583623 732292 969417 772430
40776 772430 1265669 3202731 6347217 9657485 12065233 13144574 13232593 13104236 13516547
40767 13516547 14829173 16814474 18761842 19882394 19800887 18789633 17549763 16713608
40759 16713608 16498279 16783107 17429681 18425630 19715432 21019138 21941437 22251261 21975815
40750 21975815 21222793 20000034 18244123 15952574 13234682 10298793 7475575 5211841
40742 5211841 3906527 3676436 4288441 5300426 6226049 6653713 6447491 5973158 5984930
40733 5984930 7053343 9060583 11349363 13327171 14783441 15682472 15942097 15544748 14647788
40724 14647788 13394045 11776429 9915112 8323302 7550851 7522402 7502145 6829554 5508481
40715 5508481 3989620 2605455 1422114 510560 101521 413083 1402281 2688076 3697283
40706 3697283 3970960 3415806 2239553 678862 -1015238 -2257282 -2101487 75178 3835688
40697 3835688 7865818 10968157 12772966 13567298 13772109 13735907 13764348 14014741 14349054
40688 14349054 14475628 14288659 13972023 13728706 13481618 12920305 11860044 10516378 9353651
40679 9353651 8624151 8115496 7431201 6476913 5554934 4990866 4801311 4750778 4584338 4131047
40669 4131047 3331653 2330796 1494840 1181777 1438661 1961151 2355459 2431037 2282879
40660 2282879 2143595 2164663 2349254 2708063 3404106 4619200 6291323 8132373 9927498
40651 9927498 11643982 13179179 14208296 14466376 14088412 13534345 13273132 13650634 14876573
40642 14876573 16849656 19007984 20580668 21062411 20412943 18971324 17419356 16682929
40634 16682929 17408849 19340837 21414956 22606549 22573234 21524231 19847287 18069634
40626 18069634 16860932 16658434 17286523 18148901 18772707 19033472 18965407 18605298 18040929
40617 18040929 17439377 16982519 16841387 17142714 17824095 18596632 19249433 19976910 21202757
40608 21202757 23028620 24985424 26340269 26524955 25325292 22930092 19905317 16911538
40600 16911538 14269690 11892486 9725696 8083233 7351337 7444923 7763796 7702456 7087642
40591 7087642 6139627 5158780 4291958 3501893 2711764 2026376 1800437 2378665 3714968
40582 3714968 5321290 6661899 7577837 8315858 9237796 10599310 12545582 15103708 18001569
40573 18001569 20519529 21718224 21016783 18637950 15489817 12608069 10674918 9910211
40565 9910211 10173651 11056772 12023435 12692905 13054631 13339064 13689716 14076906 14538763
40556 14538763 15315127 16571552 18049307 19171917 19556160 19320867 18835959 18258415 17425521
40547 17425521 16183611 14706418 13422402 12651832 12347082 12166136 11759173 10994692 9979025
40538 9979025 8924987 8002211 7257530 6638188 6102833 5720536 5615908 5764333 5873269
40529 5873269 5559281 4678772 3447344 2248424 1422635 1248976 1927051 3361792 5007475
40520 5007475 6147008 6417658 5973952 5141136 4114262 3104315 2560272 2946485 4276695
40511 4276695 6043182 7642091 8742676 9251722 9153921 8557668 7799702 7324450 7423179
40502 7423179 8113491 9186720 10264782 10880256 10702995 9795596 8601621 7633537 7177987
40493 7177987 7261118 7775237 8577606 9557457 10721902 12203305 14095812 16274412 18434634
40484 18434634 20304180 21728940 22543110 22509789 21549914 19996984 18450841 17298982 16469922
40475 16469922 15715942 15007058 14483326 14083813 13464153 12379615 10995138 9679762 8605905
40466 8605905 7733025 7127250 7045441 7597085 8467586 9110266 9151278 8519496 7276465 5492888
40456 5492888 3293605 859975 -1707837 -4464207 -7470220 -10586186 -13460125 -15725599
40448 -15725599 -17197751 -17893763 -17895032 -17215913 -15840724 -13914508 -11859845 -10212950 -9281570
40439 -9281570 -8969203 -8951433 -9008803 -9172231 -9555697 -10067754 -10324986 -9933936 -8930448 -7889936
40429 -7889936 -7469007 -7794122 -8377355 -8645184 -8432484 -7927967 -7333827 -6765631 -6373429
40420 -6373429 -6286194 -6371251 -6233273 -5579799 -4522338 -3450240 -2674148 -2252426 -2091786
40411 -2091786 -2108776 -2272366 -2510598 -2582874 -2100310 -792334 1193983 3329228 5083482
40402 5083482 6215294 6671768 6372670 5285091 3692652 2213021 1444586 1609206 2520084
40393 2520084 3794279 5046098 5963502 6339430 6118322 5446128 4679221 4301589 4742584
40384 4742584 6187720 8513895 11370375 14300777 16837450 18623916 19597224 20075582
40376 20075582 20545409 21226869 21838752 21877556 21155823 19982395 18758918 17490030 15818977
40367 15818977 13542532 10998869 8933249 8030085 8520015 10080296 12043118 13787881
40359 13787881 15024938 15710451 15734646 14832104 12861732 10074035 7009085 4187478 1967384
40350 1967384 605603 289101 1059898 2763535 5081233 7578794 9747275 11081703
40342 11081703 11226343 10187507 8533352 7309211 7440021 8952955 10830864 11818301
40334 11818301 11419904 10085965 8579188 7410129 6865784 7227353 8640066 10788923
40326 10788923 12927584 14368398 14926104 14826918 14221922 12926706 10731185 7868383 4982666
40317 4982666 2610217 864762 -316061 -857787 -676558 59996 1083386 2382984 4157949
40308 4157949 6422058 8907971 11380492 13762765 15857331 17217482 17495418 16753442
40300 16753442 15257880 13136597 10489362 7751961 5657442 4733279 4941101 5833481
40292 5833481 6935726 7908060 8450845 8249803 7160258 5468649 3860751 2978760 2958986
40283 2958986 3441654 4001729 4475453 4908632 5378244 5940170 6616216 7348275 8072288
40274 8072288 8879790 9916378 10981006 11395860 10517504 8376257 5703224 3390575 2015725
40265 2015725 1715483 2229827 3050687 3755717 4294986 4863096 5499650 5950198 5907608 5227092
40255 5227092 3910499 2099011 157258 -1441243 -2475514 -3132705 -3694046 -4151051 -4225479
40246 -4225479 -3665608 -2402494 -519081 1740423 3938894 5608395 6542526 6874795 6831813
40237 6831813 6473347 5732535 4669743 3592571 2869608 2635339 2712639 2816957 2773633
40228 2773633 2518406 2006963 1278136 579931 235091 272862 300870 -136972 -1130368 -2413960
40218 -2413960 -3695804 -4772087 -5325395 -4858824 -3020989 46795 3784790 7586085
40210 7586085 11003969 13685699 15348893 15953916 15782332 15168104 14148344 12513209 10248701
40201 10248701 7823651 5948458 5098731 5332531 6457647 8167940 9988139 11317317
40193 11317317 11769350 11492336 11045769 10945621 11377297 12259000 13350276 14206555 14227192
40184 14227192 12999690 10628371 7642516 4647987 2206776 937478 1346336 3317282
40176 3317282 5901925 7847299 8381200 7494046 5651210 3416453 1215173 -841336
40168 -841336 -2946868 -5224149 -7334942 -8674824 -9008172 -8689707 -8173463 -7571160 -6906444
40159 -6906444 -6573980 -7157940 -8744453 -10647375 -11923247 -12073780 -11246139 -9907698 -8416895
40150 -8416895 -6832877 -5056806 -3161948 -1581949 -905549 -1417930 -2807219 -4287428
40142 -4287428 -5026507 -4592083 -3148884 -1264824 547472 2159273 3740596 5425817
40134 5425817 7107952 8479073 9172149 8935609 7848537 6397783 5192247 4492460 4063019
40125 4063019 3520129 2729156 1770220 593617 -1087437 -3423838 -5984342 -7845842 -8292955
40116 -8292955 -7471570 -6284544 -5605683 -5633169 -5980385 -6216702 -6180796 -5877119 -5301861 -4447141
40106 -4447141 -3376587 -2234542 -1212140 -488693 -120960 26191 162795 350526 434674
40097 434674 216856 -320792 -938710 -1252253 -974167 -130540 974678 2054283 3030723
40088 3030723 3850068 4213866 3729997 2387736 720014 -613380 -1334700 -1605779 -1705762
40079 -1705762 -1766477 -1769563 -1670120 -1453480 -1068619 -360641 793825 2169885 3102064 2946606
40069 2946606 1747599 343049 -284317 274614 1772897 3759224 5937640 8114412
40061 8114412 9978806 11109458 11278641 10732472 10073705 9800153 10004866 10558403 11425795
40052 11425795 12614043 13900935 14911630 15541164 16078409 16786142 17532857 17997146 18110699
40043 18110699 18112451 18193702 18212917 17760311 16458532 14253844 11469579 8535736 5657055
40034 5657055 2825845 133633 -2127820 -3760596 -4889020 -5780666 -6595371 -7447750 -8542028
40025 -8542028 -10000069 -11598052 -12854248 -13364753 -12953464 -11607135 -9481574 -6962125
40017 -6962125 -4533937 -2531838 -1052792 -21234 772068 1566569 2352093 2748514 2382579
40008 2382579 1367677 222107 -626340 -994188 -658430 664548 2872019 5313105 7366267
39999 7366267 9041470 10759964 12622943 14153961 14765797 14271102 12884866 10904686
39991 10904686 8512066 5815287 2981406 322482 -1728086 -2789750 -2794390 -2100382 -1256985
39982 -1256985 -550630 208625 1369838 2918806 4386105 5308587 5659291 5760835 5933151
39973 5933151 6359248 7124788 8121033 8957038 9251363 9067274 8828116 8715003 8366395
39964 8366395 7319326 5590702 3673612 2090927 1118662 842986 1262907 2286230 3702178
39955 3702178 5178126 6310576 6823128 6810987 6684611 6761205 7008911 7297135 7730407
39946 7730407 8487737 9388707 9884327 9528966 8274661 6274589 3646127 575171 -2529085
39937 -2529085 -5211841 -7277565 -8783269 -9766405 -10135842 -9861602 -9149557 -8340314 -7658486
39928 -7658486 -7089305 -6461856 -5610893 -4494221 -3251949 -2219513 -1838071 -2411075 -3832141
39919 -3832141 -5561654 -6961521 -7702884 -7845963 -7576612 -6985039 -6138042 -5243602 -4604203
39910 -4604203 -4400543 -4567149 -4833678 -4820073 -4185212 -2876743 -1250204 265843 1725686
39901 1725686 3689519 6483869 9573861 11967941 13234578 13813530 14255359 14511622 14226306
39892 14226306 13443441 12619908 12041932 11660505 11537553 12000326 13116116 14348466 15082899
39883 15082899 15321083 15506204 15740154 15529403 14331692 12041942 8883424 5198379 1596216
39874 1596216 -975774 -1756600 -851715 798051 2180131 2850602 2893371 2522336 1867875
39865 1867875 1007539 8788 -1072296 -2159857 -3150114 -4013318 -4878984 -5903239 -6997153
39856 -6997153 -7751549 -7723197 -6829621 -5445316 -4088250 -3008476 -2083096 -1073975 92271
39847 92271 1318867 2484712 3444490 3940837 3766501 3132933 2690610 2966691 3852147
39838 3852147 4834098 5656442 6476127 7359968 7970224 7949399 7385014 6613961 5669790 4202128
39828 4202128 1940046 -987457 -4195506 -7247587 -9617389 -10701516 -10166593 -8321394
39820 -8321394 -6016153 -4087101 -2853709 -2080885 -1378444 -678237 -380584 -1015304 -2700475
39811 -2700475 -4917737 -6840142 -7900630 -8070501 -7638328 -6772208 -5333585 -3131387 -318264
39802 -318264 2551297 4882872 6367668 6881106 6198930 4064750 622767 -3343087 -6712772
39793 -6712772 -8593171 -8691019 -7372028 -5468401 -3859729 -3001965 -2787831 -2862269 -2989293
39784 -2989293 -3071219 -2982374 -2601999 -1990892 -1347117 -730037 63787 1313423 3142936
39775 3142936 5458027 7943840 10062877 11245143 11311214 10732854 10357641 10809354 12142325
39766 12142325 13987358 15880955 17410137 18175041 17810396 16168612 13505548 10442663
39758 10442663 7666338 5585125 4228220 3419496 2958196 2585218 1886009 436232 -1857642
39749 -1857642 -4639042 -7395703 -9815329 -11800032 -13262899 -14104379 -14375837 -14267991 -13853055
39740 -13853055 -12966468 -11444423 -9399777 -7185733 -5165317 -3583487 -2546229 -1981137
39732 -1981137 -1674204 -1478036 -1444106 -1621743 -1772897 -1453233 -387716 1359221 3562637
39723 3562637 6002888 8424008 10520660 12074656 12992093 13141881 12308368 10422477 7728490
39714 7728490 4599567 1281413 -2059681 -5141262 -7606962 -9255406 -10099590 -10214760
39706 -10214760 -9651728 -8496944 -6897931 -5009149 -2997316 -1088889 510916 1790459
39698 1790459 2953428 4247143 5822004 7730824 9931034 12225656 14285421 15811210
39690 15811210 16667926 16861882 16456545 15542900 14231190 12623230 10832417 9076645 7722106
39681 7722106 7166137 7607570 8852991 10311283 11273637 11362363 10750719 9862420 8855917
39672 8855917 7540969 5840162 4133409 2952483 2412111 2153396 1866554 1686574 1978010
39663 1978010 2829649 3858287 4477001 4327652 3535872 2623895 2131425 2241925 2761996
39654 2761996 3423302 4069986 4505427 4367378 3415600 1909467 436180 -729799 -1915216
39645 -1915216 -3593459 -5813248 -8221573 -10477330 -12393268 -13753621 -14309542 -14055951
39637 -14055951 -13317057 -12437137 -11514816 -10535938 -9604553 -8835002 -8050160 -6785045 -4694098
39628 -4694098 -1924282 945381 3327270 5019277 6254833 7415437 8690239 9964164
39620 9964164 10949282 11367645 11070011 10121062 8835974 7675595 7040326 7143603 8006565
39611 8006565 9433446 10970356 12063648 12428480 12251033 11957799 11827347 11891224 12121964
39602 12121964 12536354 13059333 13386203 13082473 11866558 9844285 7511972 5497200 4195545
39593 4195545 3576199 3304934 3048283 2687798 2299294 1954212 1528123 720452 -678989
39584 -678989 -2535420 -4429410 -5958955 -6909225 -7163265 -6620892 -5281465 -3284147 -791235
39575 -791235 2043917 4923828 7418022 9322299 10893796 12519430 14221765 15707135
39567 15707135 16846467 17848798 18941585 20124025 21287531 22318141 22946754 22735080
39559 22735080 21458774 19437433 17313494 15528438 14105958 12850844 11584079 10203154
39551 10203154 8696742 7200626 5994461 5382595 5539629 6408494 7710306 9118563
39543 9118563 10510508 12020563 13755917 15470674 16640057 16923031 16498273 15893753 15545065
39534 15545065 15597984 16064305 16945772 18074198 18963623 19056076 18160052 16519483 14450559
39525 14450559 12110008 9686192 7552141 5963592 4706133 3309846 1628277 32248
39517 32248 -945181 -970807 15338 1769433 3694873 5109490 5790548 6155701 6774882
39508 6774882 7794100 8900126 9655208 9691736 8728736 6657743 3641428 29341 -3785529
39499 -3785529 -7360635 -10195960 -11939498 -12599368 -12436616 -11673790 -10394381 -8641318 -6464731
39490 -6464731 -3926588 -1205270 1369086 3570042 5529536 7520179 9453828 10792570
39482 10792570 11039276 10198370 8727442 7185732 5955816 5098422 4343172 3348313 2106881
39473 2106881 1032337 566425 792045 1488494 2396262 3259714 3746195 3606542 2960198
39464 2960198 2218004 1608516 891535 -340868 -2124879 -3980717 -5294146 -5774307 -5560660
39455 -5560660 -5016213 -4521572 -4415857 -4963143 -6248407 -8106051 -10175956 -11995058 -13055644
39446 -13055644 -12977410 -11844449 -10329005 -9226116 -8754832 -8458624 -7868771 -7081856 -6532258
39437 -6532258 -6369143 -6325729 -6163352 -5978429 -5995031 -6234392 -6482321 -6454776 -5922427 -4821547
39427 -4821547 -3384204 -2081783 -1293651 -1019571 -953526 -780987 -372353 164673 457422
39418 457422 -24864 -1596400 -3998355 -6510038 -8451043 -9501488 -9559556 -8477003 -6061621
39409 -6061621 -2298873 2440509 7305459 11097790 12804307 12301121 10519432 8722421
39401 8722421 7563797 6903999 6435219 6255804 6796788 8364602 10822413 13567100 15743951
39392 15743951 16667428 16234301 14912613 13244271 11417397 9408072 7429379 6026689
39384 6026689 5669102 6337890 7546935 8682880 9288206 9115493 8059857 6130710 3492124
39375 3492124 465449 -2584591 -5380676 -7716971 -9342306 -9969260 -9452173 -7896587
39367 -7896587 -5571649 -2808665 -2089 2484171 4575398 6521556 8453381 9970052
39359 9970052 10436026 9716468 8362975 6976698 5632916 4103824 2425457 957739
39351 957739 -22704 -485335 -384269 473295 2126351 4159713 5863404 6676333 6452647
39342 6452647 5435223 4112146 3007574 2367168 1938137 1173797 -195931 -1784995 -2815190
39333 -2815190 -2794409 -1918735 -820917 6461 500422 814667 943993 628561 -386445
39324 -386445 -2038617 -3912212 -5513149 -6581043 -7143978 -7329033 -7232297 -7026284 -7064198
39315 -7064198 -7648820 -8612803 -9268212 -8940894 -7570115 -5729426 -4108956 -3071112 -2645233
39306 -2645233 -2728734 -3152689 -3647143 -3934439 -3928888 -3773587 -3600352 -3259443 -2359980 -647038
39296 -647038 1644337 3831512 5195647 5371924 4424476 2697495 682329 -1068785 -2102253
39287 -2102253 -2268224 -1791567 -1136429 -761814 -878044 -1308162 -1612593 -1487313 -1083183
39278 -1083183 -863036 -1144159 -1873308 -2831879 -3900888 -5078772 -6405821 -7981117 -9934081
39269 -9934081 -12258293 -14741620 -17105048 -19054317 -20121660 -19733388 -17739434 -14775580
39261 -14775580 -11811168 -9362953 -7377531 -5767525 -4649662 -3980903 -3340572 -2274790
39253 -2274790 -612998 1682039 4628170 7897062 10645523 12097968 12272856 11862042
39245 11862042 11424746 10925179 9979009 8243034 5560752 2060351 -1732297 -5063792
39237 -5063792 -7404167 -8718916 -9342152 -9726714 -10277438 -11178315 -12275705 -13274706 -14128010
39228 -14128010 -15106742 -16428059 -17933378 -19176806 -19701842 -19219670 -17735725 -15626277
39220 -15626277 -13420323 -11321457 -9000612 -5981112 -2216836 1710189 4849980 6355224
39212 6355224 5977706 4334048 2577529 1570645 1310147 1158632 510916 -829007 -2694217
39203 -2694217 -4695296 -6364570 -7408024 -7874287 -7971093 -7753872 -7140656 -6175857 -5057077
39194 -5057077 -3887942 -2643929 -1481338 -862059 -1160919 -2223926 -3496209 -4585353
39186 -4585353 -5562575 -6676862 -7886459 -8766535 -8859989 -8067858 -6711645 -5283210 -4159462
39177 -4159462 -3483255 -3192006 -3078420 -2824464 -2047280 -451053 1898591 4398755 6161631
39168 6161631 6650686 6106417 5265186 4685345 4446285 4417012 4567091 4952849 5605358 6537991
39158 6537991 7698007 8815308 9498063 9632747 9505060 9319957 8763376 7315973 4935092
39149 4935092 2159420 -455361 -2758317 -4826042 -6594356 -7782490 -8073849 -7317941
39141 -7317941 -5657438 -3499919 -1271417 861597 3017135 5393479 8076360 10908978
39133 10908978 13382950 14748966 14491246 12762769 10249847 7645344 5398913 3881428
39125 3881428 3463048 4296572 6188106 8774363 11720113 14735039 17577558 20100833
39117 20100833 22169846 23564147 24186225 24354368 24563079 24832504 24591951 23402272 21546711
39108 21546711 19678085 18092925 16611578 14978859 13040172 10612118 7558933 4103104
39100 4103104 868870 -1464402 -2502524 -2261077 -1190668 -54689 477125 218397 -641811
39091 -641811 -1989186 -3905021 -6299439 -8666417 -10382020 -11167934 -11164233 -10631003 -9689134
39082 -9689134 -8306328 -6423181 -4071527 -1424108 1223787 3498829 5001127 5411273
39074 5411273 4642583 2883648 458204 -2295662 -4946905 -6905644 -7690623 -7358991 -6538593
39065 -6538593 -5894450 -5560583 -5126942 -4139246 -2559585 -768060 805591 1995891 2861614
39056 2861614 3426452 3586099 3303738 2781337 2327132 2098656 2069282 2192771 2445844 2667338
39046 2667338 2463158 1381473 -752282 -3601110 -6391068 -8338874 -9166897 -9225118 -9067280
39037 -9067280 -8969381 -8929352 -8976182 -9199250 -9450426 -9291598 -8423987 -7062472 -5730888 -4719993
39027 -4719993 -3834839 -2630281 -808194 1575661 4173730 6553517 8368611 9403101
39019 9403101 9580783 9045760 8189227 7433816 6939359 6622383 6469250 6622950 7017134
39010 7017134 7094791 6192535 4300379 2308326 1362176 1918750 3382713 4616844 4837301
39001 4837301 4131790 3239587 2907428 3420933 4563416 5801660 6511170 6277367 5179037
38992 5179037 3706739 2262605 788268 -1005725 -3125530 -5160962 -6599055 -7090860
38984 -7090860 -6477846 -4848983 -2662741 -575370 1026522 2208788 3128060 3710603 3896753
38975 3896753 4002749 4471427 5261610 5815547 5753692 5341572 5065834 4907874 4272379 2608637
38965 2608637 -24490 -2934845 -5178392 -6050886 -5481415 -4079882 -2718491 -1977577 -1952685
38956 -1952685 -2446741 -3146107 -3639340 -3545391 -2811310 -1810094 -1051496 -849145 -1262565
38947 -1262565 -2152075 -3145155 -3719094 -3560167 -2821509 -1892349 -1002844 -244808 133300
38938 133300 -190720 -1133000 -2078939 -2449209 -2284160 -2140721 -2540645 -3672754 -5493691
38929 -5493691 -7827332 -10292887 -12315899 -13383365 -13350977 -12548338 -11614499 -11141545 -11316834
38920 -11316834 -11844560 -12258790 -12342051 -12238279 -12220902 -12442892 -12885817 -13418127 -13849564 -14015500
38910 -14015500 -13875217 -13484985 -12853803 -11922576 -10761601 -9696809 -9087986 -8968975 -9009709
38901 -9009709 -8854747 -8394813 -7655692 -6550282 -4926326 -2897337 -992352 174656 425430
38892 425430 161376 -40111 61902 278532 307989 -10695 -766654 -2080465 -3913406
38883 -3913406 -5797829 -6966144 -6863468 -5499079 -3325138 -924516 1171785 2626931
38875 2626931 3494628 4174600 4941684 5527689 5342966 4096857 2021265 -495469 -3247821
38866 -3247821 -6122969 -8917692 -11410267 -13472416 -14979001 -15763649 -15844394 -15572450 -15329758
38857 -15329758 -15105526 -14559494 -13517310 -12259848 -11292833 -10912540 -10974925 -10988962 -10466960
38848 -10466960 -9313418 -7880908 -6559701 -5342244 -3898584 -2045762 -12057 1741468
38840 1741468 2829336 3116719 2797806 2352016 2240743 2515884 2776550 2552078 1682160
38831 1682160 358504 -1072880 -2348240 -3478771 -4744304 -6355562 -8076079 -9308414
38823 -9308414 -9611572 -9054946 -8104276 -7332568 -7186866 -7706501 -8337184 -8285866 -7258015
38814 -7258015 -5685462 -4127036 -2729085 -1480544 -657312 -576675 -1049376 -1516335 -1725101
38805 -1725101 -1895700 -2204053 -2534039 -2907422 -3786737 -5627587 -8262660 -10951197 -12978818
38796 -12978818 -14105016 -14557000 -14751414 -14957302 -15097410 -14889901 -14199445 -13140091 -11822540
38787 -11822540 -10218909 -8397421 -6655914 -5161276 -3576217 -1344118 1630992 4775508
38779 4775508 7297414 8636769 8501061 6815413 3882354 433916 -2756271 -5372708
38771 -5372708 -7595694 -9685807 -11655945 -13327710 -14522011 -15093139 -14907223 -13982488 -12663144
38762 -12663144 -11491438 -10798369 -10480421 -10253783 -10049693 -10033372 -10276944 -10578649 -10633922
38753 -10633922 -10250203 -9365979 -8039024 -6525978 -5218891 -4333609 -3754530 -3351740 -3338616
38744 -3338616 -4043814 -5317610 -6431329 -6700260 -6067495 -4998174 -3983250 -3285152 -2987367
38735 -2987367 -3040369 -3307350 -3792989 -4835776 -6844151 -9731887 -12760184 -15080564 -16388075
38726 -16388075 -16971130 -17215772 -17211076 -16829383 -16042488 -15065889 -14227957 -13750864 -13645979 -13781588
38716 -13781588 -14036056 -14382656 -14821419 -15251645 -15477286 -15397831 -15190279 -15245990 -15877748 -17067874
38706 -17067874 -18474405 -19625490 -20079604 -19473000 -17566329 -14358228 -10155226 -5484489
38698 -5484489 -931939 2929515 5543765 6504675 5860582 4298968 2887715 2466854 3200117
38689 3200117 4682774 6444167 8315984 10371152 12644613 15002524 17227655 19116852
38681 19116852 20474899 21104176 20887769 19908370 18493072 17137624 16315741 16247422 16800732
38672 16800732 17633598 18402746 18779949 18362651 16831609 14343731 11626959 9474722 8124547
38663 8124547 7191033 6115203 4555532 2464339 52901 -2271767 -4128995 -5406661
38655 -5406661 -6186696 -6474086 -6235064 -5733570 -5522267 -5913534 -6685659 -7532757 -8589701
38646 -8589701 -10192142 -12241818 -14186615 -15636693 -16646401 -17286520 -17272331 -16265246 -14388581
38637 -14388581 -12233860 -10420052 -9260436 -8736431 -8596100 -8485541 -8122158 -7390893 -6280838
38628 -6280838 -4820204 -3133588 -1459362 -1466 1172504 2007111 2349814 2121554 1527581
38619 1527581 925774 517644 339623 520209 1287924 2625033 4097525 5169374 5583380
38610 5583380 5352659 4567957 3443991 2469334 2197223 2734861 3545536 3867270 3305828
38601 3305828 2016295 432027 -1081548 -2388696 -3564358 -4756607 -5999896 -7133731
38593 -7133731 -7931450 -8290493 -8233425 -7724215 -6561572 -4503301 -1507249 2083797 5514694
38584 5514694 7871184 8646861 8246273 7810794 8309241 9717786 11138744 11699183 11267573
38575 11267573 10374115 9625253 9251746 9078995 8786869 8179286 7243040 6002212 4432489
38566 4432489 2612063 855514 -524123 -1630535 -2966619 -4863197 -7016367 -8702197
38558 -8702197 -9377230 -8981403 -7783462 -6154284 -4508897 -3261386 -2645480 -2542051 -2531242
38549 -2531242 -2173500 -1293872 -15718 1475576 3129788 4879747 6310350 6693038 5551543
38540 5551543 3188782 551229 -1433226 -2366467 -2392422 -1951767 -1576468 -1715103 -2522554
38531 -2522554 -3752396 -4915450 -5616683 -5787798 -5626906 -5335647 -4935891 -4346513 -3590647
38522 -3590647 -2859156 -2370564 -2216993 -2320614 -2458593 -2377935 -2063081 -1915740 -2439834 -3587779
38512 -3587779 -4582332 -4608163 -3610401 -2220844 -979175 117828 1316110 2661346 3979195
38503 3979195 5079618 5798003 5945755 5411533 4339606 3156880 2404334 2456192 3238883
38494 3238883 4199105 4730224 4750835 4755772 5195148 5920132 6373005 6207648 5521733 4530375
38484 4530375 3275610 1780397 347213 -467890 -193330 1283738 3712555 6618615
38476 6618615 9431387 11626865 12925581 13380091 13166885 12271282 10517318 7993612 5296365
38467 5296365 3154911 1870559 1300318 1306940 1910245 2934740 3857494 4287117 4440341
38458 4440341 4866518 5742044 6658369 7083947 6805072 5884559 4439131 2620510 682129
38449 682129 -1127793 -2731538 -4154515 -5264076 -5677089 -5037512 -3408024 -1321148 632209
38440 632209 2263663 3789108 5398993 6951581 8151508 8922341 9475628 10044644 10650468
38431 10650468 11103485 11130711 10525606 9315293 7826873 6491752 5531059 4902806 4583629
38422 4583629 4768790 5643355 6968185 8041354 8209593 7481428 6635750 6677408 8102595
38413 8102595 10608995 13442779 15970620 17945150 19369651 20267629 20583482 20165096 18774520
38404 18774520 16230578 12688159 8770548 5297141 2782184 1168050 1878 -1182876
38396 -1182876 -2598543 -4120436 -5351533 -5889988 -5741371 -5469862 -5734624 -6570511 -7276795
38387 -7276795 -7167355 -6330271 -5478915 -5141757 -5235428 -5418652 -5566467 -5734640 -5838461 -5580884
38377 -5580884 -4674337 -3056672 -984980 977479 2184279 2318253 1616689 621559 -265722
38368 -265722 -943756 -1449429 -1784163 -1859393 -1515439 -673050 421512 1242226 1516584 1673449
38358 1673449 2497761 4282456 6519344 8482429 9917016 11081764 12340810 13887790
38350 13887790 15727795 17727366 19693565 21481096 22975855 23958118 24133527 23399049
38342 23399049 21961372 20103322 17976670 15734221 13665818 11960778 10432560 8736434
38334 8736434 6853918 5169934 4092902 3790667 4244862 5255284 6296664 6642553 5859681
38325 5859681 4120881 1960285 -150020 -1910092 -3091287 -3554593 -3328823 -2536226 -1286060
38316 -1286060 268527 1888567 3442979 5075084 6972832 8986398 10662071 11659992
38308 11659992 11950503 11605835 10688621 9487314 8598234 8466652 8894374 9229736 9055806
38299 9055806 8533395 8089172 7980643 8223722 8737362 9391978 10001571 10411139 10561755
38290 10561755 10369350 9582696 7914269 5387180 2508396 29056 -1527914 -2183905
38282 -2183905 -2417791 -2751735 -3353472 -3987977 -4314078 -4188107 -3700943 -3027875 -2325033
38273 -2325033 -1720633 -1287552 -976439 -613932 -14007 867525 1834553 2491268 2451865 1588183
38263 1588183 67912 -1871632 -4131479 -6672522 -9283794 -11546489 -13070972 -13743831
38255 -13743831 -13747958 -13365183 -12728254 -11731234 -10227207 -8341574 -6480074 -4916255 -3474303
38246 -3474303 -1822989 -71414 1143505 1246822 264205 -1292053 -2913286 -4337123
38238 -4337123 -5405622 -5864391 -5363210 -3669651 -955900 2104759 4650330 6170983
38230 6170983 6772812 6947340 7163860 7612119 8069476 7887890 6337307 3234824 -784915
38221 -784915 -4741578 -7950052 -10075569 -10798093 -9844241 -7421244 -4323856 -1446990 699801
38212 699801 2015670 2655360 3026461 3700828 5006296 6675404 8025766 8487952 7921374
38203 7921374 6575445 4981078 3871590 3935717 5402114 7818752 10298663 12042980
38195 12042980 12706216 12380373 11352939 9941900 8507780 7450472 7014384 7062924 7149204
38186 7149204 6885209 6215274 5318688 4340035 3298656 2201756 1111095 45471 -1130486
38177 -1130486 -2644936 -4582991 -6663587 -8261998 -8742703 -7868128 -5928426 -3497387
38169 -3497387 -1084118 1016212 2648826 3680155 3965106 3414312 2104486 330242
38161 330242 -1476345 -2901504 -3663151 -3673926 -3096487 -2287996 -1516892 -667389 660039
38152 660039 2668078 5056795 7255415 8849580 9682598 9670623 8753529 7073549 5062532
38143 5062532 3263586 2080142 1661107 1913411 2581486 3391946 4198093 4992951 5781872
38134 5781872 6454987 6770120 6459800 5437809 3991088 2730166 2232665 2704503 4027658
38125 4027658 6057029 8668517 11458321 13622205 14426287 13879026 12816833 12215216 12407217
38116 12407217 12963803 13225280 12838413 11857679 10591986 9529729 9272853 10244405 12354408
38107 12354408 15086460 17987429 20955565 23991006 26846360 29115780 30619256 31561100
38099 31561100 32336182 33263857 34422873 35602495 36474595 36972294 37464643 38399873 39796378
38090 39796378 41236807 42339110 43075546 43674280 44423222 45556662 47065118 48531132
38082 48531132 49367931 49318987 48547587 47202378 45188849 42511247 39531567 36626134 33831173
38073 33831173 31167152 29125608 28365008 28884587 29892711 30672805 31347620 32620423 34913257
38064 34913257 37892955 40713979 42589319 43223366 42852342 41888037 40516058 38718214
38056 38718214 36685682 35009140 34272488 34498992 35134369 35566717 35563527 35239771 34787925
38047 34787925 34345233 34020843 33870201 33761463 33307865 32007447 29518586 25886396 21597087
38038 21597087 17432340 14159460 12199979 11507327 11738246 12494098 13376765 13959192 13941793
38029 13941793 13383864 12578076 11569350 9962240 7409646 4226244 1314247 -540045
38021 -540045 -1194656 -1067141 -768925 -870274 -1776267 -3579741 -5979496 -8374123 -10070207
38012 -10070207 -10539545 -9704418 -8054118 -6337172 -5015547 -4082089 -3461737 -3427080 -4406976
38003 -4406976 -6389700 -8671392 -10251490 -10422683 -9023650 -6335089 -2908933 566268
37995 566268 3486151 5626115 7236210 8739158 10261047 11464070 11848358 11192640 9710175
37986 9710175 7845817 5950292 4080817 2058893 -234773 -2582634 -4513002 -5720593
37978 -5720593 -6326543 -6623930 -6633663 -6048706 -4608181 -2436007 -55025 1822120 2601785
37969 2601785 2156047 955733 -256624 -993615 -1188107 -928533 -261180 711484 1794420
37960 1794420 2932137 4308504 5987062 7494495 7960875 6759736 4004571 463303
37952 463303 -2971362 -5803849 -8057951 -9948121 -11494621 -12541060 -13076746 -13299545 -13260352
37943 -13260352 -12662152 -11245162 -9297732 -7562451 -6600273 -6362487 -6392024 -6332520 -6212768
37934 -6212768 -6298635 -6676866 -6960713 -6475565 -4840677 -2363610 194001 2207645 3521445
37925 3521445 4334031 4940815 5562736 6226397 6693694 6548455 5411249 3113481 -224785
37916 -224785 -4156076 -7947827 -10795408 -12124531 -11799763 -10167963 -7924572 -5759159
37908 -5759159 -3932219 -2213808 -357890 1404210 2489306 2564997 1865422 867886 -219851
37899 -219851 -1601999 -3624709 -6398658 -9575624 -12421160 -14179418 -14468960 -13371924
37891 -13371924 -11217282 -8402134 -5447824 -3082688 -2064478 -2768628 -4867559 -7436455
37883 -7436455 -9525640 -10789940 -11585201 -12410456 -13295471 -13782793 -13409702 -12061162 -9901837
37874 -9901837 -7172442 -4132990 -1073061 1755730 4222288 6307207 8034503 9437357
37866 9437357 10611619 11828736 13531237 16028988 19098917 22020108 24146183 25353171
37858 25353171 25836511 25703566 25054558 24292193 23877248 23669669 22867208 20822666 17769801
37849 17769801 14649088 12406920 11516985 11860904 12811376 13585631 13762052 13431094 12806212
37840 12806212 11908577 10781688 9764589 9271976 9445653 10280309 11918707 14416139 17209029
37831 17209029 19217831 19699916 18870368 17596320 16616426 16101729 15757679 15152500 14004030
37822 14004030 12322330 10364229 8470296 6939003 5964220 5540528 5374698 4980972 3977037
37813 3977037 2354566 517688 -922670 -1479886 -1058154 45375 1403146 2710585
37805 2710585 3813262 4634013 5204755 5706340 6309800 6932928 7228196 6838219 5644641
37796 5644641 3829877 1794450 -18388 -1357844 -2299440 -3117044 -3995735 -4846720 -5336700
37787 -5336700 -5090951 -4010628 -2510928 -1345226 -1018569 -1385601 -1926668 -2336465 -2668577
37778 -2668577 -2971194 -3045188 -2631457 -1655708 -217369 1503865 3259951 4821195 6156511
37769 6156511 7377235 8363002 8568363 7410239 4880135 1702939 -1105693 -2834171
37761 -2834171 -3372003 -3114720 -2645560 -2443214 -2772314 -3686135 -4991877 -6255081 -7041460
37752 -7041460 -7261761 -7191562 -7102852 -7016441 -6920624 -7074763 -7853106 -9259301 -10739287 -11553126
37742 -11553126 -11332935 -10350899 -9351935 -9081748 -9781260 -10998462 -11911668 -11926095 -11035669
37733 -11035669 -9690670 -8395826 -7439119 -6906998 -6819972 -7157395 -7754735 -8279322 -8419270
37724 -8419270 -8115249 -7559169 -6974025 -6459424 -6027732 -5653447 -5221350 -4528655 -3443945
37715 -3443945 -2033363 -483199 1035533 2371434 3364997 3939457 4175456 4201754 4084205
37706 4084205 3957552 4194695 5224526 7132565 9594117 12235640 14864519 17222162
37698 17222162 18686045 18462298 16121511 11912735 6661804 1493637 -2480953 -4557787
37690 -4557787 -4745119 -3645133 -1954108 -98822 1663791 2986143 3473485 3004878 1907144
37681 1907144 745475 -94612 -708237 -1625038 -3376455 -5940516 -8565143 -10223618 -10314984
37672 -10314984 -8966741 -6804595 -4608038 -3115433 -2787959 -3457133 -4283457 -4366458 -3562653
37663 -3562653 -2661376 -2692377 -4051290 -6255380 -8442886 -10038722 -10969907 -11351284 -11101863
37654 -11101863 -9944271 -7721016 -4601226 -1000584 2562943 5546502 7564023 8663864
37646 8663864 9298565 9845154 10239444 10234703 9886936 9525321 9297408 9040035 8632318 8167799
37636 8167799 7627480 6628915 4754222 2071869 -800600 -3101535 -4341838 -4487554 -3918265
37627 -3918265 -3157542 -2496030 -1869504 -1147071 -444686 -36317 1032 -48035 287752 1355332
37617 1355332 3133400 5190232 6949574 8112874 8809962 9325649 9815362 10372838 11195919
37608 11195919 12465655 14116018 15882577 17500209 18682798 19050855 18432799 17293735
37600 17293735 16554450 16778965 17648547 18324018 18180268 17098119 15254060 12899754 10347428
37591 10347428 7968700 6071671 4765573 3961662 3528014 3450000 3763203 4240794 4239229
37582 4239229 3095661 786573 -1918838 -4026537 -4942686 -4564316 -3086203 -1021418
37574 -1021418 710525 1103746 -329325 -3324549 -7226780 -11432783 -15447847 -18725715
37566 -18725715 -20710672 -21125878 -20198284 -18592670 -17103966 -16307511 -16361974 -17060576 -18062311
37557 -18062311 -19112251 -20099258 -20960552 -21572270 -21765891 -21478643 -20873274 -20242467 -19743566
37548 -19743566 -19248147 -18489878 -17336259 -15875932 -14284512 -12701414 -11248826 -10069125
37540 -10069125 -9258859 -8786907 -8530799 -8381773 -8268217 -8091444 -7723335 -7132109 -6493145
37531 -6493145 -6112185 -6199021 -6709694 -7393450 -7960308 -8215033 -8116676 -7789465 -7454051 -7268830
37521 -7268830 -7225768 -7247578 -7359014 -7652386 -8070114 -8381097 -8510596 -8814481 -9836088 -11731138
37511 -11731138 -14012533 -15889481 -16790314 -16572007 -15411939 -13687774 -11957105 -10878360
37503 -10878360 -10962959 -12281430 -14355824 -16370067 -17599609 -17753473 -16957386 -15447528 -13345230
37494 -13345230 -10739075 -7870487 -5090792 -2607223 -349630 1868992 4097009 6165488
37486 6165488 7806696 8799388 9029436 8493092 7306204 5721165 4087399 2711134 1700186
37477 1700186 967355 412281 43008 -143770 -310071 -614371 -880738 -652613 234924
37468 234924 1216561 1312598 -104751 -2938252 -6645814 -10633415 -14314602 -17047094 -18299942
37459 -18299942 -17941653 -16309524 -14020295 -11734460 -9961083 -8869802 -8214688 -7530845
37451 -7530845 -6504579 -5193571 -3929019 -3046932 -2686030 -2756354 -3048663 -3387307 -3707071
37442 -3707071 -4001903 -4220561 -4217983 -3787616 -2747938 -1066634 1040347 3154387 4853450
37433 4853450 5893330 6246105 6085292 5797067 5864514 6509158 7382770 7751821 7114661
37424 7114661 5632458 3920937 2458948 1244119 -12966 -1435406 -2744024 -3443275
37416 -3443275 -3222583 -2198019 -818560 413525 1160853 1316693 959559 238051 -744031
37407 -744031 -1916932 -3108808 -3998174 -4294190 -3964420 -3273043 -2676021 -2710301 -3793218
37398 -3793218 -5900257 -8492169 -10976148 -13210660 -15316299 -17031721 -17672393 -16944089
37390 -16944089 -15495861 -14335068 -13820062 -13487289 -12717226 -11222395 -8963210 -6043631
37382 -6043631 -2856352 -16180 2106535 3672866 5079359 6537546 8078572 9769912
37374 9769912 11651965 13495970 14851063 15401617 15206327 14605719 13982212 13567020 13346758
37365 13346758 13130589 12760427 12216732 11455898 10268448 8526356 6582823 5183926 4809929
37356 4809929 5176490 5495237 5170787 4164760 2789014 1346485 1386 -1180991 -2219367
37347 -2219367 -3198075 -4128941 -4794592 -4819748 -3991209 -2511848 -902582 341701 994590
37338 994590 1099298 886281 707091 870966 1387472 1917989 2105957 1929136 1610535 1218874
37328 1218874 536974 -616852 -2072951 -3407237 -4278798 -4620585 -4606921 -4539132 -4694192
37319 -4694192 -5164765 -5857696 -6718105 -7926284 -9802797 -12526070 -15949149 -19588606 -22710985
37310 -22710985 -24559899 -24735792 -23448472 -21347217 -19076276 -16975275 -15068070 -13179802
37302 -13179802 -11111388 -8879581 -6804788 -5222614 -4096669 -3055442 -1808510 -347757
37294 -347757 1268352 3065195 4954791 6622106 7853453 8881806 10183822 11949491
37286 11949491 13893234 15538226 16526396 16688322 16012005 14613110 12649606 10251526
37278 10251526 7604114 5058261 3024656 1731204 1136333 1020350 1053238 850082 151320
37269 151320 -1042049 -2648098 -4769279 -7546251 -10708242 -13504859 -15220789 -15635831
37261 -15635831 -14934013 -13392319 -11326667 -9161224 -7299396 -5953905 -5224157 -5219031 -5893202
37252 -5893202 -6833527 -7477723 -7628498 -7618999 -7926693 -8717624 -9739284 -10472092 -10345344 -9033723
$$ [...]
##END NTUPLES=NMR SPECTRUM
##END=
