##TITLE=31Pdec_SR-75-TFAA3-V2
 CDCl3, 24 sc
 12.7.2023
##JCAMPDX= 6.0         $$ Bruker NMR JCAMP-DX V2.0
##DATA TYPE= NMR SPECTRUM
##DATA CLASS= NTUPLES
##ORIGIN= UXNMR, Bruker Analytische Messtechnik GmbH
##OWNER= root
$$ XWIN-NMR		Version 3.5
$$ Wed Jul 12 16:26:22 2023 Russian Standard Time (UT+4h)  she@DPX200
##.OBSERVE FREQUENCY= 81.013821
##.OBSERVE NUCLEUS= ^31P
##.ACQUISITION MODE= SIMULTANEOUS
##.ACQUISITION SCHEME= undefined
##.AVERAGES= 24
##.DIGITISER RES= 16
##SPECTROMETER/DATA SYSTEM= spect
##.PULSE SEQUENCE= zgpg30
##.SOLVENT NAME= CDCl3
##.SHIFT REFERENCE= (INTERNAL, CDCl3, 0, 248.564)
##AUDIT TRAIL= $$ (NUMBER, WHEN, WHO, WHERE, WHAT)
$$ ##TITLE= Audit trail, XWIN-NMR		Version 3.5
$$ ##JCAMPDX= 5.01
$$ ##ORIGIN= Bruker BioSpin GmbH
$$ ##OWNER= she
$$ F:/spectra/data/she/nmr/P31/1/pdata/1/auditp.txt
$$ ##AUDIT TRAIL=  $$ (NUMBER, WHEN, WHO, WHERE, WHAT)
(   1,<2023-07-12 16:24:53.18 +0400>,<she>,<DPX200>,
      <created by zg, POWCHK disabled, PULCHK disabled
       configuration hash MD5:
       00 E9 B6 7A A2 85 ED C7 34 08 36 98 17 FE 4E 26
       data hash MD5: 32K
       8F 73 4D 05 D6 20 05 36 69 D8 C9 ED C5 2F 02 A4>)
(   2,<2023-07-12 16:24:58.15 +0400>,<she>,<DPX200>,
      <Start of raw data processing
       efp BC_mod = 2 LB = 1 FT_mod = 6 PKNL = 1 PHC0 = -10715.39 PHC1 = 130.2848 SI = 64K 
       data hash MD5: 64K
       19 FF 9A 17 26 BA 5B 57 FA 0F 13 A2 32 26 FC A4>)
(   3,<2023-07-12 16:25:17.26 +0400>,<she>,<DPX200>,
      <pk PHC0 = -4.296227 PHC1 = 16.2 
       data hash MD5: 64K
       46 96 F7 BD 58 FE A7 A1 31 19 1B 8D DB D2 70 71>)
(   4,<2023-07-12 16:25:21.28 +0400>,<she>,<DPX200>,
      <abs ABSG = 5 
       data hash MD5: 64K
       D7 D1 3B 1C 56 92 42 64 67 0B E4 50 58 50 C0 C4>)
(   5,<2023-07-12 16:25:38.06 +0400>,<she>,<DPX200>,
      <pk PHC0 = -1.795231 PHC1 = 0 
       data hash MD5: 64K
       42 75 A5 25 9F 62 68 8E 2E 2B 3B 49 BB E1 0B 5F>)
(   6,<2023-07-12 16:25:43.53 +0400>,<she>,<DPX200>,
      <abs ABSG = 5 
       data hash MD5: 64K
       DE E0 94 DF 93 76 63 1F AC 97 1E 51 BA B3 C7 28>)
$$ ##END=
$$ 
$$ hash MD5
$$ 74 6C 20 D1 C7 26 7C B3 8D 16 38 18 34 98 9B 02
##$RELAX= 
##$RELAX= 
##$RELAX= 
##$RELAX= 
##$RELAX= 
##$RELAX= 
##$RELAX= 
##$RELAX= 
##$RELAX= 
$$ Bruker specific parameters
$$ --------------------------
##$DU= <F:/spectra>
##$EXPNO= 1
##$NAME= <P31>
##$PROCNO= 1
##$TYPE= <nmr>
##$USER= <she>
##$AMP= (0..31)
100 100 100 100 100 100 100 100 100 100 100 100 100 100 100 100 100 100 
100 100 100 100 100 100 100 100 100 100 100 100 100 100 
##$AQSEQ= 0
##$AQ_mod= 1
##$AUNM= <au_zg>
##$AUTOPOS= <>
##$BF1= 81.014009
##$BF2= 200.13
##$BF3= 200.13
##$BF4= 200.13
##$BF5= 200.13
##$BF6= 200.13
##$BF7= 200.13
##$BF8= 200.13
##$BYTORDA= 1
##$CFDGTYP= 0
##$CFRGTYP= 5
##$CHEMSTR= <none>
##$CNST= (0..31)
1 1 145 1 1 1 1 1 1 1 1 1 1 1 1 1 1 1 1 1 1 1 1 1 1 1 1 1 1 1 1 1 
##$CPDPRG= <waltz16>
##$CPDPRG1= <>
##$CPDPRG2= <waltz16>
##$CPDPRG3= <>
##$CPDPRG4= <mlev>
##$CPDPRG5= <mlev>
$$ [...]
##$SUBNAM3= <"">
##$SUBNAM4= <"">
##$SUBNAM5= <"">
##$SUBNAM6= <"">
##$SUBNAM7= <"">
##$SUBNAM8= <"">
##$SUBNAM9= <"">
##$SW= 501.771253377433
##$SWIBOX= (0..15)
0 1 3 0 0 0 0 0 0 0 0 0 0 0 0 0 
##$SW_h= 40650.406504065
##$TD= 32768
##$TD0= 1
##$TE= 0
##$TE2= 300
##$TE3= 300
##$TEG= 300
##$TL= (0..7)
0 120 53 12 22 120 120 120 
##$TP= (0..7)
150 150 150 150 150 150 150 150 
##$TP07= 0
##$TPNAME0= <>
##$TPNAME1= <>
##$TPNAME2= <>
##$TPNAME3= <>
##$TPNAME4= <>
##$TPNAME5= <>
##$TPNAME6= <>
##$TPNAME7= <>
##$TPOAL= (0..7)
0.5 0.5 0.5 0.5 0.5 0.5 0.5 0.5 
##$TPOFFS= (0..7)
0 0 0 0 0 0 0 0 
##$TUNHIN= 0
##$TUNHOUT= 0
##$TUNXOUT= 0
##$USERA1= <user>
##$USERA2= <user>
##$USERA3= <user>
##$USERA4= <user>
##$USERA5= <user>
##$V9= 5
##$VALIST= <valist>
##$VCLIST= <CCCCCCCCCCCCCCC>
##$VD= 0
##$VDLIST= <DDDDDDDDDDDDDDD>
##$VPLIST= <PPPPPPPPPPPPPPP>
##$VTLIST= <TTTTTTTTTTTTTTT>
##$WBST= 1024
##$WBSW= 4
##$XGAIN= (0..3)
0 0 0 0 
##$XL= 0
##$YL= 0
##$YMAX_a= 6780
##$YMIN_a= -6362
##$ZGOPTNS= <>
##$ZL1= 120
##$ZL2= 120
##$ZL3= 120
##$ZL4= 120
##$ABSF1= 248.5645
##$ABSF2= -253.2056
##$ABSG= 5
##$ABSL= 3
##$ALPHA= 0
##$AQORDER= 0
##$ASSFAC= 0
##$ASSFACI= 0
##$ASSFACX= 0
##$ASSWID= 0
##$AUNMP= <proc_1d>
##$AZFE= 0.1
##$AZFW= 0.5
##$BCFW= 0
##$BC_mod= 2
##$BYTORDP= 0
##$COROFFS= 0
##$CY= -3
##$DATMOD= 1
##$DC= 0
##$DFILT= <>
##$DTYPP= 0
##$F1P= 0
##$F2P= 0
##$FCOR= 1
##$FTSIZE= 65536
##$FT_mod= 6
##$GAMMA= 0
##$GB= 0
##$INTBC= 1
##$INTSCL= 6.047779e-11
##$ISEN= 30
##$LB= 1
##$LEV0= 0
##$LPBIN= 0
##$MAXI= 10000
##$MC2= 0
##$MEAN= 0
##$ME_mod= 0
##$MI= 50
##$NCOEF= 0
##$NC_proc= -9
##$NLEV= 6
##$NOISF1= 182.463
##$NOISF2= 159.3651
##$NSP= 0
##$NTH_PI= 0
##$NZP= 0
##$OFFSET= 248.5645
##$PC= 4
##$PHC0= -10721.49
##$PHC1= 146.4848
##$PH_mod= 1
##$PKNL= yes
##$PPARMOD= 0
##$PSCAL= 0
##$PSIGN= 0
##$REVERSE= no
##$SF= 81.0140089999694
##$SI= 65536
##$SIGF1= 159.3651
##$SIGF2= -187.1042
##$SINO= 113.3802
##$SIOLD= 16384
##$SREGLST= <1H.CDCl3>
##$SSB= 0
##$STSI= 65536
##$STSR= 0
##$SW_p= 40650.406504065
##$SYMM= 0
##$S_DEV= 0
##$TDeff= 32768
##$TDoff= 0
##$TI= <>
##$TILT= no
##$TM1= 0
##$TM2= 0
##$TOPLEV= 0
##$USERP1= <user>
##$USERP2= <user>
##$USERP3= <user>
##$USERP4= <user>
##$USERP5= <user>
##$WDW= 1
##$XDIM= 65536
##$YMAX_p= 297512095
##$YMIN_p= -251770203
$$ End of Bruker specific parameters
$$ ---------------------------------
##NTUPLES= NMR SPECTRUM
##VAR_NAME=  FREQUENCY,     SPECTRUM/REAL,   SPECTRUM/IMAG
##SYMBOL=    X,             R,               I
##VAR_TYPE=  INDEPENDENT,   DEPENDENT,       DEPENDENT
##VAR_FORM=  AFFN,          ASDF,            ASDF
##VAR_DIM=   65536,         65536,           65536
##UNITS=     HZ,            ARBITRARY UNITS, ARBITRARY UNITS
##FACTOR=    0.620285442955139, 1,           1
##FIRST=     20137.2065510682, 0,            0
##LAST=      -20513.1999529968, 0,           0
##MIN=       -20513.1999529968, -251770203,  0
##MAX=       20137.2065510682, 297512095,    0
$$ Real data points
##PAGE= N=1
##DATA TABLE= (X++(R..R)), XYDATA
$$ [...]
##PAGE= N=2
##DATA TABLE= (X++(I..I)), XYDATA
14968 24031238 36239427 32804734 22055474 12448257 7412927 6720822 6943023 4193293
14960 4193293 -834124 -4482981 -6621834 -9003630 -8147249 490127 10843894 10343919
14952 10343919 -1627145 -11180759 -9720677 -3932658 -955711 2704899 9670567 12889455
14944 12889455 9018456 7883943 15618315 19907366 7671972 -11776871 -18802181 -12317026
14936 -12317026 -8023959 -11317883 -11717624 -5135345 -2528537 -10763540 -20234417 -18929113
14928 -18929113 -7333893 7103550 20005251 27991384 26079445 14995080 4447418
14921 4447418 2286582 5358545 6092364 2663969 -2341905 -7805134 -12917747 -14632967
14913 -14632967 -11909273 -9249800 -11195234 -16117441 -19568031 -20620226 -20416179 -17302984
14905 -17302984 -8809005 2497601 9768790 9100052 3334753 -1767161 -3293419 -2413238
14897 -2413238 -861894 2194871 8185717 14385300 14432634 5628862 -7009887 -16456192
14889 -16456192 -20145222 -17703309 -7374568 8723950 19864934 16565099 4123662
14882 4123662 -3030746 -736584 1312071 -2684650 -4773380 2733261 12925933 13112268
14874 13112268 2494150 -7691915 -8726862 -1689397 7541568 13287111 11119846 999955
14866 999955 -9736122 -11919073 -4736957 3187424 4106749 -429083 -2918689 352682
14858 352682 4924649 3787260 -3315580 -8222984 -4097498 4894868 8274551 3675690
14850 3675690 407873 5772207 13972171 14370495 6359937 -1446095 -4636661 -7105127
14842 -7105127 -11047027 -11336518 -4172003 4669832 6310838 556521 -4803724 -5408501
14834 -5408501 -4876586 -6918194 -8976314 -7602165 -5631613 -7841705 -11379413 -7909992
14826 -7909992 3363628 11834091 8712832 -1398947 -7770698 -7896143 -7108432 -6739092
14818 -6739092 -2497397 4419781 4758888 -4907197 -13349609 -7749235 8368234 18771093
14810 18771093 15201143 6238728 3614564 7018980 7724506 2750215 -1874320 -1614814
14802 -1614814 -457392 -4299303 -11643552 -15511602 -12766537 -7004877 -2778598 -1379119
14794 -1379119 -2516814 -5505830 -7628551 -5909285 -2326184 -2576500 -7143779 -8602055
14786 -8602055 -1656498 8726367 14102050 13579008 12454281 12887592 12187062 8738154
14778 8738154 3918926 -864763 -4306744 -4132871 -775468 386878 -3720298 -6983512
14770 -6983512 -1396462 10883376 20439232 23721896 24436529 22975160 15192484 3341438
14762 3341438 -2353226 2707250 10833546 13558616 12178916 11728331 11454611 7738314
14754 7738314 1929180 -564776 3317355 11781256 19115196 18036915 6250982 -7808249
14746 -7808249 -12014640 -5597271 -506896 -5127696 -14108993 -18100956 -15740607 -10960082
14738 -10960082 -5969756 -2911891 -5399921 -11663913 -12588017 -3671497 7012935 10021980
14730 10021980 7635817 7742504 10472286 10216062 6538890 3675960 2537456 2017691
14722 2017691 4521560 10682568 12388989 2407071 -11119343 -12030452 1486473 13368633
14714 13368633 10752660 -1733226 -12038904 -15532101 -14780488 -11890253 -6955113 -311394
14706 -311394 7199453 13490184 14203879 7112525 -2116464 -4496231 835127 5772821
14698 5772821 4838353 646085 -3708712 -9245071 -14312735 -11899631 -574422 8550659
14690 8550659 4562176 -7201228 -10892523 -1030948 10996602 13051419 7339684 4753816
14682 4753816 8869829 12059199 6972362 -3738224 -11646387 -13062128 -11462903 -10702437
14674 -10702437 -10083014 -7178933 -2411022 1077891 600152 -3754471 -8350254 -7845070
14666 -7845070 -647958 7734588 10610842 8969445 9030781 10966988 8088512 -34956
14658 -34956 -2779025 6791357 19910576 23158348 15804264 7236744 2206015 -871322
14650 -871322 -557652 6435211 15226781 15551408 6374263 -2079740 -2952706 -99323 1529690
14641 1529690 3169538 5929408 6038426 1800862 -1614321 388787 5375591 9599218
14633 9599218 14491342 22082368 28598708 28356158 21371214 12884534 7453161 6185170
14625 6185170 7106422 6248992 1600232 -2618326 182620 9303960 16000548 14586452
14617 14586452 9148080 6543284 7934744 10411903 11994960 11562328 8341266 4608322
14609 4608322 4428323 7215147 7780430 5076751 4370388 7737052 10014970 8459419 8014939
14600 8014939 11009472 10537705 2684714 -2914012 3957448 16553746 19447301 10972384
14592 10972384 3820845 3955702 3023832 -5204806 -13592936 -13221401 -6909436 -3715848
14584 -3715848 -6021292 -9124078 -9882659 -9426281 -9038916 -8219330 -6470468 -4368668 -3278491
14575 -3278491 -4762157 -8524372 -10754130 -7664288 -1417683 1342995 -1531491 -4280908
14567 -4280908 -1432663 4247517 5521949 -209158 -9038452 -15607943 -16386156 -9852150
14559 -9852150 1910177 12035828 13678983 7344126 542669 -1153364 -53003 -1413871
14551 -1413871 -4904839 -4516125 3013510 12880590 17258104 13978860 7667158 2850862
14543 2850862 -713994 -4533297 -6225558 -1441377 9472325 19738621 22206154 15994471
14535 15994471 6967646 2780167 6888489 15206948 18693893 12048325 558420 -4840699
14527 -4840699 -777791 4204965 1893161 -2893970 1672802 16769878 28988160 26680354
14519 26680354 13874380 3256794 299678 623619 -206475 -2023948 -4617139 -9465643
14511 -9465643 -15286642 -17862041 -16449541 -15017433 -14886373 -11947692 -4682698 582905
14503 582905 -2513965 -11125473 -16704612 -15034694 -8658276 -2294497 101461 -3026697
14495 -3026697 -7869901 -7473700 -1335009 1757633 -3914727 -11103118 -10016740 -3925571
14487 -3925571 -3812571 -9843629 -10075663 1485710 16546967 24921857 25532232 21649233
14479 21649233 14361737 5349029 -1562924 -5973403 -11145776 -15602154 -12888560 -3516374
14471 -3516374 2607700 1394075 1958298 10581641 17291502 10152092 -4501908 -10084149
14463 -10084149 -4226150 -574904 -5964872 -9851492 -1136182 15212435 25364506 24133298
14455 24133298 18624082 17397604 21136020 23463506 18492146 7734886 -142358 2216445
14447 2216445 12548966 20674592 18446986 6706836 -6874477 -14828764 -15004859 -10403146
14439 -10403146 -4561624 2066576 9478553 13510464 9198566 -223417 -4142246 1740262
14431 1740262 8292745 5168801 -4685774 -9804521 -6053524 308756 3781096 5449080
14423 5449080 7098007 7017203 4170910 1380271 1830321 5514883 10133466 12822503 11355509
14414 11355509 6866348 4421845 7044006 10476657 8528611 2281834 -1574227 -688779
14406 -688779 1013307 1268142 2428719 5205311 6187872 4164804 3046162 5336222 7726755
14397 7726755 6638451 3874953 3181517 4684859 6199123 7125859 7823579 7607094 6374603
14388 6374603 6010032 7298418 7333938 2784999 -5545363 -13532709 -17730769 -16788986 -10741132
14379 -10741132 -1523845 6585736 9499601 6750128 1587277 -2166816 -2797464 -706696
14371 -706696 3174042 8064469 12146222 12051115 5884360 -3229185 -9379192 -10290556 -8433982
14362 -8433982 -5236886 909645 8887455 13257606 12787760 14354881 21857094 27346384
14354 27346384 22447538 13651005 13989339 21520849 20291705 4931182 -9671238 -9371408
14346 -9371408 514685 6191465 5427670 5779405 9142614 9937549 6555969 4314012 6314271
14337 6314271 8777585 6751177 -532400 -10326128 -18201741 -19541210 -13278478 -4073797
14329 -4073797 2149310 3734226 2050944 -1985544 -6000883 -4532224 4211552 12349621
14321 12349621 10629556 1890272 -1691101 4702548 12848968 14539511 11829483 10089899
14313 10089899 8748547 5408820 2962671 4698152 6628372 3364856 -1101568 1773346
14305 1773346 10004517 11328608 1177922 -9398400 -9155984 -1773551 1800000 -251218
14297 -251218 -814721 3331372 8109573 9892397 8254353 2179285 -7749016 -13983288
14289 -13983288 -8567782 4028009 10596286 7655706 5443410 9919456 12765174 6284928
14281 6284928 -2793413 -4206308 9476 1610368 963410 3652035 7461597 5562830
14273 5562830 -217660 -1609448 2242799 4874551 5400776 9439874 17137077 21774645
14265 21774645 20958406 18124412 12605855 362524 -14145636 -19778160 -15308257 -11562370
14257 -11562370 -13348094 -12426988 -3772503 4546489 5430891 4773207 10325347 18612088
14249 18612088 22370366 22432442 22993305 22774791 19757399 17408524 17771198 15814025 8900756
14240 8900756 3625304 4356611 4171586 -2308704 -6736733 -817140 6549616 1845095
14232 1845095 -9586845 -10314040 1746418 10619823 7553653 1793016 2206343 3289716
14224 3289716 -3710908 -16699886 -26485880 -27284792 -19355206 -7826862 -1214877 -4038627
14216 -4038627 -9602232 -7800370 -435830 822468 -7204412 -14001049 -11616328 -5146283
14208 -5146283 -2240371 -2461250 -3108421 -6204913 -12496331 -16387657 -14277002 -11262858
14200 -11262858 -12432081 -13767602 -9225568 -1277864 3482106 4708452 6417687 8325288
14192 8325288 6754070 1691105 -3857563 -9134739 -13852758 -13986276 -6631657 2821392
14184 2821392 5834441 2211614 -513345 1431041 4542262 6319597 9186449 13795147
14176 13795147 15359504 10628391 3343322 -1560005 -4913799 -9310591 -11246092 -4044113
14168 -4044113 11068083 22651249 20801303 8077985 -4186313 -8116244 -4426207 2608518
14160 2608518 9925889 14863363 14965570 11597222 9988482 12285180 13774126 9789489
14152 9789489 3007543 -1108156 -2995160 -6359886 -8701595 -3058383 9443035 17004041
14144 17004041 11436565 -721680 -6509315 -2341961 3586748 2997000 -2882945 -5924072
14136 -5924072 -1269800 6254580 7290906 520087 -3195127 5942793 21583774 27282302
14128 27282302 18267574 8070971 9255088 16102024 14237245 1616206 -9863065 -11645801
14120 -11645801 -7896166 -6335717 -7575408 -7416742 -4932973 -3575751 -5755291 -9739002
14112 -9739002 -12258025 -12354979 -11428741 -9948542 -6170711 321437 5604226 5500441 2409718
14103 2409718 3630363 11331061 18398709 17184177 9019913 1481511 -1139574 -444533
14095 -444533 1223035 3667861 6247958 6225236 1554843 -6107759 -12362037 -13884102 -11290242
14086 -11290242 -8174752 -6964353 -6411321 -4312219 -1457207 -419890 -1375774 -2403065
14078 -2403065 -3198557 -4354464 -3516511 2158172 9112210 9386421 1709497 -5732910 -6720782
14069 -6720782 -4603153 -4252158 -3585283 204224 2170617 -3632689 -12495271 -13619000
14061 -13619000 -5250810 3439056 5896525 5474374 7369773 10309156 9657513 4337550
14053 4337550 -2318459 -6111081 -5165924 -1828923 -1225816 -5246696 -8988319 -6662742
14045 -6662742 485546 6772292 11003791 16540078 22556272 22325831 12682715 -125470
14037 -125470 -7010988 -4806015 3528253 13596988 22035171 27202962 29605469 29958439
14029 29958439 26713392 18426745 8334897 2341975 1820088 2646227 2196129 2629290
14021 2629290 5746674 9207715 10038192 7992388 3505126 -3735460 -12040591 -17214091
14013 -17214091 -16829548 -11791267 -2755006 10268984 23165032 28298485 23426079 15631186
14005 15631186 12739209 14550240 15889917 14462088 11949663 10576942 11846292 15600591
13997 15600591 18069993 15078374 9248233 7956115 10994777 8300109 -3792806 -12240323
13989 -12240323 -3449080 15619605 24635269 16365131 3885017 484489 4132802 5948310
13981 5948310 4023885 1981654 216018 -4047196 -10516880 -14867507 -13256654 -5588974
13973 -5588974 4186673 10043783 8697536 3353785 10515 61696 345990 177344 2672719
13964 2672719 7956297 11088643 9285827 5772823 3715392 1883802 -524817 -833802
13956 -833802 1274630 1260610 -1689639 -382224 8735746 15999865 10552196 -2390591
13948 -2390591 -7910961 -3120069 356280 -3231649 -4512344 4258319 15122995 16365550
13940 16365550 10133734 7359217 10208202 10892239 5889128 311541 -2507073 -5650670
13932 -5650670 -10165606 -11051727 -6260974 -1958981 -2717789 -2876578 4529364 14706631
13924 14706631 16239211 7693205 -325911 -608463 2339182 2641742 2842137 6885205
13916 6885205 10203645 5844170 -2988387 -6199982 -2167166 -426806 -6817191 -14416660
13908 -14416660 -13938985 -6627543 -832148 -43550 -320382 3073348 11616474 23457809
13900 23457809 32316138 29750867 15236880 1409572 980761 9404934 10038475 -2345001
13892 -2345001 -13667830 -10485760 2138502 10278425 10642822 10266519 11707502 10250876
13884 10250876 4999770 2040381 4547718 8133599 8676230 7736169 7582177 7459597 7555254
13875 7555254 10151727 13992803 14474053 12614290 15598934 23666601 25881730 16699357
13867 16699357 7428054 9968520 16941632 12715709 -509536 -5021453 4303836 12438254
13859 12438254 8970853 2738670 3404718 4940763 -89199 -3910168 2809337 11266565
13851 11266565 6759782 -6050046 -9535006 -1847310 734634 -8692826 -17348222 -14857771
13843 -14857771 -7683622 -3664811 1659771 12819269 22073323 21239618 15116183 11425631
13835 11425631 7245165 -2148258 -10199579 -9067403 -5299091 -10167399 -19591241 -19713411
13827 -19713411 -9454686 -1216761 -82724 1201567 5171955 3961993 -5033639 -12351628
13819 -12351628 -11224785 -6685505 -3859253 962145 10465171 18342316 19176600 17171775
13811 17171775 17368347 16920500 13108740 11352580 15820851 19283994 12446240 -1775491
13803 -1775491 -12597153 -15638882 -14243284 -10787952 -5639162 -1673135 -1458093 -2147861
13795 -2147861 -104468 2357712 1450787 -699838 -353759 174683 -2981060 -6863957 -6212706
13786 -6212706 -2988244 -2728806 -4341573 -2240906 4002024 10572574 16702994 22159433
13778 22159433 21490408 11382951 270857 -1216092 3335700 2097807 -4742816 -5346897
13770 -5346897 3253116 10587734 11218512 12449865 18816868 23181264 19837849 13963200
13762 13963200 11191262 9359607 7203691 9302976 14929337 14080580 3495435 -4907743
13754 -4907743 -1537019 5820676 5354340 -752585 -3866510 -4879163 -8819879 -11396103
13746 -11396103 -5823468 2514269 2967022 -2917838 -5060457 -2427800 -2315260 -4654655
13738 -4654655 -2348907 3598613 4573091 684515 1793633 10238346 16783772 16575451
13730 16575451 14963011 13716222 6077237 -8526805 -18605712 -17097512 -11594134 -10031653
13722 -10031653 -8086752 -540246 5877503 3027169 -3508057 -2285022 6634719 13618514
13714 13618514 14108566 10395820 3125428 -7337632 -14192140 -10816018 -2423240 526985
13706 526985 -688733 4585456 16688031 22393884 15423530 7130044 9492016 18124857
13698 18124857 21313773 17727646 14665792 13977414 10768679 4245210 8163 1121140
13690 1121140 4692572 8296109 12899098 17919731 19785304 17917278 16829094 19274396
13682 19274396 21581148 18952949 12120307 5790677 2993605 3222336 3894662 2229197
13674 2229197 -1551824 -2276252 4443164 13463184 13588069 3031216 -5928243 -3716870
13666 -3716870 2288684 -505397 -9385156 -9760533 2408946 14315593 14532003 6279345
13658 6279345 -1412313 -5514348 -6417600 -2551469 5444596 11949660 14072617 15830386
13650 15830386 18969406 17374889 8271565 1327153 6442191 18149527 23242400 19845028
13642 19845028 17134759 18702062 18863352 15260326 12623837 12245984 9410510 4278072
13634 4278072 3994511 9568588 11580464 5115381 -1039314 1986530 8867477 8910117 2852336
13625 2852336 464802 5052860 10614140 13110327 14969191 17565032 17549043 13282385
13617 13282385 8800404 8322389 10979279 13292494 13259214 10027710 3372834 -3751192
13609 -3751192 -5594019 -444436 5047304 2899499 -5317897 -9194764 -2327101 9578746
13601 9578746 16168717 14832574 11669415 12096806 15406908 18049405 16981949 9299326
13593 9299326 -5386794 -19973937 -23363013 -13106348 73524 4563769 97817 -6341247
13585 -6341247 -10682225 -11438841 -5545555 6019601 12783215 6022150 -6571597 -8999575
13577 -8999575 695401 8309552 4989669 -1935008 -3318414 -712816 1596694 5191464
13569 5191464 9849437 7896950 -3430384 -12605876 -8367792 2955818 6970546 3056241
13561 3056241 3106062 10803358 16539458 14482204 11449632 13828661 16188988 10166062
13553 10166062 -1882344 -9254157 -5706744 5396571 16643596 22891853 22986295 18834363
13545 18834363 13691971 10189210 9139122 9406483 8584551 5136262 651733 -1928686
13537 -1928686 -3217679 -7112284 -13334734 -14514225 -5408152 8249058 16057970 15942111
13529 15942111 14150467 13605714 10294187 2405470 -4642613 -5601152 -1892930 2778687
13521 2778687 7936941 13274279 15044299 11145369 6645942 8180011 14159280 16362488
13513 16362488 11455707 5497252 5021980 8082101 7944319 3359245 312775 2955637
13505 2955637 7124104 6277291 1586324 1031249 7761539 14355610 12121141 2752437
13497 2752437 -4183114 -3956059 -1397139 -2353527 -5811098 -7308911 -6090984 -4542035
13489 -4542035 -2682686 1771548 7810622 10275277 6722804 1799156 1543580 5412877
13481 5412877 7876182 6915692 6125671 7720599 8656056 6306438 3319243 2830549 2949152
13472 2949152 1148292 466025 4641722 9818640 9329733 5558706 7501173 15473642
13464 15473642 18441841 10515927 801724 633256 8444247 14475874 14704285 12604151
13456 12604151 11451377 12140102 15354785 19437392 19200773 12623129 4950175 525030
13448 525030 -4161134 -12042128 -16158692 -8918954 3783685 9560447 8144136 10078669
13440 10078669 17212969 18759405 10217463 2713227 6280347 14402595 14423822 6320782
13432 6320782 1429265 5949299 14308095 18228779 15774969 10231077 4299717 -2003715
13424 -2003715 -8547892 -12442530 -10733317 -5793330 -3853203 -5844482 -4983770 1643759
13416 1643759 5119975 -3051900 -15313072 -16355824 -5435587 2686787 470803 -2387377
13408 -2387377 3539571 12650211 14933200 10987138 7099194 3379747 -3028300 -8361881
13400 -8361881 -5834706 3897665 13539260 18041192 16764702 10443006 2533621 133757
13392 133757 6449830 14589505 15084752 7556859 -679235 -5271367 -8346426 -13108415
13384 -13108415 -19924022 -26405281 -28000117 -21268830 -9627851 -1663059 -376235 364619
13376 364619 4566387 6574049 1400234 -4556361 -2197569 6074920 10390753 7759017
13368 7759017 3080029 -699506 -3968959 -5090604 -3243154 -3662230 -10178541 -15698544
13360 -15698544 -11068395 -672829 2871726 -2344150 -6965056 -7787615 -11202031 -17812950
13352 -17812950 -18453059 -9839002 -1090967 693001 -320319 772975 1222804 -1133611
13344 -1133611 -1707468 2435080 7419344 11078931 16494880 22039374 19585498 8870749
13336 8870749 1121607 961070 -1319726 -9591820 -9465120 8885165 28618704 26131586
13328 26131586 4790827 -10926836 -10036991 -3860398 -2363244 -2156752 -317308 -1483395
13320 -1483395 -5590831 -3801150 6829601 16983232 19123879 16784207 14898671 12246115
13312 12246115 9034335 10677144 17212992 19179265 11414486 1998974 302784 4683905
13304 4683905 9071817 12796352 15838023 13210067 3796514 -2689188 1954396 11025470
13296 11025470 12197121 4963425 -1826323 -5111041 -8358743 -10115380 -4442427 7286298
13288 7286298 16175134 18495940 18877212 19815768 17997842 13436746 12624833 18151733 22718080
13279 22718080 18614403 8032504 -475935 -2235489 282809 2057506 1169447 685939
13271 685939 4112167 7947219 3492695 -9307010 -16201684 -6471292 8383452 7719318
13263 7719318 -7428539 -13084883 3615949 25397519 29734795 19339043 13983185 20736143
13255 20736143 27737969 24033521 11754389 -1069761 -8543240 -7180358 2133525 11228518
13247 11228518 11755802 6027250 3447463 6291161 7564855 3777196 411343 1562489
13239 1562489 2504756 -2535515 -11296087 -17062055 -16986134 -12862130 -7437411 -3539593 -3365427
13230 -3365427 -5115017 -3305705 4247311 12315980 14352231 10780259 8124576 10741065
13222 10741065 15729184 16288267 9618655 1051289 -1570827 1496858 769591 -9284113
13214 -9284113 -20074488 -18711004 -5581092 6168476 7997836 3744346 -537783 -4164150
13206 -4164150 -6154827 -2233342 6972531 13348400 12840287 11332261 12778775 10815467
13198 10815467 849338 -8471808 -7221026 -521982 -58016 -4674980 -4003972 1636779
13190 1636779 1075567 -7387318 -11359825 -4080281 5425019 7926859 7044168 9116167
13182 9116167 11392496 9663059 8260386 12021527 15650417 12038269 5583057 5923906
13174 5923906 12272200 15333779 12420242 9124008 6900528 1016147 -7665614 -10374812
13166 -10374812 -3793808 3989484 5708974 4493812 5581774 6546669 3225798 -1054558
13158 -1054558 -976994 224253 -4939235 -15081392 -20097175 -14979633 -5866242 -771661
13150 -771661 -954683 -3593319 -6664542 -7905172 -4519511 1795684 4036698 -984346
13142 -984346 -6203417 -2679115 7576066 13173794 7761039 -2409515 -6767092 -2449150
13134 -2449150 3932330 4206984 -3274680 -12140927 -13889622 -6397084 3641273 8147009
13126 8147009 6417151 3894371 3530180 2844904 -105812 -2913719 -3270779 -2928719 -3678572
13117 -3678572 -2691821 3540174 12245695 16122075 12335237 6165554 4603337 8768337
13109 8768337 13864780 14858465 10753863 4162034 -1793217 -5662003 -7447420 -7527644 -6696033
13100 -6696033 -6423279 -7385038 -7839987 -5177282 801702 7702273 13263077 16083622 14404637
13091 14404637 7951375 1217551 146495 3821504 4480891 -1108550 -5567373 -1358046
13083 -1358046 7081787 8851222 2011095 -4427105 -3952743 -137859 1386943 1392247 3231096
13074 3231096 5911419 6383804 5596766 6960865 10371773 12562548 12591699 12242677 11019591
13065 11019591 5980389 -1729010 -5172996 -363176 6786894 7574758 2843888 1697805
13057 1697805 7374557 11793635 7968670 1065952 162909 3908987 3848102 -79676 1501624
13048 1501624 11228418 18706621 15611457 7931419 5873420 8910609 9634019 7040373
13040 7040373 6125275 7291423 6013917 2086358 239229 1403924 1406321 -1143760 -3324147
13031 -3324147 -4878478 -8718190 -12911333 -10248056 1083258 13172198 18214571 16973665
13023 16973665 14285581 11683847 8221838 4200954 673371 -1503271 -525635 4254367
13015 4254367 8263196 5552113 -1667002 -3856088 2833082 10936807 12373277 8171664
13007 8171664 3700036 1078162 1184159 6353594 14901318 18850493 13761828 5796322
12999 5796322 2704075 3331040 3230173 4726368 11942431 20049100 19981185 11909708 4076255
12990 4076255 -657077 -6753218 -14145435 -15066696 -5886983 6391145 13506882 15271880
12982 15271880 15756194 15748373 13125303 7088770 -667199 -6125739 -3958175 6636025
12974 6636025 16592316 14328060 877371 -9284265 -6574102 1363456 1624509 -5713218
12966 -5713218 -9865857 -6501902 -2608908 -3621935 -5072894 -1366102 4105927 4351186
12958 4351186 609497 1209815 8980218 16910371 18501606 16173971 15100978 13793407
12950 13793407 7200543 -3638662 -11968028 -14246125 -12170270 -6864159 1048067 5691007
12942 5691007 50326 -11569478 -15222940 -6488661 1644272 -2829152 -13662778 -16915741
12934 -16915741 -11148284 -5599504 -3595622 -494451 4434846 6640906 6421536 9060144
12926 9060144 14281998 15970610 13042995 10439031 8857874 4550725 289989 4122241
12918 4122241 14155756 17113241 7254875 -4670099 -7530381 -4034157 -1703961 -171178
12910 -171178 3606494 6638054 6503464 8999732 18292861 25629459 19916477 5975414
12902 5975414 147623 8314761 18912062 19362028 11020812 4796302 7380021 14966202
12894 14966202 18432511 13259758 4214802 -939715 -1116298 -949161 -1285431 1467759
12886 1467759 5332843 2322697 -7326537 -10895540 -812601 12715445 15934800 9906975
12878 9906975 4085651 -227955 -7049931 -12742151 -10351751 -3190685 -210786 -789212
12870 -789212 2004352 6048403 3563408 -2162707 -538743 6060317 4304836 -5644670
12862 -5644670 -7550469 3371229 10459041 2906239 -5918195 -1144576 9048110 8407742
12854 8407742 -848589 -5346156 -5145138 -10772203 -20537353 -21135032 -10686572 -2804637
12846 -2804637 -4784143 -7991493 -5192220 -3096909 -9626065 -19473868 -21684753 -15013628
12838 -15013628 -7435030 -4308564 -4009847 -3283882 -1464737 135873 -72337 -2242130
12830 -2242130 -3573740 -234369 7651653 14655664 15154242 8555835 -956762 -7822882
12822 -7822882 -7966292 -1452978 6035266 7087727 572003 -5659521 -2707442 9119814
12814 9119814 20272724 22416622 16689392 10447122 8301303 9563853 13014886 18492214
12806 18492214 22191590 16914024 2383660 -9721883 -8887345 -770506 343954 -7392364
12798 -7392364 -11359872 -4865567 3177304 4194678 3455574 9053192 17531112 20999182
12790 20999182 20333666 19704230 15157509 2210364 -10240509 -8554861 5223360 16165343
12782 16165343 18864845 21544738 26437452 22949475 6573946 -9938375 -13299804 -6478517
12774 -6478517 223713 4942628 10843288 15090372 12940031 8093958 8076980 11958028
12766 11958028 12421224 8427838 6402770 8868253 10590023 7759476 3810938 3088478
12758 3088478 4139594 3326975 1883672 4551370 11102364 13378844 4727312 -8458107
12750 -8458107 -10592379 3892064 20269798 19797448 3474249 -9846779 -8650519 -987803
12742 -987803 1316183 -916787 -539224 2618082 4065907 3948782 4718962 4076636 -758250
12733 -758250 -5197646 -2690117 4187881 6384426 887803 -6496968 -9336305 -5064847
12725 -5064847 6082958 19254620 24718389 17734895 6816279 3842770 8157305 9885287
12717 9885287 6829371 6231153 9661162 9093810 1330289 -5642464 -6078875 -5505040 -9270602
12708 -9270602 -11558344 -5012458 5381892 8133525 1664339 -4103955 -1638851 5934263
12700 5934263 10820253 9480061 4585036 1484959 3636358 9809420 15560683 17830734
12692 17830734 17131824 15419643 13906800 12735681 10242564 3500969 -6691618 -12996983
12684 -12996983 -9594112 -2057345 -1293169 -7159627 -7870388 1182686 8700460 4323978
12676 4323978 -5231755 -6515433 1207016 8011571 10239670 12976750 16987072 15629426
12668 15629426 7155982 -311232 -633576 1293923 -2266964 -10120782 -14332498 -11334918
12660 -11334918 -5795067 -4092069 -7352587 -11426306 -12090779 -9273779 -5903980 -3345304
12652 -3345304 -27007 4796467 8652407 9123488 7071244 4427687 1602987 -304883
12644 -304883 1557805 6519013 7763371 907401 -7449946 -6774005 2866064 10485002
12636 10485002 8608093 1079145 -4560250 -5671593 -3559502 -286415 928985 -2228788
12628 -2228788 -6245430 -4739222 1066453 1719181 -6320888 -12914830 -7405965 5720535
12620 5720535 12584309 8359635 1225201 -1493934 -2141451 -4980442 -6987782 -2285024
12612 -2285024 7311403 12270385 6992427 -2230226 -4246616 2749531 8440367 4417331
12604 4417331 -3189034 -1794356 8308819 12251725 1783884 -11228703 -10839768 224838
12596 224838 5539202 -154813 -4643814 959997 8306757 6130929 -1517776 -2164977
12588 -2164977 5385763 9964622 5658018 -293045 105113 3789894 2382890 -5284014
12580 -5284014 -11793107 -10328917 -1506672 8045719 11630099 7912390 1880301 -601077
12572 -601077 507100 394006 -2855210 -5674512 -5826097 -6668316 -10535431 -12446441 -6755869
12563 -6755869 2788814 7322551 6369559 8542362 16984172 22704876 17370989 5924612
12555 5924612 -471526 516170 2464073 2991874 7324365 17563375 26217500 24924222
12547 24924222 15082937 5206677 467434 -522139 -50862 2388602 7189107 11931921
12539 11931921 14023601 14030757 14054234 13974717 11810059 7351131 2793466 -535784 -3355323
12530 -3355323 -5359237 -3870841 2325580 10129817 15634080 18427643 19674746 18529816
12522 18529816 14586570 11471008 12168255 12026425 3601321 -10831573 -19218144 -14902675
12514 -14902675 -4822303 1277333 2713827 3490400 2935233 -1353902 -6103135 -6910569
12506 -6910569 -7285321 -13785402 -23370440 -25197441 -15798802 -3670695 3058367 5169774
12498 5169774 5953556 4741987 1385145 -15916 2456918 3895519 71870 -5126418
12490 -5126418 -5731035 -3030236 -2243267 -3107667 -1328096 2153089 1340242 -4620371 -8707037
12481 -8707037 -6181456 -1604748 -1544556 -4391084 -2893749 4417901 9685200 5467241
12473 5467241 -4955181 -10158928 -3148691 11157796 21990906 24227616 21631436 19893747
12465 19893747 20059697 19861886 18443907 16926913 15396220 12031350 5623463 -2526020
12457 -2526020 -9694723 -13834017 -14198812 -10781686 -4327981 2798275 6974761 6260946
12449 6260946 2947335 1155013 1160972 -1497449 -9424524 -18163502 -20627711 -15434407 -7650409
12440 -7650409 -2190763 42049 168901 -341517 746937 4260397 6371074 2101599
12432 2101599 -6482908 -10466162 -5355241 2187853 3203051 -921181 111111 11980904
12424 11980904 28107218 36684261 32763790 21908741 13245476 10731640 11720311 12697942
12416 12697942 13678035 15765466 17208969 15307881 10984576 7712592 6501669 5926792
12408 5926792 6624141 10640190 15650212 15527868 9121173 3420061 4292614 7852329 5328339
12399 5328339 -5533082 -17592257 -22065935 -17054625 -8832577 -4981808 -5187567 -698379
12391 -698379 13331161 27280074 26162406 9563169 -6033188 -7651402 -169333 4220011
12383 4220011 2327950 -1235287 -4348376 -7639049 -9159347 -7217761 -4955705 -4498149
12375 -4498149 -802492 9844482 19168326 15616221 2322679 -4571666 3322902 16934792
12367 16934792 22851171 18111813 9275637 3364540 2621438 3729629 801609 -7408691
12359 -7408691 -14321024 -13877309 -9280716 -7227354 -7042109 -4095824 -652021 -2420690
12351 -2420690 -6509755 -5484985 -2533083 -7767939 -17942267 -16513566 633184 16076059
12343 16076059 16382536 11180114 14471159 20866946 16590740 4209411 -1665023 1794852
12335 1794852 3429989 -1974338 -7213225 -6629424 -2832998 1976591 8900238 14472421
12327 14472421 11740660 2366319 -2939775 452956 5261754 4878925 1730732 -1131976
12319 -1131976 -6456731 -14605595 -18194493 -12750497 -5439551 -4787177 -7565989 -5045207
12311 -5045207 1943123 4391520 343917 -1149004 6504437 17601539 22046028 18410834
12303 18410834 13904058 12895479 10904293 2355615 -9027354 -12863943 -5762329 3128338
12295 3128338 3973204 -920670 -2319083 1264554 2869942 344480 54070 4546992
12287 4546992 6454621 614058 -6217811 -5933650 -2711629 -6041002 -14237668 -16224414
12279 -16224414 -9004675 -2315808 -3479505 -7129904 -4689249 3243659 9858491 12424725
12271 12424725 13197155 12761054 8790628 1329946 -5313121 -7102926 -4244191 30610
12263 30610 2913015 3782290 3708443 3683112 3128882 634851 -3580121 -7123520 -8186087
12254 -8186087 -7535632 -6367415 -3471618 2997270 11020251 14633228 10043731 888106
12246 888106 -4331220 -476394 9263604 17145638 19090295 17872074 17654794 17288679 12194268
12237 12194268 3195672 -810444 6845349 19512088 22441470 10798219 -3107455 -5154419
12229 -5154419 2239409 4445609 -4043052 -11815985 -7223007 5531505 13858668 14316126
12221 14316126 13241612 12940305 8530786 -294350 -5370478 -2748276 -121343 -4499221
12213 -4499221 -9733548 -5179751 8198611 20025157 25624077 28604438 29831444 25300808
12205 25300808 16522445 11915041 13810370 13967829 7513399 1972215 4947505 11137140
12197 11137140 11170603 6789303 5965936 7391422 2802319 -6392398 -8150930 2097572
12189 2097572 14210885 18640687 18334320 19196081 18511786 11702583 3303065 959989
12181 959989 2722271 224180 -7791862 -14475421 -16034367 -14597672 -10557197 -2369054
12173 -2369054 4750085 1180699 -11374081 -16815052 -5199729 11413652 13610552 377657
12165 377657 -10732268 -7770394 2245104 6212156 1640569 -4493351 -6753827 -4831346
12157 -4831346 -46627 5660990 8998716 8489274 7386596 9258241 11632842 8612422
12149 8612422 -293923 -8628654 -11336365 -10359349 -9809418 -9447489 -6672079 -2817930 -2902613
12140 -2902613 -8517810 -14305007 -13881455 -8204679 -5257962 -10073986 -17139526 -16523945
12132 -16523945 -7837750 -2771501 -9626010 -19848138 -17892022 -3195276 7592173 3210611
12124 3210611 -7328400 -9520213 -4571232 -4659679 -11757607 -14934732 -9340514 -4426881
12116 -4426881 -8000701 -13243780 -10162646 -2041041 26480 -5040173 -6725864 1032944
12108 1032944 11329622 14127035 8107507 -164659 -4194552 -1874171 4488084 9530327
12100 9530327 8528979 1983309 -4951132 -8457507 -9076404 -7934843 -3780616 3260675
12092 3260675 7988262 5008048 -3063462 -6803982 -1103359 8137535 11161057 6127111
12084 6127111 151095 -546863 3014558 7085264 10994745 14785384 15094598 9329418
12076 9329418 2129190 1021341 5618151 7946300 4878779 2923519 7278355 13196275
12068 13196275 13763341 10542092 9680576 11621051 12080725 10496583 9911526 10011233 7748001
12059 7748001 4316155 4297292 7695049 9649903 8608552 8010073 8888847 7736333 3689619
12050 3689619 1504025 4712578 10863855 15438172 15712694 10059013 -419937 -8607038
12042 -8607038 -7078162 974112 4422199 477164 -825773 6843158 14586298 11134425
12034 11134425 -277001 -7218799 -5141155 181058 3615465 4774126 3412500 -312815
12026 -312815 -2067327 2010897 7591193 6964367 1148769 -967631 3889950 8844775
12018 8844775 7607651 2431439 -1445322 -3140232 -4527890 -5877587 -6240501 -5135717
12010 -5135717 -1998926 3296764 8525569 10649902 9565255 7465410 5357140 3939621
12002 3939621 6308206 14287022 22863095 24395366 18429692 11515137 7749858 6396509
11994 6396509 8383280 16185446 25611638 27061047 18641860 9629157 6709164 5468352
11986 5468352 891398 -2829354 -745437 2564109 719775 -2634975 -396935 4034513
11978 4034513 1224029 -7506202 -9766498 -306508 10630712 11006493 1603899 -7358584
11970 -7358584 -9094798 -5629531 -3121114 -4609880 -6698087 -3913773 2449888 3446812
11962 3446812 -5361935 -15140179 -14626407 -6645550 -3834875 -8855582 -10767940 -3591937
11954 -3591937 3823222 2761945 -1243859 1575315 9112025 11878863 8380774 5025982
11946 5025982 3688525 590516 -2994867 -88910 9391944 14656784 7463058 -6499635
11938 -6499635 -14362888 -10585079 -1152767 4160020 1051497 -6179267 -9326748 -5042384
11930 -5042384 1811331 5387365 6784460 10234316 13972440 12342524 6656660 5376331
11922 5376331 11174544 15923278 12638051 5261454 1489505 2214306 3902183 5822404
11914 5822404 8442456 9366830 7412236 6427543 8731240 9751013 6483061 5526848 12884603
11905 12884603 20602806 15925624 1552586 -6594388 -2384996 2967876 -863729 -10341253
11897 -10341253 -18091017 -23717752 -27510565 -23956181 -10473589 5025239 13438942 14774814
11889 14774814 12271826 4259559 -9377079 -20080914 -20447903 -15650618 -14695366 -15305822
11881 -15305822 -8715323 4451983 14994973 19275934 20685513 18913571 10561219 217438
11873 217438 -2154691 3440245 6660713 4168268 4537409 11742376 16792275 12973044
11865 12973044 8157827 12512219 21965666 23618940 12749170 -3447411 -15340089 -17925048
11857 -17925048 -12267724 -5307300 -4587881 -9217635 -10856112 -6821381 -4755782 -9226754
11849 -9226754 -12424473 -6388062 3122281 5284192 1182532 883968 6948038 12089572
11841 12089572 11673851 7892577 2126451 -6368602 -13609033 -12816743 -5059754 927538
11833 927538 1568156 2562797 7924277 13635508 15730347 16492715 18010800 16856422 10797786
11824 10797786 5004441 5570287 10953090 15185558 16183242 15806456 14605015 11897302
11816 11897302 9567225 10874530 15419648 18487971 15902784 8197859 261728 -2695337
11808 -2695337 122511 4221857 4828418 1793315 -2496642 -7694105 -13405492 -14575518
11800 -14575518 -6138056 7453002 15245544 14547475 14552886 21202723 26785836 21667360
11792 21667360 9872499 3946716 7611930 12326130 10227105 3154262 -1533705 1379590
11784 1379590 11450616 22105849 24471601 16250987 5596767 1642100 3415917 3746526
11776 3746526 1127280 -476836 -1782366 -7666450 -15340729 -14088294 -1492025 9623179
11768 9623179 7428077 -3100103 -8447841 -4735543 1273994 5062587 8177102 10803281
11760 10803281 10508944 9037927 11121738 14482205 10249131 -2344726 -10298282 -3139732
11752 -3139732 11194812 15737741 6702558 -3100910 -2818775 3873168 7561644 6117094
11744 6117094 3171632 -469449 -6286441 -11736406 -12274731 -9383654 -9400702 -13014353 -12855362
11735 -12855362 -4893913 3745878 3560801 -4786243 -12500962 -14724144 -14460537 -15550569
11727 -15550569 -17858102 -19835363 -20452962 -17671157 -10119755 -1459971 2347782 1846703
11719 1846703 4041818 10442026 11826916 936283 -14679046 -20392890 -12818392 -2497325
11711 -2497325 1282119 378740 657629 2196083 1194427 -2447212 -4259149 -863192
11703 -863192 5962680 10310385 6764856 -4232353 -15474207 -19825523 -17870110 -15683443
11695 -15683443 -15630119 -14413888 -10850325 -9135538 -11298553 -12344712 -7816861 -1535639
11687 -1535639 -62985 -2971206 -4787705 -3941067 -3075258 -2197356 1192244 5413481 5311858
11678 5311858 738466 -2448055 -1882668 -2573152 -7649783 -10894336 -3991435 11479945
11670 11479945 24226070 24936671 15025166 4086119 370118 3573920 6567754 4512263
11662 4512263 749839 1309806 5317401 5482997 -1831436 -11741273 -16928823 -14364128
11654 -14364128 -5579591 4367973 7351807 -1517160 -15101144 -18519992 -6822955 7524646
11646 7524646 10147700 2162494 -4237115 -2250578 5444110 14921375 23814927 27747701
11638 27747701 23740164 17517328 18231737 24183568 22849186 8922580 -5873624 -7207028
11630 -7207028 3372029 11815912 10641428 6671089 8765463 14440049 13626672 3511714
11622 3511714 -6284718 -5732374 2473935 6932053 2952044 -2894732 -4476485 -4413715 -6700779
11613 -6700779 -8655901 -7025355 -5693614 -8429647 -8998846 470215 13889035 16200286
11605 16200286 4314101 -8763080 -12993107 -12900458 -15752110 -19120453 -17150284 -10762955
11597 -10762955 -4249586 1681336 6624939 6463914 -169994 -6673948 -6708373 -2837551
11589 -2837551 -274206 2483344 8678706 14065771 12610058 8396154 11109471 20057414
11581 20057414 23091082 13737568 697340 -4017028 -305899 1908424 -3077770 -9380796
11573 -9380796 -7378054 3195439 11267117 7815745 -1623509 -3956839 2792613 6988629
11565 6988629 2253200 -2049512 3399718 11810933 11781259 7302172 11336331 22963028
11557 22963028 27286148 19088514 10806935 12104555 15416936 9864419 -1165234 -6062314
11549 -6062314 -1914128 3706520 4303198 837372 -1408023 2015064 10360990 16044756
11541 16044756 11191659 -2190669 -13684895 -17915812 -19527229 -21744482 -18901267 -6972189
11533 -6972189 6157561 10091998 6811290 6909950 13730376 20108659 19808342 14228541
11525 14228541 7808391 3606818 3639194 7347203 9255619 3915608 -6130272 -12676613
11517 -12676613 -12827175 -12002488 -14409177 -16179001 -11623183 -2614829 2826852 587229
11509 587229 -4344836 -4069911 2325438 7600335 5949642 880820 -31116 3810759 6239022
11500 6239022 5447863 6975641 12377036 12904454 1266135 -15739651 -24137585 -19208062
11492 -19208062 -8040470 1314135 5626674 3867471 -2481904 -6986050 -4239022 1393926
11484 1393926 611009 -6917866 -11714658 -8841150 -4253051 -3679307 -3726161 430389 5146545
11475 5146545 2957314 -6583618 -16650775 -21593736 -20944656 -16727978 -11145837 -6279507
11467 -6279507 -2793444 924472 6276782 11452673 12424718 7048048 -2007978 -8359533
11459 -8359533 -7470146 -2535838 -2363482 -10248168 -17742756 -14717049 -3562636 3537703
11451 3537703 764848 -6041610 -11038343 -15830195 -21370906 -21510857 -11925802 529128
11443 529128 5385911 2174864 -574978 2289033 7841049 11665282 12952358 12640971
11435 12640971 11222222 9503621 8693468 8923638 8906881 6796150 1389250 -5464424 -8025153
11426 -8025153 -2414779 6335408 8766910 4274571 2761366 9270972 15033563 10689698
11418 10689698 1193622 -2094991 824149 -61940 -7867417 -14704456 -15035401 -12672780
11410 -12672780 -12092983 -11833683 -9915732 -8202846 -7786976 -6690462 -5378523 -7726299
11402 -7726299 -12840418 -13172054 -6006502 -106070 -3835671 -11736229 -11388878 -1194999
11394 -1194999 7493143 6542558 1531849 2724992 11007690 18039981 18250127 15055798
11386 15055798 13864872 13444461 8722522 422841 -4232087 -2286155 -783680 -6919844
11378 -6919844 -16442058 -18452002 -10029435 884491 6981568 8670717 8250416 4518151
11370 4518151 -2758271 -8735771 -9153298 -6647775 -6571679 -8828372 -8447760 -2997049 4735714
11361 4735714 11119511 15259414 17631982 17616305 13894333 6928979 51111 -3196306
11353 -3196306 -3233800 -4195947 -8111545 -11616357 -10929323 -7324100 -3807190 510036 6936138
11344 6936138 10980899 7789214 2450511 4802533 12896709 12926971 -123435 -12857427
11336 -12857427 -11724466 -1224159 5486315 5868966 6138463 5939649 -1281182 -13889740
11328 -13889740 -20873408 -17081557 -9538424 -5612922 -3427410 2068665 10023103 14841505
11320 14841505 12451801 3179659 -8088087 -13884193 -10533020 -2958441 1120362 1158520
11312 1158520 2606256 6941654 10227797 11521869 14112914 16827919 13323822 3574926
11304 3574926 -2909540 -620654 3394660 1091729 -3971207 -3807287 392301 1560258
11296 1560258 -301432 1121979 6255634 8390823 5539820 4387990 9501368 15875949
11288 15875949 16239270 10650979 4960648 3336743 5603552 9014622 9564745 3931261
11280 3931261 -6667294 -15747284 -17173690 -10991431 -2365129 4143243 7633122 9117562
11272 9117562 8855145 6185305 1361713 -3485371 -6054788 -6312258 -5955855 -5410675 -3340531
11263 -3340531 314656 3594282 6203783 10491684 16119638 17786843 12924063 8040694
11255 8040694 10667325 17171648 16862999 7952897 129757 -842378 -1295199 -7413342 -13869656
11246 -13869656 -12621211 -6276811 -3275348 -4192970 -2849041 1475862 3255104 1501885
11238 1501885 1175123 2972081 1901312 -1475870 1349721 13002120 22883892 20448467
11230 20448467 9094676 -211374 -3597231 -5007093 -6702346 -7372440 -7459626 -8768833
11222 -8768833 -9738803 -7400698 -2989027 239342 3207442 8454729 12593445 9001816
11214 9001816 -1291653 -8582940 -6424091 1156617 6592568 7987026 8760820 11594678
11206 11594678 14900070 13698628 4603727 -7721974 -12042693 -3661667 7026971 6796301
11198 6796301 -1936490 -5202026 340891 2261094 -6588652 -14804133 -9021510 5898793
11190 5898793 14240115 10971186 4826675 3091933 4092814 4607115 5695042 9015048
11182 9015048 12844114 13597933 8900694 -4198 -6960032 -5233088 3711552 9825956
11174 9825956 6877122 454455 -1400382 130843 -597935 -2651179 -1331118 1836888
11166 1836888 1968220 1155113 5325784 11937965 11875676 4206484 -1575473 334332 5813422
11157 5813422 10656347 16009953 20654324 18729657 10724785 7129950 14102090 23230295
11149 23230295 23012245 14300634 6975283 6472258 11047065 18152174 25753554 29817221
11141 29817221 27573493 22339662 19901164 21104059 21920825 18994099 11542659 555650
11133 555650 -9614991 -11783035 -3561181 6946990 8311873 -1494405 -13416043 -18107649
11125 -18107649 -14879145 -9685912 -7231761 -6378767 -2672753 5056715 11691142 11224426
11117 11224426 4447515 -1700815 -2280567 1430850 5595261 7750576 7263014 6148206
11109 6148206 8801112 15708520 18887624 11213982 -431715 -1343711 10302028 20214957
11101 20214957 19130258 14938717 17009252 20578955 16989539 9406575 6185298 6249537
11093 6249537 3746017 1011762 3619079 7533055 5220859 703529 3497610 9939541
11085 9939541 6958269 -5260483 -11314145 -4714744 2227288 -1049423 -7692740 -7244858
11077 -7244858 -2643412 -2425266 -5237844 -4086410 -347936 -2060736 -10439887 -17297607
11069 -17297607 -15608555 -6419733 4163824 10141345 8805209 2837904 -1515393 -880580
11061 -880580 2151986 3679056 2839067 -331733 -6726853 -14226482 -16052139 -8000659
11053 -8000659 4754123 12182494 9789819 2224175 -1993138 2059897 11305352 16798638
11045 16798638 12944989 4696331 1720691 5982248 11125282 14059702 18453783 24296811
11037 24296811 23969468 14704237 6067791 6611147 10210495 5758312 -4669505 -8638924
11029 -8638924 -2077650 5889681 7072906 3469598 704987 467786 1932852 3968154
11021 3968154 3564360 -1977026 -9174108 -10520398 -4872668 62907 -1410486 -5157611
11013 -5157611 -4137529 1742167 7692828 12271809 17342732 21098835 17577971 5313786
11005 5313786 -7569901 -10732952 -3200098 5695313 7627775 4292960 2410894 2585482
10997 2585482 -1086318 -10070870 -16657529 -13899123 -5584335 -1360007 -4960047 -12101442
10989 -12101442 -17364322 -17831069 -12222442 -2615123 4221312 3457395 -487501 452258
10981 452258 5847797 7817021 4418167 2894516 6701829 8528591 2226512 -5773301
10973 -5773301 -5018052 3769623 10516791 10060939 6004239 1468931 -4753030 -11093485
10965 -11093485 -10807375 -1476580 8833430 10597419 4566441 -1054261 -2693780 -4098762
10957 -4098762 -7326249 -8406567 -5017532 -2344801 -5335164 -8623505 -1987273 13984616
10949 13984616 25401181 21920736 10226504 4800544 8782503 11391701 4161284 -7442476
10941 -7442476 -11703270 -5277053 4224579 8314013 6214410 3168317 3088952 4844432
10933 4844432 5432708 4977794 6578405 11045579 14279620 12045611 5980150 2046367
10925 2046367 3296024 6774958 7931774 5876813 3614874 4558418 9051813 13248568
10917 13248568 12135227 5250242 -1907347 -4450446 -4073243 -4581414 -3561274 4827981
10909 4827981 18190652 24481367 16186512 484380 -9554874 -9702320 -5360735 -1631179
10901 -1631179 454720 -182283 -4670725 -9228063 -7069159 2038279 9436627 8248621
10893 8248621 2149974 -730706 595528 26979 -4972602 -8584651 -4485667 5380575
10885 5380575 12984686 13221109 7776788 1210675 -3337969 -4463860 -2112684 1571177
10877 1571177 3645076 4271165 6576918 10720504 11563404 5728953 -2418081 -6947104
10869 -6947104 -9512649 -15131191 -20606697 -17041603 -5596952 -25593 -7603491 -16888058
10861 -16888058 -13512721 -945678 6126654 4723821 5963299 14458352 19650825 13061537
10853 13061537 2476947 166719 4899937 5789992 -505515 -6937273 -9037058 -10421719
10845 -10421719 -13139209 -11358216 -526046 12219964 14227434 3717432 -5970670 -1757043
10837 -1757043 12537247 19666975 9353010 -9367790 -19062622 -13593013 -1940222 5450585
10829 5450585 6898563 4993858 -341143 -8998600 -15754111 -14968728 -8639701 -4023179
10821 -4023179 -3664916 -3177264 384921 3228445 687654 -5034855 -6813418 -1474693
10813 -1474693 6462009 10973455 12251052 15165994 19984445 19050284 6705197 -10353728
10805 -10353728 -19083241 -16074594 -10171143 -7862432 -5276168 469897 1704520 -8265680
10797 -8265680 -20942289 -22442654 -14233819 -10625920 -15944960 -18600484 -11198628 -2241676
10789 -2241676 -399548 233669 8198351 17587579 16457539 6972853 2972995 8764662
10781 8764662 13868850 10947965 6624903 8956172 13886362 12319437 4833613 413990
10773 413990 2419741 4105325 -60809 -4851116 -1089207 10105326 15819519 6702625
10765 6702625 -9878010 -17153864 -8658445 5073422 10784251 7263509 2090639 -362717
10757 -362717 -804408 1389861 7885095 14965842 15079135 6545903 -3977157 -10168925
10749 -10168925 -11722316 -10110786 -5083454 1724673 5462033 4272331 2291270 2880792
10741 2880792 3743558 2959866 4488154 11426926 18098155 16626618 9115967 5089144
10733 5089144 7523797 10065565 9226086 10191195 16391161 21357912 17843132 9704694
10725 9704694 6820733 10958474 14600352 12909933 9086332 7070981 6484527 7162019
10717 7162019 11418802 17531268 17444267 7225128 -4884705 -8131223 -3991989 -3337838
10709 -3337838 -10046774 -15775785 -12130739 -573351 11997088 20690735 22729828 16896079
10701 16896079 7314213 2165764 3768567 5020677 871616 -2334589 3602706 14270935
10693 14270935 17345584 10645101 5784157 11695916 22649548 27018992 22133912 14757331
10685 14757331 9938764 5698474 -609249 -5538454 -3274326 4697716 8536508 2108266
10677 2108266 -7191359 -7082082 1931894 6028342 -1998898 -11161000 -7327053 7144421
10669 7144421 17683581 16674526 8735168 160429 -6242921 -6995619 478581 10966134
10661 10966134 15366289 12606350 9065826 6256789 -18247 -7109227 -5168712 6006095
10653 6006095 12286597 4611288 -8021071 -13523867 -14006314 -17155094 -19878982 -14718252
10645 -14718252 -6606284 -7550448 -16133083 -17340997 -5006583 8730634 11260497 6096032
10637 6096032 4763902 9776541 13744450 11652140 6730983 4680467 6951883 10583728
10629 10583728 12061278 10243375 6387199 2334745 -522023 -704225 2882978 8505872
10621 8505872 11312166 7759324 -341038 -7799973 -11137140 -10391338 -7503128 -4835662
10613 -4835662 -3989321 -4339579 -3996004 -3134412 -3900961 -5829131 -5017611 -106741 5051377
10604 5051377 7708464 10265636 13580579 12079308 2957955 -4689161 -341513 10603505
10596 10603505 12137911 1513580 -5103441 3629581 16692118 16750698 5059880 -2565844
10588 -2565844 -262136 2019319 -1939228 -3637294 4599981 13880159 9527532 -7490183
10580 -7490183 -21100728 -21163417 -13889246 -9421704 -8111511 -4064134 3939144 11061074
10572 11061074 12606538 6970740 -4556735 -16378371 -19845125 -11227924 2907366 12522447
10564 12522447 14754691 13787567 12400241 9149223 3398436 -1798461 -2719645 1450939
10556 1450939 7410155 8900498 2200856 -7700440 -11249914 -7340606 -5309196 -9431206
10548 -9431206 -10503345 -1344113 8382090 5341847 -6262259 -11358617 -7438823 -5338190
10540 -5338190 -8729710 -9454755 -3604410 3482155 9066671 14291803 13434398 -640321
10532 -640321 -19026486 -23690063 -14348166 -8242214 -9800507 -4016129 12868315 21283346
10524 21283346 9451588 -6468899 -8632133 -3108297 -2964806 -5607313 -4723570 -6267591
10516 -6267591 -14028614 -16692810 -7502897 858898 -1240426 -2986941 2792670 1288055
10508 1288055 -15193174 -23837317 -5312330 21402831 29073965 24714821 28195192 31617821
10500 31617821 19071315 4846684 8766162 14794343 1098334 -12354762 -592778
10493 -592778 8880509 -16533693 -37541391 -5456954 14078376 -98950006 -312432615
10486 -312432615 -422810001 -309106953 -100337471 815804 -26041778 -50464763
10480 -50464763 -12988473 20265941 4548815 -14690308 -1244081 9642248 -12335195
10473 -12335195 -34444610 -22480086 1612842 5580200 334783 7831871 17188746 11192577
10465 11192577 2036095 4575773 3902990 -15360928 -33286197 -23356414 3291063 15879254
10457 15879254 10422652 6306467 8477395 4273284 -7793885 -13475424 -6431824 3882988
10449 3882988 8181966 6612168 3242364 2054060 5599801 10148055 7751382 -1294573
10441 -1294573 -7102765 -6633324 -9059688 -17669081 -20991116 -12045143 -2011415 -2528833
10433 -2528833 -7767217 -7389455 -4640857 -6953414 -9884238 -5740114 1307427 3446726
10425 3446726 3718963 8029472 11542842 7797272 3049454 6292680 12455456 10857484
10417 10857484 3438493 -983224 -3908795 -12081826 -20849138 -19968471 -12307136 -9513467
10409 -9513467 -11370080 -6807365 4917431 11097004 5784423 -1835806 -2793785 512040
10401 512040 2347787 2496722 3381110 5908534 9885093 12583314 8518192 -2267895
10393 -2267895 -9425866 -5117769 2632030 759914 -8858404 -13906191 -12714940 -14409592
10385 -14409592 -18703948 -13932807 1083937 10901195 6513021 -794603 1942559 10055236
10377 10055236 11618756 6532267 2926848 1912238 -1753901 -7884210 -10495618 -7124575
10369 -7124575 -214219 8339921 16292291 17562746 8553783 -3134144 -5017216 4512417
10361 4512417 14193337 14922761 9647606 6049798 6581676 10186527 17783379 29019243
10353 29019243 36584934 31713352 16161788 2478291 -140278 4584373 7623557 6941170
10345 6941170 6890460 8657845 8579077 5942134 5568976 9924296 13490125 8748295 -4535241
10336 -4535241 -18649695 -25318938 -22666474 -16429259 -14650091 -19355721 -23988192 -21587659
10328 -21587659 -14100262 -9392960 -10256842 -12067382 -11180842 -9257832 -8376207 -8309077 -9969127
10319 -9969127 -14798086 -19116855 -16523646 -8236628 -3102620 -4263699 -4400958 1636673
10311 1636673 8597055 10761512 10908346 12334172 10995324 4348084 -328431 3219159
10303 3219159 8104621 4404654 -4336260 -6913197 -2575744 -423875 -2883922 -2787137
10295 -2787137 2842434 7827516 7427556 4196636 1563714 68705 1165496 6435920
10287 6435920 11701376 9845769 867118 -8305121 -14810434 -22532115 -32214904 -37280035
10279 -37280035 -32933196 -23021163 -14267379 -8384294 -2821489 4000663 10264652 12019442
10271 12019442 7383059 682477 -1082294 1594443 -94778 -9098247 -14893029 -8362011
10263 -8362011 2712803 4504083 -1569079 -1728820 8540193 19439958 22820910 20001890
10255 20001890 13434197 3768055 -3696277 -2729728 2041921 -26494 -7739692 -9184938
10247 -9184938 -2452467 754489 -4014604 -6371516 -480275 5016914 4740075 7004870
10239 7004870 15525068 17642719 5386756 -6755632 -2642671 9028566 8499834 -3623865
10231 -3623865 -9648968 -4505506 -674359 -3883450 -4358383 3805468 12185477 13500801
10223 13500801 13107330 17035278 20104834 15174959 6144572 2581868 6244595 10724912
10215 10724912 11467177 9288712 5325535 -1409956 -10465606 -17760089 -18939361 -13701890
10207 -13701890 -5550524 2259870 9070171 14804555 17854786 17284991 15457749 14864734
10199 14864734 13389820 7375574 -897202 -4375195 -743224 4800820 7426627 7349962
10191 7349962 5438973 1275419 -2349696 -928395 2872403 627254 -7564013 -10242336
10183 -10242336 -2080421 6390283 5130548 313184 2355952 7465676 5362149 -1083851
10175 -1083851 153554 9674364 15806429 13954858 11927187 14451761 16379404 14439293
10167 14439293 12874857 12926269 8314856 -3204613 -13472876 -14686953 -8556426 -420957
10159 -420957 7560482 13134537 12342918 6081995 690367 -2062418 -7155962 -14412955
10151 -14412955 -14630308 -4181804 6327626 6521152 735075 -1486377 -1231745 -5017906
10143 -5017906 -10311500 -9642763 -5291026 -5723301 -8738039 -2964763 11881939 20727428
10135 20727428 14700387 4492572 4028492 10987683 13848397 10775503 9379428 11543316
10127 11543316 11010807 5838143 1677054 348544 -4187889 -13717527 -19070158 -12785034
10119 -12785034 -1310568 4028950 2956005 3289705 5569463 2458841 -6159268 -9451898
10111 -9451898 -1646254 7586936 5680564 -5997465 -15012306 -13863657 -6385020 149146
10103 149146 3474135 6448976 11811526 17498843 17393503 8741472 -2102348 -5918618
10095 -5918618 -2392627 579598 -266463 186832 4126008 5774395 2788160 2522647 9245557
10086 9245557 14673113 11031917 4763943 5481564 9068502 5560286 -2364067 -4225072
10078 -4225072 -721319 -1131831 -4224482 -57812 8832333 7404997 -6604317 -15920613
10070 -15920613 -9439220 2093341 5032423 1900797 913898 890982 -820903 1986444
10062 1986444 12799206 21166729 17835744 11688207 15459657 22625802 17235090 2180920
10054 2180920 -2769790 8140446 17162295 9968822 -4249616 -8660071 -2585016 1782296
10046 1782296 -493450 -1575319 5704334 16960243 21240692 13925118 2285096 -2512035
10038 -2512035 1930883 7442582 7024544 3917960 5338192 11370397 15884530 15953862 14210190
10029 14210190 13293811 13819072 16626093 21137620 22588930 17197761 9483236 8006258
10021 8006258 13855162 19503104 19102087 13710271 6450086 -463015 -3151324 2012215
10013 2012215 11706217 17254480 15381366 11792928 12039551 14739989 16254269 15948097
10005 15948097 13600643 7377951 -1567550 -7299570 -6083937 -1302816 2225352 4894663
9997 4894663 9368245 14507978 16545639 14108409 8901139 3630177 1622949 5347264
9989 5347264 12352395 15728093 11793669 4638792 245370 -571249 -58647 1818037 5771721
9980 5771721 8882272 7308488 2229420 -1659441 -2925307 -4094015 -5846990 -5516483
9972 -5516483 -2537487 -904177 -3514186 -7075952 -6077380 -561593 3536722 2161887
9964 2161887 -1933529 -3932108 -3955496 -5447493 -7688803 -5521227 1696135 6436680 2753264
9955 2753264 -4434697 -5549078 847675 7729697 10228171 9616156 7531043 3725637
9947 3725637 45587 -563264 127488 -1988979 -4681510 -1849403 4027828 2574598 -7495724
9938 -7495724 -13344565 -6753390 2655115 2224291 -4945310 -7462000 -4604832 -4604952 -8441686
9929 -8441686 -9027772 -4856129 -1631241 -476912 3468292 10110506 13693853 13996508 16238910
9920 16238910 18212686 10792429 -4812322 -13940437 -9465972 -3481552 -8866797 -19973751
9912 -19973751 -22964748 -17087516 -12922150 -14435669 -15309817 -10963646 -3155353 6441355
9904 6441355 16999696 22864967 17041421 2247335 -9600684 -11267750 -7006246 -3833355
9896 -3833355 -2720455 -961521 2593594 7733919 13833634 18208930 17517054 12642337
9888 12642337 8363777 6881234 5790106 3337056 627489 -2664613 -8864571 -16044449
9880 -16044449 -17094980 -8912895 2304956 8863272 10118006 9344170 7334646 4557431
9872 4557431 4911181 10337700 14903270 11687828 3581143 -448354 1289466 2007995 -983519
9863 -983519 -1591806 4006758 9654456 7964941 1068938 -3372502 -2952902 -1321460 -952167
9854 -952167 -1275790 -2573275 -5566687 -7204420 -2717442 6764819 13597471 12806621 7809359
9845 7809359 4222487 1640200 -4233705 -13187490 -19088970 -17561902 -11595176 -7544725
9837 -7544725 -7412537 -7394015 -3634445 2782429 7591441 8854071 8889268 10476656 12801788
9828 12801788 12749432 9708151 7072878 8004113 10986503 11493549 8164609 5444181 8463931
9819 8463931 16001344 20779251 17644732 9749613 4934979 7074720 13029322 17232516
9811 17232516 16348670 9667605 -1037707 -10478951 -12618362 -7635079 -3161316 -4832833
9803 -4832833 -8452329 -6692999 -1325335 -1358100 -8577634 -13116794 -7321671 2754784
9795 2754784 5924393 1269751 -2548502 -1045300 1289109 374214 -1117129 92951
9787 92951 1451179 -1125893 -6418383 -10135005 -11408984 -12077704 -10797971 -3289853 10680620
9778 10680620 24758755 32272064 32201175 27386165 19994414 11508824 4476113 -7586
9770 -7586 -5350334 -14899253 -23823480 -21579797 -6090388 9675247 11692854 2562319
9762 2562319 -2902099 858964 3292776 -3892690 -11967223 -8297728 2665208 4703610
9754 4703610 -5295269 -11723478 -3513817 9387919 11466862 4594432 3711500 13633930
9746 13633930 22817510 21245361 13391299 8487078 6286998 351902 -8662689 -11730670
9738 -11730670 -4179243 6769055 10641352 6541527 3123391 6587703 13016387 14483967
9730 14483967 9722060 5027798 5467243 9110968 10822313 8454824 3762451 66856
9722 66856 820335 7338509 15254062 16226810 7038144 -5005457 -9771268 -5832772 20681
9713 20681 3204766 5257154 6987127 4382164 -4936289 -15321051 -17946153 -10976210
9705 -10976210 -1484045 2967016 2397457 2875720 7660553 12022746 9137415 297519
9697 297519 -5120999 -1668309 4954843 6682099 4485230 4628927 7128290 6591967 3282579
9688 3282579 3695003 8953885 12062036 9486884 6335477 5969307 3693745 -3395147 -8896076
9679 -8896076 -6817438 -1408417 722434 1424575 5041245 8218088 6193582 3858544
9671 3858544 8669430 16231729 15533083 6548803 -165262 -692560 -1327212 -4274350 -3584397
9662 -3584397 1759079 3959619 120912 -2451051 267412 2550750 1924598 5566418
9654 5566418 15289967 18827226 7507708 -7767300 -11014185 -3463076 1830056 886656
9646 886656 138913 1483629 421000 -3132002 -5357790 -8117358 -15120772 -20274687 -13987267
9637 -13987267 -819879 4106678 -1912438 -4948218 2937996 12037525 12541579 9412472
9629 9412472 10252174 10638142 3606046 -5064020 -3991444 6258432 14252280 13577080 7930592
9620 7930592 2432176 -1055350 -1014356 2894338 5977437 2631669 -4961070 -8199867 -3223679
9611 -3223679 4022011 5284970 -496315 -6269745 -4248502 5393700 13241331 10681833
9603 10681833 1053944 -4252340 -1401649 1835725 595237 1937121 12157962 23650054
9595 23650054 25045484 18701093 16086414 19044009 18320952 10021994 1029331 -3461097
9587 -3461097 -6160223 -8449212 -5897127 2102281 7515253 4518751 -1884939 -3784076
9579 -3784076 -1064498 1189899 1230428 1452972 3868481 8248881 12149893 11658903 6174109
9570 6174109 2200466 5912584 12095944 9555685 -1108656 -6271803 135364 6910378
9562 6910378 3901214 -1553255 2479563 12326087 14622342 6759349 -1817069 -5508393
9554 -5508393 -7107001 -8018971 -6050645 -3006884 -3632081 -6230838 -4117523 2843396 7382904
9545 7382904 6062996 2339332 -1645206 -6511590 -8657198 -2714383 7547213 11782237
9537 11782237 8716486 8039411 14079645 19751568 20477400 20809701 21435446 13805827 -3244753
9528 -3244753 -14983318 -10871794 -1574063 -1875546 -6712466 -1196162 12268604 16039191
9520 16039191 4792208 -7055132 -7559887 -917032 5077760 10328870 14580523 11221111
9512 11221111 -1661298 -13110903 -12115496 -3111138 245908 -6194132 -12335557 -7343067
9504 -7343067 7316129 19089604 16792374 2272838 -10524159 -10369453 -1404748 3562349
9496 3562349 1128322 825152 8926081 17648807 16278889 6407585 -1576306 -3343435
9488 -3343435 -3883258 -6998591 -9105068 -5560961 1674599 6107381 4886818 2089947
9480 2089947 2772400 5185109 2344833 -7188725 -14312645 -10015262 1787812 8867763
9472 8867763 7005490 3598341 4245817 4861610 608171 -5846763 -10405124 -14513729 -19565645
9463 -19565645 -20679735 -13683463 -3623746 1274819 470448 -1229454 -2959619 -6524946
9455 -6524946 -8822058 -4806848 2733046 4972950 -644425 -7039008 -7429737 -2505915
9447 -2505915 3168528 6275156 5487636 2277089 1566252 6757119 13807757 14928667 8262499
9438 8262499 -469104 -5368507 -4881923 -237321 5275944 6593940 1882536 -4097656
9430 -4097656 -6808252 -9081405 -14610855 -18274435 -12819705 -2553212 1354172 -1763685
9422 -1763685 -2235547 2121987 2927152 -1397580 -1182243 5538236 5985507 -5437848 -13486572
9413 -13486572 -4380483 10782126 12062720 1378975 -2004239 7325612 13832599 6506447
9405 6506447 -5953477 -10840558 -8669358 -7123204 -7203221 -3498106 6436406 18533556
9397 18533556 25806389 23624637 14353284 6875013 7648760 12996768 14775410 11696516
9389 11696516 8675662 7106320 4334220 1962140 4732503 9939125 8213327 -1878811
9381 -1878811 -9680376 -7571420 -1358997 327668 -1217927 -170247 2344127 950052
9373 950052 -3844775 -6681536 -6419281 -6746667 -8732203 -9269407 -6784974 -3070982 659332
9364 659332 4847265 8542364 9605026 8513982 8172470 9061929 8055850 3692482 67987
9355 67987 2996508 12790244 22716914 25696065 21960719 18223641 18680031 19666229 15902251
9346 15902251 9277716 6467807 9035553 12013541 12740799 14328086 17883125 17807954 9364883
9337 9364883 -3737192 -13888518 -17884494 -16421813 -9552192 1570783 11119910 12856454
9329 12856454 7339887 784936 -2211353 -1588024 321822 168594 -4609484 -11284934
9321 -11284934 -12200141 -4618397 3021601 1135652 -7225465 -10233724 -3695827 4787207
9313 4787207 8518402 9789003 12494204 14490540 12015108 6074668 -462985 -7891511
9305 -7891511 -16919819 -23984428 -24056727 -16686425 -6088065 3248691 8766090 9986314
9297 9986314 9110259 9488350 11232813 10476998 4897685 -2750783 -8531733 -11268798 -10375887
9288 -10375887 -4577037 3175715 4671262 -3158428 -10662688 -6531705 5480534 10184903
9280 10184903 1820225 -8226069 -7740214 854911 6705234 5324027 535182 -3459173
9272 -3459173 -4845011 -2163078 3621126 6812104 2861505 -4749739 -8844487 -7878365
9264 -7878365 -5287247 -2107569 2416228 4780772 609240 -6265557 -7386736 -2957866
9256 -2957866 -1415923 -4015397 -1563962 9037084 17156582 14714699 8526301 6485440
9248 6485440 2613506 -10435608 -22820826 -18563964 -1028220 9914584 5482219 -3682283
9240 -3682283 -7672658 -8646549 -8238104 -1248748 10020874 10895497 -4542644 -19627767
9232 -19627767 -15664500 2364536 14006903 11033880 3224639 -128216 -753567 -2777896
9224 -2777896 -4593062 -2593992 3323328 10054721 13453690 10699779 3865145 -786978
9216 -786978 -380814 838937 -1217461 -4239843 -5116314 -5887354 -7737968 -5261881 4787381
9207 4787381 14485354 14562971 8986647 8575357 13153923 12450867 3676376 -4541273 -6589174
9198 -6589174 -5807652 -3816301 3578405 15359790 21537556 16665187 8025909 4058200
9190 4058200 2711094 -1960413 -8614023 -11367714 -8735599 -3400650 2868259 8497477
9182 8497477 10035754 6074730 476590 -2242878 -1890639 -290121 1926467 3510341
9174 3510341 2379668 164677 1553652 5847863 5738343 -692171 -3748978 4767054
9166 4767054 17617092 20190307 9906409 -1028719 -1876384 4986736 9794376 7064562
9158 7064562 -558969 -6735567 -7772879 -5617871 -4715335 -5846006 -5147949 -111038 6510642
9149 6510642 10722218 12378343 14022585 17145306 21362913 24540750 22583284 13157070
9141 13157070 1305528 -3509132 1360983 8186884 9201763 5073446 -80086 -5453655
9133 -5453655 -10176934 -9579692 -1883929 6046501 6794987 2483415 39734 414758 47266
9124 47266 -569113 1771150 5527570 6536364 5585337 5879992 5459596 1228561 -1820034
9115 -1820034 3668650 13266051 14473148 6065912 1181340 6989817 13562235 10115232
9107 10115232 1635948 -452471 3742386 5237505 2128473 1257778 5171569 7913456
9099 7913456 5078730 -698499 -6623130 -13966935 -21272719 -20560499 -7277416 10021580
9091 10021580 17676467 13404403 7293335 5847229 3666598 -4586264 -11727779 -6370375
9083 -6370375 9753012 22268115 21715387 12005664 749592 -9034570 -14501161 -10628236
9075 -10628236 1014489 9388086 7915423 4469671 8650772 15694936 14301744 5774241
9067 5774241 2090804 6370606 8848619 3854027 -2135466 -3376096 -3882612 -7218512
9059 -7218512 -7387502 1567360 13815962 18415166 13789468 8079376 7553278 11006634
9051 11006634 14140808 14245745 11228558 7594023 6585510 8281856 9498442 8981481
9043 8981481 9189569 10895830 10480835 5887185 1006533 166648 2210877 4358496 7800013
9034 7800013 14049902 19317639 18986310 15579030 15733271 20070715 22031680 16713301 5790828
9025 5790828 -6015875 -14194071 -14564573 -6298196 4090288 7444035 2782711 -1315579
9017 -1315579 1645847 7792694 9286859 4658317 -1489996 -5773702 -7790010 -6280956
9009 -6280956 586966 10233267 15820721 14114802 10201674 11143242 16592986 19410583
9001 19410583 15416716 8617694 5040539 4714583 3340084 175095 -559463 3107191
8993 3107191 6881044 6502364 4868929 8056615 15156653 17765050 11835690 5227748
8985 5227748 8148904 18064073 21020645 9910851 -4987187 -9219385 -3662733 -2398429
8977 -2398429 -11429035 -19081259 -12337625 4741184 16928735 18059121 15805361 16759019
8969 16759019 16832256 10706226 3063506 2772920 9062051 11350733 3719814 -6519870
8961 -6519870 -8127107 -375401 6359565 3849741 -4579424 -9738460 -8332993 -5394905
8953 -5394905 -6419637 -11217282 -15794486 -16744188 -13084092 -7121303 -4113545 -7257133
8945 -7257133 -12362028 -12194057 -6957867 -4161731 -6000780 -4957441 3225777 10857628
8937 10857628 10709888 9177578 15412838 23033229 17544070 675011 -8549553 -525951
8929 -525951 11492362 11578141 2756215 -985551 4477743 11178422 12483742 8882912 2923459
8920 2923459 -3373119 -7155409 -7145754 -6478740 -8326904 -10492710 -9106297 -5622120 -4974531
8911 -4974531 -8164092 -11359872 -11304036 -7751218 -2044161 3237146 5354925 5609958 9357608
8902 9357608 17573410 22210793 16039566 4110521 -1774400 1736703 7395127 9305389
8894 9305389 8536187 6430697 1722593 -2760548 275125 10501671 15262737 5297038
8886 5297038 -9935003 -12758333 -1522561 6436811 -1388128 -15774085 -19404204 -10392912
8878 -10392912 -2352130 -3651023 -7596432 -5362740 1160873 5111724 5600985 5085960
8870 5085960 1318855 -8340641 -17322116 -15362794 -4152868 2878811 -601105 -4790680
8862 -4790680 1166101 13287826 19385843 15794315 9110323 4599344 1562166 -439934
8854 -439934 1099154 5919300 8507195 5069607 -43438 1259602 10436272 19216150
8846 19216150 18221970 7171062 -5767106 -13904457 -17330960 -17679313 -13643466 -5905220
8838 -5905220 -788885 -1917370 -2736933 3585113 10530510 6400908 -5424351 -8899281
8830 -8899281 -205974 5356713 -2082272 -10776218 -6938793 2159184 -364178 -14383188
8822 -14383188 -23292752 -17618126 -4137948 7030904 11889723 9549228 1445343 -5600213
8814 -5600213 -5388141 -1802502 -3084767 -7388878 -4870691 5329073 11896724 7891912
8806 7891912 -433237 -5545311 -9172977 -14996929 -19376221 -16847730 -9353149 -3245915
8798 -3245915 -826490 -365625 -1349192 -4373755 -7767165 -8847918 -7741385 -6847468 -7095560
8789 -7095560 -6861136 -4283420 445812 4914763 6697262 6229606 6532107 9341357 13402451
8780 13402451 17457026 21540721 23627989 19958342 12135352 7933114 9414257 6835941
8772 6835941 -6851598 -21231744 -20230841 -5792555 3994664 803038 -4152179 -50164
8764 -50164 7469231 7703367 1411613 -3608001 -5780293 -8541523 -10531858 -6594710 2997219
8755 2997219 11500370 13414299 8636774 371634 -7052844 -9989661 -8767530 -7473875
8747 -7473875 -7652861 -5163835 2923247 11224230 10947473 970511 -10371789 -14820971
8739 -14820971 -12352706 -9009882 -8673427 -8760145 -4618537 2821262 6829673 3971461 -225147
8730 -225147 926966 4703829 2845232 -5007661 -9534186 -4830166 4019291 9415815
8722 9415815 10790251 11698665 12984591 13677487 14573141 16152708 15967914 12302892 7810422
8713 7810422 5524862 3546374 -2176044 -11053411 -17498842 -17106238 -10833410 -3167895
8705 -3167895 2333276 5506726 8044983 10016272 9572650 6858449 5294038 6412750
8697 6412750 6475962 2212068 -2830602 -2743891 1911903 5002843 2944128 -2842325 -9061874
8688 -9061874 -11166440 -5101211 4825335 5274454 -9223055 -23925170 -21098667 -5551642
8680 -5551642 2507858 -2013002 -4291865 3094816 8565638 4122849 -132046 4590430
8672 4590430 9052697 2981266 -5511088 -3542190 4891476 7692525 5888392 8348910
8664 8348910 12150944 7127564 -3130857 -3265027 10311960 23794946 26209113 21660012
8656 21660012 18309907 16937572 14488319 9922800 3323246 -3626281 -5143603 2938631
8648 2938631 14277053 17064083 9153662 251387 -2223711 -1370489 -2777556 -5879543
8640 -5879543 -6922905 -5353627 -4000555 -5579567 -9919383 -12742549 -8878608 608529
8632 608529 7838699 8371179 7215196 9265896 9800199 2741318 -6899676 -9276558 -5130590
8623 -5130590 -4064502 -9074977 -13349040 -11725859 -5598331 2563776 9932892 10552502
8615 10552502 2851632 -2011612 7988410 26438249 34883476 28649958 20908519 19222655
8607 19222655 15615962 5836120 824853 8277836 17333893 14775854 5315886 1841381
8599 1841381 4274385 3187943 -1369087 -448405 6337925 8720682 2708130 -2863579
8591 -2863579 -533202 5085219 6266703 4323621 5827935 10695839 11261542 3154686
8583 3154686 -8311841 -14856554 -14942395 -13245521 -12349267 -10254907 -6687951 -5528166 -7211849
8574 -7211849 -4600577 6851076 18769693 18220821 5163173 -6842241 -7890951 -1898535
8566 -1898535 2118654 1721377 1132212 4976665 14321771 25043513 29662413 25118146
8558 25118146 17688179 14599114 13092356 6164987 -2815806 -2801820 6666061 12374534
8550 12374534 6714298 -1646625 -2382683 2048480 4432609 5683835 9994897 14198899
8542 14198899 12377359 7057116 6532554 12738488 18575339 16253089 4329829 -11179100
8534 -11179100 -20298490 -17949702 -11070314 -10618884 -15155958 -12252196 228372 7143600
8526 7143600 -1061341 -10860475 -4370996 13258724 20828414 10925835 -2606168 -5782681
8518 -5782681 893258 9621976 14785985 13268935 5705244 -526570 1587084 7685692
8510 7685692 7278394 418617 -1562840 5831612 12339124 7748199 -4353500 -12929574
8502 -12929574 -12292930 -3716474 8623094 17569501 14963785 611916 -14025475 -16728819
8494 -16728819 -7224228 4607985 10575564 10390449 8145851 6734349 5980741 4684928
8486 4684928 4023664 7403307 14772787 19207265 13994184 2435242 -5178799 -4807537
8478 -4807537 -2500564 -3454712 -4451130 -1209505 3072116 2665799 -1070560 -1393587 4161616
8469 4161616 11122606 14414883 13010768 8550573 3245948 -398046 -803765 881890
8461 881890 2035151 1928395 2364731 4861463 8635058 11689687 12885234 12513361 11327092
8452 11327092 9526032 7195565 5848044 8182142 14587345 20600586 20652124 15257170
8444 15257170 11996498 16971507 26154750 27991064 16109696 -1582331 -9118935 642622
8436 642622 17252464 24000892 16845893 6748349 2711078 474280 -6825722 -14459233
8428 -14459233 -12767227 -4283541 -1848073 -8921113 -14107372 -9593543 -3322706 -4777935
8420 -4777935 -8482128 -3257840 8017765 11128170 1609580 -9197869 -11083744 -7349425
8412 -7349425 -6222449 -8608014 -10065435 -8861255 -6314186 -3316648 -1358106 -3321740
8404 -3321740 -8720525 -11561500 -7466395 183293 5321734 6602003 4994924 -1288885
8396 -1288885 -12317487 -20327291 -16862291 -4944926 4272212 6626082 7706446 9948953
8388 9948953 7572629 -1665273 -9220791 -6612650 3537600 13434569 20365220 24201542
8380 24201542 21362791 10403804 -635205 -1849110 5742356 13116425 16459056 18623210
8372 18623210 19408628 14813519 6599007 2723520 5694421 8875473 7464173 5368712
8364 5368712 7157748 10027678 8887117 4602851 2343311 4728224 9939941 14078057
8356 14078057 13487541 7760060 1519033 -375181 229986 -2635787 -9249708 -13020422
8348 -13020422 -10220187 -4261632 1333323 6643907 9437243 4334401 -6920943 -12408812
8340 -12408812 -4500129 8626164 13451910 8295040 2423961 2176192 6296463 12418434
8332 12418434 19587072 24925376 25069935 21207524 17094575 12700321 5703530 -1360428
8324 -1360428 -2407353 2527208 5246623 4603 -8223065 -9679237 -1813590 7912727
8316 7912727 10853855 6497692 1728835 1676201 3939251 3505188 732735 465904 4440050
8307 4440050 9327371 12050392 12179555 9634461 6142287 8415193 21374395 36947738
8299 36947738 39555933 26514577 12719394 9229570 8259059 -1042247 -12098007 -10281364
8291 -10281364 2739370 9419895 875182 -12299958 -16474205 -11481716 -6076033 -4714587
8283 -4714587 -4656870 -2620679 59474 -1167914 -8020033 -15220230 -15461474 -9354990 -5088560
8274 -5088560 -5736259 -4430728 2468226 5975302 -2387473 -15081897 -18151213 -11646257
8266 -11646257 -7203208 -8008811 -6052697 368379 1939091 -4670146 -9074632 -3669656
8258 -3669656 3447865 993861 -8290153 -12475802 -7500981 -565907 1206639 -1715527
8250 -1715527 -4731757 -5061454 -3552104 -2920950 -4532079 -6568529 -6272412 -3518686 -455359
8241 -455359 1410471 1517332 -727499 -4308194 -6054278 -5151068 -5389631 -8648826 -9783314
8232 -9783314 -3938432 4660424 8629409 8819375 10871493 13120695 8923415 423614
8224 423614 -2070215 3280611 5255880 -3758692 -16164467 -20132591 -14746239 -8031458
8216 -8031458 -5271560 -5035026 -3729663 -149240 2988095 1336321 -4988794 -9574061
8208 -9574061 -8392852 -7010114 -12056523 -19061083 -18568300 -11784774 -8258452 -9193814 -6721765
8199 -6721765 -410161 604571 -4861452 -5943855 1187108 5503967 366061 -4154486
8191 -4154486 1528534 10423375 12093022 9912795 11731475 13735058 8638563 1728456
8183 1728456 2836706 8229881 6660203 -473541 -1653867 3613421 3250750 -5665022
8175 -5665022 -9610127 705511 14766691 16043635 3851451 -7074749 -5601490 3937592
8167 3937592 8891289 3443215 -5435461 -7180207 -844499 4280924 1392147 -5320641
8159 -5320641 -7328598 -2513894 4201310 7343736 4654170 -2159875 -7400813 -5841421
8151 -5841421 103764 2118078 -2472597 -6470468 -3619300 2445282 4738710 2743599
8143 2743599 393399 -874205 -1935365 -2985259 -4556860 -7019445 -6871724 -287186
8135 -287186 7595571 6316021 -3515984 -8710999 -3675290 920821 -2154402 -2497250 9702077
8126 9702077 23722905 22778384 9427230 -451205 -2492185 -5161216 -10568468 -11784294
8118 -11784294 -8046725 -6500050 -8401474 -7390393 -1626926 4440411 8907374 11103400
8110 11103400 5190393 -10723210 -23073363 -17278369 -1145562 4438794 -3166540 -6775729
8102 -6775729 -153831 2211524 -7887498 -17211300 -13407703 -4605615 -4452469 -11791370
8094 -11791370 -17248579 -18381932 -17214056 -12856559 -6476113 -4140660 -6198062 -3871769
8086 -3871769 5564299 11655692 7905183 3919177 9289102 16878714 15300006 7971349
8078 7971349 5076808 4720728 -1751999 -10858928 -10149033 876811 7892013 1629448
8070 1629448 -10928152 -17878975 -16003312 -10268773 -6316108 -6074000 -7222909 -6244992
8062 -6244992 -3701374 -4107420 -8478290 -11628519 -10411772 -8906635 -10282282 -9748782 -2747238
8053 -2747238 5384852 6648773 3252839 3742864 8522280 9142557 2384945 -3830583 -1496976
8044 -1496976 6452503 9907579 4003328 -4782471 -5431437 4664676 15351684 15264881
8036 15264881 5944723 -1014628 246430 4624187 6821838 7823724 8175491 4769796
8028 4769796 -1523731 -4771600 -5086066 -10076020 -19597971 -21474882 -10858674 -1170202
8020 -1170202 -4135806 -10445800 -4482506 11100183 21132349 21033948 18137045 15569812
8012 15569812 11182201 8242824 10660132 10947746 -60441 -14319623 -15619860 -5871293
8004 -5871293 -2504602 -9041614 -9623447 2851922 14520940 14606811 11842629 15557396
7996 15557396 18020074 9955787 -456935 -10163 8074030 10528616 4960432 35468
7988 35468 -479387 -554067 -1550659 -784523 877488 -360575 -3964993 -6225800 -6914514
7979 -6914514 -7620150 -5974466 645910 7530243 6665587 -2072150 -10106787 -10196393 -2554601
7970 -2554601 7337428 12314498 7516614 -3774160 -10672062 -6438420 2827794 6486546
7962 6486546 2984136 -1074737 -2038593 -1593812 -21917 4778925 11669888 16397280 17375630
7953 17375630 15908589 11958564 5783101 1955403 4345942 8150937 4884567 -4898851
7945 -4898851 -12019661 -12172057 -10439888 -10989958 -11099388 -8251647 -4994872 -3242563 -1399615
7936 -1399615 -754584 -6381369 -16547483 -19494152 -8113254 8476699 15702710 10737733
7928 10737733 1349534 -7022349 -13440035 -14575143 -7104282 3237946 5532256 -1369162
7920 -1369162 -6658162 -3068989 3922158 6512049 6302984 9338914 15000333 17077675
7912 17077675 13258330 7343687 3087854 628290 -1494783 -4399297 -8308854 -11271004
7904 -11271004 -9993802 -4720041 -819704 -1671538 -2419369 3968229 15808111 23717532
7896 23717532 22578402 17084389 14632413 17703298 24159256 29824483 29390219 20320474
7888 20320474 8092164 2149568 4068151 5639675 2088771 108698 6565969 15536944
7880 15536944 15695446 7218706 1346239 3617845 7225002 4883533 -1476829 -6666253
7872 -6666253 -10397840 -14057051 -14827614 -9578441 -1856077 993066 -2914617 -7888411
7864 -7888411 -7827572 -2522180 3312078 5244217 3127075 514391 -559129 -3724697 -14285014
7855 -14285014 -30390108 -42163037 -42227812 -33890635 -25681800 -20794057 -16094865 -9450780
7847 -9450780 -3173823 -560542 -2487517 -6939593 -9401332 -5703225 2123523 5574417
7839 5574417 211525 -6211851 -2966059 8106920 14905558 12947437 10697583 14022312
7831 14022312 16156485 10243923 2758335 4121130 11680064 13546570 6971261 1552290
7823 1552290 3855394 9186454 10841292 8555756 4653239 -239361 -3959157 -2508444
7815 -2508444 3028478 5986093 4511742 5267479 11825958 16991408 13644780 6559601
7807 6559601 4977044 8710249 10940943 10697952 12140089 13806085 9729579 1297246
7799 1297246 -2595059 965855 4725385 3188621 -50878 -297016 1134844 1994472 3902601
7790 3902601 7403466 8901983 7463645 8273000 13822429 17801797 14377218 8422130
7782 8422130 8992897 16031403 21020997 18942649 12659192 6198940 -51005 -6888392
7774 -6888392 -13551512 -18294650 -19405717 -16389825 -11902317 -10233331 -11618352 -11176244
7766 -11176244 -6319011 -1236481 22869 710422 6001528 13718478 16824726 13324857
7758 13324857 7681203 3727086 1878893 2171894 4280374 5322037 3145095 1046574
7750 1046574 3914732 10664891 15908608 17712809 17569742 14276930 5583580 -4258418
7742 -4258418 -6865629 -1330475 3855702 2786175 -752747 -1073881 820022 347081 -3649859
7733 -3649859 -8553124 -11094809 -8577198 -761309 7734805 11069182 9564434 8693229
7725 8693229 9590055 6962594 -832152 -6413120 -3077301 5139912 8696503 4594070
7717 4594070 -1777074 -4397658 -1721495 4197279 9745224 12050327 12002678 13514414 17634829
7708 17634829 19560701 14037640 2072894 -9703806 -14882063 -11704169 -4290040 -132875
7700 -132875 -3009701 -7751593 -6246647 957529 5077833 2671194 1119988 6249024
7692 6249024 12017408 9762174 2148448 -837733 3211432 7137089 6324333 4411973
7684 4411973 5505803 7487486 5987318 886273 -3565797 -2916144 3779570 12100672
7676 12100672 14553236 7878026 -2154086 -6642020 -4204591 -1940319 -5089709 -9857329
7668 -9857329 -9103983 -2699325 1356180 -3468403 -13737686 -19328554 -15185952 -7125432
7660 -7125432 -3802583 -5452891 -5140779 -160862 3949027 2196821 -2999417 -6699154
7652 -6699154 -7761059 -6319329 -153987 10895875 20648603 22598867 17893863 12414878
7644 12414878 8735218 6275584 6285648 9889199 13101086 10967709 5866624 4515509
7636 4515509 6745602 4858133 -4160580 -12817687 -12828447 -5425862 1584732 3087733 -542005
7627 -542005 -6741227 -12807186 -15821538 -13876497 -8201882 -3086340 -2678862 -6767886 -9789560
7618 -9789560 -6245623 1977804 6707928 3924639 -450613 1291525 8068552 12347073
7610 12347073 10479029 5441462 1424851 1357307 7581537 17976049 22732184 13251141
7602 13251141 -5023128 -16519100 -14082318 -6068523 -2463471 -2194380 677193 5184516
7594 5184516 5444805 990246 -2062747 286688 5083544 6875815 3872771 -1199752
7586 -1199752 -4671460 -5206649 -3436821 648267 7295377 13025684 11186823 400234
7578 400234 -10978221 -14347134 -11727152 -10066422 -7885003 1752006 15274034 18560756
7570 18560756 7494710 -3023231 1393057 14967655 21041289 14287978 3372614 -3960829
7562 -3960829 -7357025 -7199420 -2172016 5428009 10301593 11906475 14885831 20007360
7554 20007360 21076810 13868804 3327423 -1777622 944900 5199391 3270109 -5040260
7546 -5040260 -10888069 -5773438 6794579 13137226 6068091 -4979654 -6229026 2133396
7538 2133396 8238786 7027819 6180739 11972966 19072801 19441018 14068265 9542264 7779831
7529 7779831 5573526 1533337 -2197358 -3628264 -1929519 3570280 11099891 14759753
7521 14759753 9980439 285188 -5689970 -4088691 972823 4231235 5213643 6126081
7513 6126081 7341292 7333719 5356084 2369591 4577 -834776 -1137902 -3241162 -7585977
7504 -7585977 -10645040 -8476250 -1989495 4145432 7326189 7860389 4431915 -5106771
7496 -5106771 -16511619 -19756593 -11876877 -3193400 -3685277 -8210254 -4749849 5723937
7488 5723937 9398542 354117 -10489680 -10927726 -1666260 10072390 20797499 27234804
7480 27234804 22414313 5829321 -9595015 -12251386 -8384353 -11678271 -20558228 -20482471
7472 -20482471 -8022653 2799017 1544013 -5238126 -7737665 -7794721 -11250743 -14557882
7464 -14557882 -9640007 2357628 11371214 11309553 6723224 6838690 15610568 26641719
7456 26641719 28041669 15889570 1614963 -654884 6964288 9748039 3536958 929377
7448 929377 9323164 17067176 11664158 -428148 -5590256 -5048492 -9316077 -17024840
7440 -17024840 -16750789 -7782049 -1964346 -3604746 -3464373 3218933 7100220 -142749
7432 -142749 -12308884 -17979098 -15114935 -9366881 -4469022 -1126768 -538807 -2738404
7424 -2738404 -4299570 -1890633 4254922 12264093 20092894 23655224 18956386 8847479
7416 8847479 2606846 5504779 12790449 16531610 14342044 9313723 5716898 6607330
7408 6607330 11087465 12581231 5210941 -6838005 -12660395 -8905433 -3297591 -1587644
7400 -1587644 194049 5962811 10981159 10004523 6770247 7351105 9566939 7080176 -217035
7391 -217035 -7355634 -11780165 -12581205 -6945220 4391004 12511036 10520807 4880313
7383 4880313 6379781 12705296 11868248 2067010 -4953007 -2433292 2320504 2156925 1370778
7374 1370778 5129781 7769631 1985348 -7108386 -8456598 -2039705 1935450 -16886
7366 -16886 302239 8367440 17391489 18580361 13675933 10213008 8975910 4619349 -2620741
7357 -2620741 -4612908 2762500 12194690 14282911 9936385 7481226 9627282 10383558
7349 10383558 5930069 1931967 5573987 14020378 16662619 8685687 -2667278 -7722558
7341 -7722558 -6703424 -7801874 -13672532 -15924693 -7027603 6512076 10315150 1272007
7333 1272007 -7710248 -5592639 1845510 1885403 -5978123 -10351487 -5216287 3107093 7081558
7324 7081558 7066429 6717750 6881470 7406972 8623159 7908171 1308468 -7927623 -9392686
7315 -9392686 886366 13009589 15321616 9019651 4272800 5636664 8228258 6514796
7307 6514796 847719 -4550162 -6377495 -5215678 -4904357 -7038175 -6567034 1932735 13493211
7298 13493211 16222808 7714369 -1319828 -3723988 -5206559 -10217794 -10751611 -599395
7290 -599395 9921258 8368422 1350645 4250175 14892631 16297526 4229647 -7228084
7282 -7228084 -9403667 -9418561 -12385492 -12052600 -7054380 -8570538 -20203034 -25818658 -12258885
7273 -12258885 7713214 11652606 -1185286 -11328435 -7583989 2374980 9124876 13608742
7265 13608742 18564111 19966971 13339691 1780657 -7391563 -10295247 -8098816 -4243572
7257 -4243572 -2068638 -2837108 -4713020 -4792753 -2108999 2035153 5345502 5570692 2792737
7248 2792737 1233565 4881903 10512951 10620207 5042258 2420588 6456090 9145139
7240 9145139 4084145 -1925807 132799 6083105 5821709 882179 1321675 7581337 9820545
7231 9820545 5688912 4220912 8783001 10212599 3210525 -3053863 279892 6506827
7223 6506827 3858220 -5579813 -9349047 -3967488 607343 -3374579 -10547209 -10978394
7215 -10978394 -4307270 -325823 -5935379 -14917283 -14212432 -1147673 10429625 6659887
7207 6659887 -7150374 -12895505 -4588206 4531668 3139946 -2113951 388418 8686123
7199 8686123 12945039 11984839 11108354 8684199 -541691 -10911624 -9885916 2088350
7191 2088350 10050892 6376864 651647 2485990 7749811 9656407 11029581 14884184
7183 14884184 13624822 1379330 -10368286 -5206675 12981552 22638034 13568009 -368762
7175 -368762 -1894010 7752913 14427926 10983907 3683831 1726994 6193228 9656311
7167 9656311 5296361 -3703077 -6185039 2813381 13741003 14438433 6819529 2548751
7159 2548751 4184799 2786251 -4417232 -7607227 -1317275 4786121 1161332 -5933598
7151 -5933598 -5290884 686555 1138544 -4601593 -7039693 -3316020 -1110102 -5012183 -10112249
7142 -10112249 -11273729 -9416426 -6173833 -754542 5006887 5933531 1112482 -3723974
7134 -3723974 -4041440 -1673807 -648649 -2894014 -8689908 -15809126 -18217897 -12082747
7126 -12082747 -2856544 841355 -389983 561646 3171142 21684 -6787920 -4419914
7118 -4419914 9720813 20000357 15337853 7496761 13368798 28314646 32859426 21171052
7110 21171052 7061143 2310270 3403338 2398432 -891656 -2334384 -876421 2037584
7102 2037584 5149793 6906775 6820867 8102295 13490530 18110262 13355777 -414478
7094 -414478 -12080045 -13744825 -10056594 -9257225 -10876789 -8910848 -3808848 -3290146 -10239329
7085 -10239329 -16069118 -10428183 5083384 17867012 19283310 13680207 9643043 7411218
7077 7411218 1962859 -4220692 -1918309 9119314 15624877 8532011 -2985891 -4340742
7069 -4340742 3256526 5389271 -3801628 -13464461 -11439623 580069 10671617 10217682
7061 10217682 1100860 -7392101 -7558189 -1170677 2589473 -754386 -4552352 -1416670
7053 -1416670 4299204 2515296 -6197772 -9880579 -2077652 8779671 9933017 -1420306
7045 -1420306 -16721673 -24492291 -19192652 -6135341 2196665 -828177 -7756258 -7279257
7037 -7279257 -286547 2589583 -1804767 -4717401 293145 8786900 14114158 15289151
7029 15289151 12559386 4601952 -4884499 -6817684 788377 7866050 6367656 1717293
7021 1717293 2704527 6950518 5545625 -2695866 -10902923 -15235055 -17777772 -19657758
7013 -19657758 -18654828 -13803191 -7363663 -2445619 -1607915 -5442196 -9377426 -5674290
7005 -5674290 6884678 18823273 20446892 13242963 5779299 1724929 -1950328 -7246838
6997 -7246838 -11863850 -12880629 -9279436 -1931868 5705260 9156695 8065130 6437995
6989 6437995 5364046 1143514 -5491290 -5816014 4155032 14304763 13342576 5825917
6981 5825917 5137823 12745412 16617363 9657895 -2137212 -11293639 -17549122 -21896358
6973 -21896358 -21876401 -17464701 -13968252 -14434158 -15215404 -12799597 -9303093 -7746529 -7468300
6964 -7468300 -7622877 -9631733 -12457119 -11065836 -4260360 765153 -2841653 -11399918
6956 -11399918 -14389975 -6760792 6324336 15712204 15983470 8189368 -1719422 -6973722
6948 -6973722 -4577244 3043012 10530148 13531776 11474372 7904103 6874750 7409437
6940 7409437 3633977 -7028897 -18364829 -21904695 -16684214 -7986203 1115678 10873625
6932 10873625 19150201 21690635 18268809 12502524 5872846 -1695867 -6451913 -4519315
6924 -4519315 -939218 -4951923 -14340518 -15474146 -3483686 8608644 8400572 2102267
6916 2102267 3957216 14760964 22627848 21576650 17763379 17569885 19405570 19008717
6908 19008717 15417412 9824198 4338711 2972129 7999963 14088935 12230397 2089481
6900 2089481 -5197747 -624785 10405245 14590829 7754433 -84593 2205654 12839815
6892 12839815 19682418 15338290 5278344 -367255 928932 3638080 3084968 -567985
6884 -567985 -6142845 -12868044 -16884045 -12655942 -1125555 8403193 8409381 1609189 -4127965
6875 -4127965 -5500072 -4266708 -1505292 3143535 7712655 8061448 2363876 -6412132
6867 -6412132 -12036561 -8904542 2521364 13264566 13348139 3950695 -2997011 -515701
6859 -515701 4113784 1051877 -6820288 -8194983 368942 10713349 14427213 10513831
6851 10513831 2282322 -6080078 -9223119 -3639753 7233236 15693602 18436748 18214055
6843 18214055 17077838 13602714 7691957 2716667 1047748 1500268 2271929 2535037 742283
6834 742283 -3983824 -7879602 -4720826 6284541 18513758 25297034 26181134 25007236
6826 25007236 24653460 24271430 19897149 9121647 -2861278 -5921245 1725313 8080476
6818 8080476 3083937 -5165954 -1551876 11429448 15152239 2869504 -9354808 -6284853
6810 -6284853 5776863 11679595 9446736 7726561 9587911 11593351 13784405 18545413
6802 18545413 22750325 21731228 18399507 18586977 20300425 17732275 12843777 11781071
6794 11781071 12374443 7793207 1436782 4317244 16303489 23770744 19361446 10870159
6786 10870159 5574673 -827111 -11965155 -19798955 -16383505 -7376801 -2739658 -1382645
6778 -1382645 3179555 7888594 4408635 -4195629 -4642685 7229077 19409601 19429356
6770 19429356 8881198 -1288079 -3474194 1990537 9608379 12716086 8575842 1893244
6762 1893244 105795 4206224 8251287 8452769 7115351 5798340 1052626 -8761043
6754 -8761043 -17502355 -17721673 -10183883 -1700882 4452141 10416594 16880954 20135109
6746 20135109 17484196 11538178 6886256 4954653 4156074 3426545 3468284 5060934 7783714
6737 7783714 10579985 12724251 13872316 13436355 10353163 4011214 -4257580 -11051367
6729 -11051367 -13216418 -10763158 -7131102 -6111587 -8559425 -12322212 -14950695 -15545093
6721 -15545093 -13933667 -9769892 -4123027 -908187 -3681290 -10092707 -12330271 -5626257
6713 -5626257 5103745 9991009 5279273 -2892292 -5938121 -1597050 5398957 9041661
6705 9041661 7049099 1922822 -1341691 266261 4150965 4141191 -2063335 -8562957 -7219938
6696 -7219938 1785510 8500690 4531832 -6244248 -11927319 -7231015 469210 1611548
6688 1611548 -3198687 -5578197 -1350053 5686792 10941044 13099698 10224598 -116243
6680 -116243 -12771900 -14702805 -228074 18227256 23149865 13277641 3471390 4429043
6672 4429043 11637195 15539338 13774953 9752171 5907312 2748535 122066 -3582759
6664 -3582759 -9494160 -13978519 -11509320 -3399857 2516570 2987571 2947281 5135315 4700977
6655 4700977 -475367 -2640573 4441954 13467327 12435961 1521203 -7825256 -7780059
6647 -7780059 -5609 10421012 18228088 17470673 7123117 -3856240 -5665557 -952771
6639 -952771 -321248 -5601358 -7535742 -733469 8966379 14249762 14784388 13442036 11806769
6630 11806769 11737474 14363991 16100989 12745817 7653975 7295765 9232503 5611523 -1070961
6621 -1070961 544298 10634050 14904937 7293558 212445 2999854 5961563 -1004705
6613 -1004705 -8392745 -2825588 8517941 8949897 164974 -2081040 3711308 2960574
6605 2960574 -7953255 -14443537 -8208513 627000 3116564 5174088 11806113 14095883
6597 14095883 5047285 -4558884 -1142834 9688702 11112304 -451773 -12957517 -17707485
6589 -17707485 -17417637 -16169597 -13497438 -9988647 -8892707 -9752106 -8147948 -3829557
6581 -3829557 -2248362 -5898583 -10281089 -10784007 -8194786 -5108996 -1891846 1184495
6573 1184495 2277118 1468510 2324707 6880619 11831024 12628772 9311233 5755414 4975702
6564 4975702 7481917 12418824 17483602 19018729 15559360 11202505 12158172 18707457
6556 18707457 23232433 18652098 7334628 -1436229 -2519215 185738 1002694 663319
6548 663319 3793150 10754815 16408344 16207372 9915494 377520 -7484735 -8360418 -2931632
6539 -2931632 -835636 -9250331 -19095085 -13600064 6393864 18294286 7100663 -12337578
6531 -12337578 -15099564 -223511 11007448 7298496 64600 1598408 7211669 6736729
6523 6736729 1055177 -2742502 -3870842 -5463172 -5757072 -1415693 4095335 4203796 -793120
6514 -793120 -4526331 -3497457 676492 5639496 9371664 9677628 7953194 9604768 14630540
6505 14630540 13045431 -1420282 -17597795 -18376124 -3892575 9192884 11548763 10739138
6497 10739138 14140027 16414083 11188680 3646191 2144825 5811050 9598715 14014338
6489 14014338 19801791 19836850 8293074 -6304090 -9426393 -137450 9088678 11202172
6481 11202172 11299673 13677482 14534628 11514155 9719509 12282688 13492996 7954626 -172250
6472 -172250 -3905200 -4002352 -5767293 -9301840 -10014207 -6511379 -1699822 2665680 7179837
6463 7179837 11313268 13186933 12399617 10018481 7059377 5527616 8172887 13576958
6455 13576958 14822492 8349079 1450908 4105497 14043412 17144832 4558153 -15904243
6447 -15904243 -27928997 -22711025 -5257929 11698670 18140784 14009500 8150825 8671911
6439 8671911 14133420 16592595 12809863 8183719 8530500 12409984 14354251 12460827
6431 12460827 9336727 7263103 5724805 3446019 665964 -1073643 -798878 295347
6423 295347 -342324 -3225747 -5215622 -3380618 396952 1769030 432625 138414 1549432
6414 1549432 -11329 -7110679 -14718406 -16037697 -11041212 -5382196 -3131632 -4604101
6406 -4604101 -9024317 -14000053 -13564943 -3260503 11698165 19539820 16306757 11665021
6398 11665021 15449960 22963438 21289663 8527017 -2608657 -2750303 1742583 959692
6390 959692 -1586116 4785566 17976176 22933182 13795117 3320008 3504860 8334209
6382 8334209 6534342 2101658 7084996 18674441 20796512 9524284 158124 3367244
6374 3367244 9275351 4853085 -5005233 -6375339 1708894 7665163 5851236 2045801
6366 2045801 1504864 2515986 2562723 1884811 -220582 -4970624 -9165419 -7924802 -2936226
6357 -2936226 -607230 -1402202 836770 7335911 10750783 6509218 65852 -1885204
6349 -1885204 -1032492 -2804255 -6883575 -8021663 -3654921 3400566 7787730 4831905
6341 4831905 -5758807 -17108966 -20096012 -13851968 -7241085 -6880179 -8416776 -4002912
6333 -4002912 5713195 12359985 10203047 1389073 -7113524 -8342386 144668 12673141
6325 12673141 18854372 14455973 6590624 4593634 8614604 11335943 8247718 1583135
6317 1583135 -4031650 -5682208 -3467544 -718795 -609657 -490790 5843454 17265741
6309 17265741 23214440 17939195 9942124 9301991 12244105 9038553 1943699 1691109
6301 1691109 8224042 9783806 2723222 -2195600 2179555 8329516 8089579 6253995
6293 6253995 10813884 18142093 18135594 8859286 -2997482 -12414873 -18461524 -19353224 -13498365
6284 -13498365 -4962916 -1464977 -6141062 -14527709 -19088662 -15021826 -4147863 5281760
6276 5281760 6376896 2713976 4350888 12986617 18776101 15927421 12530358 17393305
6268 17393305 24944600 23383175 12687191 3680598 2019492 3585033 4572644 6178241
6260 6178241 8759686 9691247 8136617 5757167 2940467 -100615 -492346 2588902 3351081
6251 3351081 -2676086 -9424775 -8277745 -2089938 -350952 -3112953 -2651247 444893
6243 444893 -1943229 -7688288 -4312470 8593908 13635719 997693 -15168061 -16887557
6235 -16887557 -6481864 2048693 5159787 8823839 13054480 12575332 8875866 7791773
6227 7791773 7654359 2883475 -2367859 2392767 16500701 26706533 25745789 21195020
6219 21195020 21920906 25324765 23504457 15167931 5710709 -578069 -4011261 -7086619
6211 -7086619 -10661095 -11777698 -6493333 3164873 8535929 5157050 365090 3242714
6203 3242714 10574720 12088500 7426064 6310453 11182824 12237849 4065154 -4215044
6195 -4215044 -2585910 5149953 8614162 5826752 2038897 -1070000 -5347376 -8310808
6187 -8310808 -4956312 2966818 7501752 5125515 553420 -838697 1306323 5146227
6179 5146227 9701663 13539909 15027311 15481782 17880442 21106222 20174782 14147037 8715542
6170 8715542 7589891 6236992 -622300 -8894681 -9117487 629451 12165044 17716901
6162 17716901 16925471 12465524 5474485 -1716071 -4740535 -3941291 -6577954 -16275478
6154 -16275478 -24893164 -22438161 -11685828 -4162291 -3669531 -4011642 -2860741 -6054155
6146 -6054155 -14827888 -20199986 -16336882 -9749207 -7513777 -5524132 1566867 6651454
6138 6651454 -601838 -15075779 -20492202 -11904718 -1453491 22470 -4232729 -6024861
6130 -6024861 -4121852 -1646833 886324 3928503 5134579 2297868 -2928282 -7252622
6122 -7252622 -8816588 -6600744 -649274 5920020 9557020 11860335 17279803 24283041
6114 24283041 25420163 18653519 11896224 12297889 16834018 18172976 14898755 10772876
6106 10772876 7674349 4398574 140604 -4534730 -8119806 -7643692 -1375861 6243973
6098 6243973 7645455 2744095 319426 4886942 9116417 5275605 -2462712 -5356508
6090 -5356508 -4527856 -8072817 -16263390 -19996368 -14516358 -5906299 -1922164 -3383743
6082 -3383743 -6998873 -10721536 -13346657 -13261073 -10537678 -7594479 -6241785 -6196520 -6492111
6073 -6492111 -5646507 -1485339 5164746 7776614 746413 -11216419 -16509308 -10838547
6065 -10838547 -1924444 2204831 3057113 5574142 8102055 5199076 -2443027 -7727777
6057 -7727777 -6503119 -1776166 2051219 4513880 6932111 8535622 7631852 5249176
6049 5249176 5104408 9437054 15575811 17384192 11071348 -98242 -8225387 -9037722
6041 -9037722 -6233378 -5696810 -7380288 -6853690 -3964162 -4100510 -9027808 -12414956 -8939045
6032 -8939045 -2975996 -1942381 -4678970 -4537289 -1875579 -3460331 -9000754 -9610820 -3480534
6023 -3480534 -1524832 -9895920 -17301073 -10742630 4059993 11207608 8219142 6102908
6015 6102908 8264277 5957085 -3271288 -8748384 -4129450 2202162 1838721 -921574
6007 -921574 -217287 -1065015 -8961298 -16001632 -10763049 3414554 12860054 12692413 9077736
5998 9077736 4902122 -3314270 -13545767 -16006329 -6737910 5761229 11587823 10107487
5990 10107487 6372378 3358939 1283842 -480816 -3831081 -10276177 -17249455 -20205231
5982 -20205231 -18953274 -16866644 -13764210 -6402383 2923481 6460037 3013078 1991569
5974 1991569 10095720 20666237 22993448 16940792 10721754 8177543 7053490 7799665
5966 7799665 14076424 23106645 24667395 14218767 530780 -5327247 -3938970 -4186532
5958 -4186532 -9106638 -12635673 -10004620 -3929331 1477153 6417640 11534570 13956579
5950 13956579 12056036 9641800 9805023 8558772 1539823 -5956944 -4180546 6588909
5942 6588909 15407860 15478393 11239213 8572440 6366576 1808139 -3128710 -5297308 -4905069
$$ [...]
##END NTUPLES=NMR SPECTRUM
##END=
