##TITLE=31Pdec_SR-75-TFAA3-V2'
 CDCl3, 24 sc
 13.7.2023
##JCAMPDX= 6.0         $$ Bruker NMR JCAMP-DX V2.0
##DATA TYPE= NMR SPECTRUM
##DATA CLASS= NTUPLES
##ORIGIN= UXNMR, Bruker Analytische Messtechnik GmbH
##OWNER= root
$$ XWIN-NMR		Version 3.5
$$ Thu Jul 13 13:47:31 2023 Russian Standard Time (UT+4h)  she@DPX200
##.OBSERVE FREQUENCY= 81.013821
##.OBSERVE NUCLEUS= ^31P
##.ACQUISITION MODE= SIMULTANEOUS
##.ACQUISITION SCHEME= undefined
##.AVERAGES= 24
##.DIGITISER RES= 16
##SPECTROMETER/DATA SYSTEM= spect
##.PULSE SEQUENCE= zgpg30
##.SOLVENT NAME= CDCl3
##.SHIFT REFERENCE= (INTERNAL, CDCl3, 0, 248.564)
##AUDIT TRAIL= $$ (NUMBER, WHEN, WHO, WHERE, WHAT)
$$ ##TITLE= Audit trail, XWIN-NMR		Version 3.5
$$ ##JCAMPDX= 5.01
$$ ##ORIGIN= Bruker BioSpin GmbH
$$ ##OWNER= she
$$ F:/spectra/data/she/nmr/P31/1/pdata/1/auditp.txt
$$ ##AUDIT TRAIL=  $$ (NUMBER, WHEN, WHO, WHERE, WHAT)
(   1,<2023-07-13 13:45:39.93 +0400>,<she>,<DPX200>,
      <created by zg, POWCHK disabled, PULCHK disabled
       configuration hash MD5:
       00 E9 B6 7A A2 85 ED C7 34 08 36 98 17 FE 4E 26
       data hash MD5: 32K
       40 0E BF 59 D2 43 A5 D8 C8 0F 6C F4 CB 4F F7 9C>)
(   2,<2023-07-13 13:46:01.67 +0400>,<she>,<DPX200>,
      <Start of raw data processing
       efp BC_mod = 2 LB = 1 FT_mod = 6 PKNL = 1 PHC0 = -10721.49 PHC1 = 146.4848 SI = 64K 
       data hash MD5: 64K
       F9 6F CE 75 64 1B 59 C8 FD A7 E0 4F 9F C6 6E D1>)
(   3,<2023-07-13 13:46:23.79 +0400>,<she>,<DPX200>,
      <pk PHC0 = -37.19153 PHC1 = 111 
       data hash MD5: 64K
       63 A7 CB A2 10 E7 89 18 26 51 8E 2F 70 7B A7 86>)
(   4,<2023-07-13 13:46:30.50 +0400>,<she>,<DPX200>,
      <abs ABSG = 5 
       data hash MD5: 64K
       AA DF 00 34 BE 47 A1 A5 D0 37 94 B0 9C D5 89 C9>)
(   5,<2023-07-13 13:46:44.35 +0400>,<she>,<DPX200>,
      <pk PHC0 = -6.402518 PHC1 = 0 
       data hash MD5: 64K
       08 CE 84 B6 0E 5A 11 AC A9 5A 28 FB 3B 6B 8C E2>)
(   6,<2023-07-13 13:46:52.42 +0400>,<she>,<DPX200>,
      <abs ABSG = 5 
       data hash MD5: 64K
       B2 7B 3A A6 50 47 09 F3 2D 00 9D 4C 54 E6 A1 0A>)
$$ ##END=
$$ 
$$ hash MD5
$$ 9E D3 FB 34 2D FF E6 B7 1E D5 3E 45 25 BD 85 76
##$RELAX= 
##$RELAX= 
##$RELAX= 
##$RELAX= 
##$RELAX= 
##$RELAX= 
##$RELAX= 
##$RELAX= 
##$RELAX= 
$$ Bruker specific parameters
$$ --------------------------
##$DU= <F:/spectra>
##$EXPNO= 1
##$NAME= <P31>
##$PROCNO= 1
##$TYPE= <nmr>
##$USER= <she>
##$AMP= (0..31)
100 100 100 100 100 100 100 100 100 100 100 100 100 100 100 100 100 100 
100 100 100 100 100 100 100 100 100 100 100 100 100 100 
##$AQSEQ= 0
##$AQ_mod= 1
##$AUNM= <au_zg>
##$AUTOPOS= <>
##$BF1= 81.014009
##$BF2= 200.13
##$BF3= 200.13
##$BF4= 200.13
##$BF5= 200.13
##$BF6= 200.13
##$BF7= 200.13
##$BF8= 200.13
##$BYTORDA= 1
##$CFDGTYP= 0
##$CFRGTYP= 5
##$CHEMSTR= <none>
##$CNST= (0..31)
1 1 145 1 1 1 1 1 1 1 1 1 1 1 1 1 1 1 1 1 1 1 1 1 1 1 1 1 1 1 1 1 
##$CPDPRG= <waltz16>
##$CPDPRG1= <>
##$CPDPRG2= <waltz16>
##$CPDPRG3= <>
##$CPDPRG4= <mlev>
##$CPDPRG5= <mlev>
$$ [...]
##$SUBNAM3= <"">
##$SUBNAM4= <"">
##$SUBNAM5= <"">
##$SUBNAM6= <"">
##$SUBNAM7= <"">
##$SUBNAM8= <"">
##$SUBNAM9= <"">
##$SW= 501.771253377433
##$SWIBOX= (0..15)
0 1 3 0 0 0 0 0 0 0 0 0 0 0 0 0 
##$SW_h= 40650.406504065
##$TD= 32768
##$TD0= 1
##$TE= 0
##$TE2= 300
##$TE3= 300
##$TEG= 300
##$TL= (0..7)
0 120 53 12 22 120 120 120 
##$TP= (0..7)
150 150 150 150 150 150 150 150 
##$TP07= 0
##$TPNAME0= <>
##$TPNAME1= <>
##$TPNAME2= <>
##$TPNAME3= <>
##$TPNAME4= <>
##$TPNAME5= <>
##$TPNAME6= <>
##$TPNAME7= <>
##$TPOAL= (0..7)
0.5 0.5 0.5 0.5 0.5 0.5 0.5 0.5 
##$TPOFFS= (0..7)
0 0 0 0 0 0 0 0 
##$TUNHIN= 0
##$TUNHOUT= 0
##$TUNXOUT= 0
##$USERA1= <user>
##$USERA2= <user>
##$USERA3= <user>
##$USERA4= <user>
##$USERA5= <user>
##$V9= 5
##$VALIST= <valist>
##$VCLIST= <CCCCCCCCCCCCCCC>
##$VD= 0
##$VDLIST= <DDDDDDDDDDDDDDD>
##$VPLIST= <PPPPPPPPPPPPPPP>
##$VTLIST= <TTTTTTTTTTTTTTT>
##$WBST= 1024
##$WBSW= 4
##$XGAIN= (0..3)
0 0 0 0 
##$XL= 0
##$YL= 0
##$YMAX_a= 6572
##$YMIN_a= -6010
##$ZGOPTNS= <>
##$ZL1= 120
##$ZL2= 120
##$ZL3= 120
##$ZL4= 120
##$ABSF1= 248.5645
##$ABSF2= -253.2056
##$ABSG= 5
##$ABSL= 3
##$ALPHA= 0
##$AQORDER= 0
##$ASSFAC= 0
##$ASSFACI= 0
##$ASSFACX= 0
##$ASSWID= 0
##$AUNMP= <proc_1d>
##$AZFE= 0.1
##$AZFW= 0.5
##$BCFW= 0
##$BC_mod= 2
##$BYTORDP= 0
##$COROFFS= 0
##$CY= -3
##$DATMOD= 1
##$DC= 0
##$DFILT= <>
##$DTYPP= 0
##$F1P= 0
##$F2P= 0
##$FCOR= 1
##$FTSIZE= 65536
##$FT_mod= 6
##$GAMMA= 0
##$GB= 0
##$INTBC= 1
##$INTSCL= 6.047779e-11
##$ISEN= 30
##$LB= 1
##$LEV0= 0
##$LPBIN= 0
##$MAXI= 10000
##$MC2= 0
##$MEAN= 0
##$ME_mod= 0
##$MI= 50
##$NCOEF= 0
##$NC_proc= -9
##$NLEV= 6
##$NOISF1= 182.463
##$NOISF2= 159.3651
##$NSP= 0
##$NTH_PI= 0
##$NZP= 0
##$OFFSET= 248.5645
##$PC= 4
##$PHC0= -10765.08
##$PHC1= 257.4848
##$PH_mod= 1
##$PKNL= yes
##$PPARMOD= 0
##$PSCAL= 0
##$PSIGN= 0
##$REVERSE= no
##$SF= 81.0140089999694
##$SI= 65536
##$SIGF1= 159.3651
##$SIGF2= -187.1042
##$SINO= 113.3802
##$SIOLD= 16384
##$SREGLST= <1H.CDCl3>
##$SSB= 0
##$STSI= 65536
##$STSR= 0
##$SW_p= 40650.406504065
##$SYMM= 0
##$S_DEV= 0
##$TDeff= 32768
##$TDoff= 0
##$TI= <>
##$TILT= no
##$TM1= 0
##$TM2= 0
##$TOPLEV= 0
##$USERP1= <user>
##$USERP2= <user>
##$USERP3= <user>
##$USERP4= <user>
##$USERP5= <user>
##$WDW= 1
##$XDIM= 65536
##$YMAX_p= 361155854
##$YMIN_p= -511755455
$$ End of Bruker specific parameters
$$ ---------------------------------
##NTUPLES= NMR SPECTRUM
##VAR_NAME=  FREQUENCY,     SPECTRUM/REAL,   SPECTRUM/IMAG
##SYMBOL=    X,             R,               I
##VAR_TYPE=  INDEPENDENT,   DEPENDENT,       DEPENDENT
##VAR_FORM=  AFFN,          ASDF,            ASDF
##VAR_DIM=   65536,         65536,           65536
##UNITS=     HZ,            ARBITRARY UNITS, ARBITRARY UNITS
##FACTOR=    0.620285442955139, 1,           1
##FIRST=     20137.2065510682, 0,            0
##LAST=      -20513.1999529968, 0,           0
##MIN=       -20513.1999529968, -511755455,  0
##MAX=       20137.2065510682, 361155854,    0
$$ Real data points
##PAGE= N=1
##DATA TABLE= (X++(R..R)), XYDATA
$$ [...]
12954D569146P208958m057426p389725k978173L83886J243821M650961R686438
$$ 4569146 11778104 7720678 330953 -2647220 -2263334 -1019513 3631448 13317886
12946A3317886R270150J917314n444528p301103n258463l134309k188928k078484
$$ 13317886 22588036 24505350 19060822 11759719 6501256 3366947 1178019 -900465
12938i00465j917945j33431L035520M022484R24618k186070r67300J736088L64942
$$ -900465 -2818410 -2951841 83679 4106163 5030781 2844711 1877411 3613499 3978441
12929C978441l794979m910621k699805j853906k277364P17779O029402O583029
$$ 3978441 183462 -4727159 -7426964 -9280870 -11558234 -10840455 -4811053 1771976
12921A771976J557133j341744P92740R52641m287763o711337J64666Q901121R305360
$$ 1771976 3329109 1987365 2780105 3732746 -555017 -7266354 -7101688 1799433 11104793
12912A1104793M298706L127207M465906l00391r640275j2017441m512622K039536
$$ 11104793 15403499 18530706 22996612 22696221 13055946 1038505 -3474117 -1434581
12904a434581M03062k481615J482524P932924P749992J381108l318421l293959
$$ -1434581 -1031519 -3513134 -2030610 5902314 13652306 15033414 11714993 8421034
12896H421034k240105k800422l880167m464057m491817l186100j086325j496223
$$ 8421034 6180929 3380507 -499660 -4963717 -9455534 -12641634 -13727959 -15224182
12888a5224182n048573n945141R8076P102031N973265j315661l855826J820055
$$ -15224182 -20272755 -26217896 -26119820 -19017789 -13044524 -14360185 -18216011 -16395956
12880a6395956P354902O757977M818890O370433O499075n70576r591132j0817646
$$ -16395956 -9041054 -2283077 2535813 8906246 15405321 14834745 5243613 -5574033
12872e574033m759694q22582k307772k081520M941934J2657606J1455183R22584
$$ -5574033 -10333727 -11156309 -13464081 -15545601 -10603667 2053939 13509122 14431706
12864A4431706r342886j0275438k171450O584557Q212301K693884l510796n065045
$$ 14431706 5088820 -5186618 -7358068 -773511 7438790 10132674 6621878 1556833
12856A556833k462837P09344K259114J744827o10511k826053j583714L140481
$$ 1556833 -906004 -196660 2062454 3807281 3196770 370717 -1212997 1927484
12848A927484O055975K650717m448763q680657p330914k500548L409829Q374926
$$ 1927484 7983459 10634176 6185413 -2495244 -9826158 -12326706 -8916877 -541951
12840e41951Q857839L391635k524041j665338M147400N404579r67307o134139
$$ -541951 8315888 11707523 9183482 7518144 11665544 17070123 16102816 9968677
12832I968677k478157M194114K738440o493131j1250072m281501O477850Q231312
$$ 9968677 7490520 11684634 14423074 7929943 -3320129 -7601630 -1123780 7107532
12824G107532l00764p744036m649091N133972R986963N213201j950837k980654
$$ 7107532 6806768 -937268 -5586359 -452387 9534576 14747777 12796940 9816286
12816I816286M54679O9556n865734r417294m968704J698202J569660m018454n206176
$$ 9816286 10270965 10340521 4474787 -4942507 -9911211 -8213009 -6643349 -10661803 -15867979
12807a5867979J415284P318448M584771k362598l290792L225516Q440920N763831
$$ -15867979 -14452695 -7134247 -2549476 -4912074 -8202866 -4977350 3463570 9227401
12799I227401j685685o454559m564229K883693J0868132J2268704M123179o446100
$$ 9227401 7541716 1087157 -3477072 -593379 10274753 22543457 26666636 20220536
12791B0220536q755718k943865k44850n633908r627588l933243M411232M753849
$$ 20220536 11464818 8520953 8276103 2642195 -6985393 -10918636 -6507404 -1753555
12783a753555L55674R56205M082938j59352q700445p796662L401765R613989L967489
$$ -1753555 -1397881 -441676 3641262 3481910 -5218535 -13015197 -9613432 557 3968046
12774C968046j840082J021926M109008q65171n881716j398742N677759M032347
$$ 3968046 2127964 3149890 7258898 6393727 512011 -886731 4791028 8823375
12766H823375k259652j996424K972554K388873l200589m501790j170706j035707
$$ 8823375 6563723 4567299 7539853 9928726 6728137 2226347 1055641 19934
12758A9934l544392m19487P067628P638911p45597o170101j744367L903574J185189
$$ 19934 -3524458 -3943945 3123683 10762594 10016997 3846896 2102529 6006103 7191292
12749G191292o158159q299332l307524K384921K910461j515101m967951j080503
$$ 7191292 1033133 -7266199 -10573723 -8188802 -5278341 -6793442 -11761393 -12841896
12741a2841896Q549902J3264323O164712n148837q237723k806262J493619J159404
$$ -12841896 -4291994 8972329 15137041 9988204 1750481 -1055781 437838 1597242
12733A597242J108194K314107l0035n162559n840053r29784K328625J000414N31752
$$ 1597242 2705436 5019543 4989508 -173051 -6013104 -6942888 -4614263 -3613849 -3082097
12724c082097L557893N122186J927395l164771p703041j1165634r598303k0700
$$ -3082097 475796 5597982 7525377 4360606 -3342435 -14508069 -24106372 -24127072
12716b4127072R583488P683535k430664n879050O57172M888499J018110j609408
$$ -24127072 -14543584 -6860049 -9290713 -15169763 -14512591 -9624092 -8605982 -10215390
12708a0215390K363136M272077j148350n062400j119690L015604J372638J336867
$$ -10215390 -7852254 -3580177 -4728527 -9790927 -10910617 -7895013 -6522375 -5185508
12700e185508P727333J0612769K634909o044153m918354j243361m727673p829974
$$ -5185508 2541825 13154594 15789503 9745350 4826996 3583635 -1144038 -8974012
12692h974012j97702R153994N282991n941444o688735L035101O792093K68414
$$ -8974012 -9171714 -17720 5265271 -676173 -7364908 -4329807 2462286 2730700
12684B730700l375406K579011Q779503P059014R38344m135568p136509o307316
$$ 2730700 -644706 1934305 10713808 17772822 18711166 14575598 7439089 1131773
12676A131773o08362L337585j204164p581045m282998M519360M045518n441070
$$ 1131773 523411 3860996 2656832 -4924213 -9207211 -4687851 -642333 -6083403
12668f083403p434913K789356Q911572L14430r977804n806655P821636J4163758
$$ -6083403 -13518316 -10728960 -1817388 -1502958 -11480762 -17287417 -9465781 4697977
12660D697977Q589788L01676l285756k637222m74480J006201k86942l492783m327621
$$ 4697977 13287765 13589441 10303685 7666463 7191983 8198184 7911242 4418459 90838
12651I0838j567766K45814j540776k578589J215735O216464O281440J577459k870820
$$ 90838 -1476928 -1231114 -2771890 -5350479 -4134744 2081720 8363160 9940619 7069799
12642G069799m475338m242967k814667K99901M172049N932638L213472k966217
$$ 7069799 2594461 -1648506 -4463173 -4163272 8777 5941415 9154887 6188670
12634F188670p394880m778866L097867P065690J352658p984551j0430150m293376
$$ 6188670 -1206210 -5985076 -2887209 4178481 5531139 -2453412 -12883562 -17176938
12626a7176938L238704O876127P134990N339395K295318R97003L362633N171980
$$ -17176938 -13938234 -7062107 72883 5412278 7707596 8704599 12067232 17239212
12618A7239212J342441n251090p687379n462277k687685R36767O847459Q555705
$$ 17239212 18581653 13330563 5643184 180907 -2506778 -1570011 5277448 13833153
12610A3833153p37310j2821129j2053556N38234O926355l37807p040218j116255
$$ 13833153 13095843 274714 -11778842 -11240608 -4314253 -4652060 -11692278 -12808533
12602a2808533Q483283P695118j021836n717878l729784n99733K096922N220066
$$ -12808533 -4325250 3369868 2348032 -3369846 -7099630 -7699363 -5602441 -382375
12594c82375M429225l276197r719748m819662O688816R986249J439242o153499
$$ -382375 4046850 770653 -8949095 -13768757 -7079941 2906308 4345550 -1807949
12586a807949k006202Q088244J0385206J177476r016952q500690J583651Q889701
$$ -1807949 -3814151 4274093 14659299 15836775 6819823 -1680867 -97216 8792485
12578H792485N744389j054958q80309M540148M492118k859309p567960m722850
$$ 8792485 14536874 13481916 12601607 17141755 21633873 18774564 11206604 6483754
12570F483754j878523m645200o669226j647913N082994O069441L684588K784456
$$ 6483754 4605231 -39969 -6709195 -8357108 -3274114 2795327 6479915 9264371
12562I264371K38780o950336j1116195m610518N200199N669777j007463k405688
$$ 9264371 9503151 2552815 -8563380 -13173898 -7973699 -2303922 -3311385 -5717073
12554e717073K407351K353980m353060n772423K516913P862692O38585r278656
$$ -5717073 -3309722 -955742 -5308802 -11081225 -8564312 -701620 -63035 -9341691
12546i341691p413884L143019P289225Q59881m897143j653807M581123M398592
$$ -9341691 -16755575 -13612556 -6323331 -5463450 -10360593 -12014400 -7433277 -3034685
12538c034685q19343k386344K037300N847301M377091J292242J123400J377161
$$ -3034685 -3854028 -6240372 -4203072 1644229 6021320 7313562 8436962 9814123
12530I814123k157789o277875m229895K870447O808197M712405K071338J762856
$$ 9814123 7656334 1378459 -2851436 19011 6827208 11539613 13610951 15373807
12522A5373807l26777n033776n259182K010605P991385M656489k665769m598683
$$ 15373807 15047030 10013254 4754072 6764677 14756062 19412551 16746782 12148099
12514A2148099k713094m270149p579422n247668J218042L308855R08748K341410
$$ 12148099 9435005 5164856 -2414566 -7662234 -6444192 -3135337 -2226589 114821
12506A14821Q054671P903762j444112r020074n868118J698837L148858l91859
$$ 114821 8169492 16073254 14629142 5609068 -259050 1439787 4588645 4196786
12498D196786p20559K593273K164654m078510q592636m687664M307583R140169
$$ 4196786 3476227 6069500 8234154 4155644 -4436992 -9124656 -4817073 4323096
12490D323096N564050j155582k864569J484180M706326J248512n128276p143692
$$ 4323096 9887146 8731564 5866995 7351175 12057501 13306013 8177737 1034045
12482A034045m431570k189373j277594K230944P185565O306386j475222o370911
$$ 1034045 -3397525 -5586898 -6864492 -4633548 2552017 8858403 7383181 1012270
12474A012270j536902N836201N218775j256057l314439L99872J148013m009125
$$ 1012270 -524632 5311569 10530344 9274287 5959848 6359720 7507733 3498608
12466C498608o647338j241207M762385K106789n749473p668840q54485O579599
$$ 3498608 -3148730 -4389937 372448 2479237 -3270236 -10939076 -11793561 -5213962
12458e213962P940877M911386J449657j770035m260099l609228m28958J4659m113370
$$ -5213962 2726915 7638301 9087958 7317923 3057824 -551404 -980362 -965703 -5079073
12449e079073o369525j358109N154602L456971m660403o866836J951329J1441944
$$ -5079073 -11448598 -12806707 -7652105 -4195134 -8855537 -15722373 -13771044 -2329100
12441b329100R455249k372117j1933588j1285658k757889O493009J0667126P771501
$$ -2329100 7126149 4754032 -7179556 -18465214 -21223103 -14730094 -4062968 3708533
12433C708533R87730k842333j83280M108868K674389l628943n961362k02066N664279
$$ 3708533 4696263 1853930 1670650 5779518 8453907 4824964 -1136398 -1338464 4325815
12424D325815J772454q594145j1273773k92169J2147860J0943316r52617o458109
$$ 4325815 6098269 -2495876 -13769649 -14061818 -1913958 9029358 8076741 1618632
12416A618632J003077Q303717L070864p642742r307398k482785L31336l455588
$$ 1618632 2621709 10925426 13996290 6353548 -2953850 -5436635 -5105299 -8560887
12408h560887l466566L882984Q050929K356301m034107r11163O364029N658086
$$ -8560887 -12027453 -8144469 -93540 2262761 -1771346 -2682509 3681520 9339606
12400I339606l003069q037693l034325N980624R428350M360800l949492p166914
$$ 9339606 6336537 -1701156 -4735481 1245143 10673493 15034293 11084801 3917887
12392C917887j987324N172419M745778l597880j0331268r293245m432654o30283
$$ 3917887 1930563 7102982 11848760 8250880 -2080388 -11373633 -15806287 -16436570
12384a6436570L578007Q998344J0065868L441721m487837o069300k404151J536513
$$ -16436570 -12858563 -3860219 6205649 9647370 5159533 -909767 -3313918 -1777405
12376a777405M837549O782694L236789m616142o456913J945583Q206931N60042
$$ -1777405 3060144 9842838 13079627 8463485 2006572 3952155 12159086 12719128
12368A2719128j1973825j1451290K264420J2308791R238941p48455r860810j5191672
$$ 12719128 745303 -10705987 -8441567 3867224 13106165 12357710 2496900 -12694772
12360a2694772j2344372P95791J3300840J0863906j930822n960190K984654P711360
$$ -12694772 -25039144 -24243353 -10942513 -78607 -2009429 -7969619 -4984965 2726395
12352B726395j485077j0779744o381159L060869K345650n027088m452291M812763
$$ 2726395 1241318 -9538426 -15919585 -12858716 -10513066 -15540154 -19992445 -15179682
12344a5179682R232413K887604m682920l618029L775839Q296124N237323j752716
$$ -15179682 -5947269 -3059665 -7742585 -11360614 -7584775 711349 5948672 4195956
12336D195956n213566j629879M539636O026342J616987l558968n675858m776206
$$ 4195956 -1017610 -2647489 1892147 7918489 9535476 5976508 300650 -4475556
12328d475556q60951N081309O973563K11804p678785m752211N604191O849436
$$ -4475556 -5336507 -255198 6718365 6930169 -748616 -5500827 103364 6952800
12320F952800m666485j1895466l561997P655046N971881k782329l392249L148337
$$ 6952800 2286315 -9609151 -13171148 -5516102 455779 -2326550 -5718799 -2570462
12312b570462M758864J208357K216638O652328L501248o607658r557420l63889
$$ -2570462 2188402 3396759 5613397 12265725 15766973 9159315 -398105 -761994
12304g61994Q715050P248932k98875n575462p542828p050151j985311N648864
$$ -761994 7953056 15201988 14903113 9327651 1784823 -5265328 -7250639 -1601775
12296a601775P867665K311609l023048k143950P48177P76415M47060J802056M53623
$$ -1601775 6265890 8577499 5554451 3410501 4158678 4935093 5382153 7184209 7637832
12287G637832m551532m681882M193781J0774280L710395q836096r728660P98354
$$ 7637832 3086300 -1595582 2598199 13372479 17082874 8246778 -1481882 -683528
12279f83528N562423k427614r819255n171179L554244L527126k431539k878482
$$ -683528 4878895 2451281 -7367974 -12539153 -8984909 -5457783 -7889322 -10767804
12271a0767804J906790J632730m158436l595158O875595J3572699N602690p209700
$$ -10767804 -8861014 -7228284 -11386720 -14981878 -8106283 5466416 11069106 3859406
12263C859406q230841J217830N250106r96640m896512J473724P712839K482232
$$ 3859406 -4371435 -3153605 2096501 1099861 -3796651 -2322927 5389912 7872144
12255G872144p034842n864856M956880R480921O25719j0205376j0270528j712095
$$ 7872144 837302 -5027554 -70674 9410247 10035966 -169410 -10439938 -12152033
12247a2152033M818826N073510K865901J267408q18805m207512o547201m844577
$$ -12152033 -7333207 -2259697 606204 1873612 1054807 -3152705 -9699906 -14544483
12239a4544483R90935P228531Q617608L197258m466492o992280k430823L252468
$$ -14544483 -13553548 -6325017 2292591 5489849 1023357 -5968923 -8399746 -5147278
12231e147278L473219j235984m754751k976719K344574O303780N395920K03839
$$ -5147278 -1674059 -2910043 -7664794 -10641513 -8296939 -1993159 3402761 3606600
12223C606600m519148l222994M595736J1933579J0196407j070826j1908650j1498477
$$ 3606600 -912548 -4135542 460194 12393773 22590180 21519354 9610704 -1887773
12215a887773N8945J1389341J2157313L981419l110555l852918l192688p207538
$$ -1887773 -1828828 9560513 21717826 25699245 22588690 18735772 15543084 8335546
12207H335546j2935675j1986315k774731O337326P535333K895729J82855K057378
$$ 8335546 -4600129 -16586444 -19361175 -13023849 -5488516 -2592787 -2409932 -352554
12199c52554L730840J016154l440590m070084q1386L973217M790061L956986L806451
$$ -352554 3378286 4394440 953850 -3116234 -3197620 775597 5565658 9522644 13329095
12190A3329095L069526p4020k975131j519508K204266R91003o645948j2090703
$$ 13329095 16398621 16324601 13349470 11829962 14034228 15025231 8379283 -3711420
12182c711420p445533L063204Q196806M347523j130858j286929J928298K792100
$$ -3711420 -11156953 -8093749 103057 4450580 3319722 2032793 3961091 6753191
12174F753191M15593j672194j523021j24644J827727M374179N567764K261260
$$ 6753191 7168784 5496590 3973569 3848925 5676652 10050831 15618595 17879855
12166A7879855m836807r858573q188748k588757J36451j913447l553022j81425
$$ 17879855 13043048 3184475 -5004273 -7593030 -7456579 -9370026 -12923048 -13104473
12158a3104473N652239P760659M285811o04582j875170J653163O416174O224675
$$ -13104473 -7452234 308425 4594236 3989654 2114484 3767647 10183821 16408496
12150A6408496k118497j2701367j3806002k074766J0543719J1032012K906315
$$ 16408496 14289999 1588632 -12217370 -14292136 -3748417 7283595 10189910
12143A0189910l50211K825697O00926r810435j4191035m037182P316587M482225
$$ 10189910 9839699 12665396 13266322 3455887 -10735148 -14772330 -7455743 -2973518
12135b973518n580699n714498K780694L427445o381419j0693108k029304O995100
$$ -2973518 -8554217 -14268715 -11488021 -8060576 -14441995 -25135103 -27164407 -20169307
12127b0169307O201516L585980P595844J0007871J462678q603245n442886N662803
$$ -20169307 -13967791 -10381811 -2785967 7221904 8684582 81337 -5361549 301254
12119C01254O732857l714377q268217J185592J1170314Q370190j807049p190493
$$ 301254 7034111 3319734 -4948483 -3762891 7407423 15777613 13970564 6780071
12111F780071o883814o575724n285753Q71817P455346O576944L02958k168266
$$ 6780071 -103743 -6679467 -11965220 -11093403 -3638057 2938887 3241845 1073579
12103A073579M89144Q13202l004027l584078J674825M609200J85857m010555p38319
$$ 1073579 1562723 2375925 -628102 -4212180 -2537355 2071845 2257702 -1752853 -2491172
12094b491172L396937j117536q669450n678294O481694J1179058J646373q393889
$$ -2491172 905765 -211771 -8881221 -14559515 -8077821 3101237 4747610 -3646279
12086c646279o000559K007780J876237n035069o330697N25812N293360K168583
$$ -3646279 -9646838 -7639058 -5762821 -10797890 -17128587 -16602775 -11309415 -9140832
12078i140832k345583r93119M402012P870179O872179K233194l457651n483897
$$ -9140832 -11486415 -12479534 -8077522 -207343 6664836 8898030 5440379 -43518
12070d3518r87709N129817M456707l237206q908629o361306J226486Q192318J2004679
$$ -43518 -1031227 4098590 8555297 5318091 -3590538 -9951844 -8725358 -533040 11471639
12061A1471639J0236055J229917q688254q467003J868421Q324931K470624o268223
$$ 11471639 21707694 22937611 14249357 5782354 7650775 15975706 18446330 12178107
12053A2178107o609956l277968o346590j1278326n711027P853902J3187993M816320
$$ 12178107 5568151 2290183 -4056407 -15334733 -21045760 -13191858 -3865 4812455
12045D812455m164644k567871L986635M729559m38917m185048l331198k43526
$$ 4812455 647811 -1920060 2066575 6796134 6357217 2172169 -1159029 -1402555
12037a402555K496490L390149J418126k329885n276669o858146p644552n434468
$$ -1402555 1093935 4484084 5902210 3572325 -1704344 -8562490 -16207042 -21641510
12029b1641510J779027R253237R482954L279204j275787j483519k103765l788419
$$ -21641510 -19862483 -10609246 -1126292 2152912 877125 -606394 -2710159 -6498578
12021f498578j027706N392863O516401Q91939r70776N079962P822447p4862p460909
$$ -6498578 -7526284 -2133421 4382980 5274919 4304143 9384105 17206552 17131690 9670781
12012I670781k805223N319962K374713p310513q755320k584282k195141p731373
$$ 9670781 6865558 12185520 14560233 7249720 -1505600 -4089882 -6285023 -14016396
12004a4016396m941976Q168880J4752667N480609o757391p429997n94889J691275
$$ -14016396 -18958372 -10789492 3963175 9443784 2686393 -4743604 -5338493 -3647218
11996c647218j776923l966227k641267j006888p73738j411104j662817J664319
$$ -3647218 -5424141 -9390368 -12031635 -13038523 -13812261 -15223365 -16886182 -15221863
11988a5221863R871368J5492109Q903615n483165j1392898l521115M703970K524559
$$ -15221863 -5350495 10141614 19045229 13562064 2169166 -1351949 3352021 5876580
11980E876580k974648k243668K43829k644366n240422J78809P143582N331932
$$ 5876580 2901932 658264 902093 -1742273 -6982695 -6803886 339696 5671628
11972E671628p95872p4170N105411L707722l491760n951698k928585l251257o911232
$$ 5671628 4875756 4801586 9906997 13614719 10122959 4171261 1242676 -2008581 -8919813
11963h919813m892182K174530L203628l165764n128998J669175P139147N577636
$$ -8919813 -13811995 -11637465 -8433837 -11599601 -16728599 -15059424 -7920277 -2342641
11955b342641M564994P971752O645356m235086j3218411r470337M18429M017153
$$ -2342641 2222353 10194105 16839461 12604375 -614036 -10084373 -9665944 -5648791
11947e648791J068521j355692k142325l013962p37311N806391Q593023K308551
$$ -5648791 -4580270 -5935962 -8078287 -11092249 -11829560 -6023169 2569854 4878405
11939D878405m366793j784956L920088J370022n333230l159375O165918P249755
$$ 4878405 511612 -1273344 2646744 4016766 -1316464 -4475839 1690079 8939834
11931H939834l410582j0492551l487682P575718P948417j431300q384771o959560
$$ 8939834 5529252 -4963299 -8450981 -875263 7073154 5641854 -2742917 -9702477
11923i702477j677500J609833J752291O29733K25789R88363J185692q12787l114661
$$ -9702477 -11379977 -9770144 -8017853 -7388120 -7162331 -6173968 -4988276 -5801063 -8915724
11914h915724j886798K969865O882573O347994K719986n89947j963282j935271
$$ -8915724 -10802522 -7832657 -950084 5397910 8117896 7527949 5564667 3629396
11906C629396k062971l570241n123077l196233K460848N857020J841250n546736
$$ 3629396 1566425 -2003816 -7126893 -10323126 -7862278 -2005258 -164008 -5710744
11898e710744p488809k166577M199482P447852Q932182Q310582K067443p301052
$$ -5710744 -13199553 -15366130 -11166648 -3718796 5213386 13523968 15591411 8290359
11890H290359r601513q98964P910574M749282o259850j0544357l896218K901204
$$ 8290359 -1311154 -2210118 5700456 10449738 4189888 -6354469 -10250687 -7349483
11882g349483J447192k456141K21460O533687O026120k630093q898820n675712
$$ -7349483 -5902291 -8358432 -8136972 -1603285 4422835 1792742 -7106078 -12781790
11874a2781790Q85166J510767k644428l945222j619090j357847k497376K779939
$$ -12781790 -11896624 -10385857 -13030285 -16975507 -18594597 -19952444 -22449820 -19669881
11866a9669881J3774853J6439753K926753j3097194j2945754O93690Q157232J956030
$$ -19669881 -5895028 10544725 13471478 374284 -12571470 -11877780 -3720548 -1764518
11858a764518m246372Q58525R038445P411955j489470o172047m600195l386188
$$ -1764518 -6010890 -5152365 3886080 11298035 9808565 3636518 -963677 -4349865
11850d349865l373432M52577N925755L993041n439986r768658j366456J0160398
$$ -4349865 -7723297 -7270720 -1344965 2648076 -2791910 -12560568 -13927024 -3766626
11842c766626J0824899J161604o017607l615974K311366L244807n88943k704508
$$ -3766626 7058273 8219877 2202270 -1413704 897662 4142469 3553526 849018
11834H49018k74710K470768O42335m257655o103000k786069K58429k196357o773040
$$ 849018 574308 3045076 3687411 -570244 -6673244 -9459313 -9200884 -11397241 -18170281
11825a8170281n947813M18821M850660M301100M329475P720510P536501j267935
$$ -18170281 -24118094 -23699273 -18848613 -14547513 -10218038 -2497528 5038973 3771038
11817C771038j0428730q712864O63913M453749n34327m029008J02969N296138
$$ 3771038 -6657692 -15370556 -14706643 -10252894 -10787221 -14816229 -14713260 -9417122
11809i417122N003947K316881J156929j333797o129422o039824K437284R465280
$$ -9417122 -4413175 -2096294 -939365 -2273162 -8402584 -14442408 -12005124 -2539844
11801b539844N054917m743886o655848p2485M500360L365635K485054L702925
$$ -2539844 2515073 -2228813 -8884661 -8957146 -4456786 -1091151 1393903 5096828
11793E096828J836073l243968m258236R12002N291162M416445J660213o70611
$$ 5096828 6932901 3688933 -569303 342699 5633861 10050306 11710519 11039908
11785A1039908m810050q890030o121444K770790P260855K664269k678995j976149
$$ 11039908 6229858 -2660172 -8781616 -6010826 1250029 3914298 1235303 -740846
11777g40846l95165k971248l441429M099384J1759634Q556299j904769o886028
$$ -740846 -1136011 -4107259 -7548688 -3449304 8310330 16866629 14961860 8075832
11769H075832l314914P30989M84804r05094j032598j437287k260659j809972j033778
$$ 8075832 4760918 5491907 5976711 5071617 4039019 2601732 341073 -1468899 -2502677
11760b502677j701472j773873Q08323K481634l59768l265593J61842O586228O798943
$$ -2502677 -4204149 -5978022 -5169699 -2688065 -3047833 -6313426 -6151584 434644 7233587
11751G233587q6649n681023n039298j258533K512448O391379Q223919L790530
$$ 7233587 7146938 1465915 -3573383 -4831916 -2319468 4071911 12295830 16086360
11743A6086360n053494r831890n755922K778865Q353698P440890J174651n680823
$$ 16086360 11032866 1200976 -4554946 -1776081 6577617 14018507 15193158 9512335
11735I512335p024409j689424L813938L610810N80659L24409J354963o55432l247121
$$ 9512335 2487926 798502 4612440 8223250 8803909 9128318 10483281 9827849 6580728
11726F580728j784117K48263k732112n457562J135124J1603253J0718356k353545
$$ 6580728 4796611 5044874 2312762 -3144800 -2009676 9593577 20311933 17958388
11718A7958388j1205709p344165j306410j973471j815493O241215J2161990M004560
$$ 17958388 6752679 -591486 -1897896 -3871367 -5686860 554355 12716345 16720905
11710A6720905j0329467j2620293m41177J0890027J0418696K647111l810126p237466
$$ 16720905 6391438 -6228855 -6670032 4219995 14638691 17285802 13475676 6238210
11702F238210r177232p973620j395384P310010J0367472L760408o484706r374060
$$ 6238210 -2939022 -10912642 -12308026 -4998016 5369456 9129864 2645158 -6728902
11694f728902k323067M370152J236099o436941o599543R85128N579948L697524
$$ -6728902 -9051969 -4681817 -3445718 -9882659 -16482202 -15497074 -9917126 -6219602
11686f219602K691276M447027R72816q178714r694732K706857J4920084J1889628
$$ -6219602 -3528326 918701 1891517 -6287197 -15981929 -13275072 1645012 13534640
11678A3534640q89477q220061p472479n687483l084877M293673J1189777Q887645
$$ 13534640 12645163 4425102 -3047377 -8734860 -11819737 -7526064 3663713 12551358
11670A2551358J218026q21940J784767j622108j0600696j2069135k121406O538576
$$ 12551358 13769384 12947444 14732211 13110103 2509407 -9559728 -11681134 -5142558
11662e142558M339150j738272j555625K766336L149478j032404m001522k739939
$$ -5142558 -803408 -2541680 -4097305 -1330969 1818509 786105 -3215417 -5955356
11654e955356J115856M543735M200928j458582q037895q020041m95721P080950
$$ -5955356 -4839500 -295765 3905163 2446581 -5591314 -13611355 -14107076 -7026126
11646g026126R173650Q077751O826839L436352l032900p223094m584491R53378
$$ -7026126 2147524 10225275 17052114 20488466 17455566 10232472 5647981 6601359
11638F601359K635259M65160j146012k191228o290915j2146441j2793643m843718
$$ 6601359 9236618 9701778 8555766 6364538 73623 -12072818 -24866461 -29710179
11630b9710179O397053J3018762J2457508P625823J927968l185748o842975p690744
$$ -29710179 -23313126 -10294364 2163144 9788967 11716935 8531187 1688212 -6002532
11622f002532n155926p01777L246544N388257N761514M298752P14648l860736
$$ -6002532 -11158458 -11860235 -8613691 -3225434 2536080 6834832 7549480 3688744
11614C688744o748318o105727k408762K677311P147722Q166046L648988m071743
$$ 3688744 -3059574 -9165301 -11574063 -8896752 -1749030 6417016 10066004 5994261
11606E994261q743220o567630k99265M661083N966979M321063O57837l772473
$$ 5994261 -2748959 -9316589 -9615854 -4954771 1012208 5333271 5991108 2218635
11598B218635o540665o042688l091390Q36754M554748N582525J944095k699579
$$ 2218635 -4322030 -10364718 -13456108 -12619354 -8064606 -2482081 -537986 -3237565
11590c237565j371832N469462P969259Q72455p337385o854692j587207j406102
$$ -3237565 -4609397 860065 8829324 9701779 2364394 -4490298 -6077505 -7483607
11582g483607m475663q09560Q109045Q460356l734692j3535199p688625O553030
$$ -7483607 -11959270 -12768830 -4659785 3800571 65879 -13469320 -21157945 -14604915
11574a4604915J2796211P837729J821297P41710L26221l122809n888142l765842
$$ -14604915 -1808704 6029025 7850322 8592032 8918253 5795444 -92698 -3858540
11566c858540R10042K967320J149613k065116m651282n881941m720193p58431
$$ -3858540 -2948498 18822 1168435 -896681 -5547963 -11429904 -16150097 -16908528
11558a6908528L521907M531231K493523J850267M797650O933976K975317m553398
$$ -16908528 -13386621 -8855390 -6361867 -4511600 286050 7220026 10195343 5641945
11550E641945p346719k678215K594230J963157j791554k053844J154195K135144
$$ 5641945 -1704774 -4382989 -1788759 174398 -1617156 -3671000 -2516805 -381661
11542c81661r32034l674992k835205l72308J015418J891565L443595M230707K327319
$$ -381661 -1313695 -4988687 -7823892 -8196200 -7180782 -5289217 -1845622 2385085 4712404
11533D712404r70283k095491J63508K466021N54147m760446p096348k314994M490039
$$ 4712404 3742121 1646630 1810138 4276159 4830306 69860 -7026488 -9341482 -4851443
11524d851443M092152m392455j1095147p610967K886700J0741824J1010041O204327
$$ -4851443 -759291 -5151746 -16246893 -23857860 -20971160 -10229336 780705 6985032
11516F985032J477938M85857K895271L513114k120048r424980q287299K039435
$$ 6985032 8462970 8948827 11844098 15357212 13237164 3812184 -4475115 -2435680
11508b435680R358526N268324k725044l543457R20166J734688j140804r28691
$$ -2435680 6922846 12191170 9466126 5922669 6842835 8577523 7436719 6508028
11500F508028K137111J519630l173237o037756n634318m878143k299679M554031
$$ 6508028 8645139 10164769 6991532 953776 -4680542 -9558685 -11858364 -7304333
11492g304333R034558K526591q912390r991163L63390O435195N6832q013650o944403
$$ -7304333 1730225 4256816 -4655574 -14646737 -14283347 -7848152 -7791320 -15804970 -22749373
11483b2749373j306011O04102J097143N766693J1504208J1393104M707407m606886
$$ -22749373 -24055384 -23451282 -22354139 -16587446 -5083238 6309866 11017273 6410387
11475F410387j2236302j1979601Q4639J4978864J6260847K576056q177970n118917
$$ 6410387 -5825915 -17805516 -17720877 -2742013 13518834 16094890 7916920 2798003
11467B798003J89497l993955p963727J350413J3756625R454864p764499j4323989
$$ 2798003 2987500 -1006455 -8970182 -7619769 6136856 15591720 7827221 -6496768
11459f496768k492116R959593Q725417J309969m10689J474214j3359k669937j472508
$$ -6496768 -8988884 970709 9696126 11006095 10595406 12069620 12056261 9386324 7913816
11450G913816J59225l404688q346578o232762K588265R235864Q729542M677906
$$ 7913816 8073041 4668353 -3678225 -9910987 -7322722 1913142 10642684 15320590
11442A5320590J331930k269142p536542j0479622n622450M992726J1465459P197340
$$ 15320590 16652520 14383378 6846836 -3632786 -9255236 -4262510 7202949 14400289
11434A4400289k531213o965574l068317K555323L898803J436437k559138p156706
$$ 14400289 11869076 4903502 1835185 4390508 8289311 9725748 7166610 9904
11426I904r039917l476512O855515J1323601M933562m195470o638786m020627
$$ 9904 -9030013 -12506525 -5651010 5672591 10606153 6410683 -228103 -4248730
11418d248730k809101k798695k56237L348760M871825O621961J0593111J0670808
$$ -4248730 -7057831 -9856526 -10112763 -6764003 -1892178 4729783 15322894 25993702
11410B5993702J196349j0852373j3638649p467288k534313k225372j027033K322600
$$ 25993702 27190051 16337678 2699029 -4768259 -7302572 -9527944 -10554977 -8232377
11402h232377K816383Q45391K980295Q889420R387771Q63410q709564j1350994
$$ -8232377 -5415994 -4570603 -1590308 7299112 16686883 17550293 8840729 -2510265
11394b510265p402256k97540P119854R392661K467916o854555o948381P19902
$$ -2510265 -9912521 -10210061 -3090207 6302454 8770370 1915815 -5032566 -4312664
11386d312664K568385m658195p288375K490913J2161113Q110863l126768o239081
$$ -4312664 -1744279 -6402474 -13690849 -11199936 961177 9072040 5945272 -293809
11378b93809m57566K918629L16409j369059O90697J234561k225408n154374m181782
$$ -293809 -751375 2167254 2483663 1114604 1805301 3039862 814454 -4339920 -8521702
11369h521702j481550N41516K539907M792738N462009L603858P58223q73625j01623
$$ -8521702 -10003252 -9461736 -6921829 -2129091 3332918 6936776 7694999 6821374 6719751
11360F719751K267876L026920j63649m200072l543371J034073K732388j87240
$$ 6719751 8987627 12014547 11850898 7650826 4107455 5141528 7873916 7686676
11352G686676j329482J904832K251498m619735r686092k969224R495799J2425601
$$ 7686676 6357194 8262026 10513524 5893789 -3792303 -6761527 2734272 15159873
11344A5159873K387680q419459q992521j159890O152712O963575J572814m677465
$$ 15159873 17547553 9128094 135573 -1024317 5128395 12091970 13664784 8987319
11336H987319n513142l27064M516341L967929N18228j507159k759433m673184
$$ 8987319 3474177 3147113 7663454 11631383 12149611 10642452 7883019 3209835
11328C209835m202661L41249L847294K717853K668659Q775183J3686997P369142
$$ 3209835 -992826 -651577 3195717 5913570 8582229 17357412 31044409 38413551
11320C8413551n967549j3226972j1199269o875789k412827N032493J0235441L728081
$$ 38413551 32446002 19219030 8019761 1143972 -1268855 3763638 13999079 17727160
11312A7727160r925806j4382912n369599L835695M780488M428128P124670M310165
$$ 17727160 7801354 -6581558 -11951157 -8115462 -3334974 1093154 8217824 12527989
11304A2527989p275648j3919975n412255O551645O040591k156823k313214N619373
$$ 12527989 5252341 -8667634 -14079889 -7528244 -1487653 -3644476 -5957690 -338317
11296c38317P457805r47359q267905o534794p86452K035907J967881J073993j112325
$$ -338317 7119488 6172129 -2095776 -8630570 -9417022 -7381115 -5413234 -4339241 -5451566
11287e451566m374724o424615o047604l240050K300319Q221207Q742389K859724
$$ -5451566 -9826290 -16250905 -22298509 -25538559 -23238240 -15017033 -6274644 -3414920
11279c414920j287163K463820Q153756P508896L859579M824572O549423l02442
$$ -3414920 -4702083 -2238263 5915493 13424389 17283968 22108540 28657963 28355521
11271B8355521j1645319j3039593k306663O265561L298351m173790o743173n010098
$$ 28355521 16710202 3670609 1363946 7629507 10927858 6754068 10895 -4999203
11263d999203k753490J73952K514166L73083l487037p67217O694833N640897o848436
$$ -4999203 -7752693 -7578741 -5064575 -4691492 -8178529 -8945746 -2250913 3389984 -3458452
11254c458452j4311003m376859J1284853J3820192L847777l476598k326793N87005
$$ -3458452 -17769455 -22146314 -10861461 2958731 6806508 3329910 1003117 1590122
11246A590122J792131M207064O387877L060241l589086n583183k246495k17475
$$ 1590122 3382253 7589317 13977194 17037435 13448349 7865166 5618671 5401196
11238E401196q59755L40518K039670k061966r220275q360858J665400Q007302
$$ 5401196 4541441 4881959 6921629 4859663 -4360612 -12721470 -11056070 -3048768
11230c048768L474007k586319n43161M318472K719865k305235j620083M262077
$$ -3048768 425239 -2161080 -2704241 1614231 4334096 2028861 408778 4670855
11222D670855P302162N406379K743604j96056n693405r688191n128484M923216
$$ 4670855 11973017 17379396 20123000 19926944 14233539 4545348 -583136 4340080
11214D340080Q390699J088243p020881o462866n77351K323555J808619K922544
$$ 4340080 12730779 13819022 6798141 335275 -242076 2081479 3890098 6812642
11206F812642N659056N075806M16228l077887k114677K89455j05207l176633n609565
$$ 6812642 12471698 17547504 17963732 14885845 12771168 13060623 12955416 9778783 4169218
11197D169218n040308j743928J950140L289213J840519N23105J727931K988937
$$ 4169218 -871090 -2615018 -664878 2624335 4464854 4987959 6715890 9704827
11189I704827k6666o174168q927994n242454K59461K570500L213701N761971Q308697
$$ 9704827 9678161 3503993 -5424001 -10666455 -10406994 -7836494 -4622793 1139178 9447875
11180I447875N968267j103258p445495q905799n045030L095555J2053574J4520788
$$ 9447875 15416142 14312884 6867389 -2038410 -7083440 -3987885 8065689 22586477
11172B2586477N919477p561817j4165475j0341376l011852J701346L944877L748243
$$ 22586477 28505954 20944137 6778662 -3562714 -6574566 -4873220 -928343 2819900
11164B819900q99492o569729n190193K646122N303840k124456p990610j550831
$$ 2819900 1920408 -4649321 -9839514 -7193392 -1889552 -4014008 -12004618 -13555449
11156a3555449R314450J0278086K891738o9861L178696K423508m359614o701272
$$ -13555449 -4240999 6037087 8928825 8858964 12037660 14461168 10101554 3400282
11148C400282n42412L982689l67625o244142m770161O81450K461653J414799K312871
$$ 3400282 2857870 6840559 6472934 228792 -4541369 -3859919 -1398266 16533 2329404
11139B329404L422320K11272n160557o836662m664563l104015l213278k281295
$$ 2329404 5751724 5962996 802439 -6034223 -10698786 -13802801 -17016079 -19297374
11131a9297374O01510M038360P062907P952286L937009l136182n529576j9695
$$ -19297374 -18695864 -14657504 -7594597 357689 4294698 1158516 -4371060 -4390755
11123d390755N343161K349461m149305l431673L984771P204964K054254l625977
$$ -4390755 952406 3301867 -847438 -4279111 -294340 6910624 8964878 5338901
11115E338901l295859l19080m5209j879383l288707m452503m722882j032445N716150
$$ 5338901 2043042 1723962 1678753 -200630 -3489337 -7941840 -12664722 -13697167 -7981017
11106g981017Q799123N082330O13200J431786M115753J859837m350570p746861
$$ -7981017 818106 5900436 6513636 7945422 12061175 13921012 9570442 1823581
11098A823581o001223k295574J787754O931820J0374524P195357j500704q061077
$$ 1823581 -4177642 -6473216 -4685462 2246358 12620882 19816239 18315535 10254458
11090A0254458p728876l338463P15391L442069M284448J362002l929737o000838
$$ 10254458 2525582 -812881 -97490 3344579 7629027 8991029 5061292 -939546
11082i39546k827139K49249j080866k959007l65824L468249K164731k604642l666552
$$ -939546 -3766685 -3517436 -4598302 -7557309 -7923133 -4454884 -2290153 -4894795 -8561347
11073h561347n01254M17040k401480k750892J865672N435768L861138J465845
$$ -8561347 -9062601 -8645561 -11047041 -13797933 -11932261 -6496493 -2635355 -1169510
11065a169510K058245J969568j412284k328429L449321Q392624L550899n862941
$$ -1169510 888735 2858303 1446019 -882410 2566911 10959535 14510434 8647493
11057H647493p134121M45373N332379K486353p19600N02734L51656n334722j0030089
$$ 8647493 1513372 1958745 7291124 9777477 9057877 9560611 9912267 4577545 -5452544
11048e452544p029960k93876K979709L381847M806297N266042J302213l021755
$$ -5452544 -12482504 -12776380 -9796671 -6414824 -1608527 3657515 4959728 1937973
11040A937973j065298N028684O823216K040323l639756o176833o339523l836043
$$ 1937973 872675 5901359 12724575 14764898 11125142 4948309 -1391214 -5227257
11032e227257K736339Q972350O745148l490379j0254527n531230M489998Q281114
$$ -5227257 -2490918 6481432 13226580 9736201 -518326 -6049556 -1559558 6721556
11024F721556L535174k736664m750366k573009J225079L542628Q48409o810125
$$ 6721556 10256730 7520066 2769700 196691 1421770 4964398 5812807 -997318
11016i97318j2461767q722596J911143Q949897P334375L129468L253584N491970
$$ -997318 -13459085 -22181681 -20270538 -11320641 -3986266 -856798 2396786 7888756
11008G888756L642207j873732n011853l538122q98456P18329K640527M311719
$$ 7888756 11530963 9657231 4645378 1107256 208800 927129 3567656 7879375
11000G879375K225314l271961n975876k389325K503263K448825j127640k505281
$$ 7879375 10104689 6832728 856852 -1532473 970790 3419615 2291975 -213306
10992b13306p54297M44370j0575O165M1388k769201o744435n167424M110651J3022878
$$ -213306 -967603 -523233 -533808 -527643 -486255 -3255456 -9999891 -15167315 -11056664 1966214
10982A966214J1560021O5960j0235760r329806P81950Q517501N784339l061978
$$ 1966214 13526235 13592195 3356435 -5973371 -5191421 3326080 9110419 6048441
10974F048441p267830l339615J753345J643657j030410q92472Q85111l68241l978343
$$ 6048441 -1219389 -4559004 -2805659 -1162002 -2192412 -3084884 -2199773 -2568014 -6546357
10965f546357n046767k648628k23895J213865L570530N848780M820871J916119
$$ -6546357 -11593124 -14241752 -14465647 -13251782 -9681252 -3832472 988399 2904518
10957B904518K332679N796175N154119k824042j0938268r824617N42573J0594719
$$ 2904518 5237197 11033372 16187491 13363449 2425181 -7399436 -6856863 3737856
10949C737856J0743190L44443j1186674j2921975m203144M334229M351028Q7624
$$ 3737856 14481046 14825489 3638815 -9283160 -13486304 -9152075 -4801047 -4713423
10941d713423j76754K499767J691669j425055o77119J773043j859522q617357
$$ -4713423 -4890177 -2390410 -698741 -2123796 -2800915 -1027872 -2887394 -11504751
10933a1504751n856699P599769J5811378Q241742m705483p713398j538563K408820
$$ -11504751 -17361450 -9761681 6049697 14291439 9585956 1872558 333995 2742815
10925B742815K56922k636675k936698k084605o66884J897290L828502K790134
$$ 2742815 2999737 363062 -2573636 -4658241 -5325125 -3427835 400667 3190801
10917C190801o00182m110732n477801j713046O943719J1941524M877209p360125
$$ 3190801 2590619 -1520113 -6997914 -8710960 -1767241 10174283 15051492 7691367
10909G691367q351530L217677R721614K504199l470281M537116J3133860L529474
$$ 7691367 -660163 2557514 12279128 14783327 11313046 15850162 28984022 32513496
10901C2513496j5956797k0398408n185407R605927J0093698L184133j195617l418554
$$ 32513496 16556699 -3841709 -9027116 578811 10672509 13856642 12661025 9242471
10893I242471n266982l771099L72154J063511j836320j140860L866651M424164
$$ 9242471 3975489 204390 576544 1640055 -196265 -1337125 2529526 6953690
10885F953690k371659p243049l637863K051619K080216o30917q621J737143q59805
$$ 6953690 4582031 -2661018 -6298881 -4247262 -2167046 -2797963 -2806584 -1069441 -1929246
10876a929246n463139m871616J205041M830299Q49575n652999n298733L540645
$$ -1929246 -7392385 -12264001 -11058960 -6228661 -5379086 -11032085 -16330818 -12790173
10868a2790173J1524540R555851J209215j911308K688664M758067j617258p706011
$$ -12790173 -1265633 8290218 9499433 7588125 10276789 15034856 13417598 5711587
10860E711587m702027J332480L28968m433864l547806P07369m78630m224152l76485
$$ 5711587 1009560 2342040 2671008 -1762856 -5310662 -4603293 -5081923 -9306075 -9682560
10851i682560Q081561P623975k203437o580815j79771M421333p71027n915628
$$ -9682560 -1600999 6022976 3819539 -2761276 -2941047 1480286 709259 -5206369
10843e206369j684307M591168K447296m198469n029857N955L175133J921471n9035
$$ -5206369 -6890676 -2299508 147788 -4050681 -9080538 -9074583 -5899450 -3977979 -4037014
10834d037014l01308R47641L013108M007345J978131p58069q4142K160956N91056
$$ -4037014 -4338322 -3390681 -377573 3629772 5607903 4849834 4765692 6926648 7517704
10825G517704l140517k147109K403019J832827m045504n018044J535331N164302
$$ 7517704 4377187 2230078 4633097 6465924 2420420 -2597624 -1062293 4102009
10817D102009P05753k696266J198152M230472l32982m337360P39116P804489N969107
$$ 4102009 4807762 2111496 3309648 7540120 7207138 2869778 3608894 11413383 17382490
10808A7382490j454393l932117n88591K153139K409155J074821l966260j0883009
$$ 17382490 15928097 11995980 11407389 13560528 15969683 17044504 13078244 2195235
10800B195235r819975K284920J1673763N835786o687424q988295r51988L796619
$$ 2195235 -7624740 -5339820 6333943 12169729 5482305 -3505990 -4457978 -661359
10792f61359M44434l452771l409390k049030j08997L183365L477014k309839o719053
$$ -661359 -216925 -3669696 -7079086 -9128116 -9237113 -6053748 -2576734 -4886573 -11605626
10783a1605626j934173N405606M046719k106868p75029N990388M994933l342949
$$ -11605626 -13539799 -8134193 -4087474 -6194342 -6969371 -978983 4015950 673001
10775F73001l982292O209548J1021574P46814j2187150j2788980m302060J080495
$$ 673001 -3309291 2900257 13921831 14668645 2481495 -10307485 -14609545 -13529050
10767a3529050J007578J368658L530043L570121N51224j857262n38906L594923
$$ -13529050 -12521472 -11152814 -7622771 -4052650 -3501426 -5358688 -5897594 -2302671
10759b302671N695802R67450p827957r709541Q83043J3112260J2177922L51801
$$ -2302671 3393131 4360581 -3467376 -13176917 -12293874 818386 12996308 13348109
10751A3348109o374929j884460L421461J205546l592801m421754l182958k853005
$$ 13348109 6973180 5088720 8510181 9715727 6122926 1701172 -1481786 -4334791
10743d334791j086917K926799M913820L675025L185422K956780k359939r941645
$$ -4334791 -5421708 -2494909 2418911 6093936 9279358 12236138 9876199 -65446
10735f5446q881144Q75098M429577m501116j0821910j171915J3413960J3438920
$$ -65446 -8946590 -8071492 -3641915 -8143031 -18964941 -20136856 -6722896 6716024
10727F716024p1517r079286n145344L323121P361426O635515L344079j110117
$$ 6716024 6644507 -2434779 -7580123 -4257002 3104424 9739939 13084018 11973901
10719A1973901l645441k841236k892016o293627p035962l95187O139376L206524
$$ 11973901 8328460 5487224 2595208 -3698419 -10734381 -11129568 -4990192 -1783668
10711a783668m498490n740919j451267j162598m485911k633404L511371M448827
$$ -1783668 -6282158 -12023077 -13474344 -14636942 -19122853 -21756257 -18244886 -13796059
10703a3796059R77427L486698J0787446R482269j479252o390061J91339L512131
$$ -13796059 -12818632 -9331934 1455512 10937781 9458529 3068468 3259807 6771938
10695F771938m009255p613827K562521J0338122K6858j3944086q833705Q425982
$$ 6771938 2762683 -4851144 -2288623 8049499 8076357 -5867729 -14701434 -6275452
10687f275452J2733901J866730l450545K573075L157682p709027j3204857l553513
$$ -6275452 6458449 8325179 4874634 7447709 10605391 2896364 -10308493 -13862006
10679a3862006P410645P122674L378172N227568N278569l114944q908246j558681
$$ -13862006 -6451361 671313 4049485 9277053 14555622 11440678 2532432 973751
10671I73751Q379651N588311m752088o975631q06527K015502j49770N45930L463524
$$ 973751 9353402 14941713 10189625 3213994 2407467 4422969 4273199 4819129 8282653
10662H282653J069429m042803j816841O288142P834155m36053q214953q454880
$$ 8282653 9352082 5309279 3492438 9780580 17614735 17178682 8963729 508849
10654E08849m635222m96142L926145N394123O3700o354072m280489L678081O131771
$$ 508849 -4126373 -4622515 -696370 4697753 4761453 -1592619 -5873108 -2195027 3936744
10645C936744K057223J040483L902484N86256r490845j2868431l853471N564893
$$ 3936744 5993967 7034450 10936934 11523190 2032345 -10836086 -14689557 -9124664
10637i124664N118602N38557K32037J819255J018007J030601L644851K860912
$$ -9124664 -4006062 -3467505 -3235468 -1416213 -398206 632395 4277246 7138158
10629G138158l251804n855809j27106M613071J03522o135307k971277O339412
$$ 7138158 3886354 -1969455 -2096561 2516510 2620032 -3515275 -6486552 -147140
10621a47140J0289377O328679P17558l239341o510918q179047o625802l420906
$$ -147140 10142237 16470916 17188474 13949133 7438215 -740832 -7366634 -10787540
10613a0787540q9243M222369P560311M859849k518843n581662j308028K225761
$$ -10787540 -10876783 -6654414 905897 5765746 3246903 -2334759 -3642787 -1417026
10605a417026K70966k04392N505684Q946930K100467p829796q742856j244804
$$ -1417026 -1146060 -1350452 4155232 13102162 15202629 7372833 -1370023 -2614827
10597b614827M861567N235992K317908j889195n251328l623425K346891M723427
$$ -2614827 2246740 7482732 9800640 7911445 2660117 -963308 1383583 6107010
10589F107010k59902n395937l964624K04970J111617N0412n38708l031088o802759
$$ 6107010 5847108 451171 -3513453 -3308483 -2196866 -2146454 -2685162 -5716250 -12519009
10580a2519009m737198M232335R582811M738004k449198l072721J98503J992343
$$ -12519009 -17256207 -13023872 -3441061 1296943 -1152255 -4224976 -4026473 -2034130
10572b034130L374510L888691j699307r907394p438324O163656J1864333l77911
$$ -2034130 1340380 5229071 3529764 -6377630 -13815954 -7652298 4212035 3834124
10564C834124j4058156j1545633M50023O811960P713723Q659920M503375o838223
$$ 3834124 -10224032 -21769665 -21319642 -14507682 -6793959 1865961 6369336 -468887
10556d68887j1440576r66097Q910290K923336p558330n320069K878869K137489
$$ -468887 -11909463 -12875560 -3965270 -1041934 -8600264 -13920333 -11041464 -8903975
10548h903975j799876L258485Q783743J545903p670497j667170J0062103P109283
$$ -8903975 -10703851 -7445366 1338377 2884280 -4786217 -6453387 3608716 10717999
10540A0717999n131188o685123L72611m20376o145448k377258M872288k68364
$$ 10717999 5586811 -1098312 -725701 -1146077 -7291525 -9668783 -4796495 -5064859
10532e064859j0185168o140428N464428N336128o29924N762994J4824393M240159
$$ -5064859 -15250027 -21390455 -15926027 -10589899 -11219823 -5456829 9367564 13607723
10524A3607723j4635744j1501197Q374698J1919246l712369r877188p97295J291103
$$ 13607723 -1028021 -12529218 -4154520 7764726 4052357 -5824831 -6622126 -5331023
10516e331023n416782o14227J0829224L664186j4062848q510395J5749055J8557428
$$ -5331023 -10747805 -11362032 -532808 3131378 -10931470 -19441865 -3692810 14864618
10508A4864618l691339j1626775L681165P189588r379882j2640753K893043K873107
$$ 14864618 11173279 -453496 3227669 10417257 1037375 -11603378 -8710335 -5837228
10500e837228j3766922p507764J8588653J4275076j8440655j8307713J5529356
$$ -5837228 -19604150 -27111914 -8523261 5751815 -12688840 -30996553 -15467197
10493a5467197R553419l8680209l4376321K8472666P032542j48211253k38984112
$$ -15467197 -5913778 -44593987 -78970308 -50497642 -43465100 -191676353 -430660465
10486d30660465q1094990J86743824K64905294J08049527m1723907k7924556L9282414
$$ -430660465 -511755455 -325011631 -60106337 47943190 6219283 -21705273 17577141
10479A7577141K1999959l3989541k8596652J2240802J0940933j6296845q857253
$$ 17577141 39577100 5587559 -23009093 -10768291 172642 -16124203 -24981456
10472b4981456J8965213J5439713p324164m436343J3203909O231550j3723309
$$ -24981456 -6016243 9423470 2099306 -2337037 10866872 17098422 3375113
10465C375113r398045Q305450L707485j3379408q369036J0384036Q833020p611669
$$ 3375113 -6022932 2282518 5990003 -7389405 -15758441 -5374405 3458615 -4153054
10457d153054p296928O307623N084078o367900p45247J5999527J3620844n873682
$$ -4153054 -11449982 -5142359 -58281 -6426181 -7171428 8828099 22448943 16575261
10449A6575261j2821046m294231l404830r813031j588400J6013210J4010345o422906
$$ 16575261 3754215 -540016 -3944846 -13757877 -15346277 666933 14677278 8254372
10441H254372j2106100M757951J3753553j01506j3574974q989431r36228l288145
$$ 8254372 -3851728 906223 14659776 14558270 983296 -8006135 -8942363 -12230508
10433a2230508m861067L820238R781501K688816m681486L27973P913572M499816
$$ -12230508 -17091575 -13271337 -3489836 -801020 -5482506 -5154533 2759039 7258855
10425G258855m263151o187090l228556l354803l978772R20471O170972K619884
$$ 7258855 2995704 -3191386 -6419942 -9774745 -13753517 -12833046 -6662074 -4042190
10417d042190o225202p490073K524857J2487887J0310145j792483r794422n005343
$$ -4042190 -10267392 -17757465 -15232608 -2744721 7565424 5772941 -4021481 -9026824
10409i026824N137975P849636L155658J520269M309293J319500q293115r902521
$$ -9026824 -3888849 3960787 7116445 8636714 12946007 14265507 5972392 -3930129
10401c930129K223850J1625651M819510o240208m658129L002480M27775q176565
$$ -3930129 -1706279 9919372 14738882 8498674 3840545 6843025 7270800 -905765
10393i05765o425986L261963L513180o281140q604591P80480N650550j569859
$$ -905765 -7331751 -4069788 -556608 -6837748 -15442339 -14661859 -9011309 -10581168
10385a0581168p225154j268042O150541L852122j813611m5521N921841O138084
$$ -10581168 -17806322 -19074364 -12923823 -9071701 -10885312 -10930833 -5008992 1129092
10377A129092N89894l207430l313547l661996m380901p61417P832635J4034950
$$ 1129092 1718986 -1488444 -4801991 -8463987 -12844888 -13606305 -5773670 8261280
10369H261280J0510295L26202m714258J041766P705005K747696r076182j0823152
$$ 8261280 18771575 19097777 14383519 15425285 23130290 25877986 16801804 5978652
10361E978652L63725P421078O9879q979531n750364K477294J696936m856474n155876
$$ 5978652 6342377 13763455 13833334 4853803 -896561 1580733 3277669 -1578805 -6734681
10352f734681l46742O73281P97M460119Q160832J959400o174178k208552P877091
$$ -6734681 -7081423 -6408142 -6407345 -1947226 6213606 8173006 1998828 -209724 7667367
10343G667367O680682l615200m324091O496739J0548843J659399n021410j989709
$$ 7667367 14348049 10732849 6408758 12905497 23454340 25113739 20092329 18102620
10335A8102620j328149q572621r789135K463772J2622933O694273n553273q594915
$$ 18102620 16774471 8201850 -1587285 876487 13499420 20193693 14640420 6045505
10327F045505m800486m028615m245445M95257M627560N13568n949678m806507
$$ 6045505 1245019 -2783596 -7029041 -6533784 -1906224 -1392656 -7342334 -12148841
10319a2148841Q00097J715631k80294K384702O843975L973138m515619p321924
$$ -12148841 -11348744 -9633113 -9913407 -7528705 -684730 3288408 -1227211 -8549135
10311h549135q14668O818625Q377612M736262o18290n531875p512052m958715
$$ -8549135 -9363803 -2545178 5832434 10568696 9950406 4418531 -3093521 -8052236
10303h052236j49526L596167N987066P042039M074535l365510r321311q046568
$$ -8052236 -8201762 -4605595 1381471 8423510 12498045 9132535 -188776 -8235344
10295h235344j656012M005031P263500Q784174O234521j942937j0181479j0578643
$$ -8235344 -9891356 -5886325 1377175 10161349 16395870 14452933 4271454 -6307189
10287f307189l189251M142540N583277K457835m46202J12184L540681N384816
$$ -6307189 -9496440 -5353900 229377 2687212 2241010 2353194 5893875 11278691
10279A1278691J289176o927416j1926884r650345l847686L92140K935123N219111
$$ 11278691 12567867 5640451 -6286433 -15936778 -19784464 -19392324 -16457201 -11238090
10271a1238090N720000L454499J664268K800989L440529l34279n424573n455774
$$ -11238090 -5518090 -2063591 -399323 2401666 5842195 5507916 83343 -5372431
10263e372431l82121L174675R08419m162969o111460k716801K876518N796609
$$ -5372431 -5754552 -2579877 -1671458 -5834427 -11945887 -14662688 -11786170 -5989561
10255e989561M420494J410356n89676k011205k844400J69721P322790J0379601
$$ -5989561 -1569067 -158711 -748387 -2759592 -5603992 -5434271 1888519 12268120
10247A2268120J942800j1042261j3696029m034921M132120K205710j895840L88982
$$ 12268120 14210920 3168659 -10527370 -14562291 -10430171 -8224461 -10120301 -9731319
10239i731319L824771R37246k790212J517437Q864749P386802j362403m067703
$$ -9731319 -5906548 -4969302 -7759514 -6242077 2622672 10009474 8647071 4579368
10231D579368L008237Q494115M046150m407139p861092o200136l502903k38073
$$ 4579368 7587605 16081720 20127870 15720731 7859639 1659503 -1843400 -2081473
10223b081473L341651L170987j947212n087171n19306N701444L402297n373103
$$ -2081473 1260178 4431165 2483953 -2603218 -3122524 2578920 5981217 608114
10215F08114p869933O1922O588368J627355p006211n443498L738195M778171n417113
$$ 608114 -7261819 -7199897 -611529 1015826 -5990385 -11433883 -7695688 -2917517 -8334630
10206h334630j0155065J404416J5280911J2310583k680336q202170J232543Q319651
$$ -8334630 -18489695 -17085279 -1804368 10506215 7825879 -376291 856252 9175903
10198I175903J204009r115133p675142K184493O940007L847559J218392K694968
$$ 9175903 10379912 1264779 -6410363 -4225870 2714137 6561696 7780088 10475056
10190A0475056K992600j772237q279704j0900176p046097J426920Q215186O704383
$$ 10475056 13467656 11695419 3415715 -7484461 -14530558 -13103638 -4888452 1815931
10182A815931j564949o295609j512631N097805K907858n360379p124051J433298
$$ 1815931 250982 -6044627 -7557258 -2459453 448405 -4911974 -12036025 -10602727
10174a0602727R668388P490201j537845o244864k333186L827294M388668n82603
$$ -10602727 -934339 6555862 5018017 -1226847 -3560033 267261 4655929 4073326
10166D073326m185925k163053J435238N20139l362967l280682J237872K168716
$$ 4073326 -112599 -2275652 -840414 -320275 -3683242 -6963924 -5726052 -3557336
10158c557336m072251r286589n079119M428270R047969O937357L980237K233298
$$ -3557336 -7629587 -16916176 -21995295 -17567025 -8519056 -1581699 2398538 4631836
10150D631836j227580n229574m407728O23235K184156k470096n982755j916896
$$ 4631836 3404256 -1825318 -6233046 -5609811 -3425655 -5895751 -11878506 -13795402
10142a3795402N465571P592693L254394j508646k576465j644523j604727k255355
$$ -13795402 -8329831 -737138 2517256 1008610 -1567855 -3212378 -4817105 -7072460
10134g072460j758876r9966P72387P9779n4547K518124O014063O141318J937492
$$ -7072460 -8831336 -8931302 -8158915 -8079136 -8133683 -5615559 398504 6539822 8477314
10125H477314k675551m338477m016777l507854k058792M44700Q57113k141159
$$ 8477314 5801763 1463286 -2553491 -6061345 -8120137 -7675437 -6818324 -8959483
10117h959483l645415J171148Q612528J0544783N818075J110992L18233j95370
$$ -8959483 -12604898 -11433750 -2821222 7723561 13541636 14652628 14970861 14775491
10109A4775491l918809p675764o303770k57332M913875N060449J205461k351445
$$ 14775491 10856682 3180918 -3122852 -3380184 1533691 6594140 7799601 5448156
10101E448156k550301l61200J176571J516676K800244M551705K314627m955430
$$ 5448156 2897855 2536655 3713226 5229902 8030146 12581851 14896478 9941048
10093I941048j0215032o778216J310753M269099N73463j846298J162113L826290
$$ 9941048 -273984 -7052200 -5741447 -1472348 -898885 -2745183 -1583070 2243220
10085B243220N83084m684245m605528R06025N068022L325170k125620o197460
$$ 2243220 2826304 -1857941 -6463469 -5557444 -489422 2835748 710128 -5487332
10077e487332o397723m114814j664738Q86837M601137P668807O298923J466956
$$ -5487332 -11885055 -15999869 -17664607 -16777770 -12176633 -4507826 1791097 3258053
10069C258053k36885L206646L952381l472718j0274023n011938O334774O614888
$$ 3258053 3021168 6227814 10180195 6707477 -3566546 -8578484 -2243710 4371178
10061D371178n572909j1599057j018545J1941008J0377665p29753n949615m304925
$$ 4371178 -1201731 -12800788 -13819333 -1878325 8499340 7769587 1819972 -2484953
10053b484953n549580q552338k816781R849612J3992745M063146o917566p737432
$$ -2484953 -8034533 -16586871 -19403652 -9554040 4438705 8501851 1584285 -6153147
10045f153147l601021l002632l192183J165428N302601K166114m082346m163478
$$ -6153147 -9754168 -12756800 -15948983 -14783555 -9480954 -7314840 -11397186 -15560664
10037a5560664J192313L378036K91402k201272j562362p04775O52916N772208
$$ -15560664 -14368351 -10990315 -10698913 -12900185 -14462547 -15167322 -14514406 -8742198
10029h742198J1024676P684179l050772q087819j499093M908011r17686j1824538
$$ -8742198 2282478 9966657 6915885 -1171934 -2671027 2236984 1319298 -10505240
10021a0505240j1626257K87516Q447053M952645m09187K057622O542231K901115
$$ -10505240 -22131497 -21843981 -13396928 -8444283 -8853470 -6795848 -253617 2647498
10013B647498n286062n351834M866735J2988911Q838485l003935j0469410q139236
$$ 2647498 -2638564 -7990398 -3123663 9865248 18703733 15699798 5230388 -2908848
10005b908848n14297N131072N414678J902548j799428l781309m702387m717172
$$ -2908848 -3423145 1707927 7122605 9025153 7225725 3444416 -1257971 -5975143
9997e975143j878331L677806O640405K801008l248207l552088N90411K57065n224156
$$ -5975143 -7853474 -4175668 2464737 5265745 2017538 -1534550 -944139 -687074 -5911230
9988e911230m773029O296746J5147019Q739928n419354r052237L94530P577444
$$ -5911230 -10684259 -4387513 10759506 19499434 14080080 5027843 5422373 12999817
9980A2999817L444754l242996k632417J415469Q47416k789635l546656k515048
$$ 12999817 16444571 13201575 10569158 11984627 12832043 10042408 6495752 3980704
9972C980704m016772n529352j753800M194376L993793k143031m798759m7702M084168
$$ 3980704 -36068 -5565420 -7319220 -3124844 868949 -1274082 -6072841 -6120543 -2036375
9963b036375l0001p645853q184001k46814O594176N167730P3161J12183M905439
$$ -2036375 -2066376 -9712229 -17896230 -18143044 -11548868 -6381138 -6307977 -6195794 -1290355
9954a290355N684518r3111l026129L668588J0904318N601681p804758j1653315
$$ -1290355 4394163 4301052 1274923 4943511 15847829 21449510 13644752 1991437
9946A991437j909936M800949k489174j0938215m294486J0641612J4497909N160737
$$ 1991437 81501 4882450 2393276 -8544939 -12839425 -2197813 12300096 17460833
9938A7460833j230972K704959N685898j760462j2113866j2946254l770557N768388
$$ 17460833 16229861 18934820 24620718 22860256 10746390 -2199864 -5970421 -202033
9930b02033P619690R24840q195711j0137899j257910R392965R948981J868877
$$ -202033 7417657 8342497 146786 -9991113 -11249023 -1856058 8092923 9961800
9922I961800l183228j992731k837272q153545q493853O34112R244940Q166714
$$ 9961800 6778572 4785841 1948569 -6204976 -14698829 -14064717 -4819777 3346937
9914C346937K325929M9774k13506k878816m783514k214187L74051q16878r3640
$$ 3346937 5672866 5722640 5509134 2630318 -2153196 -4367383 -3993332 -4810210 -4903850
9905d903850O424787R633732J050449j0195427r417108K03782K860483m363774
$$ -4903850 1520937 11154669 12205118 2009691 -7407417 -7203635 -4343152 -8706926
9897h706926q553108l438697K115110J083264j448455P899K312493K217328K805510
$$ -8706926 -17260034 -20698731 -18583621 -17500357 -18948812 -18940913 -16628420 -14411092 -11605582
9888a1605582N325421M491525j576147n525321j862172L709867L431401m05114
$$ -11605582 -6280161 -1788636 -3364783 -8890104 -10752276 -7042409 -3611008 -4016122
9880d016122n52743K607446K281035k736518n375574r39673N363356N025929k072442
$$ -4016122 -4568865 -1961419 319616 -2416902 -7792476 -8732149 -3368793 1657136 -415306
9871d15306o707434k091578O682179Q920723K510294m132524m795619k745324
$$ -415306 -7122740 -9214318 -2532139 6388584 8898878 4766354 -29265 -2774589
9863b774589k316576j391489K009952L321896o55831m259546k150287P59094j266016
$$ -2774589 -5091165 -6482654 -4472702 -1150806 -1806637 -6066183 -8216470 -7457376 -8723392
9854h723392k597003L624889R687592L785097p897091q224411K692811O565729
$$ -8723392 -11320395 -7695506 1992086 5777183 -2119908 -10344319 -7651508 -1085779
9846a085779k991916j0417905n376627N81192l654077q337207j029072R619956
$$ -1085779 -4077695 -14495600 -19872227 -19291035 -22945112 -31282319 -32311391 -22691435
9838b2691435P697877k180594j891952R762476J4472512L503724r217873q962980
$$ -22691435 -14993558 -17174152 -19066104 -9303628 5168884 8672608 -545265 -9508245
9830i508245k74994L749637J535201J190251M209463K955826n194442j1023800
$$ -9508245 -9783239 -6033602 -4498401 -3308150 901313 3857139 -1337303 -12361103
9822a2361103n814762N384161J0033223N171213k74594p50454j592095o491415
$$ -12361103 -18175865 -12791704 -2758481 2412732 2138138 1387684 -204411 -6695826
9814f695826p675474J528415J1916663R313247l685419j0935900o393019J04504
$$ -6695826 -14371300 -12842885 -926222 8387025 4701606 -6234294 -12627313 -12522809
9806a2522809J483629K331637N295687L803498m683381j1192153q939860l176172
$$ -12522809 -11039180 -8707543 -3411856 391642 -4291739 -15483892 -24423752 -27599924
9798b7599924J45007L894029R741650J0702237L817604j031701L512902Q539661
$$ -27599924 -27454917 -23560888 -13819238 -3117001 700603 -331098 3181804 11721465
9790A1721465L185103o701514q178123j637647K955594L631314M994586M667297
$$ 11721465 14906568 8205054 26931 -1610716 1344878 4976192 9970778 14638075
9782A4638075k641480j0866472q712026J328714N735872J381404j394320K140406
$$ 14638075 11996595 1130123 -7581903 -6253189 -517317 864087 -530233 1610173
9774A610173M912765L566059M292382Q129045N486636o939960j6668154j2345429
$$ 1610173 6522938 10088997 14381379 22510424 27997060 21057100 4388946 -7956483
9766g956483l23182N418071K366249j159293k48015K451938L717411K810258o43449
$$ -7956483 -8279665 -2861594 -495345 -1654638 -1902653 549285 4266696 7076954 6433505
9757F433505n178725n449898J894781J0923665J1332413J684834p695573p600638
$$ 6433505 1254780 -4195118 -2300337 8623328 19955741 21640575 13945002 6344364
9749F344364j285392J432396j388776k132905K722681N351405q57234p953004
$$ 6344364 5058972 6491368 5102592 2969687 5692368 11043773 10186539 2233535
9741B233535l591451P999751R216017m098098j3949922o547364O433882O357068
$$ 2233535 -1357916 6641835 15857852 11759754 -2190168 -8737532 -2303650 4053418
9733D053418l291849m106681O446796J1448610K734797o266632k557121O925618
$$ 4053418 761569 -3345112 3101684 14550294 17285091 11018459 8461338 15386956
9725A5386956P867705k00371o489409o164218m035935l915697l716715j367993
$$ 15386956 23254661 23054290 16564881 10400663 6364728 2449031 -1267684 -2635677
9717b635677J054699P40911j886113l828509k537299J861215O385670P566114
$$ -2635677 -1580978 -840067 -2726180 -6554689 -9091988 -7230773 -845103 6721011
9709F721011M603445n2754l020141k417711Q57448L179015J142111l913166o395877
$$ 6721011 11324456 11271702 8251561 5833850 6691298 9870313 11012424 7099258 703381
9700G03381l634910P3429l03207l141687l446921j120706k07495q43270J735713
$$ 703381 -2931529 -2858100 -3161307 -6302994 -9749915 -10870621 -11078116 -11921386 -10185673
9691a0185673Q882914J4347299J1146018J32667j0307848j2235521n380232K927078
$$ -10185673 -1302759 13044540 24190558 24323225 14015377 1779856 -3600376 -673298
9683f73298N296866J778324j576447j114251P92487P97217j165953l892776o345036
$$ -673298 4623568 6401892 4825445 3711194 4503681 5300898 4134945 242169 -6102867
9674f102867n587433R38571Q909597R534069J641163n655689n959454l145647
$$ -6102867 -11690300 -10751729 -1842132 7691937 9333100 3677411 -2282043 -5427690
9666e427690j520584J646200O757660N583478n353011j4175564q908999L748058
$$ -5427690 -6948274 -5302074 1455586 7039064 1686053 -12489511 -21398510 -17650452
9658a7650452Q243593L041009o93351Q79868J048169k090714k200120K202775
$$ -17650452 -9406859 -6365850 -7059201 -6179333 -5131164 -7221878 -9421998 -7219223
9650g219223M434922J623771j094972k72652J498089J913637J253855r13837l283279
$$ -7219223 -2784301 -1160530 -2255502 -2528154 -1030065 883572 2137427 1223590 -2059689
9641b059689l51371Q109533J0567210o25995j2996380r618902L691411O453927
$$ -2059689 -2411060 5698473 16265683 15639688 2643308 -6975594 -3284183 3169744
9633C169744l416302p063854K806174J0425601M888924k640307n73785L657791
$$ 3169744 -246558 -7310412 -4504238 5921363 10810287 8169980 7596195 11253986
9625A1253986p33269q610351r441841m569519p86065K459863P167133Q186404
$$ 11253986 10520717 1910366 -7531475 -12100994 -12887059 -10427196 -3260063 4926341
9617D926341K452715k358458K72407L918609K88805o504072p929494n300680m740628
$$ 4926341 7379056 5020598 5293005 9211614 9500419 2996347 -4933147 -10233827 -14974455
9608a4974455m920848r67381N019909P207160M953240R65312l510511n567189
$$ -14974455 -19895303 -20862684 -15842775 -8635615 -3682375 -2717063 -6227574 -11794763
9600a1794763q08146P202717P545720j233891o518927j717813K658050j578930
$$ -11794763 -12602909 -5400192 2145528 911637 -5607290 -7325103 -4667053 -6245983
9592f245983m709592K773373J0671924N707259m084811k125746P970400Q360508
$$ -6245983 -10955575 -8182202 2489722 8196981 4112170 1986424 9956824 18317332
9584A8317332l016932j0356041o806752k510285l834529l642560K837110Q307825
$$ 18317332 15300400 4944359 -1862393 -4372678 -8207207 -11849767 -9012657 -704832
9576g04832O018678K70802j558882R44356L191880J594371l694858p606053m268074
$$ -704832 5313846 5584648 4025766 4970122 8162002 9756373 6061515 -1544538 -5812612
9567e812612K988926K527179p219014j0258591L479738J7685904J1081671q397073
$$ -5812612 -2823686 -296507 -7515521 -17774112 -14294374 3391530 14473201 6076128
9559F076128j3592806N20708J0435925K126996r247563o814630K368872K897928
$$ 6076128 -7516678 -6995970 3439955 5566951 -3680612 -10495242 -8126370 -5228442
9551e228442l814136n304230J216739P645369Q310990M021133k425683o905932
$$ -5228442 -9042578 -14346808 -13130069 -5484700 2826290 6847423 4421740 -2484192
9543b484192m844933K360242O578249L465962j517683j672515K122121M796796
$$ -2484192 -7329125 -4968883 1609366 5075328 3557645 1885130 4007251 8804047
9535H804047L535271j860979q801605j0647950l463732M991942L026081o647090
$$ 8804047 12339318 10478339 1676734 -8971216 -12434948 -7443006 -4416925 -11064015
9527a1064015q655148J400335R216456M597844k500412L46658P147201M773455
$$ -11064015 -19719163 -18318828 -9102372 -4504528 -7004940 -6658282 488919 5262374
9519E262374m142923n990590J020042N084764Q66191l500453j630746J493515
$$ 5262374 1119451 -4871139 -3851097 1233667 2099858 -1400595 -3031341 -1537826
9511a537826k96440m213582m356739j149895R67533J381122L268283P074371Q561709
$$ -1537826 -1834266 -6047848 -10404587 -11554482 -10586949 -9205827 -5937544 1136827 9698536
9502I698536M441470k383016n364608k071991K617672K528394k297299o577518
$$ 9698536 14140006 11756990 6392382 4320391 6938063 9466457 7169158 591640
9494E91640o915441m453552j170022K160739L946202K045563k513552n417367
$$ 591640 -6323801 -10777353 -11947375 -9786636 -5840434 -3794871 -6308423 -11725790
9486a1725790m011465J24644L959532N750612N107368L047889J541647P57102
$$ -11725790 -15737255 -15612611 -11653079 -5902467 -795099 2252790 3794437 4551539
9478D551539j302748l936645k636058K841475M905597l74529m555493J64146N567403
$$ 4551539 3248791 -687854 -3323912 -482437 4423160 4048631 -506862 -342716 5224687
9469E224687m43324j0874599p745703P118699J1348782k272108j2122291k049086
$$ 5224687 4781363 -6093236 -13838939 -6720240 4628542 2356434 -9765857 -11814943
9461a1814943J1656568O364212j0219188j2979495O38168Q819038J110441p952254
$$ -11814943 -158375 6205837 -4013351 -16992846 -16354678 -7535640 -6425199 -14377453
9453a4377453m788799L793955N179140J04391k205468J533654P168038R857733
$$ -14377453 -19166252 -15372297 -10193157 -10088766 -12294234 -10760580 -3592542 6265191
9445F265191O959518p25160p392298p153462k148035L18238p37659O00474N162218
$$ 6265191 13224709 12499549 5107251 -2046211 -4194246 -3876008 -4613667 -4013193 1149025
9436A149025O077996J469382o53013L904461O590658n96221j0500036r923411
$$ 1149025 7227021 8696403 8043390 11947851 18538509 17942288 7442252 -2481159
9428b481159J019022R306177P377043J238955r14197L30820l18974l518372m848652
$$ -2481159 -1462137 7844040 15221083 16460038 15545841 15876661 15557687 12039315 7190663
9419G190663j705799K874345L484813j661644q350023j0376154o127226j31389
$$ 7190663 5484864 8359209 11844022 10182378 1832355 -8543799 -14671025 -14802414
9411a4802414K407792R94618j102913j075416J609763N292645O085775N48499
$$ -14802414 -12394622 -11400004 -12502917 -13578333 -11968570 -6675925 -590150 -41651
9403d1651q601226j2354814n582449M679438O920674M98223l514589J718371R116344
$$ -41651 -8642877 -20997691 -26580140 -21900702 -14980028 -14481805 -17996394 -16278023 -7161679
9394g161679Q321429L72764m772664k381108K572740M691348N078821O696664
$$ -7161679 1159750 1532514 -3240150 -5621258 -3048518 1642830 6721651 13418315
9386A3418315P894681M676033k591638q270489p494177j594695L083185J843851
$$ 13418315 21312996 25989029 23397391 15126902 7632725 6038030 9121215 10965066
9378A0965066k975181m405257N41371O464413O121902m2541m583292l174745O9858
$$ 10965066 7989885 3584628 4125999 10590412 16712314 16669773 12086481 8911736 8981594
9369H981594q74044n253849o304006K43369J0377693J4764294P498178p305733
$$ 8981594 8107550 2853701 -3450305 -3206936 7170757 21935051 29433229 22127496
9361B2127496j7966471j5726018l109064Q710880J0292983J473329r286437j1922688
$$ 22127496 4161025 -11564993 -14674057 -5963177 4329806 5803135 -3483302 -15405990
9353a5405990l972515N524250N101641l954844p460839K016635J2842828J0411489
$$ -15405990 -19378505 -13854255 -8752614 -12707458 -20168297 -18151662 -5308834 5102655
9345E102655j152034o025583j155948J829119j753355l445731j02684o81974p580649
$$ 5102655 3950621 -2074962 -3230910 -1401791 -3155146 -6600877 -6703561 -7385535 -14966184
9336a4966184q361831L263403J3696584J0051306R88104J389707P537970N331338
$$ -14966184 -23328015 -20064612 -6368028 3683278 4671382 6061089 13599059 18930397
9328A8930397m743489r381697m640275J112808L803390O839702R201764N831568
$$ 18930397 14186908 4805211 164936 1277744 5081134 11920836 21122600 26954168
9320B6954168p38257l365390l633435p958958j2461901p721490K506748M635098
$$ 26954168 26215911 22850521 19217086 11258128 -1203773 -8925263 -6418515 -1783417
9312a783417k125211m254395K732797P471944L431037j249876n08996j59087l668335
$$ -1783417 -3908628 -8163023 -5430226 2041718 5472755 4222879 3713883 3554796 -113539
9303a13539l860635K812570P854631N020568O9240j462547l128464o657760n796449
$$ -113539 -3974174 -1161604 6693027 11713595 11782835 10320288 7191824 534064 -5262385
9294e262385Q07553M234106J041449o4502M007388K559081q173508j3104203j782608
$$ -5262385 -4454832 -220726 820723 756221 4763609 7322690 -850818 -13955021 -15737629
9285a5737629J1837969J0496774R34122O34786Q251482Q507483n87398o697755
$$ -15737629 -3899660 6597114 7531236 8166022 16417504 24924987 24337589 17639834
9277A7639834n621768m990548p008265n718441j623315k430046p837053q222250
$$ 17639834 12018066 7027518 19253 -5699188 -7322503 -9752549 -17589602 -25811852
9269b5811852l98294P954376J0951484J0156766O990542O91480n440803o152551
$$ -25811852 -26210146 -18255770 -7304286 2852480 9843022 10534502 5093699 -1058852
9261a058852l109772k436087m102347l045379N94136J957532N29156n56445j634891
$$ -1058852 -4168624 -6604711 -10707058 -13752437 -13158301 -11200769 -10671613 -11228058 -12862949
9252a2862949l508686j404079P237157J3656562R020291K0152j002980L087696
$$ -12862949 -16371635 -17775714 -10538557 3118005 12138296 12158448 11155468 14243164
9244A4243164p1326r047509j0079060j552612K823609j932749m383305J588039
$$ 14243164 14171838 5124329 -4954731 -6507343 -3683734 -5616483 -9999788 -8411749
9236h411749O000941J667384l093249m22497L190657p151m486498j602665N338681
$$ -8411749 -2410808 -743424 -3836673 -4259170 -1068513 -1075664 -5562162 -7164827 -1826146
9227a826146P224238L016256j945926n226143o721450m546139J247739N648337
$$ -1826146 5398092 8414348 6468422 1242279 -5479171 -10025310 -8777571 -3129234
9219c129234N068220K278806J232194K101707L728846M827458J892390o223220
$$ -3129234 1938986 4217792 5449986 7551693 11280539 16107997 18000387 11777167
9211A1777167j1876234p154217J638318J376010n729760m260825P286875J1441840
$$ 11777167 -99067 -7253284 -5614966 -4238956 -9968716 -14229541 -6942666 4499174
9203D499174J080941p310074j874863M015440l125248j0257288N31922J8038543
$$ 4499174 5580115 -1729959 -3604822 410618 -2714630 -12971918 -12439996 5598547
9195E598547J6672159k542874j3592081o328362J674167j955430n462638K726542
$$ 5598547 22270706 19727832 6135751 -192611 1481556 -473874 -5936512 -3209970
9187c209970J2094363P450651o137529j1767821n649847J128573J732656J115954
$$ -3209970 8884393 16335044 10197515 -1570306 -7220153 -6091580 -4358924 -3242970
9179c242970M158995O867254L280698m780757r488981o546570M40459N011015
$$ -3242970 916025 7783279 11063977 6283220 -3205761 -9752331 -9311872 -4300857
9171d300857M629577J370596j641182j953249J740143O763121O096107l157416
$$ -4300857 328720 1699316 58134 -1895115 -154972 6608149 12704256 9546840
9163I546840j2094839q916536L790284J0335859L672808m731169l071314L194899
$$ 9546840 -2547999 -11464535 -7674251 2661608 6334416 1603247 -1468067 1726832
9155A726832J989275n177985o231720K113182J0116048R406923J930693n479574
$$ 1726832 3716107 -1461878 -7693598 -5580416 4535632 13942555 15873248 10393674
9147A0393674p660002k804166N376410Q288670J849790o665486p825391l117740
$$ 10393674 2733672 -70494 5305916 13594586 15444376 8778890 953499 -2164241
9139b164241j009751l165711m043712k081567j085920j340785N49932L125184
$$ -2164241 -3173992 -6339703 -10383415 -12464982 -13550902 -14891687 -14341755 -11216571
9131a1216571J469305k572548j922307L119926M581478R60981L34324N665757
$$ -11216571 -9747266 -12319814 -14242121 -11122195 -6540717 -5579736 -5245412 420345
9123D20345Q083519Q10749r274853j1049807l591693N097093Q675430O335611
$$ 420345 8503864 9314613 39760 -11010047 -14601740 -9504647 -829217 5506394
9115E506394N00606m426717m336814p2780K987278J806132j429898l872792m457688
$$ 5506394 6007000 1580283 -2756531 -2829311 157967 1964099 534201 -3338591 -7796279
9106g796279j630180M734759Q537250K673504r029215j3766779o818753K145782
$$ -7796279 -9426459 -4691700 3845550 6519054 -2510161 -16276940 -23095693 -20949911
9098b0949911L936093J714793K107326L467766J188527k265060j558672K011305
$$ -20949911 -17013818 -15299025 -13191699 -9723933 -8535406 -10800466 -12359138 -10347833
9090a0347833L312675J900922N61969q92450l322221l513601Q90944N092690L465001
$$ -10347833 -7035158 -5134236 -4572267 -5464717 -8786938 -12300539 -11409595 -6316905 -2851904
9081b851904o45078L80642N697088O472261p04107q313741p632759R71366R145899
$$ -2851904 -3496982 -3116340 2580748 9053009 8348902 35161 -7597598 -6626232 2519667
9072B519667R349543K378244k777889J144807R052452Q092856m374114j4714027
$$ 2519667 11869210 14247454 11469565 12614372 21666824 29759680 25385566 10671539
9064A0671539j1014734m0989K937124m024741q974102m786235K918024O583427
$$ 10671539 -343195 -384184 2552940 -1471801 -10445903 -15232138 -12314114 -5730687
9056e730687N212747Q57873m293778n799253l13567P351256Q433130K643760j850877
$$ -5730687 -517940 339933 -3953845 -9753098 -10066665 -2715409 5717721 8361481 6510604
9047F510604j621571j401623k661924j50134N856844N422138n446570j4869080
$$ 6510604 4889033 3487410 825486 675352 6532196 11954334 6507764 -8361316
9039h361316j0384478K930295R812875N435660j514888l455290j520198Q41619
$$ -8361316 -18745794 -15815499 -6002624 -566964 -2081852 -5537142 -7057340 -6215721
9031f215721K991163M531823M175446K614797J857729J335431j020226m138883
$$ -6215721 -3224558 1307265 5482711 8097508 9955237 11290668 10270442 6131559
9023F131559m819511l006189j356064L4111L207736O554453N262241q85295n400506
$$ 6131559 1312048 -1694141 -3050205 -3016094 191642 6746095 12008336 11123041 5722535
9014E722535l375717K240689N498220N073119L605304K007191j244999n612905
$$ 5722535 2346818 4587507 10085727 15158846 18764150 20771341 19526342 13913437
9006A3913437p217801l760654J376054K594403n04374k055071J940508P033406
$$ 13913437 6695636 2934982 4311036 6905439 6401065 4345994 6286502 13319908
8998A3319908N814392j309341o347759n338035l193323m045242l770553J802707
$$ 13319908 19134300 17824959 11477200 6139165 2945842 -1099400 -4869953 -3067246
8990c067246P171190M502176k665556l390705L491100O954244R81790o300451
$$ -3067246 4103944 8606120 5940564 2549859 6040959 12995203 13976993 7676542
8982G676542o089554k266997l062113o275272l447652M406088O675380j37787
$$ 7676542 1586988 -680009 -3742122 -10017394 -13465046 -9058958 -2383578 -2521365
8974b521365n760934q82194Q847895J0414396J217320q081016q061771j505545
$$ -2521365 -8282299 -9164493 -316598 10097798 11315118 3234102 -4827669 -6333214
8966f333214K385901J57258l488781l382725K99610M032508N228939L313860o66308
$$ -6333214 -3947313 -3790055 -7278836 -10661561 -10361951 -6329443 -1100504 2213356 1547048
8957A547048l687627k469097J956151L547433j408519p691843o369952L194644
$$ 1547048 -2140579 -4609676 -2653525 893908 -514611 -8206454 -14576406 -11381762
8949a1381762J1214868R295503N14675n429555m314628m62626J128045J044881
$$ -11381762 -166894 9128609 9643284 4213729 -100899 -563525 564520 1609401
8941A609401K478724N262852N810040K175869l205077o297011n475392k055956
$$ 1609401 4088125 9350977 15161017 17336886 14131809 7834798 2359406 303450
8933C03450J762082M014290L052439j186561n884619p372743m892972n67160M058904
$$ 303450 2065532 6079822 9132261 7945700 2061081 -5311662 -10204634 -10771794 -6712890
8924f712890Q239870Q785424K008282q270051j0339692J620842J6831564J8580772
$$ -6712890 1526980 10312404 12320686 4050635 -6289057 -4668215 12163349 30744121
8916C0744121M706434j0138601j3334706p566781k521051r78373R22849M357965
$$ 30744121 35450555 25311954 11977248 4410467 1889416 911043 1833892 6191857
8908F191857N767797K993165j672124m759582m785333k129334J860825N446374
$$ 6191857 11959654 14952819 13280695 8521113 3735780 1606446 3467271 8913645
8900H913645P337357O681243K376760n274800j1649912j0249697q65649P577469
$$ 8913645 16251002 22932245 25309005 20034205 8384293 -1865404 -2731053 4846416
8892D846416O358919k232194p660132m602117Q72157O77554l422367k334080O172541
$$ 4846416 11205335 8973141 1313009 -3289108 -2416951 -1739397 -5161764 -7495844 -1323303
8883a323303J1877915N552198n877288o386105O181250J4516118N309810j0918457
$$ -1323303 10554612 16106810 10229522 3843417 10024667 24540785 29850595 18932138
8875A8932138j4253078l453708M504411J021148l758752l30069N335788L951415
$$ 18932138 4679060 1225352 5729763 6750911 2992159 2662090 7997878 11949293
8867A1949293j825783l812607j535423K29813O30569J076396K37693j860350j084637
$$ 11949293 10123510 6310903 4775480 5005293 5635862 6712258 6949951 5089601 4004964
8858D004964K315042K49154r710916j6131857r863810K25379J058175k868191
$$ 4004964 6320006 6569160 -3141756 -19273613 -29137423 -28912044 -27853869 -30722060
8850c0722060K055101J3567201J5868442N772881k517259j314478n8438o310876
$$ -30722060 -28666959 -15099758 768684 6541565 4024306 2709828 2651390 -3659486
8842c659486j2199463q198492J901782Q071918O736169L78039o569814p263961
$$ -3659486 -15858949 -24057441 -22155659 -14083741 -7347572 -6969533 -13539347 -20803308
8834b0803308J982755J2279217J0201928j453459n602155J751808M049870o904651
$$ -20803308 -18820553 -6541336 3660592 2207133 -3395022 -1643214 2406656 -4497995
8826d497995j4089930k531069J4032523J3955708J764080j885441M630858M328990
$$ -4497995 -18587925 -21118994 -7086471 6869237 8633317 6747876 11378734 15707724
8818A5707724o176213j0783463k777794L976260n31078p053899n230328K0462
$$ 15707724 9531511 -1251952 -4029746 -53486 -584564 -7638463 -12868791 -12848329
8810a2848329P77028M89614M675788Q659752N983836K54275j649123o70989q67665
$$ -12848329 -12071301 -11581687 -6905899 1753853 7737689 7991964 6342841 5671852 4804187
8801D804187j095030j17128k210430q360831r783633q73399Q650336O583241k787367
$$ 4804187 3709157 3592029 1381599 -6979232 -16762865 -17636264 -8985928 -2402687 -5190054
8792e190054n688204k62812L376262J875044J925474M570025K049874n912452
$$ -5190054 -10878258 -11141070 -7764808 -5889764 -3964290 605735 2655609 -3256843
8784c256843p466399K694797J2298518Q229330m865840j2252245q628829n76572
$$ -3256843 -10723242 -8028445 4270073 12499403 7633563 -4618682 -13247511 -13824083
8776a3824083N448825Q073675O927343K370228j831291k306808j192279j739784
$$ -13824083 -8375258 -301583 6625760 8995988 7164697 4857889 3665610 1925826
8768A925826j589929K582735O392592K486177o875291j1192751o664044p18006
$$ 1925826 335897 2918632 9311224 11797401 4922110 -6270641 -12934685 -13652691
8760a3652691P57091J496743N417820P522711J935042o347988o544214K754155
$$ -13652691 -12895600 -11398857 -5981037 1541674 3476716 -2871272 -9415486 -6661331
8752f661331J1083548R355732r8005q202618r454281n229541K42312L961930M687978
$$ -6661331 4422217 13777949 13679944 5477326 -3976955 -9206496 -8964184 -5002254 -314276
8743c14276K088882k739278o377886n078321Q73676O328047O742379L169270k62803
$$ -314276 1774606 -964672 -7342558 -12420879 -11547203 -5219156 1523223 4692493 4429690
8734D429690j814329j926173P8706M194830O286883K587538k961869k850294K152046
$$ 4429690 2615361 689188 767894 4962724 11249607 13837145 10875276 8024982 10177028
8725A0177028L269691k205311n764903q59631O740656P765304K148038l676993
$$ 10177028 13446719 11241408 5476505 4616874 11357530 19122834 21270872 17593879
8717A7593879o801096q207638p354544l348206J232681L179150K664593Q21711
$$ 17593879 10792783 2585145 -4769399 -8117605 -6884924 -3705774 -1041181 -219470
8709b19470k083722k856930K956560J0932434Q784360m848621j3002540l078863
$$ -219470 -2303192 -5160122 -2203562 8728872 17513232 12664611 -337929 -3416792
8701c416792J2647041J3838829J726463n553599k358616m58733n209292p146049
$$ -3416792 9230249 23069078 24795541 19241942 16883326 16424593 11215301 4069252
8693D069252j352233L213274O24678j584468K977393Q123749O762478K161371
$$ 4069252 2717019 5930293 6554971 4970503 7947896 16071645 22834123 24995494
8685B4995494o40490l574201p577336o791653N49086N678605K816249p22422K455696
$$ 24995494 24355004 20780803 13203467 6411814 6960900 12639505 15455754 14733332 17189028
8676A7189028O342888K130328n947244p436803k461022K5850k975314n831825
$$ 17189028 23531916 25662244 19715000 12278197 9817175 9843025 6867711 1035886
8668A035886m208134L87060M128160L597930j696716o029230k633529M724905
$$ 1035886 -3172248 -2785188 1342972 4940902 3244186 -2785044 -5418573 -693668
8660f93668M454264m141810o755294L558493J2767199O380571p762473j1651680
$$ -693668 3760596 -381214 -7136508 -3578015 9189184 15569755 7807282 -3844398
8652c844398l224523N049419O917369N937476L296640k409979o641687m587839
$$ -3844398 -7068921 -2019502 4897867 10835343 14131983 11722004 5080317 492478
8644D92478j859760n340223p955023J114228J4736574J4899582O31660r925964
$$ 492478 -1367282 -6707505 -14662528 -13548300 1188274 16087856 16719516 6793552
8636F793552o960276j02673J515253K177443N978951O542823o64138q270396q055572
$$ 6793552 -166724 -269397 1245856 3423299 9402250 15945073 15280935 7010539 -1045033
8627a045033k471049J835204L340007K966006N84222j286566J090910M084851
$$ -1045033 -3516082 -1680878 1659129 4625135 5209357 3922791 5013701 9098552
8619I098552o80497j1515768j5327205o015912O201533R446376M521809p87458
$$ 9098552 8418055 -3097713 -18424918 -24440830 -18239297 -8792921 -4271112 -5058570
8611e058570k386659L47607O223613R047597K551897p384795o852746M855587
$$ -5058570 -7445229 -7097622 -874009 8173588 10725485 3340690 -3512056 1343531
8603A343531J1179640K611365q400845o796835L225248P834308M815145J858506
$$ 1343531 12523171 15134536 6733691 -63144 3162104 10996412 15811557 17670063
8595A7670063J265143m03939k652494k694851k352939l409953j559641N059001
$$ 17670063 18935206 18531267 15878773 13183922 10830983 7421030 5861389 10920390
8587A0920390P762405o83461j1733389j1397655n70100P787332Q260722O409319
$$ 10920390 18682795 17999334 6265945 -5131710 -5701810 2085522 10346244 16755563
8579A6755563M911475L99555n831152p277579m152935m010381q105460q244919
$$ 16755563 21667038 22066593 16235441 8957862 4804927 794546 -7310914 -15555833
8571a5555833n82349P397393P849121K470085k224288k648349J379262P007597
$$ -15555833 -16138182 -8740789 -891668 1578417 -645871 -3294220 -1914958 5092639
8563E092639P397479j776898j2748566j1484939L135430J4888142J0646541k684544
$$ 5092639 12490118 10713220 -2035346 -13520285 -10384855 4503287 15149828 12465284
8555A2465284r036299m515842J207809J129312j358139j014417J281759J854018
$$ 12465284 3428985 -1086857 120952 1250264 -107875 -1122292 159467 2013485
8547B013485N8965k410779m542530n371500l041057K237310O151142M898057Q47787
$$ 2013485 2072450 -338329 -4880859 -10252359 -13293416 -11056106 -4904964 -6907 840880
8538H40880m92393J136618N52889l491482m911877j6011N343840M530034R57202
$$ 840880 348487 1485105 2037994 -1453488 -6365365 -6381376 -1037536 3492498 4449700
8529D449700J835190M973724K624552l088790j430006Q150147J1638627R44047
$$ 4449700 6284890 11258614 13883166 10794376 9364370 17514517 29153144 30097191
8521C0097191j2691600j4426781n966492r4045j775180n131263m997937j788889
$$ 30097191 17405591 2978810 -2987682 -3081727 -4856907 -9988170 -14986107 -16774996
8513a6774996K668563O188763N555068J361798j34486L549376N115440j160034
$$ -16774996 -14106433 -7917670 -2362602 -1000804 -1135290 2414086 7529526 6369492
8505F369492q060336n636505K486637N026243J225398l38594J513045R8422l312088
$$ 6369492 -1690844 -7327349 -4840712 185531 1410929 1072335 2585380 2683802 -628286
8496f28286L61061R379698R517015k637018j0591265k180419J0654770R241188
$$ -628286 -267225 9112473 18629488 15992470 5401205 3220786 13875556 23116744
8488B3116744m668650j3554715r849641k462233m7757j286392k541647l761255
$$ 23116744 18448094 4893379 -4956262 -7418495 -7466252 -8752644 -11294291 -15055546
8480a5055546m050131l41244O085279Q626202M278689j781383l433155q97411
$$ -15055546 -19105677 -19446921 -13361642 -4735440 -456751 -2238134 -5671289 -6568700
8472f568700J709545J944004k05807l269765l957599j5611M563524K385745n994482
$$ -6568700 -4859155 -2915151 -3120958 -6390723 -10348322 -10363933 -5800409 -3414664 -9409146
8463i409146r471925r76559J0452156J0691323Q16986m196965K150583Q123463
$$ -9409146 -18881071 -19857630 -9405474 1285849 2102835 -2094130 56453 8179916
8455H179916J870484j0038854j1579087K14939J1883231J1713475K426652n684411
$$ 8179916 10050400 11546 -11567541 -11352602 530629 12244104 14670756 8986345
8447H986345p141249l828110L1608K018922K531527L182845L637639J469457l135744
$$ 8986345 1845096 -1983014 -1951406 67516 2599043 5781888 9419527 10888984 7753240
8438G753240n627266l538780j066071k184401l244520O47456N773700N175594
$$ 7753240 2125974 -1412806 -2478877 -4663278 -7907798 -7260342 -1486642 3688952
8430C688952O18202j270971j920095o909467j0848161k380741J3802302J7771479
$$ 3688952 4307154 3036183 1116088 -5793379 -16641540 -19022281 -5219979 12551500
8422A2551500L402822j0684268q668535O27962J952698k115063j348143J153957
$$ 12551500 15954322 5270054 -3398481 -2770519 -817821 -2932884 -4281027 -3127070
8414c127070k534251n860249J785373J2041158P510495q032778j2238380J595158
$$ -3127070 -5661321 -11521570 -9736197 2304961 9815456 1782678 -10455702 -8860544
8406h860544J4606857J1497779k61932p488700r262846q262449o01188J2993618
$$ -8860544 5746313 17244092 16982160 9493460 230614 -8031835 -8633023 4360595
8398D360595J8542054N723751j4175937k0293821q152074O945681J0174653K194952
$$ 4360595 22902649 28626400 14450463 -5843358 -13995432 -7049751 3124902 5319854
8390E319854n548605m456618L144296P723392M712790Q12558L599647Q149173
$$ 5319854 -228751 -4685369 -1541073 6182319 10895109 11707667 15307314 23456487
8382B3456487L628284p753940j1257836k088602O277800L080523l484090j565099
$$ 23456487 27084771 19330831 8072995 5984393 12262193 15342716 11858626 10293527
8374A0293527L957066N78877r280667j0673661M89750J0772107Q454208j665820
$$ 10293527 14250593 14829470 5548803 -5124858 -4635108 6136999 14591207 12925387
8366A2925387p349074n079497j600576l191181q049516q811417j111852J0315676
$$ 12925387 5576313 496816 -1103760 -4294941 -12344457 -21155874 -22267726 -11952050
8358a1952050J5063528Q104662l725654q602618k582688O532006Q340861J254517
$$ -11952050 3111478 11216140 7490486 -1112132 -3694820 2837186 11178047 12432564
8350A2432564o358998o471746j134539J169987j462240j309745N412508R323883
$$ 12432564 6073566 -398180 -1532719 -362732 -1824972 -3134717 2277791 11601674
8342A1601674Q65718j2700668j5232501m738586M784556N323693M239026P640190
$$ 11601674 12467392 -233276 -15465777 -20204363 -15419807 -10096114 -5857088 1783102
8334A783102R072213K770100m478528m684931j340515n87647P2048L190420K189055
$$ 1783102 10855315 13625415 9146887 4461956 3121441 2533794 2605842 5796262 7985317
8325G985317n751084q090034M757241J8171292J1150795r561199j6681828l660216
$$ 7985317 2234233 -5855801 -1098560 17072732 28223527 18662328 1980500 -1679716
8317a679716O486278l53565p603579J481919J3754145P687443j0031186j4076394
$$ -1679716 4806562 4452997 -3150582 -1668663 12085482 19772925 9741739 -4334655
8309d334655p640J0281581L325645p680815o050790M430940Q965663L277229m980975
$$ -4334655 -4342295 5939286 9264931 1584116 -4466674 -35734 8929929 12207158 7226183
8300G226183q659734n644790L137813J1736770J0316334l034899j5612743j3871984
$$ 7226183 -1433551 -7078341 -3940528 7796242 18112576 15077677 -535066 -14407050
8292a4407050p77079R211814R472524N719316L179267O53801j995187j633475
$$ -14407050 -15184129 -5972315 3500209 9219525 12398792 13052593 11057406 9423931
8284I423931K97767j895701o699663m953507M448084R577852L243722m853488
$$ 9423931 9721698 7825997 1126334 -3827173 620911 10198763 13442485 8588997
8276H588997l041179M525333O151787J181999k253942k657494n019156q363384
$$ 8588997 5547818 10073151 16224938 17406937 15152995 12495501 7476345 -887039
8268h87039o632421q93650J632791M74244J974889O212389N948705K00504k918181
$$ -887039 -7519460 -8413110 -6780319 -6306075 -4331186 1881203 7829908 8030412 5112231
8259E112231K51841L330005J342938k059642k533928j327075k21795J614154L007253
$$ 5112231 5364072 8694077 10037015 7977373 5443445 4116370 3894575 5508729 8515982
8250H515982J009728k459734k584862r05384k805612n794122k547317L696866
$$ 8515982 9525710 7065976 4481114 3575730 770118 -5024004 -7571321 -3874455
8242c874455J630885p467988q271686L511122J1935917O062759k468033J43770
$$ -3874455 -2243570 -9711558 -17983244 -14472122 -2536205 3526554 1058521 1202291
8234A202291P166350N011230k757540l166540K796272K862049n014519j0500243
$$ 1202291 8368641 13379871 10622331 7455791 10252063 13114112 8099593 -2400650
8226b400650q145305k652394J619569M250785L748321j38398j844153K072794
$$ -2400650 -10545955 -13198349 -11578780 -7327995 -3579674 -3718072 -5562225 -3489431
8218c489431M795438r7403n674399k271016M954332M423197r95968P48158P821019
$$ -3489431 1306007 1208604 -4465795 -6736811 -1782479 2640718 1644750 2392908 10213927
8209A0213927O414543m120295q495253j477887L368326k195970p253685k224396
$$ 10213927 16628470 12508175 4012922 2535035 5903361 3707391 -3546294 -5770690
8201e770690L785981o28322r073924q621440j191119J796212n81398L75962N638764
$$ -5770690 -1984709 -2613031 -11686955 -20308395 -21499514 -19703302 -20284700 -19908738 -14269974
8192a4269974P034177K894002J276635M950293N395984k712434j0892271q731045
$$ -14269974 -7235797 -4341795 -3065160 1885133 7281117 4568683 -6323588 -15054633
8184a5054633J40830L527128q24703k739754L127102Q057457L247020n511990
$$ -15054633 -14913803 -11386675 -12211378 -14951132 -11824030 -3766573 -519553 -6031543
8176f031543o875977k121899j738181o016227l936984O158950J0519996K023222
$$ -6031543 -12907520 -15029419 -16767600 -22783827 -26720811 -20561861 -10041865 -8018643
8168h018643o272479j221110Q980452Q315227j283986m921130j4580J868948k917977
$$ -8018643 -14291122 -15512232 -6531780 1783447 499461 -4421669 -4436249 -2567301 -5485278
8159e485278m447491J737500O280664K248165l750064l434545Q65198K687904
$$ -5485278 -9932769 -8195269 -1914605 333560 -3416504 -6851049 -5985851 -3297947
8151c297947J706770J070872J047783O83965O16919N27131j313111l668719k863864
$$ -3297947 -1591177 -520305 527478 1211443 1828362 2355493 1042382 -2626337 -5490201
8142e490201P83998K780830J745974Q46359J401874J490097J038210J473224Q04320
$$ -5490201 -4706203 -1925373 -179399 666960 2068834 3558931 4597141 6070365 6874685
8133F874685l325070o649553l117103M129069O159340J907063j703260k079370
$$ 6874685 3549615 -3099938 -6217041 -2087972 4071368 5978431 4275171 2195801
8125B195801k131580q62867L830505M699431o068036j7900969j1438315R784545
$$ 2195801 64221 -798646 3031859 7731290 1663254 -16237715 -27676030 -17891485
8117a7891485J9034203N424287r033335l990811Q980021Q555083k060469n240789
$$ -17891485 1142718 6567005 -2466330 -6457141 2522880 11077963 9017494 3776705
8109C776705m08908r81656o840126m272479P642350J2627102K781690r234306
$$ 3776705 3367797 2386141 -4453985 -8726464 -1084114 11542988 14324678 5090372
8101E090372r496627p70179N391619M689457J643434R46069K426878K633735k40992
$$ 5090372 -4406255 -5176434 215185 4904642 6548076 7494145 9921023 12554758 12313766
8092A2313766k869311p52179L833319L833207p14618j571621K885665K936478
$$ 12313766 9444455 8692276 12525595 16358802 15644184 14072563 16958228 19894706
8084A9894706n031061q940525n33550P825232J752663j0151040r505666J100413
$$ 19894706 14863645 5923120 5389570 13214802 14967465 4816425 -4689241 -3588828
8076c588828L364670m014575l183889R607658J4187582n60599j6418582j3242589
$$ -3588828 -224158 -4238733 -7422622 2185036 16372618 15812019 -606563 -13849152
8068a3849152J090270N878403r4419j389988N764115Q389671J24270p859322m750019
$$ -13849152 -12758882 -6880479 -6974898 -8364886 -2600771 5788900 5913170 -1946152 -6696171
8059f696171L740152N220093j186127n647226l326312o8297j225273k829988P36375
$$ -6696171 -2956019 2264074 1077947 -4569279 -7895591 -7963888 -9189161 -12019149 -11282774
8050a1282774N734739M259177j560477j161189O533588Q288952l461004j6114825
$$ -11282774 -5548035 -1288858 -2849335 -4010524 2523064 10812016 7351012 -8763813
8042h763813j3487946M02516P784826L552908J38171N591215J1615239Q254462
$$ -8763813 -22251759 -21849243 -14064417 -10511509 -10373338 -4782123 6833116 15087578
8034A5087578j253557p030568n762939j165118K738416L762565J708414k76999
$$ 15087578 13834021 6803453 1040514 -124604 2613812 6376377 8084791 7807792
8026G807792J050439L037284M21815m544662l430532M764664J0390128P261297
$$ 7807792 8858231 11895515 12317330 7772668 4342136 9106800 19496928 26758225
8018B6758225Q96765k197187m070879p576970q211413k536002K642649m29289
$$ 26758225 27654990 25457803 21386924 13809954 5598541 3062539 5705188 5275899
8010E275899p235344p222564L79508O846323P525467N374085K494270k004158
$$ 5275899 -1959445 -9182009 -8802501 -1956178 5569289 10943374 13437644 11433486
8002A1433486n768028m203595J097460L274223R94176J33567K657850K538633
$$ 11433486 5665458 1461863 2559323 5833546 6827722 6961289 9619139 12157772
$$ [...]
##END NTUPLES=NMR SPECTRUM
##END=
