##TITLE=31Pdec_SR-75-TFAA3'
 CDCl3, 24 sc
 11.7.2023
##JCAMPDX= 6.0         $$ Bruker NMR JCAMP-DX V2.0
##DATA TYPE= NMR SPECTRUM
##DATA CLASS= NTUPLES
##ORIGIN= UXNMR, Bruker Analytische Messtechnik GmbH
##OWNER= root
$$ XWIN-NMR		Version 3.5
$$ Tue Jul 11 13:43:41 2023 Russian Standard Time (UT+4h)  she@DPX200
##.OBSERVE FREQUENCY= 81.013821
##.OBSERVE NUCLEUS= ^31P
##.ACQUISITION MODE= SIMULTANEOUS
##.ACQUISITION SCHEME= undefined
##.AVERAGES= 24
##.DIGITISER RES= 16
##SPECTROMETER/DATA SYSTEM= spect
##.PULSE SEQUENCE= zgpg30
##.SOLVENT NAME= CDCl3
##.SHIFT REFERENCE= (INTERNAL, CDCl3, 0, 248.564)
##AUDIT TRAIL= $$ (NUMBER, WHEN, WHO, WHERE, WHAT)
$$ ##TITLE= Audit trail, XWIN-NMR		Version 3.5
$$ ##JCAMPDX= 5.01
$$ ##ORIGIN= Bruker BioSpin GmbH
$$ ##OWNER= she
$$ F:/spectra/data/she/nmr/P31/1/pdata/1/auditp.txt
$$ ##AUDIT TRAIL=  $$ (NUMBER, WHEN, WHO, WHERE, WHAT)
(   1,<2023-07-11 13:42:41.75 +0400>,<she>,<DPX200>,
      <created by zg, POWCHK disabled, PULCHK disabled
       configuration hash MD5:
       00 E9 B6 7A A2 85 ED C7 34 08 36 98 17 FE 4E 26
       data hash MD5: 32K
       D1 80 62 B2 47 A6 19 45 ED 4C 17 A1 70 B5 26 C9>)
(   2,<2023-07-11 13:42:45.76 +0400>,<she>,<DPX200>,
      <Start of raw data processing
       efp BC_mod = 2 LB = 1 FT_mod = 6 PKNL = 1 PHC0 = -10639.62 PHC1 = -76.51532 SI = 64K 
       data hash MD5: 64K
       2D F5 A3 AB C6 50 46 FB 0E 7E 11 95 2C C4 83 B7>)
(   3,<2023-07-11 13:43:03.15 +0400>,<she>,<DPX200>,
      <pk PHC0 = -0.1292728 PHC1 = 0 
       data hash MD5: 64K
       83 1D FF 1A 0A 0B D7 65 89 C0 2E 09 F4 B7 F5 4A>)
(   4,<2023-07-11 13:43:08.65 +0400>,<she>,<DPX200>,
      <abs ABSG = 5 
       data hash MD5: 64K
       BC 6C F6 9E 70 7C 14 95 29 1F 34 49 4D 31 2B 9E>)
$$ ##END=
$$ 
$$ hash MD5
$$ 49 26 21 C7 1A 85 56 D8 05 A7 33 86 52 A8 48 6B
##$RELAX= 
##$RELAX= 
##$RELAX= 
##$RELAX= 
##$RELAX= 
##$RELAX= 
##$RELAX= 
##$RELAX= 
##$RELAX= 
$$ Bruker specific parameters
$$ --------------------------
##$DU= <F:/spectra>
##$EXPNO= 1
##$NAME= <P31>
##$PROCNO= 1
##$TYPE= <nmr>
##$USER= <she>
##$AMP= (0..31)
100 100 100 100 100 100 100 100 100 100 100 100 100 100 100 100 100 100 
100 100 100 100 100 100 100 100 100 100 100 100 100 100 
##$AQSEQ= 0
##$AQ_mod= 1
##$AUNM= <au_zg>
##$AUTOPOS= <>
##$BF1= 81.014009
##$BF2= 200.13
##$BF3= 200.13
##$BF4= 200.13
##$BF5= 200.13
##$BF6= 200.13
##$BF7= 200.13
##$BF8= 200.13
##$BYTORDA= 1
##$CFDGTYP= 0
##$CFRGTYP= 5
##$CHEMSTR= <none>
##$CNST= (0..31)
1 1 145 1 1 1 1 1 1 1 1 1 1 1 1 1 1 1 1 1 1 1 1 1 1 1 1 1 1 1 1 1 
##$CPDPRG= <waltz16>
##$CPDPRG1= <>
##$CPDPRG2= <waltz16>
##$CPDPRG3= <>
##$CPDPRG4= <mlev>
##$CPDPRG5= <mlev>
##$CPDPRG6= <mlev>
##$CPDPRG7= <mlev>
##$CPDPRG8= <mlev>
##$CPDPRGB= <>
##$CPDPRGT= <>
##$D= (0..31)
0 1 0 0 0 0 0 0 0 0 0 0.03 2e-05 3e-06 0 0 0 0 0 0 0 0 0 0 0 0 0 0 0 0 
0 0 
##$DATE= 1689068561
##$DBL= (0..7)
120 120 120 11 120 120 24 19 
##$DBP= (0..7)
150 150 150 150 150 150 150 150 
##$DBP07= 0
##$DBPNAM0= <>
##$DBPNAM1= <>
$$ [...]
##$SUBNAM3= <"">
##$SUBNAM4= <"">
##$SUBNAM5= <"">
##$SUBNAM6= <"">
##$SUBNAM7= <"">
##$SUBNAM8= <"">
##$SUBNAM9= <"">
##$SW= 501.771253377433
##$SWIBOX= (0..15)
0 1 3 0 0 0 0 0 0 0 0 0 0 0 0 0 
##$SW_h= 40650.406504065
##$TD= 32768
##$TD0= 1
##$TE= 0
##$TE2= 300
##$TE3= 300
##$TEG= 300
##$TL= (0..7)
0 120 53 12 22 120 120 120 
##$TP= (0..7)
150 150 150 150 150 150 150 150 
##$TP07= 0
##$TPNAME0= <>
##$TPNAME1= <>
##$TPNAME2= <>
##$TPNAME3= <>
##$TPNAME4= <>
##$TPNAME5= <>
##$TPNAME6= <>
##$TPNAME7= <>
##$TPOAL= (0..7)
0.5 0.5 0.5 0.5 0.5 0.5 0.5 0.5 
##$TPOFFS= (0..7)
0 0 0 0 0 0 0 0 
##$TUNHIN= 0
##$TUNHOUT= 0
##$TUNXOUT= 0
##$USERA1= <user>
##$USERA2= <user>
##$USERA3= <user>
##$USERA4= <user>
##$USERA5= <user>
##$V9= 5
##$VALIST= <valist>
##$VCLIST= <CCCCCCCCCCCCCCC>
##$VD= 0
##$VDLIST= <DDDDDDDDDDDDDDD>
##$VPLIST= <PPPPPPPPPPPPPPP>
##$VTLIST= <TTTTTTTTTTTTTTT>
##$WBST= 1024
##$WBSW= 4
##$XGAIN= (0..3)
0 0 0 0 
##$XL= 0
##$YL= 0
##$YMAX_a= 5856
##$YMIN_a= -5711
##$ZGOPTNS= <>
##$ZL1= 120
##$ZL2= 120
##$ZL3= 120
##$ZL4= 120
##$ABSF1= 248.5645
##$ABSF2= -253.2056
##$ABSG= 5
##$ABSL= 3
##$ALPHA= 0
##$AQORDER= 0
##$ASSFAC= 0
##$ASSFACI= 0
##$ASSFACX= 0
##$ASSWID= 0
##$AUNMP= <proc_1d>
##$AZFE= 0.1
##$AZFW= 0.5
##$BCFW= 0
##$BC_mod= 2
##$BYTORDP= 0
##$COROFFS= 0
##$CY= -3
##$DATMOD= 1
##$DC= 0
##$DFILT= <>
##$DTYPP= 0
##$F1P= 0
##$F2P= 0
##$FCOR= 1
##$FTSIZE= 65536
##$FT_mod= 6
##$GAMMA= 0
##$GB= 0
##$INTBC= 1
##$INTSCL= 6.047779e-11
##$ISEN= 30
##$LB= 1
##$LEV0= 0
##$LPBIN= 0
##$MAXI= 10000
##$MC2= 0
##$MEAN= 0
##$ME_mod= 0
##$MI= 50
##$NCOEF= 0
##$NC_proc= -10
##$NLEV= 6
##$NOISF1= 182.463
##$NOISF2= 159.3651
##$NSP= 0
##$NTH_PI= 0
##$NZP= 0
##$OFFSET= 248.5645
##$PC= 4
##$PHC0= -10639.75
##$PHC1= -76.51532
##$PH_mod= 1
##$PKNL= yes
##$PPARMOD= 0
##$PSCAL= 0
##$PSIGN= 0
##$REVERSE= no
##$SF= 81.0140089999694
##$SI= 65536
##$SIGF1= 159.3651
##$SIGF2= -187.1042
##$SINO= 113.3802
##$SIOLD= 16384
##$SREGLST= <1H.CDCl3>
##$SSB= 0
##$STSI= 65536
##$STSR= 0
##$SW_p= 40650.406504065
##$SYMM= 0
##$S_DEV= 0
##$TDeff= 32768
##$TDoff= 0
##$TI= <>
##$TILT= no
##$TM1= 0
##$TM2= 0
##$TOPLEV= 0
##$USERP1= <user>
##$USERP2= <user>
##$USERP3= <user>
##$USERP4= <user>
##$USERP5= <user>
##$WDW= 1
##$XDIM= 65536
##$YMAX_p= 532958316
##$YMIN_p= -128103236
$$ End of Bruker specific parameters
$$ ---------------------------------
##NTUPLES= NMR SPECTRUM
##VAR_NAME=  FREQUENCY,     SPECTRUM/REAL,   SPECTRUM/IMAG
##SYMBOL=    X,             R,               I
##VAR_TYPE=  INDEPENDENT,   DEPENDENT,       DEPENDENT
##VAR_FORM=  AFFN,          ASDF,            ASDF
##VAR_DIM=   65536,         65536,           65536
##UNITS=     HZ,            ARBITRARY UNITS, ARBITRARY UNITS
##FACTOR=    0.620285442955139, 1,           1
##FIRST=     20137.2065510682, 0,            0
##LAST=      -20513.1999529968, 0,           0
##MIN=       -20513.1999529968, -128103236,  0
##MAX=       20137.2065510682, 532958316,    0
$$ Real data points
##PAGE= N=1
##DATA TABLE= (X++(R..R)), XYDATA
$$ [...]
44051h921235r448999P00898K0031211K2055506k80153k0660613j5392718L677492
$$ -8921235 -18370234 -17669336 2361875 24417381 24137228 3476615 -11916103 -8238611
44043h238611R634680J64532o004350l190866k426146m269603L320942J7307939
$$ -8238611 1396069 1560601 -4443749 -7634615 -10060761 -14330364 -11009422 6298517
44035F298517J8205573L303225o577106l149861m084226j6070567j5799223R195354
$$ 6298517 24504090 27807315 21230209 18080348 13996122 -2074445 -17873668 -8678314
44027h678314K9327894J3921680j8211037k5053080m174066R226811P89360o411077
$$ -8678314 20649580 34571260 16360223 -8692857 -12866923 -3640112 -2850752 -9261829
44019i261829K686717J0366898j6831j4885857j3142108K157841J2357437R915345
$$ -9261829 -6575112 3791786 3774955 -11110902 -24253010 -22095169 -9737732 177613
44011A77613J730060m472615m685712L189493J5531804K2449006J8088421O955146
$$ 177613 1907673 -2564942 -7250654 -4061161 11470643 33919649 52008070 58963216
44003E8963216m032868j3251901k0037100j9888134r999488M431093J3594866
$$ 58963216 54930348 41678447 21641347 1753213 -8246275 -3815182 9779684
43996I779684J1077844j292609j3349270j3836725k960534N867552L108912l821820
$$ 9779684 20857528 19564919 6215649 -7621076 -10581610 -4714058 -1605146 -5426966
43988e426966l620649J65214k564272p507546j789032J1419504J4807947N690465
$$ -5426966 -9047615 -8882401 -11446673 -18954219 -20743251 -9323747 5484200 11174665
43980A1174665J494882R745010J3456289j335246k0865298k2406012o066674Q361655
$$ 11174665 12669547 22414557 35870846 34535600 13670302 -8735710 -14802384 -6440729
43972f440729R452646M041093J730250J992016j548462j0333602j6623843j0546838
$$ -6440729 3011917 7053010 8783260 10775276 9226814 -1106788 -17730631 -28277469
43964b8277469O262823J7601888J1148698l248213n845245M410487R910312L975479
$$ -28277469 -22014646 -4412758 6735940 3487727 -2357518 2052969 11963281 15938760
43956A5938760L07530O349310Q322888m299873j7909832j5190670j689468O243882
$$ 15938760 16246290 22595600 30918488 26618615 8708783 -6481887 -8171355 -1927473
43948a927473P466021R958793R370952l115908j7248260j2378125J0044874K4478713
$$ -1927473 5538548 15497341 24868293 21752385 4504125 -7874000 2170874 26649587
43940B6649587J5773177k818315j1747296r230966n613754o104284p524852n084028
$$ 26649587 42422764 39604449 27857153 18626187 13012433 6908149 -616703 -5700731
43932e700731K474099R602149O638524o436475j2862527Q17303K0410294J8713591
$$ -5700731 -3226632 6375517 13014041 6577566 -6284961 -5467658 14942636 33656227
43924C3656227l911005j6284216k461632J2682761J902693k0465485j9785907
$$ 33656227 29745222 13461006 10999374 23682135 25584828 5119343 -14666564
43917a4666564M863601J9369793P003594r126068o257355K999948m396369k1799583
$$ -14666564 -9802963 9566830 16570424 7444356 1187001 4186949 -209420 -22009003
43909b2009003k3587895o319639P546396N740321R38593M745142R914690Q336502
$$ -22009003 -45596898 -51916537 -44370141 -38629820 -37691227 -32946085 -23031395 -14694893
43901a4694893O325784Q183691K912982j4290994k3063538m467804K3410220K4403194
$$ -14694893 -8369109 -185418 2727564 -11563430 -34626968 -39094772 -15684552 8718642
43893H718642l443791k3034713j0669830J3747947K0519998J0180603K134467
$$ 8718642 5274851 -17759862 -28429692 -14681745 5838253 16018856 18153323
43886A8153323J735281K09053l676530l348290p17595l795250r883048p885402
$$ 18153323 19888604 20097657 16421127 13072837 12355242 8559992 -1323056 -9208458
43878i208458K199210P009439k65732r937300j0003698j468627M923263K167118
$$ -9208458 -7009248 191 -265541 -10202841 -20206539 -21675166 -16751903 -14584785
43870a4584785n520223o937475L010526J3748342R481345p162263j2973227M581187
$$ -14584785 -20105008 -27042483 -24031957 -10283615 -802270 -7964533 -20937760 -16356573
43862a6356573K5108444K0481078n096312k0323698j0170305P286062J0928627
$$ -16356573 8751871 29232949 24136637 3812939 -6357366 928696 11857323
43855A1857323L272594j373628J355621O762609J0814164Q923632l298093j8578622
$$ 11857323 15129917 13756289 15111910 21874519 32688683 41612315 38314222 19735600
43847A9735600j9818022m345971O896702j727342j5685999j2427324L164263Q656949
$$ 19735600 -82422 -4428393 2468309 740967 -14945032 -27372356 -24208093 -15551144
43839a5551144K148267K698216J2869150J1098060r106089k0849157l519924K1451213
$$ -15551144 -13402877 -10704661 2164489 13262549 4156460 -16692697 -20212621 1238592
43831A238592J9427837o841151k2745419j1685035P721278J4643968J0554243
$$ 1238592 20666429 13825278 -8920141 -20605176 -12883898 1760070 12314313
43824A2314313M508957l242521j1859785j2288289k117147N840644K262577m001185
$$ 12314313 16823270 13580749 1720964 -10567325 -12684472 -6843828 -4581251 -8582436
43816h582436k417101J224886j708468l890741M519179J3811264Q103762n664778
$$ -8582436 -10999537 -9774651 -11483119 -15373860 -10854681 2956583 11060345 5395567
43808E395567o402478N665792Q234443n273763j3788633l910980P864628L710430
$$ 5395567 -1006911 4658881 12893324 7619561 -6169072 -10080052 -2215424 1495006
43800A495006o127037k995020P210271N020299p839107j0274885K971770J1840943
$$ 1495006 -4632031 -7627051 -416780 4603519 -3235588 -13510473 -10538703 1302240
43792A302240K418763j1426830r014644O813456J3737746M52350j8094497j9010697
$$ 1302240 3721003 -7705827 -16720471 -9907015 3830731 4283081 -13811416 -32822113
43784c2822113K71563J8282972J5762783k57548o931759K037741Q018589l428965
$$ -32822113 -32550550 -14267578 1495205 1237657 -5694102 -3656361 4362228 933263
43776I33263j9136535j6938440J861858J5439774J2682033L647165j262130l934030
$$ 933263 -18203272 -35141712 -33279854 -17840080 -5158047 -1510882 -2773012 -6707042
43768f707042n216778K788146J9723246K6933424J0682521j3447443j7820588
$$ -6707042 -11923820 -9135674 10587572 37520996 48203517 34756074 16935486
43761A6935486j396936Q220573n207555k3125204j9554004K324717J7136343J3155563
$$ 16935486 15538550 23759123 18551568 -4573636 -24127640 -21802923 -4666580 8488983
43753H488983K764686j506718k408013m476810k572689N536638Q991113Q8335
$$ 8488983 11253669 9746951 7338938 2862128 289439 5826077 14817190 14905525
43745A4905525r691047n771437N151295N017170n932833r978591k211759K010183
$$ 14905525 5214478 -556959 4594336 9611506 3678673 -6299918 -8511677 -6501494
43737f501494m811462q466585J377764J0682818K652028j3865752j6731243l342722
$$ -6501494 -11312956 -19779541 -18401777 -7718959 -5066931 -18932683 -35663926 -39006648
43729c9006648Q253959Q020731M861620O969513Q323996K250329m011123M97655
$$ -39006648 -30752689 -22731958 -17870338 -10900825 -2576829 -326500 -4337623 -3839968
43721c839968J1463500J2337610k592872j7668507j4861962K099507J2647359
$$ -3839968 7623532 19961142 17368270 -300237 -15162199 -13062692 -415333
43714d15333P441342j299751j943148j140846p766737j2940967m774445O996221
$$ -415333 7026009 5726258 3783110 2642264 -5124473 -18065440 -22839885 -15843664
43706a5843664N042579k574195P559222L0331723L1000688j665140l2704779k9844974
$$ -15843664 -10801085 -13375280 -5816058 24515665 55516353 53851213 21146434 -8698540
43698h698540p427870K334571j796837N02743R998992Q992140m316074j2333569
$$ -8698540 -16126410 -13791839 -15588676 -15085933 -5086941 3905199 -410875 -12744444
43690a2744444o706950L649816J0887982J3616348Q316114l769347p387907O316323
$$ -12744444 -19451394 -15801578 -4913596 8702752 17018866 13249519 5861612 12177935
43682A2177935J7621795L430220k1513406k0662719Q023706K6348690J2142287
$$ 12177935 29799730 33229950 11716544 -8946175 -922469 25426221 37568508
43675C7568508j2477151k0217929j4034819p284382K319582J7350345K2717564
$$ 37568508 25091357 4873428 -9161391 -16445773 -14126191 3224154 25941718
43668B5941718P292249j3087377j6859074p742533k934648k144057P688205K3191944
$$ 25941718 33233967 20146590 3287516 -4455017 -7389665 -9533722 -1845517 21346427
43660B1346427K4077254L054648k1748195k8489550j4447057N519892J5139339
$$ 21346427 45423681 48478329 26730134 -1759416 -16206473 -10686581 4452758
43653D452758R393153l601626j1817450j1312614o654079n14436R065301J9140383
$$ 4452758 13845911 10244285 -1573165 -12885779 -19539858 -20054294 -10988993 8151390
43645H151390J9681433O748699r891349j8075810j5650690p462562K060383Q445025
$$ 8151390 27832823 34581522 24690173 6614363 -9036327 -16498889 -14438506 -5993481
43637e993481P341569P81915l323816j876409L34655O11850K094716M669878K855777
$$ -5993481 1348088 2130003 -1193813 -3070222 -2735567 -2123717 -29001 4640877 7496654
43628G496654l144421n142810m51592K856946j258381q845056j3821638j2987893
$$ 7496654 4352233 -790577 -1242169 1614777 356396 -8488660 -22310298 -35298191
43620c5298191k689333J5104634K3807089Q990928j4253462j5182945O026140
$$ -35298191 -37987524 -22882890 924199 9915127 -4338335 -19521280 -13495140
43613a3495140J4504826m840117k1022782o197472J8986252J9055810j473885
$$ -13495140 1009686 -3830431 -24853213 -31050685 -12064433 6991377 5517492
43606E517492j1901847o342613l253116n132678K333813J5261152J3576386j042305
$$ 5517492 -6384355 -12726968 -15980084 -21112762 -18778949 -3517797 10058589 9016284
43598I016284m842912O236208Q945148n403586j4767147m465920Q469798M598645
$$ 9016284 4173372 10409580 19354728 13951142 -816005 -5281925 3187873 7786518
43590G786518r554691j8120937j8462962j2336049L312409K1022435K0547442
$$ 7786518 -1768173 -19889110 -38352072 -50688121 -47375712 -26353277 -5805835
43583e805835j20496j2811076J334186K0913312J6821264k691237q234661K941721
$$ -5805835 -5926331 -18737407 -17403221 3510091 20331355 17640118 9405457 12347178
43575A2347178P520213j825428p453614r09914L895971j631489o022920j087011
$$ 12347178 19867391 18041963 10588349 9678435 13574406 11942917 5919997 4832986
43567D832986K413990m168176r403060j317904R142637L013078j5857575k3397906
$$ 4832986 7246976 3078800 -6324260 -7642164 1500473 4513551 -11344024 -34741930
43559c4741930p855804J5244830K3955676J5079711K876043j376722j335157o323276
$$ -34741930 -42597734 -27352904 -3397228 11682483 14558526 13181804 11846647 5523371
43551E523371j4650738j3201902K851792J7234308J1019302q493349j3862518
$$ 5523371 -9127367 -22329269 -19477477 -2243169 8776133 282784 -13579734
43544a3579734K896103J5619893K464951j8329865j4288484J0657358K1491482
$$ -13579734 -10683631 4936262 7401213 -10928652 -25217136 -14559778 6931704
43537F931704O542524o988190r33881M578963r351351k2138780p345372J7339048
$$ 6931704 13474228 6486038 5552157 10131120 779769 -21359011 -28704383 -11365335
43529a1365335J4127488j1924069j8890326K589010J3007524q714687k6737627
$$ -11365335 2762153 -9161916 -28052242 -25463232 -12455708 -21170395 -47908022
43522d7908022n821296K9013139K9873784k13567j5222634J779739J8527719Q627118
$$ -47908022 -53729318 -24716179 5157605 4944038 -10278596 -8498857 10028862 18655980
43514A8655980j2401897j8822754j1229340l743705J758981Q807147J0686468
$$ 18655980 6254083 -12568671 -23798011 -27541716 -25782735 -16975588 -6289120
43507f289120K053805n025194L437551J8268712J6762141l996508k0773038j4786325
$$ -6289120 -4235315 -9260509 -5822958 12445754 29207895 25211387 4438349 -10347976
43499a0347976M742960J4731606P493076l066160k163539O879936P998932o164700
$$ -10347976 -5605016 9126590 16619666 13553506 11389967 18269903 26268835 20104135
43491B0104135k3609883k6139697r774337J2355766K5544785K5829125J6847180
$$ 20104135 -3505748 -29645445 -39419782 -27064016 -1519231 24309894 41157074
43484D1157074K554602j1959092j8179445j1091967K124790P600493J319529n711854
$$ 41157074 43711676 31752584 13573139 2481172 4605962 12206455 13525984 7814130
43476G814130l050844M013214K985285n100541n619593N926181J3220418K227009
$$ 7814130 4763286 8776500 11761785 6661244 1041651 6967832 20188250 22415259
43468B2415259j5151856j5728573J520837J3823711O676427q989775j5142886
$$ 22415259 7263403 -8465170 -6944333 6879378 13555805 4566030 -10576856
43461a0576856o812815J0749713K9325610L5567135J8049241j3716392l2411760
$$ -10576856 -17389671 -6639958 22685652 58252787 76302028 62585636 30173876
43454C0173876k5970626j2374084r534100q346556O222930K3535196K1035174
$$ 30173876 4203250 -8170834 -17704934 -26051490 -19828560 3706636 24741810
43447B4741810P0292j6546907j7790039j2292060o294718L037002J2520413J3048804
$$ 24741810 24812102 8265195 -9524844 -21816904 -28111622 -25074620 -12554207 494597
43439D94597O661575M336689N813577Q64862q750914r374712L03095N942693K051392
$$ 494597 7156172 11492861 17306438 18171300 9420386 45674 348769 6291462 8342854
43430H342854q97688J724657P86681o648224r963952m960380j773635n299689
$$ 8342854 7445166 9169823 9956504 3308280 -6655672 -11616052 -13389687 -18689376
43422a8689376o679655j762865J099024r62794O46316O909558P451153K915983
$$ -18689376 -25369031 -27131896 -26032872 -26995666 -26349350 -19439792 -11988639 -9072656
43414i072656O899167J6986023J1714359j0932413k2156308p504228P278369o01470
$$ -9072656 -2173489 14812534 26526893 15594480 -6561828 -14066056 -6787687 -7389157
43406g389157j2036353j036939J7803053J3909818p002179j4765795n057717K090384
$$ -7389157 -19425510 -20462449 -2659396 11250422 4248243 -10517552 -15575269 -13484885
43398a3484885M214899J5210298K6930949J4866337j5538680k8783471j2617582
$$ -13484885 -9269986 5940312 32871261 47737598 32198918 3415447 -9202135
43391i202135N733858N787316K02197K780042M862194j33243k41079Q627055Q599395
$$ -9202135 -3468277 2319039 2521236 5301278 10163472 10030229 9789150 18416205 27015600
43382B7015600q335191k1504559j5196526m787306o623308q213637M492066J4962839
$$ 27015600 18680409 -2824150 -18020676 -22807982 -29431290 -37644927 -33152861 -18190022
43374a8190022L998273j0460349J147381K8083645L2804726J0429244n870225
$$ -18190022 -14191749 -24652098 -23504717 4578928 37383654 47812898 41942673
43367D1942673o89773K517078j3008257k7046874j7290957L507353R160591l62623
$$ 41942673 41252900 43769978 30761721 3714847 -13576110 -10068757 -908166 -1270789
43359a270789n336999k23566K234804m616834j2958666j4996610r995062J928091
$$ -1270789 -6607788 -6831354 -4596550 -9213384 -22172050 -37168660 -47163722 -45235631
43351d5235631J8052313K5453240J1190091j6085257k9057635j3932102J0751984
$$ -45235631 -27183318 -1730078 9460013 -6625244 -35682879 -49614981 -38862997
43344c8862997J6365915j913641k2382301k3109899k320171K4031978L6231291
$$ -38862997 -22497082 -24410723 -46793024 -69902923 -72223094 -48191116 -11959825
43337a1959825K4557667j634691j9000339j3042945M382129R839102j784m914245
$$ -11959825 12597842 10963151 -8037188 -21080133 -16698004 -6858902 -6860686 -11774931
43329a1774931P130759K0492163J4918169m374471j4938134q269024L251246P398261
$$ -11774931 -4644172 15847991 30766160 26391689 11453555 3184531 6435777 13834038
43321A3834038M714039N47490j501136K431597J1957251J5606356K631489j7518089
$$ 13834038 18548077 19095567 17594431 20026028 31983279 47589635 50221124 32703035
43313C2703035k3462010j2162799l057289o622197q912284J788976J2792064Q605275
$$ 32703035 9241025 -2921774 -5979063 -12601260 -21513544 -19724568 -6932504 1672771
43305A672771j354414J781306J3660620J2999544m064784j8854280j9307914j2720242
$$ 1672771 318357 2099663 15760283 28759827 24695043 5840763 -13467151 -26187393
43297b6187393o191203M613103J9229481K3300484Q145206j3084688k1416612
$$ -26187393 -32378596 -27765493 -8536012 14764472 22909678 9824990 -11591622
43290a1591622j5669758q585778o283594l664756L599908J3797790K4059498L0440305
$$ -11591622 -27261380 -35847158 -42130752 -45795508 -42195600 -28397810 -4338312 26101993
43282B6101993K4712719K864441k1758807k6588036p750297J0878516P183277
$$ 26101993 50814712 53679153 31920346 5332310 -2417987 8460529 15643806
43275A5643806r104095j1499281K373674P045570q196175j7342518K945467L1118732
$$ 15643806 6539711 -4959570 -2585896 4459674 -3736501 -21079019 -18133552 12985180
43267A2985180K7515779n317137k4205838j0022763O227245l237938j8944677
$$ 12985180 40500959 35183822 10977984 955221 7182466 3944528 -15000149
43260a5000149j0841319R227549Q556455j0098736j4001781L890910J5101806
$$ -15000149 -25841468 -16613919 -8057464 -18156200 -32157981 -28267071 -13165265
43253a3165265M637019p245045k119763R854322J3307108R965478M247260o894243
$$ -13165265 -8528246 -15773291 -17893054 -8038732 5268376 15233854 19481114 12586871
43245A2586871j5991349n070955J9329234K1009641j2335183l9067628j8710680
$$ 12586871 -3404478 -8475433 10853801 31863442 19528259 -19539369 -38250049
43238c8250049K6241865M1187847J6238027q999069j0092388m216150q582134
$$ -38250049 -12008184 29179663 45417690 36418621 26326233 22110083 13527949
43231A3527949j2602334m931526L295171l64913p974892o684549J524405Q519751
$$ 13527949 925615 -4005911 -710740 -1075653 -9050545 -15735094 -14210689 -5690938
43223e690938J2810931J2862852L590532r860892j1352415J481406Q418307l429549
$$ -5690938 7119993 19982845 23573377 13712485 2360070 3841476 12259783 8830234
43215H830234j7075059j0514440R161867J6789589N924009o047602o258853o55487
$$ 8830234 -8244825 -18759265 -9597398 7192191 13116200 7068598 809745 154258
43207A54258J242055j8844J95808J942666K719580J530585j678153n811392p137983
$$ 154258 1396313 1377469 1573277 3515943 6235523 7766108 6087955 276563 -6861420
43198f861420k786041L870629N764093R19007m560477l434105M127938R803171
$$ -6861420 -9647461 -5776832 -12739 906268 -3654209 -7088314 -2960376 6842795
43190F842795N903205m544353r631508l577351M475790K940506n303815p894995
$$ 6842795 12746000 8201647 -1429861 -5007212 -531422 2409084 -2894731 -10789726
43182a0789726j787870M644539O877841Q263908Q461267K316641p445961j0949878
$$ -10789726 -12577596 -7933057 -1055216 7208692 15669959 17986600 10540639 -409239
43174d09239p274965m528780j858193R288853K1757225J4372745j2499550k7648419
$$ -409239 -7684204 -12212984 -14071177 -4782324 16974901 31347646 18848096 -8800323
43166h800323j2108049J1096423J2197958l69112K199524K0479528K6914573R105166
$$ -8800323 -20908372 -9811949 2386009 2016897 4216421 24695949 51610522 60715688
43158F0715688j4832269k4022091j5760377J059178J4398842J2512871l762557
$$ 60715688 45883419 21861328 6100951 7160129 21558971 34071842 30309285
43151C0309285j5813440j0730870j957468o784643j4408815l614096J6350673
$$ 30309285 14495845 3764975 1807507 -4977136 -19385951 -23000047 -6649374
43144f649374J6068611m945285j5000928p68714J3672122Q571318l009267l143416
$$ -6649374 9419237 4473952 -10526976 -11295690 2376432 10947750 7938483 4795067
43136D795067K765893K524406j925885n843602j2104428j6559537o177618J4284044
$$ 4795067 7560960 10085366 8159481 2315879 -9788549 -26348086 -32525704 -18241660
43128a8241660J9187998J859478r711760K701501J5798781M158855j5035427j0467009
$$ -18241660 946338 2805816 -6905944 -4204443 11594338 15753193 717766 -9749243
43120i749243J0552313J5867934K208867m281746M062112O844260l673792p970418
$$ -9749243 803070 16671004 18879871 14598125 18660237 25504497 21830705 13860287
43112A3860287N079639J7278368R607910r625396j9092136j2577208j369277K209132
$$ 13860287 18939926 36218294 45826204 36200808 17108672 4531464 3162187 5371319
43104E371319m087480j2117425j1411920j569597O681882Q054613J1140290K0259254
$$ 5371319 1283839 -10833586 -22245506 -23815103 -17133221 -9078608 2061682 22320936
43096B2320936K1508253M217837j5012578j2702147M618413R866217k089458r740881
$$ 22320936 43829189 48047026 33034448 20332301 24950714 34816931 32727473 22986592
43088B2986592l440197J178951n191630q964614m13882P846242L763706l642783
$$ 22986592 19546395 20725346 15533716 6569102 6155220 14001462 17765168 14122385
43080A4122385k324655J892342j540179q403716q745752l440400J548900N914463
$$ 14122385 11797730 13690072 12149893 3746177 -4999575 -8439975 -6891075 -976612
43072i76612Q412873K662220q228176p503781R586020K0345359L960835k4824374
$$ -976612 7436261 10098481 1870305 -5633476 3952544 24297903 28258738 3434364
43064C434364l2949000j3605463Q287476J3381352R237356J0257520J4258766
$$ 3434364 -29514636 -43120099 -34832623 -21451271 -12213915 -1956395 12302371
43057A2302371Q988524p432307k2201563k2150171p856267P345696J1922993P645290
$$ 12302371 21290895 13858588 -8342975 -30493146 -38349413 -31003717 -19080724 -11435434
43049a1435434L818660L497922K848391J605339K699152J960673p309057j7545667
$$ -11435434 -7616774 -4118852 -1270461 334878 3034030 4994703 -2314354 -19860021
43041a9860021j2049167P512523J7724212P032672o894279o285694R78563K011558
$$ -19860021 -31909188 -24396665 -6672453 360219 -6534060 -12819754 -11841191 -9829633
43033i829633L761179J3711405J6082332k386142j9592110p466390J7272519J3922381
$$ -9829633 -6068454 7642951 23725283 21339141 1747031 -5719359 11553160 25475541
43025B5475541j4828721k3418238K585248K2096654O556078j4296857n170963
$$ 25475541 10646820 -12771418 -10186170 11910484 18466562 4169705 -1001258
43018a001258J5918892J1563604j1606043j8574086o410860k228580r657379m265103
$$ -1001258 14917634 26481238 14875195 -3698891 -10109751 -12338331 -21995710 -26260813
43010b6260813J6869788K5129452Q564049q801948q642563l927356p040678o109627
$$ -26260813 -9391025 15738427 24302476 15500528 6857965 2930609 -4110069 -10219696
43002a0219696O243819J1716612o76201q367817P596950K3373779P057744k4686278
$$ -10219696 -3975877 7740735 7064534 -1303283 6293667 29667446 36725190 12038912
42994A2038912k6747228M939811K7554013J7940652K283040N701092J1378292
$$ 12038912 -14708316 -9768505 17785508 35726160 38009200 43710292 55088584
42987E5088584m718196k7783835k5759258j248176J1291357l250032k0660034
$$ 55088584 50370388 22586553 -3172705 -4420881 6870476 3620444 -17039590
42980a7039590j3893342J1395108K7882169K0817025Q89865j1595865p145741
$$ -17039590 -30932932 -19537824 8344345 29161370 30051235 18455370 11309629
42973A1309629P359033J7913391J5759802K579273j2433510j8992930j3346842
$$ 11309629 18668662 36582053 52341855 54921128 42487618 23494688 10147846
42966A0147846l436411k351351j1263673j4543299q34451J7106211J7626541J566731
$$ 10147846 6711435 4360084 -6903589 -21446888 -22281339 -5175128 12451413 14018144
42958A4018144r406590n880291j422602n350684o951012J951510R002248J828525
$$ 14018144 4611554 -1268737 -2691339 -8042023 -14993035 -13041525 -4039277 -2210752
42950b210752r747166r373089J179477R850710J3926057J4595665N735913j1774666
$$ -2210752 -11957918 -21331007 -20151530 -10300820 3625237 18220902 23956815 12182149
42942A2182149j7933617N93176K3592842K1827837n06568j4901667j2020303n690307
$$ 12182149 -5751468 -5158292 18434550 40262387 39755819 24854152 12833849 7143542
42934G143542M66106J5013584K7519968J3585572k0724478l5551092j2718987
$$ 7143542 7609648 22623232 50143200 63728772 43004294 7453202 -5265785
42927e265785J7293770K0943034M957178n648902o082982n297167l440900L86832
$$ -5265785 12027985 32971019 37928197 32279295 26196313 20899146 17458246 17845078
42919A7845078l484951j6527269j9376736q66160J7793868J2660455n219548q673005
$$ 17845078 14360127 -2167142 -21543878 -22410038 -4616170 8044285 2824737 -5848268
42911e848268K803107Q019182J542725l426708k877514l846146l024554Q074513
$$ -5848268 -3045161 4974021 6516746 3090038 212524 -3633622 -6658176 1416337
42903A416337J9368890J2182353p648439j4961649m600100L348803P57877L056723
$$ 1416337 20785227 32967580 25319141 10357492 5757392 9106195 9864072 12920795
42895A2920795J5209741J6632043m280557k5709799k2100015m13574J2490202
$$ 12920795 28130536 44762579 40482022 14772223 -7327792 -7741366 4748836
42888D748836O163411p253749j4549291j3571273q341215l497788j542628j61977
$$ 4748836 10912247 3658498 -10890793 -24462066 -32803281 -36301069 -37843697 -38005674
42880c8005674L892133P106540L738251j334828L350245J6156168K0855498J0358763
$$ -38005674 -34113541 -27007001 -23268750 -24603578 -21253333 -5097165 15758333 26117096
42872B6117096k194050l777448K94786j938109j0100064j4183501q517432M047815
$$ 26117096 23923046 20145598 20440384 18502275 8402211 -5781290 -14298722 -10250907
42864a0250907J4743583J2460427m885905k0548439j4775452O727709J7969607
$$ -10250907 4492676 16953103 12067198 -8481241 -23256693 -16528984 1440623
42857A440623J0676376M487833J0024098Q629282j2346297k9287029j5104935
$$ 1440623 12116999 16604832 26628930 35258212 22911915 -6375114 -21480049
42850b1480049J5764652K6805853J2764811P06086L275380N076783k738213p297999
$$ -21480049 -5715397 21090456 33855267 34561353 37836733 42913516 40175303 32877304
42842C2877304j789062M94486p707574j2148467k553138P727556M508197k760656
$$ 32877304 31088242 31582728 23875154 11726687 9173549 16901105 21409302 18648646
42834A8648646J376544J0050717M772405j3078126k2131125j0961867Q540055
$$ 18648646 20025190 30075907 34848312 21770186 -360939 -11322806 -2782751
42827b782751J9226811J7160833R083901J313391m299071q522147j2283763j4702994
$$ -2782751 16444060 33604893 42688794 44002185 39703114 31180967 18897204 4194210
42819D194210j3581791q438170q61103Q147379J6619864J7737003N848651j1330109
$$ 4194210 -9387581 -17825751 -18686854 -10539475 6080389 23817392 29666043 18335934
42811A8335934j6940662p140486J843655k152980p360482L214624K1531504K2279673
$$ 18335934 1395272 -5745214 -3901559 -6054539 -13415021 -10200397 11331107 33610780
42803C3610780m64720k3624887k6461992j4438739l830979K040083Q476659J2566347
$$ 33610780 33146060 9521173 -16940819 -31379558 -35210537 -33170454 -24693795 -12127448
42795a2127448O977837l752129o169339K197570Q890697N910833J514635N753551
$$ -12127448 -5149611 -8901740 -15071079 -12873509 -3982812 1928021 3442656 9196207
42787I196207J3247955J0946049r66321p770999j357427P946004O776114k097800
$$ 9196207 22444162 33390211 32423890 24652891 23295464 31241468 38017582 35919782
42779C5919782n889247k755635l795560j2761913j6982637o019285J0552591J4924869
$$ 35919782 30030535 27274900 23479340 10717427 -6265210 -12284495 -1731904 13192965
42771A3192965M913211n379921n751778N47408O076156O776086P27324r099830
$$ 13192965 18106176 12726255 6974477 7521885 13598041 20374127 21101451 12001621
42763A2001621j1080291K580213J8558151J3971768j0098748k4601423j1558847
$$ 12001621 921330 3501543 22059694 36031462 25932714 1331291 -10227556
42756a0227556J0506078J4535597K355068m957776j544509J253553k02425P62415
$$ -10227556 278522 14814119 17169187 12211411 10666902 11920455 11718030 12480445
42748A2480445J864083n851687j6185058j2295171M006092J1679457M594110J079115
$$ 12480445 14344528 8492841 -7692217 -19987388 -15981296 -4301839 292271 1371386
42740A371386J0482175J6351808P052990k279261K151980N911036p739150k4096330
$$ 1371386 11853561 28205369 35258359 32979098 35131078 41042114 33302964 9206634
42732I206634j8203046L598076J4070354Q530024N831225R959484M749266j0253600
$$ 9206634 -8996412 -5398336 8672018 17202042 23033267 32992751 37742017 27488417
42724B7488417j2406648N477940J9149550J0071715p351500j2741722j0295927
$$ 27488417 15081769 20559709 39709259 49780974 42429474 29687752 19391825
42717A9391825j1740795r728176N983815K0855146J3067445q685630j3815954
$$ 19391825 7651030 -2077146 3906669 24761815 37829260 29143630 15327676
42710A5327676M405497J9031546J0579848p091870j3173880j0634654j3323695
$$ 15327676 19733173 38764719 49344567 42252697 29078817 18444163 5120468
42703E120468j7610422q781174J0271429J8772312Q934173j828941J913227R792195
$$ 5120468 -12489954 -21271128 -10999699 7772613 16706786 14877845 16791072 26583267
42695B6583267L724254j0273269q675908J1725780K3828024P688088j8642220
$$ 26583267 30307521 20034252 11358344 23084124 46912148 54600236 35958016
42688C5958016k2540220j802856J3940796N789112j0566362j1066176K224594
$$ 35958016 13417796 11614940 25555736 31344848 20778486 9712310 11936904
42681A1936904O870970o515953k1475452j8433269j62457J2790766Q900972q35564
$$ 11936904 18807874 12291921 -9183531 -27616800 -27779257 -14988491 -6087519 -6923083
42673f923083J06859J0397422J4353521O265535k401110l140246k739543p115948
$$ -6923083 -6816224 3581198 17934719 24200254 21799144 18658898 15919355 8803407
42665H803407p881634J265500Q464947K342601n164349K307894J3333795M390889
$$ 8803407 921773 2187273 10652220 12994821 7830472 10138366 23472161 27863050
42657B7863050j6378997j5377970J1688582K6909503O666126k1524297k1088426
$$ 27863050 11484053 -3893917 7794665 34704168 41370294 19845997 -1242429
42650a242429J679377J5152303J0888029M159725N24870o464506j2172485n826375
$$ -1242429 436948 15589251 26477280 30637005 31161875 24697369 12524884 6698509
42642F698509M805344J659945j1559977j2244731M788051J9409349J8185272R725972
$$ 6698509 11503853 13163798 1603821 -10640910 -5852859 13556490 31741762 41467734
42634D1467734K741186o841429j8415373j9506496p834116m44210p442925j4392854
$$ 41467734 44208920 37367491 18952118 -554378 -8388494 -8832704 -16275629 -30668483
42626c0668483n862026Q906845J0867887L04002o235082j025416Q342549J3289792
$$ -30668483 -36530509 -27623664 -16755777 -16451775 -22686857 -23712273 -15369724 -2079932
42618b079932J2027878N964115j155855l488882q25881j287270q092402j0770672
$$ -2079932 9947946 15912061 14756206 11267324 10441443 9154173 1061771 -9708901
42610i708901p33259J1350259Q658701n068344r067624L287063J4411656R888238
$$ -9708901 -10442160 908099 9566800 4498456 -4569168 -1282105 13129551 23017789
42602B3017789j57179Q08156Q042844L215638j4441518k3349065j0340407R432539
$$ 23017789 22860610 23668766 31711610 34927248 20485730 -2863335 -13203742 -3771203
42594c771203J3762042L356792l884563k001381k232599q983228r866845K274562
$$ -3771203 9990839 13347631 9463068 7461687 5229088 -3754140 -13620985 -11346423
42586a1346423J3864747J0418421k66499r86805O908035O886856m701966j2847970
$$ -11346423 2518324 12936745 12670246 11683441 18591476 25478332 20776366 7928396
42578G928396p868380J774045N357088L863361J610406k987930r929301j1625002
$$ 7928396 60016 1834061 7191149 11054510 12664916 9676986 -252315 -11877317
42570a1877317m046283L817888J147682r111595j4129762p238687O700056J8935573
$$ -11877317 -15923600 -12105712 -10958030 -20069625 -34199387 -41438074 -34738018 -15802445
42562a5802445K3324744J7249490K871721j1357862j4855602m336965J0385449
$$ -15802445 7522299 24771789 27643510 16285648 1430046 -2906919 7478530
42555G478530J3229089p97615j6231335j3239994N640941J6626577P856313l932220
$$ 7478530 20707619 19910004 3678669 -9561325 -3920384 12706193 20562506 16630286
42547A6630286k011282K113832r289523k3879698j5583454Q676774J4228927n777501
$$ 16630286 14619004 16732836 7443313 -16436385 -32019839 -23343065 -9114138 -14891639
42539a4891639j6948359J336151K2957972J8698244J360751j716972M102104m276699
$$ -14891639 -31839998 -30503847 -7545875 11152369 12513120 10796148 14898252 10621553
42531A0621553k2392021k4712492q179871N444581P741783J1451368J9539649
$$ 10621553 -11770468 -36482960 -44662831 -39218250 -31476467 -20025099 -485450
42524d85450J8162397N642703p59520M497178M411971r521897j9514928r341148
$$ -485450 17676947 23319650 22560130 27057308 31469279 21947382 2432454 -6908694
42516f908694R128762J2879947k310503k1672079k9854302j9914114M027672K4365232
$$ -6908694 2220068 15100015 12789512 -8882567 -38736869 -58650983 -54623311 -30258079
42508c0258079K2984360N057078l967810O369125J5816688M903012j4950481j9823117
$$ -30258079 -7273719 -2216641 -6184451 184674 16001362 20904374 5953893 -13869224
42500a3869224q151863K300919K975437N12817K62352J894625P005088J4506646
$$ -13869224 -22021087 -19720168 -16744731 -16231914 -15969562 -14074937 -7069849 7436797
42492G436797J3605422j286823j4576342q831331M982824J613476j5536829j5647341
$$ 7436797 21042219 19755396 5179054 -3652277 1330547 2944023 -12592806 -28240147
42484b8240147Q547283K3018582L653413k2807317j6853587J4113180K7807667
$$ -28240147 -19692864 3325718 6979131 -15828186 -32681773 -18568593 9239074
42477I239074R790055j1234059j1752605k445929J326736O088640J7989664K0193888
$$ 9239074 19029129 7795070 -3957535 -6403464 -5076728 1011912 19001576 39195464
42469C9195464r10846k4855713k2450610j417817N231530p820699j1494601O922610
$$ 39195464 38284618 13428905 -9021705 -10439522 -5207992 -13028691 -24523292 -17600682
42461a7600682K1516493J1295189n039348j438765J2452299R735773q160597j5913614
$$ -17600682 3915811 15211000 10171652 8732887 21185186 30920959 22760362 6846748
42453F846748o437006K569941K510667M280087J1059974R110388n171036j3870464
$$ 6846748 409742 2979683 5490350 9770437 20830411 29940799 24769763 10899299
42445A0899299n835580M687417K096353n930723l982759N598231R912681P247731
$$ 10899299 5063719 9751136 11847489 5916766 1934007 7532238 17444919 24692650
42437B4692650N216538N372368M433544L865546N185676L013609n081908j0500618
$$ 24692650 29909188 35281556 39715100 43580646 48766322 51779931 46698023 36197405
42429C6197405p718077n539514r682015p425263J0191557K3576668R118817j9044127
$$ 36197405 28479328 22939814 13257799 5832536 16024093 39600761 48719578 29675451
42421B9675451k3383020J355135K0033101J1271968l733767j067905Q508728M603814
$$ 29675451 6292431 7647566 27680667 38952635 35218868 34150963 42659691 47263505
42413D7263505n984484n757523j428984j0998036k6666876k2887802J399429J8457640
$$ 47263505 41279021 35521498 34092514 23094478 -3572398 -26460200 -25060771 -6603131
42405f603131J2479879j681777o460337m412293l949070k914009J798764M320570
$$ -6603131 5876748 4194971 -2265366 -6677659 -10626729 -13540738 -11741974 -7421404
42397g421404Q57523k511484k291256m166632q423566m517491Q632946J3678448
$$ -7421404 -6563881 -9075365 -11366621 -15533253 -23956819 -28474310 -19841364 -6162916
42389f162916J302453j0298159j793673J5073904J5293850Q39098m281638M751677
$$ -6162916 -4860463 -15158622 -16952295 -1878391 13415459 14254557 9972919 14724596
42381A4724596P121804n203181j2130552m67130J1398611K744053j4463867j2940336
$$ 14724596 21846400 16643219 4512667 4045537 15444148 18188201 3724334 -9216002
42373i216002P820960K0340546Q243754j3168877j9236030m790675J4976531K3311679
$$ -9216002 -1395042 18945504 27189258 14020381 -5215649 -10006324 4970207 28281886
42365B8281886J5854813J121958q447077q090007m724837p122642j2927449j0579656
$$ 28281886 44136699 45258657 36811580 28721573 23996736 16874094 3946645 -6633011
42357f633011M311404J9872612K0451374O303958n906206m796097L12047o093691
$$ -6633011 -2321607 17551005 38002379 44306337 38400131 33604034 33916081 27822390
42349B7822390j9597035j8413200L916567K3546891J6364869q229281k0533702
$$ 27822390 8225355 -10187845 -6271278 17275613 33640482 25411201 4877499
42342D877499j0685220M089811R579131R832561R616874M011228o060739p578459
$$ 4877499 -5807721 -1717910 7861221 17693782 27310656 31321884 25261145 17682686
42334A7682686L729758J2783988P698899k150012l784522j819546o551419j3130365
$$ 17682686 21412444 34196432 41895331 39745319 35960797 34141251 27589832 14459467
42326A4459467r601159K560889J0886467Q391893l378759j8683823k5229881j0693464
$$ 14459467 4858308 7419197 18305664 26697557 23318798 4634975 -20594906 -31288370
42318c1288370J6540676K8717433J5079689r96840J309904P847677j539434j3339256
$$ -31288370 -14747694 13969739 29049428 28052588 29362492 37210169 35670735 22331479
42310B2331479l635800J5458295J2897832o958379j0545071O300571J1095797
$$ 22331479 18695679 34153974 47051806 40093427 29548356 35848927 46944724
42303D6944724p698330k0178132o436392J1503227Q789596n728476j3512384j6084598
$$ 46944724 39246394 19068262 12631870 24135097 32924693 27196217 13683833 -2400765
42295b400765j8233867r782188J1502623K3625216J1786932n593731n797577M107735
$$ -2400765 -20634632 -30416820 -18914197 4711019 16497951 10904220 5106643 9214378
42287I214378N286571j360605n287292p704881r520842O84105K2047724K8208396
$$ 9214378 14500949 13140344 7853052 148171 -9372671 -8688566 13359158 41567554
42279D1567554O660123j3119990l493521J4174849N585110j5704518j1071767
$$ 41567554 48227677 35107687 31614166 45789015 51374125 35669607 24597840
42272B4597840J4623952J9790791l677451j9432374r187479L765491K536783O29393
$$ 24597840 39221792 59012583 55335132 35902758 26715279 30480770 33017553 33646946
42264C3646946M488781k200710j8671510j5631390J2703687K6574359M48501l1817137
$$ 33646946 38135727 35935017 17263507 1632117 14335804 40910163 41358664 9541527
42256I541527k6608687M895617K0480723J1944055M813994P508171L182305j1057203
$$ 9541527 -17067160 -12171543 8309180 20253235 25067229 32575400 35757705 24700502
42248B4700502j4395730K809006K2137235K2672779M924190j5034937k1538266
$$ 24700502 10304772 13113778 35251013 57923792 62847982 47813045 26274779
42241B6274779r686972P693728P636056j4682232l2403419j9220936J2217802
$$ 26274779 16587807 24281535 31917591 17235359 -15168060 -34388996 -22171194
42234b2171194K5964904J2258518l670183k518585N847183O932537M933352Q430333
$$ -22171194 3793710 16052228 12382045 9863460 15710643 22643180 27576532 36006865
42226C6006865J1322858L584683j0781654j9930892j9608511j1835248K566820
$$ 36006865 47329723 50914406 40132752 20201860 593349 -11241899 -8675079
42219h675079J8898424K4663886J3634183k073543o429885j114383L91094l722724
$$ -8675079 10223345 34887231 48521414 46447871 40017986 38903603 39294697 35571973
42211C5571973j992815Q067389J2721418L093530j0134748j2460600n709528j402988
$$ 35571973 33579158 41646547 54367965 57461495 47326747 34866147 29156619 27753631
42203B7753631j690778L9724L742472K179351m088473m642090M161530J1588914
$$ 27753631 26062853 26102577 29845049 32024400 27935927 23293837 27455367 39044281
42195C9044281O901770p234435k0294457k4376517j5090070P192325K9751890
$$ 39044281 45946051 38711616 18417159 -5959358 -21049428 -13857103 15894787
42188A5894787L2024632Q846539j8082826k3306539o886867R802710J1750921
$$ 15894787 47919419 56765958 38683132 15376593 8489726 18292436 30043357
42181C0043357J904124j0015122j6695673j3217703n88121J0670917J0543935
$$ 30043357 31947481 21932359 5236686 -7981017 -8569138 2101779 12645714
42174A2645714K263785l309918k168781L324599J2589299K1611769J7486620m048233
$$ 12645714 14909499 11599581 9430800 12755399 25344698 46956467 64443087 60394854
42166F0394854k1929955j2780469J2156377J8330804k007055j8394576q967710
$$ 60394854 38464899 25684430 37840807 56171611 54164556 35769980 26802270
42159B6802270Q517124P921675n890635r659893J596463J1769257R403541j074564
$$ 26802270 35319394 43241069 37350434 27690541 29287004 41056261 50459802 49385238
42151D9385238r422262q916991l54338N611477k126430j7340774j9592274k236398
$$ 49385238 39962976 31045985 30691647 36303124 34176694 16835920 -2756354 -4992752
42143d992752J6622062J9957192J2693337N714779k823580j4425508j6241537
$$ -4992752 11629310 31586502 44279839 49994618 47171038 32745530 16503993
42136A6503993q55564J4019830Q172675r861446j6998824j0912587o293214m253616
$$ 16503993 15648429 29668259 37840934 27979488 10980664 68077 -6225137 -10478753
42128a0478753O488304K1750717K4152471J4017387J0027901J5078955R635929
$$ -10478753 -3990449 17760268 41912739 55930126 65958027 81036982 90672911
42121I0672911j2118119k6577428j5939521L265341N608751n893176q972688J357454
$$ 90672911 78554792 51977364 36037843 39303184 44911935 39018759 30046071 31403525
42113C1403525P625666j62369q718390k384941J2179572J3707061l860591k0777468
$$ 31403525 39029191 38866822 30148432 27763491 39943063 53650124 49789533 29012065
42105B9012065j6896428N08818P479489p63275l364108J0989158K2865224J1690991
$$ 29012065 12115637 12624455 20103944 19340669 15976561 26965719 49830943 61521934
42097F1521934r935952j3935230Q34705Q461315m634373k3268469k7586335j3707160
$$ 61521934 51585982 37650752 38485457 46946772 42312399 19043930 -8542405 -22249565
42089b2249565J0926389L3519505L6258805J1774746j8342634k1829712J874263
$$ -22249565 -11323176 22196329 58455134 70229880 51887246 30057534 31931797
42082C1931797J8776440P237120j4526635j9334179p944052J716824M915345R251229
$$ 31931797 50708237 57945357 43418722 24084543 16140491 17857315 22772660 32023889
42074C2023889J4126461J1746592M549892L870574J0667875J1409246k894089
$$ 32023889 46150350 57896942 62446834 66317408 76985283 88394529 85500440
42067H5500440k2379985k8953888j8343540n644961n582277j1657800n446817
$$ 85500440 63120455 34166567 15823027 10178066 4595789 -7062011 -12508828
42060a2508828J2604053J8227932n86625j9903042j2096386J1447448J6294953
$$ -12508828 95225 18323157 17736532 -2166510 -14262896 -2815448 13479505
42053A3479505l695534k0736841j7233874m539261N519785J6037884K4009763
$$ 13479505 9783971 -10952870 -28186744 -32726005 -27206220 -11168336 12841427
42046A2841427J5455990n693236j3012058L058171J8563735J4383847L400562
$$ 12841427 28297417 22604181 9592123 12650294 31214029 45597876 48998438
42039D8998438J979252L282983m05137J733065J2125183Q797983j4903274k5272267
$$ 48998438 50977690 54260673 53855536 55588601 67713784 76511767 61608493 36336226
42031C6336226J278438L0976500J9138546j8616662l0217794p253909J0508076
$$ 36336226 37614664 68591164 87729710 69113048 38895254 31641345 42149421
42024D2149421M128283l554571J702114M090717l933240o350519J369810K374863
$$ 42149421 46277704 42723133 44425247 48515964 44582724 38232205 39602015 41976878
42016D1976878m494398J890512K1054543K2382933j756413j6671425k421238J1344911
$$ 41976878 37482480 39372992 60427535 82810468 81054055 64382630 61961392 73306303
42008G3306303k387674k0003048r358974J2775795R318653j4370531k2011715
$$ 73306303 70918629 50915581 41556607 54332402 63651055 49280524 27268809
42001B7268809o195863P789175R772391J3089740J7608654O665488j4703787j7807562
$$ 27268809 21072946 28862121 38634512 51724252 69332906 75998394 61294607 43487045
41993D3487045L103918J7131428M174785j4587167j2547442J548409K022119j2010418
$$ 43487045 46590963 63722391 67897176 53310009 40762567 42310976 44333095 32322677
41985C2322677j8197493o214471J0072347J4489395O734734l199706p845708n979569
$$ 32322677 14125184 7910713 17983060 32472455 39207189 36007483 28161775 22182206
41977B2182206K41524P773140J3251149J2941800M892750o472953j0879408k938838
$$ 22182206 22423730 30196870 43448019 56389819 61282569 54809616 43930208 40991370
41969D0991370Q748413R914064j233408j0700386n934557Q779308J7399932R765557
$$ 40991370 49739783 59653847 58420439 47720053 41785496 50564804 67964736 77730293
41961G7730293q234453k0853513j7824225l563559R487623J4865674J4801718
$$ 77730293 69495840 48642327 30818102 27254543 36742166 51607840 66409558
41954F6409558J0557297J50954j1046473r736855N925055J6839129O304107j4374471
$$ 66409558 76966855 77117809 66071336 56334481 62259536 79098665 85402772 71028301
41946G1028301j9135077k128167J6535233J8702554O274440q658630j6077583
$$ 71028301 51893224 49765057 66300290 85002844 91277284 82618654 66541071
41939F6541071r337962R322252K1921076J0648457j4726882k3388600m485957
$$ 66541071 57203109 66525361 88446437 99094894 84368012 60979412 56493455
41932E6493455J7085534J6254935K24860r357212r069348q939996q813031k545061
$$ 56493455 73578989 89833924 90058784 80701572 71632224 62692228 53879197 51334136
41924E1334136K776489m135252j4735811r809015Q084127J6012742P534848K351046
$$ 51334136 54110625 49975373 35239562 25430547 33514674 49527416 57062264 59413310
41916E9413310J0564594J3419113l359783j9171080o546224K3440233L2267756
$$ 59413310 69977904 83397017 80037234 60866154 54319930 77760163 110027919
41909A10027919Q124964j7948525j6619332J706382P459065m944502j3488886
$$ 110027919 118152883 100204358 83585026 85291408 92750473 87805971 74317085
41902G4317085k886485J5272763J9961009O296573j2587388k2084981j7813743
$$ 74317085 71430600 86703363 106664372 112960945 100373557 78288576 60474833
41895F0474833n016845O599481Q663369R65931o870089n060993M719761J2005537
$$ 60474833 55457988 62057469 70720838 71686769 64816680 59755687 64475448 76480985
41887G6480985J1558876Q043787N595589J781367l225325j195030J0701340J8724722
$$ 76480985 88039861 96083648 101679237 103460604 100235279 99040249 109741589 128466311
41879A28466311Q719623j0485814j6206367m661470L776405k436468p589438L376359
$$ 128466311 137185934 126700120 110493753 105832283 109608688 107172220 99582782 102959141
41871A02959141J5997238P006171j5866082k0781148J362649K1786722J4010026
$$ 102959141 118956379 125962550 110096468 89315320 90677969 112464691 126474717
41864A26474717j0894601k2663938j1121460Q327257J9140398J7752767Q162297
$$ 126474717 115580116 92916178 81794718 90121975 109262373 127015140 135177437
41857A35177437k791133o207248N89543P379280L402905n707098n937173J854330
$$ 135177437 132386304 126179056 126768599 134147879 137550784 131843686 125906513 127760843
41849A27760843K891016n068259m836246J1479177K4069077J2148574j2311749
$$ 127760843 130651859 125583600 120747354 132226531 156295608 168444182 156132433
41842A56132433j8129232J600125K0515715J6617604l49070q401896m586577k200304
$$ 156132433 138003201 139603326 160119041 176736645 176387575 167985679 163399102 161198798
41834A61198798o348470r374095p960625q096249r744862j363939K0972269L8649826
$$ 161198798 154850328 145476233 137515608 129419359 119674497 118310558 139282827 177932653
41826A77932653K8104185p695747l6398747k9887216M441935L1869227K8622115
$$ 177932653 206036838 198341091 161942344 132055128 136497063 168366290 196988405
41819A96988405N876509p475335m80463J0840040J0181520L237462L282612N530462
$$ 196988405 202864914 195389579 194909116 205749156 215930676 219168138 222450750 227981212
41811B27981212m738338k1148922j7609253J0772545L1258164J6516221j3614069
$$ 227981212 223242874 202093952 184484699 195257244 226515408 243031629 229417560
41804B29417560j8890295L645707J9314731J0751403l84951N060244J2674428
$$ 229417560 210527265 214172972 233487703 244239106 243854155 248914399 261588827
41797B61588827L661451j0640920q504258N482721J0166915K858685k057709j932887
$$ 261588827 265250278 254609358 246105100 251587821 261754736 264613421 262555712 260622825
41789B60622825n784801r199825J942189K1247040K3791601M838144j0130997
$$ 260622825 254838024 245638199 247580388 268827428 292619029 297457173 287326176
41782B87326176m351456O544950M040976l795012j744248L605359j616232q854969
$$ 287326176 282974720 289519670 293560646 289765634 288021386 291626745 290010513 281155544
41774B81155544J518916K5150561L5165844J9439187m077480j2963387n125957
$$ 281155544 282674460 307825021 342990865 362430052 358352572 345389185 340263228
41767C40263228O531491J1230530O867097j465015n639166k963962j56029k574039
$$ 340263228 346794719 358025249 364892346 363427331 357788165 354824203 354668174 352094135
41759C52094135l475942N632352J7743548J7685550O087897K14504P692498J5247728
$$ 352094135 348618193 354250545 371994093 389679643 395767540 395982044 403674542 418922270
41751D18922270J0918906L108410N628607J3821443J0526079p093244k0409809
$$ 418922270 429841176 432949586 438578193 452399636 462925715 455832471 435422662
41744D35422662j2726194Q589235K0253424J1352965l464515l110211J2174757
$$ 435422662 422696468 431285703 451539127 462892092 459427577 456317366 468492123
41737D68492123K1505578J2604146j503371k495135P183579J1065673M390023
$$ 468492123 489997701 502601847 501098476 498603341 505786920 516852593 521242616
41730E21242616k635711m183083m630281m795421M60208P313335K588166j4595965
$$ 521242616 518606905 514423822 509793541 504998120 505458328 512771663 515359829 500763864
41722E00763864k5761959j7141625J372079J1168939Q271248J853852q57004K266244
$$ 500763864 475001905 457860280 459232359 470401298 478672546 480526398 479669394 481935638
41714D81935638J1564514K1120100J8338064q93237k2390092k9073245k0736849
$$ 481935638 493500152 514620252 532958316 532065079 509674987 480601742 459864893
41707D59864893r419939j860652K851345M302411J363331j864578p68906K582585
$$ 459864893 450444954 448584302 451435647 455738058 457101389 455236811 454467905 457050490
41699D57050490M859017P870545J0983808O044611q167901j5681658l415060J5439388
$$ 457050490 461909507 469780052 480763860 486808471 478640570 462958912 459543852 474983240
41691D74983240J6109437l758548k2968594k6834782j9323228o930169Q143795
$$ 474983240 491092677 487334129 464365535 437530753 418207525 411277356 419421151
41684D19421151J7017852Q394859j0493717j7364198o409033L103280k261363
$$ 419421151 436439003 444833862 434340145 416975947 410566914 413670194 411408831
41677D11408831j1239346j1080035q741348j3054577j4346235j881900J2481243
$$ 411408831 400169485 389089450 380348102 367293525 352947290 351065390 363546633
41670C63546633R900794n532411j3691925q972239l474166l555903l183619L94876
$$ 363546633 373447427 367915016 354223091 345250852 341776686 338220783 335037164 335432040
41662C35432040K276127J285170L46622k823462r747440r924064M873296J8598790
$$ 335432040 337708167 338993337 339339959 336516497 326769057 316844993 321718289 340317079
41654C40317079Q293933j5812265j7240952J1087640K9522125Q822136k3786230
$$ 340317079 348611012 332798747 315557795 326645435 356167560 364989696 341203466
41647C41203466k4449469K351874J4832665l18599j3035810l361396Q518950Q18584
$$ 341203466 316753997 319105871 333938536 333619937 320584127 317222731 325741681 326560265
41639C26560265j2647622p646491R528762J3904257K732186l525671K391599L664816
$$ 326560265 313912643 306266152 315794914 329699171 332431357 328905686 331297285 334962101
41631C34962101j0867007k7980332k9956415j6989222k56669J3621650K0372198
$$ 334962101 324095094 296114762 266158347 249169125 248912456 262534106 282906304
41624B82906304J2646264q554490k4210814j4790379J3554907L3027996K6352823
$$ 282906304 295552568 286998078 262787264 247996885 261551792 294579788 320932611
41617C20932611N038801p890323n370860k60473n127404j4934746j3526658M056881
$$ 320932611 325971412 318081089 312710229 312449756 307322352 292387606 278860948 282917829
41609B82917829K1887969K0966079K711668j4311611j9339775j8442058j6965260
$$ 282917829 304805798 325771877 328483545 314171934 294832159 276390101 259424841
41602B59424841r192047O033807J5001591Q558407q93481J032474N347972m518262
$$ 259424841 250232794 256266601 271268192 279826599 278933118 279965592 285313564 280795302
41594B80795302j9631243j4857400R741345K4478266J3022766n635340q846908
$$ 280795302 261164059 246306659 256048004 280526270 293549036 287913696 279066788
41587B79066788j041307J672665j855936l893132n573300j0858898j3729913p370846
$$ 279066788 278025481 279698146 277842210 273949078 268375778 257516880 243786967 236416121
41579B36416121K902548R032804J1959078J1836366R54072j7927537k2423201
$$ 236416121 239318669 248351473 260310551 272146917 273100989 255173452 232750251
41572B32750251j179922K0790936J3840601j0493678j6447535n07933M813303
$$ 232750251 231570329 252361265 266201866 255708188 239260653 238752720 243566023
41565B43566023j3739239k7711417j3016897J2687617J8881472N308306o168318
$$ 243566023 229826784 202115367 189098470 201786087 220667559 225975865 219807547
41558B19807547o677709m834647n832630o153927m473596k726305j32772K739392
$$ 219807547 213129838 208295191 202462561 196308634 191835038 189108733 188975961 191715353
41550A91715353K1420q831794j2223621k048876J1550427J3765875N850345j477719
$$ 191715353 191736773 182904979 170681358 168632482 180182909 193948784 199799129 198321410
41542A98321410p263424j6096246k1143234j1721758M160235O210326o494617
$$ 198321410 191057986 174961740 153818506 142096748 146256983 152467309 145972692
41535A45972692j1359264K587674J5142912M322405j9331346k5832857o500251
$$ 145972692 134613428 137201102 152344014 156666419 137335073 111502216 105001965
41528A05001965J5836663J7595254J525051j1643571r576546O90074M976454j157317
$$ 105001965 120838628 138433882 139958933 128315362 118738816 119428890 124405344 123248027
41520A23248027r877554j2969845j1494283j0674515r062823n42956J2354648
$$ 123248027 113370473 100400628 88906345 78231830 69169007 68626051 80980699
41513H0980699J6493510N439245q408823q360290L610241R656256J966805o310321
$$ 80980699 97474209 102913454 94504631 86144341 89754582 99410838 101377643 95067322
41505I5067322j545141R400971R265944m023139j4758436j2931254p857811j1937416
$$ 95067322 93522181 102923152 112189096 108165957 93407521 80476267 72618456 60681040
41497F0681040j9817526j4819208O073791K4625287K2560559L210008j4142240
$$ 60681040 40863514 26044306 32118097 56743384 79303943 82513951 68371711
41490F8371711j7318123j0862975l818396K293052Q787292J1444179O130709j389775
$$ 68371711 51053588 40190613 36372217 38665269 47452561 58896740 65027449 63637674
41482F3637674k326956j72827n953217j6254410j2284739J0400838K7361187J6645931
$$ 63637674 61310718 61137891 55184674 38930264 26645525 37046363 64407550 81053481
41474H1053481p338796j2635315M404197J6732689R100308l822450p401328q052051
$$ 81053481 73714685 61079370 65483567 82216256 91316564 87494114 80092786 72040735
41466G2040735j1932046q109825Q125508J6963416K913511j5133529r830881J0902384
$$ 72040735 60108689 51998864 60124372 77087788 80001299 64867770 55036889 65939273
41458F5939273J5721101j568023j6326433j4586719q952177q690232m234732Q012447
$$ 65939273 81660374 80092351 63765918 49179199 40227022 31536790 27302058 35314505
41450C5314505J2136067j176500j6250175j5721036m545350M324414J1488999
$$ 35314505 47450572 46274072 30023897 14302861 9757511 14081925 25570924
41443B5570924K1376709K5387906J3914217m213743j1950854p331784j651467
$$ 25570924 46947633 72335539 86249756 82036013 70085159 62753375 61101908
41436F1101908o93814k136274n792796j1713461j2314555p63516J5018833J9414199
$$ 61101908 60408094 58271820 52479024 40765563 28451008 27687492 42706325 62120524
41428F2120524R109602m009930q035693n68027J3074011K2136719J5624163m801796
$$ 62120524 71230126 67220196 59184503 58616476 71690487 93827206 109451369 104649573
41420A04649573k1578881k0839937r995631n020928o770634m089715M241978P373308
$$ 104649573 83070692 62230755 52235124 47214196 40443562 36353847 40595825 47969133
41412D7969133J720610l204666q57319L398550K858307j256308l818431j094608
$$ 47969133 49689743 46485077 45627758 49026308 51884615 50628307 46809876 45715268
41404D5715268P805534J6427774J1324687j0763704k9515303k1765134M550189
$$ 45715268 53520802 69948576 81273263 70509559 40994256 19229122 23779311
41397B3779311J7091177M031177r918425l548392P109572l795938k6552166k6516327
$$ 23779311 40870488 44901665 34983240 31434848 38544420 34748482 8196316 -18320011
41389a8320011L681704L1268513K9251643J0213329q8449j853053j0811724k1512676
$$ -18320011 -14638307 16630206 45881849 56095178 56006729 54153676 43341952 21829276
41381B1829276j1461073J7141280K9817144P281538k3578144k6925376p921389
$$ 21829276 10368203 27509483 57326627 64608165 41030021 14104645 6183256
41374F183256J343335o111725p156130O592486J4420473N958757J760192J6473292
$$ 6183256 7526591 1414866 -5741264 851222 15271695 21230452 22990644 39463936
41366C9463936K9658337J7652878p564177j8902933j6024172j6073535j5938781
$$ 39463936 69122273 86775151 79210974 60308041 44283869 28210334 12271553
41359A2271553R18591K5460552K7969151N495997j0041453j122614R577787j301800
$$ 12271553 13190144 38650696 66619847 72115844 62074391 60951777 70529564 69227764
41351F9227764j9802546j8479792Q68100J2785015O159782n619152q608985m138986
$$ 69227764 49425218 30945426 31813526 44598541 50758323 45139171 36530186 32391200
41343C2391200j19673O24528O70877L032737O862437O778547K27905m626319K689927
$$ 32391200 32271527 32896055 33566932 36599669 43462106 50240653 50468558 45842239 48532166
41334D8532166J6755899J8738083K916779j2309634r703343K604219N503550k194260
$$ 48532166 65288065 84026148 86942927 74633293 64929950 67534169 73037719 70843459
41326G0843459n818665o85007J879121m830326j1512852p266757N054956J4052180
$$ 70843459 65024794 64339787 66218908 61388582 49875730 42608973 47663929 61716109
41318F1716109J4200975R638684O221140L691312l114780j4513942j9591709o786166
$$ 61716109 75917084 85555768 91776908 95468220 92353440 77839498 58247789 51461623
41310E1461623J6652254K5687111P092326j9664064k4606274o348259P502732
$$ 51461623 68113877 93800988 100893314 81229250 56622976 50274717 57777449
41303E7777449j1651j3764921j3074665k417266O55573l048353L281528K0957734
$$ 57777449 57765798 44000877 30926212 28508946 29164519 26116166 29397694 50355428
41295E0355428K8915140J4762009n774616j1878687n431993j067479k55360N698330
$$ 50355428 79270568 94032577 88257961 76379274 70947281 69879802 69624442 75322772
41287G5322772J3330142R005072o787648j6792601j2357447m036587k120967l789696
$$ 75322772 88652914 97657986 90870338 74077737 61720290 57683703 55562736 51773040
41279E1773040n528598j0096740j3066347j989596J9395855K6123320P042904
$$ 51773040 46244442 36147702 23081355 21091759 40487614 66610934 73653838
41272G3653838j4035670j1890170L131067N560149l364743l339152O083711O277556
$$ 73653838 59618168 47727998 50859065 56419214 53054471 49715319 55799030 62076586
41264F2076586m801452r430892l202616r12976n860351l257098Q842436J1442769
$$ 62076586 57275134 47844242 44641626 43728650 37868299 34611201 43453637 54896406
41256E4896406j879050j0831331j610311J0548503Q065061j574864k635424K975632
$$ 54896406 53017356 42186025 40575714 51124217 59189278 57614414 54978990 57954622
41248E7954622M194584K87882l653913p327676q633284r71114J1630911J3440416
$$ 57954622 62149206 62437088 58783175 51455499 42822215 41851101 53482012 66922428
41240F6922428K348883l213725M656176Q237845l172474j0605369J591711J4314428
$$ 66922428 69271311 66057586 70713762 78951607 75779133 65173764 66765475 81079903
41232H1079903M604950j2745295r004397Q816271J0452399n042501j0054655Q77377
$$ 81079903 85684853 72939558 63935161 72751432 83203831 78161330 68106675 68984052
41224F8984052K906517j1383553j6764577j136460J0508533j562760j6513105
$$ 68984052 71890569 60507016 43742439 42605979 53114512 51551752 35038647
41217C5038647o225763J8982636K7087468J2657642p74663m82280J220419n384919
$$ 35038647 28812884 47795520 74882988 87540630 86765967 86283687 87504106 82119187
41209H2119187r681321p17904J1522519R385854n353725j2465303j642818J2833257
$$ 82119187 72437866 71719962 83242481 92628335 87274610 74809307 73166489 85999746
41201H5999746J2186739j597646j1630255j1621289j0627572j2641866q541818
$$ 85999746 98186485 96588839 84958584 73337295 62709723 50067857 41526039
41194D1526039N226716J5311185R655966m572954j2558171j0977742m250989P040431
$$ 41526039 46752755 62063940 71719906 67146952 54588781 43611039 39360050 46400481
41186D6400481K0012381K2291608P529250r861190j2091121k881720J923662M82516
$$ 46400481 66412862 88704470 96233720 86372530 74281409 71399689 73323351 73805867
41178G3805867J663145K413468p926792k2699766k1215387K43238K1234171K4825984
$$ 73805867 75469012 77882480 69955688 47255922 26040535 26283773 47517944 72343928
41170G2343928J4719269K378040n013878j742881J2518451K3195082J3870343
$$ 72343928 87063197 89441237 84427359 82684478 95202929 118398011 132268354
41163A32268354q310982j9265117j2189216m135264n516444o979119k722169j609429
$$ 132268354 123957372 104692255 92503039 88367775 82851331 75872212 73150043 71540614
41155G1540614n087175Q78180J8131195K4582577P784954j0746048n426398J5649042
$$ 71540614 66453439 67331619 85462814 110045391 117830345 107084297 101657899 117306941
41147A17306941K4272566J1689154n350024j0311122k499662O998243M329743
$$ 117306941 141579507 153268661 147918637 137607515 135107853 142106096 146435839
41140A46435839j3626086k8279994j6802058J2580059K4619332P991456m946730
$$ 146435839 132809753 104529759 87727701 100307760 124927092 132918548 127971818
41133A27971818J0510217K9114027J6049097j4223335j9644200L314550J8671572
$$ 127971818 138482035 167596062 183645159 169421824 149777624 153092174 171763746
41126A71763746J0801299J598211N156661P625680K295667N523623K1456155K5751070
$$ 171763746 182565045 184163256 189319917 196945597 199241264 204764887 226221042 251972112
41118B51972112N434015j4610778q689362J0766496J6475783Q035631L633431
$$ 251972112 257406127 242795349 234105987 244872483 261348266 269383897 273017328
41111B73017328O005495M495635N35732M230189J1772458J0916738M851842P009844
$$ 273017328 279022823 283518458 284054190 288284379 300056837 310973575 315825417 322835261
41103C22835261J4476011J0647439m394734r677743M537611K0477425J7852626
$$ 322835261 337311272 347958711 343563977 333886234 338423845 358901270 376753896
41096C76753896P3530j4024978j3790472l787678N032584M957184k503493p759833
$$ 376753896 376827426 362802448 349011976 345224298 350256882 355214066 352710573 344950740
41088C44950740m963041m22114j555156l036328K608616O203233o418248k5937035
$$ 344950740 339987699 339565585 338010429 334974101 337582717 343785950 337367702 311430667
41080C11430667k7354821r819391j096164j2376149j8473822j836385J3012379
$$ 311430667 284075846 274256455 273160291 260784142 242310320 240473935 253486314
41073B53486314j679462k7001324k3967647L800636J5687947j223162j5603357
$$ 253486314 251806852 224805528 200837881 204638517 220326464 219103302 203499945
41066B03499945o380572O783305L156825m658882R22381Q355976j091645j7754133
$$ 203499945 197119373 203902678 207059503 202400621 203323002 211678978 210587333 192833200
41058A92833200j8937655o877447l427631j3846500k1402363j5922774n857984
$$ 192833200 173895545 167018098 163590467 149743967 128341604 112418830 106560846
41051A06560846r59762n66900j446258l796961o812515p013704j787870R442372
$$ 106560846 105601084 105034184 103587926 99790965 92978450 85964746 84176876 93619248
41043I3619248K2918441K6714317J0366996j6069085k7572170j7642831q206069
$$ 93619248 116537689 143252006 153619002 137549917 109977747 92334916 84128847
41036H4128847j3558427j6664487j560162J3743348O078892j0373513o409080
$$ 84128847 70570420 53905933 52345771 66089119 72168011 61794498 55385418
41029E5385418J1094810J1268288n134492p083795R741931J4272943l374347j3519696
$$ 55385418 66480228 77748516 72614024 65530229 75272160 89545103 86170756 72651060
41021G2651060j337296N779999j0626063k4038721j0033250Q035031o67529j8947953
$$ 72651060 71313764 77093763 66467700 42428979 32395729 40430760 39763231 20815278
41013B0815278j0978854J4432533J8123812k970746j1948891N909982K1879787
$$ 20815278 9836424 24268957 42392769 39422023 27473132 33383114 55262901
41006E5262901J3240038m398264q837358m347069m876793p551098k276940P399384
$$ 55262901 68502939 64104675 55267317 50920248 46043455 38492357 36215417 43614801
40998D3614801R936677K980902o993250j4366801j5225079p033649M788984Q413997
$$ 43614801 53551478 56532380 49539130 35172329 19947250 12913601 17702585 26116582
40990B6116582J430533l015028N518549J7510493J5022800k979152j7608548j3712126
$$ 26116582 27547115 24532087 30050636 47561129 62583929 59604777 41996229 28284103
40982B8284103J614504R133910J806657q445042r007120l062319j018796k432547
$$ 28284103 29898607 39032517 40839174 32394132 23387012 20324693 19305897 16873350
40974A6873350R79039P040810M198158o241021o743133Q740968K0716772J2142942
$$ 16873350 17852389 24893199 29091357 22850336 16107203 24848171 45564943 57707885
40966E7707885l880597l568343J0113826J2016875n826384k1671348j5584272
$$ 57707885 53827288 50258945 60372771 72389646 66563262 44891914 29307642
40959B9307642M005758J4079382O299679p029509j1553478p468890n705244j0118052
$$ 29307642 33313400 47392782 53692461 46662952 35109474 27640584 21935340 11817288
40951A1817288j0007196L043270J6643399J1389849o998605j0653314P554200
$$ 11817288 1810092 4853362 21496761 32886610 25888005 15234691 22788891
40944B2788891J8017770j529563k8227319k6174184L09330J6339190R143316k224767
$$ 22788891 40806661 39277098 11049779 -15124405 -14815075 1524115 10667431 8442664
40936H442664n399053p979482j0237767P84325K1278848K6410037Q674160p889027
$$ 8442664 3043611 -4935871 -15173638 -14389313 6889535 33299572 41973732 34084705
40928C4084705o244163j356148q410692j2739423L648079K6099705K6474925O018637
$$ 34084705 27840542 26484394 18073702 5334279 8982358 35082063 61556988 67575625
40920F7575625q434712n148142O69622n034103j6270210j9720710j1914406r7419
$$ 67575625 59140913 53992771 54662393 49628290 33358080 13637370 1722964 1625545
40912A625545N629829Q42716p100668n677707M928077R153464j057905j1992789
$$ 1625545 7255374 8098090 997422 -4680285 247792 9401256 8343351 -3649438
40904c649438q753317J437336K901771j434814K517338J1368505P081343j0930664
$$ -3649438 -12402755 -10965419 -8063648 -9498462 -6981124 4387381 11468724 538060
40896E38060k0310172q928341P552457J1668589Q667966J0166535R443299n906272
$$ 538060 -19772112 -28700453 -21147996 -9479407 -811441 9355094 18798393 12892121
40888A2892121k5295395k3312124K086774K1542779J3748402m741129m752755
$$ 12892121 -12403274 -35715398 -33628624 -12085845 1662557 -3078572 -7831327
40881g831327J2535783J9186838L604802j3578267j2872372l196109j492244l455668
$$ -7831327 4704456 23891294 27496096 13917829 1045457 -2150652 -3642896 -7098564
40873g098564L892714J2890399N443450j2031731j3159666N556619J5938740L080112
$$ -7098564 -3205850 9684549 15127999 3096268 -10063398 -4506779 11431961 14512073
40865A4512073r362926J916031K0241818J5568022o050728j1933354M926181J5866561
$$ 14512073 5149147 7065178 27306996 42875018 36824290 24890936 29817117 45683678
40857D5683678K095356j8946432k3299927j3144542m684561p06756O532410J4584544
$$ 45683678 47779034 28832602 5532675 -7611867 -12296428 -13003184 -6470774 8113770
40849H113770J1289765n086246j9129884j4949297N933056K5081987K4378030
$$ 8113770 19403535 14317289 -4812595 -19761892 -13828836 11253151 35631181
40842C5631181M546781j3465205j0565732O508622J1534591p262530k9585803
$$ 35631181 40177962 26712757 16147025 22655647 34190238 26927708 -2658095
40835b658095k8402534n354825J2271817P689673o237216p262636Q404774K5297051
$$ -2658095 -31060629 -36415454 -24143637 -16453964 -22691180 -29953816 -21549042 3748009
40827C748009K7664470J1845245j3726834l2085472k6790505Q48524K5444848
$$ 3748009 31412479 43257724 29530890 -2554582 -29345087 -28496563 -3051715
40820c051715K1221546o004426k2999412j0080144J4870312K2300828R053926
$$ -3051715 18169831 12165405 -10834007 -20914151 -6043839 16256989 25310915
40813B5310915l618808k371433N374556R141785Q574651N473004k328403j2497901
$$ 25310915 21692107 19320674 24695230 33837015 42411666 47884670 45556267 33058366
40805C3058366j5436530p538125K045774M784624L974320N354493N770030M50072
$$ 33058366 17621836 10083711 12129485 16914109 20888429 26242922 32012952 32463024
40797C2463024o205686p613943o778340j0101206j3975550r272465K996715J1706764
$$ 32463024 26257338 18643395 11865055 1763849 -12211701 -21484166 -18487451 -6780687
40789f780687J0917772N335191N62535k529296l109386M10424M736541L984687
$$ -6780687 4137085 9472276 10034811 7505515 4396129 4806553 9543094 13527781
40781A3527781m08265p76912L585434M356085n61362r32334Q178890J2640047
$$ 13527781 13119516 12342604 15928038 20284123 19722761 18790427 26969317 39609364
40773C9609364l060780k8774919l5598588j2974402J5166486K0094352M080579
$$ 39609364 36548584 7773665 -27824923 -40799325 -25632839 -5538487 -1457908
40766a457908o069068L630668J8442262J8380054M049632q690040j0721392o324469
$$ -1457908 -7526976 -3896308 14545954 32926008 36975640 28285600 17564208 11239739
40758A1239739k681537k513707n478857r015604q718829l939654m57619j058600
$$ 11239739 8558202 6044495 565638 -8449966 -17168795 -21108449 -21566068 -22624668
40750b2624668J970019J5063391K8071984K4195832M603757j1527613j3894482
$$ -22624668 -20654649 -5591258 22480726 46676558 51280315 39752702 25858220
40743B5858220j2516519j6649223j8379342q641192L209048J299325j1857055
$$ 25858220 13341701 -3307522 -21686864 -30328056 -27119008 -25819683 -37676738
40736c7676738j7576476o675865R635351J6201839J1953658P723238J0888407
$$ -37676738 -55253214 -61929079 -52293728 -36091889 -24138231 -16414993 -5526586
40729e526586J6194160J2528175j561048j2931712r697408J137273J860703j0168944
$$ -5526586 10667574 23195749 21634701 8702989 -994419 142854 2003557 -8165387
40721h165387j7638173q548427O368682R976429K209219l351988K23450O365120
$$ -8165387 -25803560 -34351987 -27983305 -18006876 -15797657 -19149645 -18926195 -12561075
40713a2561075N357576m562678j3856553q646186J2093515K8154592K0126436
$$ -12561075 -7203499 -11766177 -25622730 -34268916 -22175401 5979191 26105627
40706B6105627j362128p983755L158638N448880j0056354j6066220L007572J8256475
$$ 26105627 24743499 16759744 19918382 25367262 15310908 -755312 2252260 20508735
40698B0508735K753449j9248358j1520459R626337K032626k5274340k2294654
$$ 20508735 23262184 4013826 -7506633 2119704 4152330 -21122010 -43416664
40691d3416664J4737072L0942526L842475j6514535Q718066L9900013K3328198
$$ -43416664 -28679592 2262934 6105409 -10409126 -1691060 38208953 61537151
40684F1537151k0893373l3432614r702280L400952q533817j0769665J0262566
$$ 61537151 40643778 7211164 -2491116 909836 -7623981 -18393646 -8131080
40677h131080K0299668p57442k0854551q382242J6311599J5962734n315857j5396812
$$ -8131080 12168588 11411146 -9443405 -17825647 -1514048 14448686 9132829 -6263983
40669f263983p504268k546974o532607k548420J3122218J9882554P555528m756456
$$ -6263983 -13768251 -16315225 -22847832 -25396252 -12274034 7608520 15164048 10407592
40661A0407592N73010J1383281P066912p164060r467315L358874J2517427P613717
$$ 10407592 10980602 22363883 29430795 22266735 12799420 16158294 28675721 36289438
40653C6289438o50667j340511K095853M251586P357221R832776K039410j4811119
$$ 36289438 35638771 34298260 36394113 40645699 48002920 57835696 59875106 45063987
40645D5063987k1372570p093784R508371N927055j0680354j6339311p684877j777251
$$ 45063987 23691417 16597633 26106004 32033059 21352705 5013394 -2671483 -4448734
40637d448734l453047k35695R274368R497893k937581r225939J714042J4885467
$$ -4448734 -7901781 -8137476 1136892 10634785 7697204 -1528735 185307 15070774
40629A5070774J3206110J627294n361597m598729q34970L352713M218062k432267
$$ 15070774 28276884 29904178 24542581 19943852 19108882 22461595 26679657 24247390
40621B4247390r379634l267039J1503198J4327962J561267o240627o06863J51406
$$ 24247390 14867756 11600717 23103915 37431877 38993144 32752517 32145654 32297060
40613C2297060j1873055j4634842K885933J3242030m236996k2330918j0170856
$$ 32297060 20424005 5789163 8675096 21917126 17680130 -4650788 -14821644
40606a4821644R804153j466364k7923116k1615174J3239500K2932897o381407
$$ -14821644 -5017491 -6483855 -34406971 -56022145 -42782645 -19849748 -26231155
40599b6231155k5584926m595174K1590585J5383510o094531r616270N30329L752054
$$ -26231155 -51816081 -56411255 -34820670 -19437160 -25531691 -35147961 -34617632 -30865578
40591c0865578L460359R923177J1891867M78063m957479J0473928K3948805J0740680
$$ -30865578 -27405219 -17482042 -5590175 -5112112 -10069591 404337 24353142 35093822
40583C5093822j1002836j0690366J784657k812552j7325653j1589732J0176369
$$ 35093822 24090986 13400620 15185277 12372725 -4952928 -16542660 -6366291
40576f366291J5176293L26943n003976M822781L027106j4879361j7579535N631988
$$ -6366291 8810002 9136945 4132969 8955750 11982856 -2896505 -20476040 -14844052
40568a4844052K1602926Q573995p432585O30470J4438018M318695j8999615k3519793
$$ -14844052 6758874 15332869 7900284 8530754 22968772 27287467 8287852 -15231941
40560a5231941p647815L265463N55819j083723M532853O310640p21418p152029
$$ -15231941 -22879756 -19614293 -19058474 -20142197 -15609344 -9298704 -10020122 -17172151
40552a7172151o895268m705276l593157K98460P774508J2920217J1243738M226244
$$ -17172151 -24067419 -28772695 -32365852 -32067392 -24292884 -11372667 -128929 4097315
40544D097315l266356n294657N52551O512914J343323j0965511j1842971L734965
$$ 4097315 830959 -4463698 -3911147 2601767 3945090 -7020421 -18863392 -15128427
40536a5128427J4866602M287482j4328176j6898214m239918M915455O610569J2278389
$$ -15128427 -261825 4025657 -10302519 -27200733 -31440651 -26525196 -19914627 -7636238
40528g636238K1172308J8326437J801362j1098676r720838k993003j498526l762374
$$ -7636238 13536070 31862507 33663869 22565193 12844355 9851352 8352826 4590452
40520D590452n138433m639941Q14238J3320172K2475380J4087398o457215j7951316
$$ 4590452 -547981 -5187922 -4373684 8946488 31421868 45509266 39052051 21100735
40512B1100735j4241453j0682676j4117331j0352670O949300J8600476Q914533
$$ 21100735 6859282 -3823394 -17940725 -28293395 -21344095 -2743619 6170914
40505F170914o985248n798794Q868707J6098260J1065307N832827M000637k196001
$$ 6170914 -814334 -6613128 2255579 18353839 29419146 35251973 39252610 37056609
40497C7056609j1926209j3997353o129952J042176O88602l534526p400886r353766
$$ 37056609 25130400 11133047 5003095 6045271 6733873 3199347 -4201539 -13555305
40489a3555305n195358O516396J5591621J1563983J699087J061036O852630K821417
$$ -13555305 -18750663 -12234267 3357354 14921337 16620424 17681460 24534090 27355507
40481B7355507j0335124j2338443K888205J4129380N239456j0048228j1344391
$$ 27355507 17020383 4681940 7570145 21699525 26938981 16890753 5546362
40474E546362k482145n16291o682580q689596m110793j460038j707361K710594
$$ 5546362 3064217 2547926 -4134654 -12824250 -16935043 -18395081 -20102442 -17391848
40466a7391848J1189689J3819106Q034746J992069j87360k766371n816443k401110
$$ -17391848 -6202159 7616947 15651693 17643762 17456402 14690031 8873588 6472478
40458F472478P114656J1035278L446241n733898o003819k246124n538049j4556978
$$ 6472478 13587134 24622412 28068653 22334755 16330936 14084812 8546763 -6010215
40450f010215j7247402q647192K737454P043023M412414K337668O130110J3697127
$$ -6010215 -23257617 -31904809 -29167355 -22124332 -17711918 -15374250 -9244140 4452987
40442D452987J7175667R607536o923473j9867449j7211678j628219J0521985Q033282
$$ 4452987 21628654 31236190 24312717 4445268 -12766410 -14394629 -3872644 4160638
40434D160638o54095J701010J6481729K4514155J1120412j2207706k1776125j3175525
$$ 4160638 3506543 5207553 21689282 46203437 57323849 45116143 23340018 10164493
40426A0164493m477177o714852p964986L815546J7045854J2712276m135792r985444
$$ 10164493 5687316 -1027536 -8992522 -5176976 11868878 24581154 20445362 10459918
40418A0459918Q44859O966274o214178k2470686j8336354K580666J6314032J2941361
$$ 10459918 11304777 18271051 12056873 -10413813 -28750167 -26169501 -9855469 3085892
40410C085892N737395O024764O723793j797155j2732575j1872544L80701Q523649
$$ 3085892 8823287 14848051 21571844 19774689 7042114 -4830430 -4449729 4073920
40402D073920L387957o381371p958287j397693L417066J862732j406354j745108
$$ 4073920 7461877 1080506 -6877781 -8275474 -4858408 -2995676 -4402030 -6147138
40394f147138R4222K263774M291104L965872j110308p129388p011515j964215
$$ -6147138 -6052916 -3789142 501962 4467834 3357526 -3771862 -10783377 -12747592
40386a2747592q80521m913726m333473K963058L515380r647734k0046764r596810
$$ -12747592 -13628113 -18541839 -22875312 -19912254 -16396874 -26044608 -46091372 -55688182
40378e5688182J2104475J9937187Q897077l101235m762902j857574J074804O502924
$$ -55688182 -43583707 -23646520 -14749443 -17850678 -22613580 -24471154 -23396350 -16893426
40370a6893426R596622J530295r517898n289441R990329J1657804l228930p525623
$$ -16893426 -7296804 -5766509 -15284407 -20573848 -10583519 1074285 -2154645 -9680268
40362i680268Q580426J6282078l142982k1806185r166621J6113758J7017666j372911
$$ -9680268 -1099842 15182236 12039254 -9766931 -18933552 -2819794 14197872 12824961
40354A2824961o082636M215463J550897j5850209j9147510k291318O850091k519501
$$ 12824961 6742325 10957788 12508685 -3341524 -22489034 -24780352 -17930261 -20449762
40346b0449762o314112P256035J4730307J222873j0945250j441491J3327024J0679900
$$ -20449762 -26763874 -19507839 -4777532 -3554659 -14499909 -15941400 -2614376 8065524
40338H065524j824006o801285p880920j3011443j1311311M762954J6253422O330346
$$ 8065524 6241518 -559767 -8440687 -21452130 -32763441 -28000487 -11747065 -5416719
40330e416719q247749m530070P823836P649653K378143R981346J8131152L448505
$$ -5416719 -13664468 -18194538 -10370702 -2721049 -342906 9638440 27769592 31218097
40322C1218097k0488432j9577491K612319J0252375j795951o23006K1114685K5500356
$$ 31218097 10729665 -8847826 -6235507 4016868 2220917 1597911 22712596 48212952
40314D8212952o614731l7613434k8489894M099915J9244412J1711380M937973
$$ 48212952 41598221 3984787 -24505107 -20405192 -1160780 10550600 15488573
40307A5488573M848678k178030j6054498k1241845j4178425n355966K491812J3453378
$$ 15488573 20337251 18159221 2104723 -19137122 -33315547 -38671513 -36179701 -22726323
40299b2726323J9231756P240033j1696133j0280598J4394580L0888319J5956733
$$ -22726323 -3494567 3745466 -7950667 -18231265 -3836685 27051634 43008367
40292D3008367j2288455k0058398m178693O551823o833049k8151956k8944362
$$ 43008367 30719912 10661514 6482821 13034644 6201595 -21950361 -50894723
40285e0894723n558558J8261710K3026160J4550319Q113152L967666o754356j7818180
$$ -50894723 -56453281 -38191571 -15165411 -615092 7498060 11465726 4711370 -13106810
40277a3106810j0733006J3224338K4325821K863132k7710847k7105986P401973
$$ -13106810 -23839816 -10615478 13710343 16573475 -11137372 -38243358 -30841385
40270c0841385L4996252K3643086j0587793k7452674j2772097J0469180J5934906
$$ -30841385 4154867 27797953 17210160 -10242514 -23014611 -12545431 3389475
40263C389475K841562j1505764j5111171q941813J281968J0547171J4034113J0279678
$$ 3389475 6231037 -5274727 -20385898 -29327711 -28045743 -17498572 -3464459 6815219
40255F815219M925659L901959L937866r83091n453079J028396J2089776P272692
$$ 6815219 11740878 15642837 19580703 18597612 13144533 14172929 26262705 33535397
40247C3535397j5132529k7756037j2353265R553172P060515j2599307j5885393
$$ 33535397 18402868 -9353169 -21706434 -12153262 -5092747 -17692054 -33577447
40240c3577447L945384J7831288P843886q019830q583471o0512J833237j167750
$$ -33577447 -29632063 -11800775 -3956889 -11976719 -20560190 -20620702 -18787465 -19955215
40232a9955215R62022O105404O613711N168685Q068199J1102215O054492m861561
$$ -19955215 -18993193 -12887789 -6274078 -1105393 6962806 18065021 24119513 19257952
40224A9257952j1777451r130731J394161J2447733J2573583j973142j4920361
$$ 19257952 7480501 -1650230 -256069 12191664 24765247 22792105 7871744
40217G871744o446628J4744744J8079644l092091j9065551j0320135K683474k948646
$$ 7871744 1425116 16169860 34249504 31157413 12091862 1771727 4455201 1506555
40209A506555j4171411j0036064k162226j0922535k1398010n088931K6538690
$$ 1506555 -12664856 -22700920 -24863146 -35785681 -57183691 -62272622 -35733932
40202c5733932L4269162J2338613o000826m657722k629894r541729p522920Q303153
$$ -35733932 -1464770 10873843 4873017 215295 -2414599 -11956328 -19479248 -11176095
40194a1176095J2418641p089531k2729005j0372327J2459138J7460704Q404862
$$ -11176095 1242546 -5846985 -28575990 -38948317 -26489179 -9028475 -623613
40187f23613M810846N070167l360816j3315062q470829N460480Q035980l566504
$$ -623613 4187233 9257400 5896584 -7418478 -15889307 -10428827 -2392847 -5959351
40179e959351j3144358j1007425o38656J3151605K3420031J7644346m117660j7901528
$$ -5959351 -19103709 -30111134 -30749790 -17598185 5821846 23466192 19348532 1447004
40171A447004n964708J2582897Q638080r571722r732466R396328J5440649j467024
$$ 1447004 -4517704 8065193 16703273 7131551 -2600915 6795413 22236062 20769038
40163B0769038j1259613L606604J7311000N558677j2464199q125674P037276K755422
$$ 20769038 9509425 13116029 30427029 35985706 23521507 15395833 22433109 25188531
40155B5188531j6133373j7722521J963659J2538259O42588j0406810l548987M093473
$$ 25188531 9055158 -8667363 -6703704 5834555 6477143 -3929667 -7478654 -3385181
40147c385181m598014j3740345j885726J8359414J8136272k197293j5576874j1001113
$$ -3385181 -7983195 -21723540 -23609266 -5249852 12886420 10689127 -4887747 -15888860
40139a5888860l952492l247643K884917J9045388K6909430J1926894j3181362
$$ -15888860 -19841352 -23088995 -20204078 -1158690 25750740 37677634 24496272
40132B4496272k6830579k5392601j7201997m604819J1014296J8858203J2413764
$$ 24496272 -2334307 -27726908 -44928905 -49533724 -38519428 -19661225 -7247461
40125g247461M194045P830594J3979747N093212j2696560j6679255l910523M947425
$$ -7247461 -3053416 4777178 18756925 23850137 11153577 -5525678 -9436201 -4488776
40117d488776j6651n019865m3846N003983J628861j667219K186181M325189j920633
$$ -4488776 -4505427 -9525292 -9569138 -4565155 -2936294 -4603513 -2417332 1907857 -12776
40108a2776o256000l55178N301658R58912k430766O381971J3359042k69103k1878027
$$ -12776 -6268776 -6623954 -1322296 -363384 -2794150 3587821 16946863 16677760 -5200267
40099e200267k1091073L244500J9049014Q115074r902304j0595998J710798Q775154
$$ -5200267 -26291340 -23046840 -3997826 4117248 -5785056 -16381054 -14670256 -5895102
40091e895102Q201161R083571R457560n62820j6156596j7913631N86964J9488561
$$ -5895102 2306059 11389630 20847190 20284370 4127774 -13785857 -13198893 6289668
40083F289668J6474073l875901j6106460p633938N987684M911712o860386r881303
$$ 6289668 22763741 18887840 2781380 -4852558 1135126 6046838 -813548 -10694851
40075a0694851j08222O113835m76978q195083o292245k933210o961478p447833
$$ -10694851 -10803073 -4689238 -5166216 -13361299 -19653544 -22586754 -29548232 -36996065
40067c6996065P776432K3990494J5685134j2419014k7169476j3656770N406561
$$ -36996065 -29219633 -5229139 10455995 -1963019 -29132495 -42789265 -37382704
40060c7382704O877560J74236N992036J9869460J9673883J687236j2725815p559526
$$ -37382704 -30505144 -30330908 -24338872 -4469412 15204471 16891707 4165892 -3393634
40052c393634P302770J1922740K512322o383667l170293M625131Q00211j3950102
$$ -3393634 3909136 15831876 18344198 11960531 8790238 13415369 14215580 265478
40044B65478j7092957N634731L2699097K7759932j0204977l8404243k3210657
$$ 265478 -16827479 -11192748 21506349 49266281 39061304 657061 -22553596
40037b2553596J5466919L0986095J0124533j6226793j9878613q907313o270586
$$ -22553596 -7086677 23899418 34023951 17797158 -2081455 -10988768 -17259354
40030a7259354j3404118j1693533O637818K5539863K5988348R276803p482802
$$ -17259354 -30663472 -42357005 -35719187 -10179324 15809024 25085827 17603025
40023A7603025j3406401j2069979r134075l412646M773795P093438p21258q049293
$$ 17603025 4196624 -7873355 -17007430 -20420076 -15646281 -8552843 -9274101 -17323394
40015a7323394l454892O408759P525541L276097Q073644J7295896Q778256j8941728
$$ -17323394 -20778286 -14369527 -6843986 -3567889 4505755 21801651 30579907 11638179
40007A1638179l5603947k0881320N259630J2656833K251041m807982k997576j547355
$$ 11638179 -23965768 -44847088 -39587458 -26930625 -24679584 -29487566 -32485142 -34032497
39999c4032497N09093J0593999K0341274J4195234k475084r025472j837514L347791
$$ -34032497 -33523404 -22929405 -2588131 11607103 9132019 106547 -1730967 1616824
39991A616824L35984j205962J486473M32518l023593K69854M840615k735058j3677529
$$ 1616824 1952808 746846 2233319 2665837 -357756 -87902 4752713 2017655 -11659874
39982a1659874n446439J5591849J6246580q576917k1535640j275698K2409109
$$ -11659874 -17106313 -1514464 14732116 6155199 -15380441 -16656139 5752970
39975E752970J6969057l715534r587772m064727p667780j5671029j0130547K975203
$$ 5752970 22722027 19006493 9418721 5353994 -2313786 -17984815 -28115362 -25140159
39967b5140159N440598J691618O429109J1005227o60348j4933986p395953J0742346
$$ -25140159 -19699561 -18007943 -11578834 -573607 -1233955 -16167941 -23563894 -12821548
39959a2821548Q144367j1067776j3661215K333498L920401j3803238j3167815
$$ -12821548 -4677181 -15744957 -29406172 -27072674 -23152273 -36955511 -50123326
39952e0123326K0137337M5488237K8583861o940430k0964782j5353466j4886893
$$ -50123326 -29985989 15502248 44086109 37145679 16180897 827431 -14059462
39945a4059462j6961457r65554K6854786L5971323J5431144j3281124k6447429
$$ -14059462 -31020919 -31986473 -5131687 30839636 46270780 32989656 6542227
39938F542227k0318153m909414P145467O799264l802755j1964821r638036j333062
$$ 6542227 -13775926 -18685340 -11539873 -4740609 -8543364 -20508185 -30146221 -31479283
39930c1479283P380481J6413451K0568475R912943r799830j6098699j738391J1814645
$$ -31479283 -24098802 -7685351 12883124 22796067 12996237 -3102462 -4840853 6973792
39922F973792P504761j613135J841165R324985N081285l966268l788194k578209
$$ 6973792 14478553 12865418 14706583 24031568 29112853 25146585 21358391 18780182
39914A8780182j4672867k7369694j6246667J2460809K6533191J4090018l257520
$$ 18780182 4107315 -23262379 -39509046 -27048237 -515046 13574972 10317452
39907A0317452n606228K423653Q000599O933231n45614j2126635j7857745q663633
$$ 10317452 4711224 7134877 15135476 22068707 21523093 9396458 -8461287 -17124920
39899a7124920P625820J4166456Q955203M799802O485630N475288k376512j0869462
$$ -17124920 -9499100 4667356 13622559 18422361 24907991 30383279 28006767 17137305
39891A7137305j6063135j9139731j6955942n792032N998643N661270l661837o593328
$$ 17137305 1074170 -18065561 -35021503 -40813535 -34814892 -29153622 -32815459 -39408787
39883c9408787M86271N466328J324007m565900l453607N228205J6841221K2944486
$$ -39408787 -38922516 -33456188 -32132181 -36698081 -40151688 -34923483 -18082262 4862224
39875D862224J4001512p064050k0925961j5201305k171505K506667N114534J6422718
$$ 4862224 18863736 11799686 -9126275 -24327580 -26499085 -23992418 -18877884 -2455166
39867b455166K3984032J0834288r969973j2982803l835000p684421j9873829j1229261
$$ -2455166 21528866 32363154 22393181 9410378 5575378 -2109043 -21982872 -33212133
39859c3212133J5859624K2919746j967947k1427364p651118J5958592J6543284
$$ -33212133 -17352509 5567237 3599290 -17828074 -25479192 -9520600 7022684
39852G022684O95621o793147n096639p916943j2289352n784902Q314663J6320322
$$ 7022684 7718305 925158 -4171481 -12088424 -24377776 -30162678 -21848015 -5527693
39844e527693J4401079P033993k731079q751872k794243Q586354O183743j1954632
$$ -5527693 8873386 15907379 13176300 4424428 1630185 10216539 16400282 4445650
39836D445650k3593264j6320007m421326K85769O147146J4612173P518691j6340428
$$ 4445650 -19147614 -35467621 -39888947 -39603178 -33456032 -18843859 -11325168 -27665596
39828b7665596k4017747L474040L4774867L2354716O971706p064458o310839q209637
$$ -27665596 -51683343 -48209303 -13434436 18920280 25891986 18827528 12516689 4307052
39820D307052q200308Q194858K4684330J2162201j9289271l0367289j2006822
$$ 4307052 -3893256 4301602 28985932 41148133 21858862 -8508427 -20515249
39813b0515249O654305Q842622O882008O250700m415840j9658040j4368083J2290443
$$ -20515249 -13860944 -5018322 1863686 8114386 3698546 -15959494 -30327577 -18037134
39805a8037134K6613360R851318j4294454j8502448q372515j504873K653908J0355216
$$ -18037134 8576226 18427544 4133090 -14369358 -22741873 -24246746 -21592838 -11237622
39797a1237622J3263082L578417o793133l343166O656730N279139r373184k2685641
$$ -11237622 2025460 5603877 -1189256 -4532422 2124308 7403447 -1969737 -24655378
39789b4655378k2680018q422822J3011959K8672116K6987176J1021505l311416
$$ -24655378 -47335396 -55758218 -42746259 -14074143 12913033 23934538 20623122
39782B0623122p438461q090611j0602454q485807K071027J0989747Q566236O4466
$$ 20623122 13184661 5094050 -5508404 -13994211 -11923184 -933437 7632799 7697265
39774G697265m616204n985810q843974j0279739n814165o86496k808365q477759
$$ 7697265 3081061 -2904749 -11748723 -22028462 -27842627 -28529123 -31337488 -39815247
39766c9815247o353204N436472J5042230J1138570l163768j2295930m320610J3942659
$$ -39815247 -46168451 -40731979 -25689749 -14551179 -17714947 -30010877 -34331487 -20388828
39758b0388828K1099786N714550j6945322k1863882n991301R079570P229937k906945
$$ -20388828 710958 6425508 -10519814 -32383696 -38374997 -29295427 -22065490 -24972435
39750b4972435m207882N401934J4508166J5194291R131101J267511m471063n388414
$$ -24972435 -29180317 -23778383 -9270217 5924074 15055175 16322686 11851623 6463209
39742F463209k204795k71856m115633j0608009j0748277r9652J3393304J5636949
$$ 6463209 4258414 3986558 -129075 -10737084 -21485361 -21585013 -8191709 7445240
39734G445240L736711o756442m04040J4093703J2056115j1444894l0093079k0748548
$$ 7445240 11181951 4425509 4021469 18115172 30171287 18726393 -11366686 -32115234
39726c2115234N314458K0146600J5513010L918129n980312j3852925j4715213
$$ -32115234 -26800776 -6654176 8858834 12776963 6796651 -7056274 -21771487
39719b1771487m097010P222054N419943k212242J732496J2008262O008457j5992961
$$ -21771487 -25868497 -18646443 -13226500 -15438742 -13706246 -1697984 4310473 -11682488
39711a1682488k5106112p283134J4761050J6923768O744661L421748N560031N03571
$$ -11682488 -36788600 -44071734 -29310684 -12386916 -5642255 -2220507 3339524 3843095
39703C843095q560214p450442M264274J2420919Q906512j010999q878780r317899
$$ 3843095 -4717119 -12167561 -7903287 4517632 13424144 12413145 3534365 -5783534
39695e783534j50576J3422887J9045491J1068456m64327l590257j223892l595347
$$ -5783534 -5934110 7488777 26534268 37602724 37138397 33548140 32324248 28728901
39687B8728901r519444q716534j117641K31148j0661214k0577367j3162315P777836
$$ 28728901 19209457 10492923 9375282 9606430 -1054784 -21632151 -34794466 -27016630
39679b7016630K0166894J0258533j0004520j8613397j1707101m715540n504102
$$ -27016630 -6849736 3408797 -6595723 -25209120 -36916221 -41631761 -47135863
39672d7135863k701066J0667479J8577922N256605j4002383r369044J8919550
$$ -47135863 -49836929 -39169450 -20591528 -15334923 -29337306 -38706350 -19786800
39665a9786800L7452845K5500824R09623r411738m511422n07914k525643l728312
$$ -19786800 17666045 43166869 44076492 34664754 30153332 29645418 27119775 23391463
39657B3391463l793311r864837j9933119k0043861l145680J7449829K1011496
$$ 23391463 19598152 9733315 -10199804 -30243665 -33389345 -15939516 5071980
39650E071980M894462r918221m281108J3066043J6674554Q32471j2527066q449413
$$ 5071980 9966442 48221 -4232887 8833156 25507710 26340181 13813115 5363702
39642E363702q37505n053583r397862K365180J6997337J0990373p279427r435927
$$ 5363702 4526197 -527386 -9925248 -7560068 9437269 20427642 13148215 3712288
39634C712288M000981M466177j3460305k1231667n807034Q200942J400224j0198591
$$ 3712288 7713269 12179446 -1280859 -22512526 -28319560 -20118618 -18718394 -28916985
39626b8916985p629886k7057l87120J083387J3646077K1211580Q690301q127162
$$ -28916985 -36546871 -36573928 -36961048 -35877661 -22231584 -1020004 7670297 -456865
39618d56865p426697K699971K442740k714897M796139J7452994J2663156o854352
$$ -456865 -7883562 -5183591 -2740851 -5455748 -659609 16793385 29456541 22602189
39610B2602189j5222169m096122P884542O959906n31996o629365j1419350j1356347
$$ 22602189 7380020 3283898 11168440 18128346 17596350 10966985 -452365 -11808712
39602a1808712l90109J2904167J0077643r291173k2702600j4938021K275219Q693830
$$ -11808712 -12198821 705346 10782989 1491816 -21210784 -36148805 -33873586 -25179756
39594b5179756J281176o870472n091005M703036J2611282J1742897N613418L485247
$$ -25179756 -23898580 -30769052 -35860057 -31157021 -18545739 -6802842 -1189424 2295823
39586B295823P560608J0304537O965977K276040j56866m851195j3343993j6834494
$$ 2295823 9856431 20160968 27126945 29402985 29246119 24394924 11050931 -5783563
39578e783563r843323j219020n55303l329716j393961J514324j704961n820106
$$ -5783563 -15626886 -16845906 -17401209 -20730925 -22124886 -20610562 -22315523 -28135629
39570b8135629m37649J2618754K1036978J6684387J192295j5380036j7100109
$$ -28135629 -28573278 -15954524 5082454 21766841 22959136 7579100 -9521009
39563i521009K368245K1524089R479958k7004806m1397010j0794721K6838515
$$ -9521009 -7152764 14371325 23851283 -3153523 -44550533 -55345254 -28506739
39556b8506739K6756348K091934l348291J3511373J6734305m719703k2148962
$$ -28506739 -1750391 341543 -3006748 10504625 27238930 22519227 370265
39549C70265j7533445n679885M92596P076826J2350646J208938k0501961k2319147
$$ 370265 -17163180 -22843065 -22350469 -15273643 -2922997 -1714059 -22216020 -44535167
39541d4535167L627693K5192542J8664311K624472J604369O756904J11526q372872
$$ -44535167 -40907474 -15714932 2949379 5573851 7178220 13935124 14046650 5673778
39533E673778j37874J4588036J2121483l634839p729682L888702R329311j982711
$$ 5673778 5535904 20123940 32245423 28610584 20880902 24769604 34098915 32116204
39525C2116204j3825856j0596834R42590N761355J313444m664856p168927o631899
$$ 32116204 18290348 7693514 8636104 14397459 15710903 11046047 3877120 -2754779
39517b754779m139106k53099L374883M743894L562662J334720q55761l980513
$$ -2754779 -6893885 -7146984 -3772101 971793 4534455 5869175 5013414 1032901
39509A032901q447137r784239k313616R597551J1436840k460531j7070986j5346016
$$ 1032901 -7414236 -17198475 -19512091 -9914540 1522300 -938231 -18009217 -33355233
39501c3355233k138826N642850O997304J4461244K5547558K1387822l03160j5292502
$$ -33355233 -35494059 -29851209 -22853905 -8392661 17154897 38542719 38239559 22947057
39493B2947057p877064N463925L190916q959525j1716071l607133K635617M527710
$$ 22947057 15069993 20533918 23724834 14765309 3049238 -557895 2077722 6605432
39485F605432Q559053J0771103Q93500j5794668k1294819j1208449j61608K063288
$$ 6605432 15164485 25935588 26829088 11034420 -10260399 -21468848 -21630456 -19567168
39477a9567168K348681O588516P105403j833827q933819m91170J6384392J9706774
$$ -19567168 -17218487 -10629971 -3524568 -5358395 -14292214 -14783384 1601008 21307782
39469B1307782J789599j9291582k1754870n553391J0940050J4747391R770441
$$ 21307782 23097381 3805799 -17949071 -23502462 -12562412 2184979 11955420
39462A1955420N192683K530191j039990m225857m150179k698357k770818k153351
$$ 11955420 17148103 19678294 18638304 14412447 10262268 7563911 4793093 2639742
39454B639742R64641J085757n700464j0491271k936277Q818671O477425r277436
$$ 2639742 3604383 4690140 -1010324 -11501595 -14437872 -5619201 858224 -8419212
39446h419212j7208205q329404M27491l692139o441215P611727K3794051J7268746
$$ -8419212 -25627417 -33956821 -33529330 -37221469 -43662684 -36050957 -12256906 5011840
39438E011840n729167j5089901k860763P251852J308240l179809R255441K2336130
$$ 5011840 -717327 -15807228 -18667991 -11416139 -10107899 -13287708 -4032267 18303863
39430A8303863J3505896q791021j8344904j0487792j801380K847903J3507687
$$ 18303863 31809759 23018738 4673834 -5813958 -7615338 -4767435 8740252
39423H740252K5194357J6406596j2737071l0191028j6932265L437976K833845
$$ 8740252 33934609 50341205 37604134 7413106 -9519159 -6081183 -3247338
39416c247338o638668K887219K2619379J7919238j3101562l1835715j6938791
$$ -3247338 -9886006 -6998787 15620592 33539830 20438268 -11397447 -28336238
39409b8336238O365673R337161K79181Q56968P511654K843689j0860221j5340465
$$ -28336238 -21970565 -12633404 -12354223 -11497255 -3985601 -1141912 -12002133 -27342598
$$ [...]
##END NTUPLES=NMR SPECTRUM
##END=
