##TITLE=31Pdec_SR-37_2
 , 124 sc
 10.2.2021
##JCAMPDX= 6.0         $$ Bruker NMR JCAMP-DX V2.0
##DATA TYPE= NMR SPECTRUM
##DATA CLASS= NTUPLES
##ORIGIN= UXNMR, Bruker Analytische Messtechnik GmbH
##OWNER= root
$$ XWIN-NMR		Version 3.5
$$ Wed Feb 10 12:22:36 2021 Russian Standard Time (UT+4h)  she@DPX200
##.OBSERVE FREQUENCY= 81.013821
##.OBSERVE NUCLEUS= ^31P
##.ACQUISITION MODE= SIMULTANEOUS
##.ACQUISITION SCHEME= undefined
##.AVERAGES= 124
##.DIGITISER RES= 17
##SPECTROMETER/DATA SYSTEM= spect
##.PULSE SEQUENCE= zgpg30
##.SOLVENT NAME= CDCl3
##.SHIFT REFERENCE= (INTERNAL, CDCl3, 0, 222.927)
##AUDIT TRAIL= $$ (NUMBER, WHEN, WHO, WHERE, WHAT)
$$ ##TITLE= Audit trail, XWIN-NMR		Version 3.5
$$ ##JCAMPDX= 5.01
$$ ##ORIGIN= Bruker BioSpin GmbH
$$ ##OWNER= she
$$ F:/spectra/data/she/nmr/P31/1/pdata/1/auditp.txt
$$ ##AUDIT TRAIL=  $$ (NUMBER, WHEN, WHO, WHERE, WHAT)
(   1,<2021-02-10 12:20:55.92 +0400>,<she>,<DPX200>,
      <continue with go, POWCHK disabled, PULCHK disabled
       configuration hash MD5:
       00 E9 B6 7A A2 85 ED C7 34 08 36 98 17 FE 4E 26
       data hash MD5: 32K
       30 33 6F E6 32 61 61 AE 65 58 B5 EC 9D D6 0A 1A>)
(   2,<2021-02-10 12:20:57.57 +0400>,<she>,<DPX200>,
      <Start of raw data processing
       efp BC_mod = 2 LB = 1 FT_mod = 6 PKNL = 1 PHC0 = -1743.21 PHC1 = 21.20217 SI = 64K 
       data hash MD5: 64K
       23 57 6C 8D 05 C8 FA EF AB C6 B3 04 34 68 77 2A>)
(   3,<2021-02-10 12:21:55.64 +0400>,<she>,<DPX200>,
      <pk PHC0 = -8.403986 PHC1 = 64.19999 
       data hash MD5: 64K
       DF AE 2E 98 84 C9 84 3F C2 FA E8 B8 62 DB A9 B4>)
$$ ##END=
$$ 
$$ hash MD5
$$ B4 FE 3B 7B C0 6C 33 8F 5A A7 4E BA CC 6E 52 84
##$RELAX= 
##$RELAX= 
##$RELAX= 
##$RELAX= 
##$RELAX= 
##$RELAX= 
##$RELAX= 
##$RELAX= 
$$ Bruker specific parameters
$$ --------------------------
##$DU= <F:/spectra>
##$EXPNO= 1
##$NAME= <P31>
##$PROCNO= 1
##$TYPE= <nmr>
##$USER= <she>
##$AMP= (0..31)
100 100 100 100 100 100 100 100 100 100 100 100 100 100 100 100 100 100 
100 100 100 100 100 100 100 100 100 100 100 100 100 100 
##$AQSEQ= 0
##$AQ_mod= 1
##$AUNM= <au_zg>
##$AUTOPOS= <>
##$BF1= 81.014009
##$BF2= 200.13
##$BF3= 200.13
##$BF4= 200.13
##$BF5= 200.13
##$BF6= 200.13
##$BF7= 200.13
##$BF8= 200.13
##$BYTORDA= 1
##$CFDGTYP= 0
##$CFRGTYP= 5
##$CHEMSTR= <none>
##$CNST= (0..31)
1 1 145 1 1 1 1 1 1 1 1 1 1 1 1 1 1 1 1 1 1 1 1 1 1 1 1 1 1 1 1 1 
##$CPDPRG= <waltz16>
##$CPDPRG1= <>
##$CPDPRG2= <waltz16>
##$CPDPRG3= <>
##$CPDPRG4= <mlev>
##$CPDPRG5= <mlev>
##$CPDPRG6= <mlev>
##$CPDPRG7= <mlev>
##$CPDPRG8= <mlev>
##$CPDPRGB= <>
##$CPDPRGT= <>
##$D= (0..31)
0 1 0 0 0 0 0 0 0 0 0 0.03 2e-05 3e-06 0 0 0 0 0 0 0 0 0 0 0 0 0 0 0 0 
0 0 
##$DATE= 1612945087
##$DBL= (0..7)
120 120 120 11 120 120 24 19 
##$DBP= (0..7)
150 150 150 150 150 150 150 150 
##$DBP07= 0
##$DBPNAM0= <>
##$DBPNAM1= <>
##$DBPNAM2= <>
##$DBPNAM3= <>
##$DBPNAM4= <>
##$DBPNAM5= <>
##$DBPNAM6= <>
##$DBPNAM7= <>
##$DBPOAL= (0..7)
0.5 0.5 0.5 0.5 0.5 0.5 0.5 0.5 
##$DBPOFFS= (0..7)
$$ [...]
##$SUBNAM2= <"">
##$SUBNAM3= <"">
##$SUBNAM4= <"">
##$SUBNAM5= <"">
##$SUBNAM6= <"">
##$SUBNAM7= <"">
##$SUBNAM8= <"">
##$SUBNAM9= <"">
##$SW= 450.49535887171
##$SWIBOX= (0..15)
0 1 3 0 0 0 0 0 0 0 0 0 0 0 0 0 
##$SW_h= 36496.3503649635
##$TD= 32768
##$TD0= 1
##$TE= 0
##$TE2= 300
##$TE3= 300
##$TEG= 300
##$TL= (0..7)
0 120 53 12 22 120 120 120 
##$TP= (0..7)
150 150 150 150 150 150 150 150 
##$TP07= 0
##$TPNAME0= <>
##$TPNAME1= <>
##$TPNAME2= <>
##$TPNAME3= <>
##$TPNAME4= <>
##$TPNAME5= <>
##$TPNAME6= <>
##$TPNAME7= <>
##$TPOAL= (0..7)
0.5 0.5 0.5 0.5 0.5 0.5 0.5 0.5 
##$TPOFFS= (0..7)
0 0 0 0 0 0 0 0 
##$TUNHIN= 0
##$TUNHOUT= 0
##$TUNXOUT= 0
##$USERA1= <user>
##$USERA2= <user>
##$USERA3= <user>
##$USERA4= <user>
##$USERA5= <user>
##$V9= 5
##$VALIST= <valist>
##$VCLIST= <CCCCCCCCCCCCCCC>
##$VD= 0
##$VDLIST= <DDDDDDDDDDDDDDD>
##$VPLIST= <PPPPPPPPPPPPPPP>
##$VTLIST= <TTTTTTTTTTTTTTT>
##$WBST= 1024
##$WBSW= 4
##$XGAIN= (0..3)
0 0 0 0 
##$XL= 0
##$YL= 0
##$YMAX_a= 49625
##$YMIN_a= -68632
##$ZGOPTNS= <>
##$ZL1= 120
##$ZL2= 120
##$ZL3= 120
##$ZL4= 120
##$ABSF1= 0
##$ABSF2= 0
##$ABSG= 0
##$ABSL= 0
##$ALPHA= 0
##$AQORDER= 0
##$ASSFAC= 0
##$ASSFACI= 0
##$ASSFACX= 0
##$ASSWID= 0
##$AUNMP= <proc_1d>
##$AZFE= 0.1
##$AZFW= 0.5
##$BCFW= 0
##$BC_mod= 2
##$BYTORDP= 0
##$COROFFS= 0
##$CY= -3
##$DATMOD= 1
##$DC= 0
##$DFILT= <>
##$DTYPP= 0
##$F1P= 0
##$F2P= 0
##$FCOR= 1
##$FTSIZE= 65536
##$FT_mod= 6
##$GAMMA= 0
##$GB= 0
##$INTBC= 1
##$INTSCL= 5.30512e-09
##$ISEN= 30
##$LB= 1
##$LEV0= 0
##$LPBIN= 0
##$MAXI= 10000
##$MC2= 0
##$MEAN= 0
##$ME_mod= 0
##$MI= 50
##$NCOEF= 0
##$NC_proc= -8
##$NLEV= 6
##$NOISF1= 182.463
##$NOISF2= 159.3651
##$NSP= 0
##$NTH_PI= 0
##$NZP= 0
##$OFFSET= 222.9266
##$PC= 4
##$PHC0= -1751.614
##$PHC1= 85.40216
##$PH_mod= 1
##$PKNL= yes
##$PPARMOD= 0
##$PSCAL= 0
##$PSIGN= 0
##$REVERSE= no
##$SF= 81.014009
##$SI= 65536
##$SIGF1= 159.3651
##$SIGF2= -187.1042
##$SINO= 113.3802
##$SIOLD= 16384
##$SREGLST= <1H.CDCl3>
##$SSB= 0
##$STSI= 65536
##$STSR= 0
##$SW_p= 36496.3503649635
##$SYMM= 0
##$S_DEV= 0
##$TDeff= 32768
##$TDoff= 0
##$TI= <>
##$TILT= no
##$TM1= 0
##$TM2= 0
##$TOPLEV= 0
##$USERP1= <user>
##$USERP2= <user>
##$USERP3= <user>
##$USERP4= <user>
##$USERP5= <user>
##$WDW= 1
##$XDIM= 65536
##$YMAX_p= 347804700
##$YMIN_p= -187559191
$$ End of Bruker specific parameters
$$ ---------------------------------
##NTUPLES= NMR SPECTRUM
##VAR_NAME=  FREQUENCY,     SPECTRUM/REAL,   SPECTRUM/IMAG
##SYMBOL=    X,             R,               I
##VAR_TYPE=  INDEPENDENT,   DEPENDENT,       DEPENDENT
##VAR_FORM=  AFFN,          ASDF,            ASDF
##VAR_DIM=   65536,         65536,           65536
##UNITS=     HZ,            ARBITRARY UNITS, ARBITRARY UNITS
##FACTOR=    0.556898609368483, 1,           1
##FIRST=     18060.178002006, 0,             0
##LAST=      -18436.1723629575, 0,           0
##MIN=       -18436.1723629575, -187559191,  0
##MAX=       18060.178002006, 347804700,     0
$$ Real data points
##PAGE= N=1
##DATA TABLE= (X++(R..R)), XYDATA
$$ [...]
46404 2927240 -2079713 -31150182 -53281156 -43207410 -14200720 3138063 1593153
46397 1593153 -1305590 5471301 14091654 15566274 11724044 6497417 114231 -3735622
46389 -3735622 1710178 13155277 16617037 6871349 -2995590 809021 14678961 25080623
46381 25080623 26075531 21030574 13735129 6234820 110925 -6906723 -19540424 -34346731
46373 -34346731 -39000160 -29734020 -19857220 -21050863 -26296817 -23972248 -18624179 -20875485
46365 -20875485 -24533124 -14027393 8745390 25732807 30289714 32113620 32754264 19492362
46357 19492362 -9014032 -32970372 -38739122 -36437059 -37128449 -32083586 -12914863 4736418
46349 4736418 1020494 -15519795 -19599220 -7174024 3202954 4697369 11317988 28461576
46341 28461576 39709479 34579552 29409702 44505405 72751437 86733696 71559792
46334 71559792 39536037 15985908 17432237 38693678 56123389 49910853 27223194
46327 27223194 14260375 21330068 29185588 18301910 -3448446 -16424828 -19024434
46320 -19024434 -22847021 -27314404 -20689796 -2314272 16747072 32950120 49609041
46313 49609041 59009001 48727418 26994952 16241040 16350890 1724750 -34602266
46306 -34602266 -61784649 -53570958 -25726655 -9794069 -10364182 -12610942 -13811846 -19089268
46298 -19089268 -19778523 -6614375 4684323 -8176847 -36215545 -51098224 -50487213 -56728043
46290 -56728043 -70289344 -63211068 -28325505 1870088 2768120 -7385463 -1336117 15241201
46282 15241201 20520610 14228760 11849104 15125112 13151217 4009213 -5186894 -12367459
46274 -12367459 -18124441 -18462123 -14858603 -19612646 -35112046 -41756682 -25504845 -3123767
46266 -3123767 2091743 -4149230 -1587056 7134686 3762349 -9107932 -12089313 -6643797
46258 -6643797 -14352377 -35846994 -44475597 -29485439 -13823187 -15789797 -21751987 -14228961
46250 -14228961 -2273866 -3175961 -12765098 -14925328 -7182856 1585818 7414808 8684939
46242 8684939 -1063522 -20409876 -30363762 -15895640 9950632 21143092 12579660 1663823
46234 1663823 -409101 -941004 -8628978 -19966942 -27225892 -29385943 -30425348 -32781337
46226 -32781337 -34885439 -31715964 -19061202 -1390409 7847522 394157 -14328919 -18047122
46218 -18047122 -5338528 8726629 4479039 -20329575 -45234389 -46096148 -22222118
46211 -22222118 -80451 -2285383 -17699453 -16652012 5467397 19870145 6162935
46204 6162935 -18167834 -24473103 -12004037 -729235 2322145 6041294 10469622 3561308
46196 3561308 -15381040 -29387756 -26758702 -15364886 -8618796 -9616485 -14289838 -19393297
46188 -19393297 -22113096 -20228113 -16111453 -13107252 -7626189 4929580 16325949 11520676
46180 11520676 -7549339 -18337256 -5786676 17239115 26792073 15968478 -3336495
46173 -3336495 -18615834 -25113354 -21142964 -7879508 5881782 8507803 -1577580 -12682005
46165 -12682005 -12346659 -1303353 6721349 211384 -14456812 -15961620 8024346 42324222
46157 42324222 58759975 49452359 34184370 30871655 32587384 24256748 9783896 5374799
46149 5374799 11857256 13453658 5061614 1271234 10814478 19139198 9997220 -7167332
46141 -7167332 -8319026 11295871 30791253 31911383 19531976 9776086 9328670 13348255
46133 13348255 15754651 14223385 9810951 6785370 8264220 9194526 1576378 -9339570
46125 -9339570 -5846467 15863911 32477213 22676050 219763 -3611848 13264533 20452634
46117 20452634 2740576 -15964793 -10028521 10207788 19181334 16486747 19817849 28434161
46109 28434161 24249445 7948276 3381707 17947667 25628855 5402698 -23946146
46102 -23946146 -28366643 -5816944 13227817 8617116 -6588097 -9124648 4616507
46095 4616507 19553174 23058518 16164087 7212092 1422076 -2273421 -6665432 -10579554
46087 -10579554 -9882751 -5158188 -4542774 -13655616 -24478392 -22062015 -4511866 11227690
46079 11227690 9266439 -5092601 -13170798 -7572754 1395266 4079019 3858687 5486479
46071 5486479 2622033 -11420342 -27701065 -30939307 -22424930 -18668556 -26106912 -32941436
46063 -32941436 -31142984 -30053021 -37258214 -40404300 -24811807 -631528 6767319 -8291516
46055 -8291516 -24436816 -24033413 -15976833 -20137568 -39142382 -54317104 -45520001 -10320637
46047 -10320637 32919693 58351222 53215552 28350583 6819044 2936996 14756144
46040 14756144 31752533 41474639 32857458 6317649 -18769071 -20270425 -712758
46033 -712758 14581110 11922503 6912710 17745125 35296783 36427365 18567025 1897915
46025 1897915 -1128786 27808 -5532749 -11042970 -3234782 15672706 27325992 17355416
46017 17355416 -8741621 -29664561 -27512145 -5367264 14149065 11520121 -8494248
46010 -8494248 -23102020 -18745814 -4652770 3553188 4977640 9987708 20706438 26232779
46002 26232779 18888948 6488649 3135521 12168693 23403088 25348089 15891977 2107339
45994 2107339 -6054745 -2041603 12313102 25971259 26611995 12815317 -3275380 -8141350
45986 -8141350 -614266 8566150 8860044 -1583661 -17471263 -30943710 -34137206 -23096869
45978 -23096869 -3194243 12353702 13983615 5374758 -1514649 -332812 4369239 5696276
45970 5696276 3363870 1377737 752007 -609684 -2812698 -4536150 -8239302 -17981390
45962 -17981390 -30232238 -34010772 -24546113 -10559329 -2478441 -101393 432664 -4809089
45954 -4809089 -19055573 -29711398 -19175533 7339862 21634136 6831128 -22118422
45947 -22118422 -39965302 -39347468 -27803079 -11506950 3026210 2891146 -16897661 -39752516
45939 -39752516 -46244763 -41547631 -45131552 -56435411 -53082661 -25828343 5915150 20314567
45931 20314567 16668303 4824406 -10740449 -24802049 -26022339 -13374355 -5593022
45924 -5593022 -16985035 -32711582 -27294345 -3318051 8910822 -7398760 -33361685
45917 -33361685 -41834329 -32305541 -24717288 -26585763 -23722238 -5747745 14457339 17770422
45909 17770422 7174324 4243375 17963558 32356109 30638096 17460667 6527271
45902 6527271 -1426176 -12486457 -19945201 -10390122 12801762 30647226 34019404 30327325
45894 30327325 23363291 6680281 -16877073 -28877219 -19365736 -1311019 9885561
45887 9885561 15761929 21240179 17733748 -2598218 -26728258 -33428794 -20256462 -2822041
45879 -2822041 7127825 8651512 2842657 -7289670 -12351212 -6928197 -1248775 -8462949
45871 -8462949 -23889776 -31773514 -29474505 -28559036 -33055771 -33601709 -24820632 -13093416
45863 -13093416 -4414995 1319172 1668859 -7445057 -18094801 -13239304 9195178 28365158
45855 28365158 25883580 8630515 -3395998 -3095254 930638 1509038 256526 -1686716
45847 -1686716 -9435417 -25453313 -39525816 -35453172 -11328008 11595399 9472149 -13661770
45839 -13661770 -27144234 -12114744 12374832 14283411 -8227156 -25219820 -14329258
45832 -14329258 15055256 38684692 43162041 30471904 10637538 -3347089 -3445474 4439552
45824 4439552 6950423 1145612 -4005241 -5476905 -11369132 -22818145 -26005790 -12993004
45816 -12993004 1827131 27035 -13996110 -18884558 -5124078 15406693 27536403
45809 27536403 28041974 21074822 9487210 -3384293 -9949307 -4398576 7850731 12868717
45801 12868717 4396980 -5783293 -1127263 14863155 17244000 -8501977 -41108751
45794 -41108751 -44495587 -12717478 21045738 24208200 393208 -21616910 -23828294
45787 -23828294 -13843563 -8925064 -14536733 -19758692 -12129129 3460960 6266645 -12775333
45779 -12775333 -31308752 -18503908 22996815 55883302 53579084 29005621 9238769
45772 9238769 -457139 -12024525 -27786732 -37714033 -37985850 -35731550 -36562340 -38780890
45764 -38780890 -37870668 -28356077 -6706955 18417810 26983546 11615224 -6395358 -883090
45756 -883090 24302230 41464798 37294333 25560930 20454690 17646450 9300917 784046
45748 784046 731592 5726938 6352504 1303713 -4062737 -7422881 -9099931 -7106650 -1266962
45739 -1266962 1798288 -2897112 -7590170 928667 21977109 37967389 34714449 18063129
45731 18063129 4416931 -516982 -4954122 -14099600 -20838243 -19161164 -18398692 -32464522
45723 -32464522 -57077120 -70262217 -59008906 -35151593 -18732726 -14327503 -12548053
45716 -12548053 -8841858 -9641834 -20285405 -35071794 -41809021 -33588459 -16529842 -6756345
45708 -6756345 -15282769 -32955140 -36089839 -12424299 23380667 45835746 45055156 30560230
45700 30560230 14892215 3620613 -1461707 -282255 3393481 5177292 5503305 6156825
45692 6156825 4008557 -3829278 -11094595 -8801871 -257246 1164118 -8424042 -16204248
45684 -16204248 -10146081 3726094 8305960 -3410399 -19277490 -20366309 -1052369
45677 -1052369 23708555 32739192 20601988 1718180 -8175604 -8093386 -6150088 -6642518
45669 -6642518 -10212983 -18911323 -30755309 -35474864 -27248095 -16440399 -16191046 -22611275
45661 -22611275 -22884317 -17738421 -17178061 -16702699 -943237 25414461 34219367 11963980
45653 11963980 -19025258 -31653819 -28855520 -29914494 -36470015 -34365135 -22647089 -18381614
45645 -18381614 -31142086 -49461438 -56903336 -49865272 -35210332 -19258326 -4312391
45638 -4312391 8469642 16421684 15424408 4729234 -7058748 -6827441 7224689 20599961
45630 20599961 20145781 10372443 3098305 -2288224 -14054167 -26654555 -21768164 4155276
45622 4155276 27951542 25484283 1000845 -19089829 -16860179 1666905 18518806
45615 18518806 22023516 13256527 2087371 -1270562 4078838 7436790 -927213 -14470042
45607 -14470042 -15520203 584667 15462519 10885332 -4459493 -5261362 14339435 30963504
45599 30963504 24075408 3038666 -9589175 -10137558 -12360535 -19758038 -18828308 -2009720
45591 -2009720 19126837 29769221 28583047 22190898 14341818 8609046 11850741 24498124
45583 24498124 33773003 27074886 9006818 -3601880 -1861361 7091513 10827306 4190835
45575 4190835 -8293271 -17428315 -16493955 -6594553 4896382 11893083 13694764 11711276
45567 11711276 6626401 149799 -5169697 -9529566 -14437324 -16954648 -12136157 -2546297
45559 -2546297 3169364 3922405 8344880 18298719 21227292 7941118 -10678762 -15475997
45551 -15475997 -1901521 18309763 32802261 36277907 27935493 12197300 -1265579
45544 -1265579 -7678893 -13617406 -24543161 -31940706 -24743038 -8503924 760329 -1394184
45536 -1394184 -6839963 -13567155 -27614498 -44352080 -45917447 -24705282 4484897 23818579
45528 23818579 32131012 37111188 39527314 36529579 32474583 34061054 38130109 34270833
45520 34270833 18412039 -2899777 -20043641 -26627544 -20719082 -5892148 9588075
45513 9588075 18696120 20324244 16866570 10861556 6180907 6919709 10350280 6295231
45505 6295231 -9411987 -24409579 -21424410 64675 22221729 31099985 32674638 40945105
45497 40945105 55371620 59625873 43913910 20115901 8403820 13448739 22420300
45490 22420300 25005643 24852966 28515874 33923536 36747290 38960986 41588102 37025691
45482 37025691 20838350 4810614 3148074 9305044 3956490 -14070861 -24087303
45475 -24087303 -15514034 -4185457 -6156287 -12011441 -3125161 17118689 25574082 9168411
45467 9168411 -20432097 -40455420 -36958237 -14931253 4080589 294221 -20468664
45460 -20468664 -29129576 -9232495 19645084 28605723 19400294 17048184 28409384 33993599
45452 33993599 23620214 13806976 18212614 23300983 11640723 -6459155 -6582207 12290384
45444 12290384 25735599 18783697 3777270 -1462833 1838781 -58756 -11221558 -20596846
45436 -20596846 -16382310 1270801 22196840 36214984 39505068 34052573 24652704 17034863
45428 17034863 15282027 17691980 17283404 10796389 5479922 10692746 23298398 29583300
45420 29583300 23552249 14417936 11829905 13198907 12706587 13424751 19511388 23474086
45412 23474086 15151430 287522 -4489553 4186944 11280504 5756609 -4962071 -9259780
45404 -9259780 -8637629 -11304037 -16016105 -13211545 -351712 11867455 10118660 -7128673
45396 -7128673 -25689991 -27145099 -7795693 15144386 22067216 14000855 8426395 13155502
45388 13155502 17027284 9377692 -5227673 -18390024 -30441561 -41785083 -44117548
45381 -44117548 -33083026 -19779419 -15927259 -15910219 -7745807 6161190 15144319 19936432
45373 19936432 28175029 35548212 31122310 18736685 12740588 13209440 6583527 -7870407
45365 -7870407 -14726536 -9658854 -7201189 -13842838 -15607520 -2978834 12394473 18012260
45357 18012260 17873687 16423579 5864385 -13592978 -20685860 -1715766 23971040 30257451
45349 30257451 22234110 22538216 30923609 26514365 5630796 -11425472 -12271360 -5582425
45341 -5582425 436615 8210521 14138603 5750855 -14756316 -24682064 -11125511 8645288
45333 8645288 9942708 -8431967 -28242850 -36859052 -35595529 -29400047 -20595606 -12005897
45325 -12005897 -8386605 -12803892 -23050776 -31790452 -32603956 -28417804 -29537930 -38701960
45317 -38701960 -44734877 -38763198 -28480916 -24546612 -21493271 -8733688 6720587 9721628
45309 9721628 5016676 10967861 25231771 24921641 7254080 -13278 16655978 29529246
45301 29529246 10398775 -23410929 -32607572 -12544764 4174188 -2266141 -15314066
45294 -15314066 -13278209 177994 8990565 12350686 23330687 44515746 58716175
45287 58716175 48910038 21645361 2338527 5771417 19249927 21442270 10032567
45280 10032567 -1299463 -7434036 -15707480 -25766261 -25199726 -10693603 4236393 10180099
45272 10180099 13493931 18487639 16415214 4556587 -1561370 8852279 21779301 19174471
45264 19174471 6958933 3091431 8324421 9136782 2085497 -4733368 -8865894 -13168417
45256 -13168417 -13258145 -4181368 4520811 -321829 -12320384 -12509326 1713957 13846944
45248 13846944 15119601 15301971 23235151 32705341 32875188 21294989 3670543 -10219869
45240 -10219869 -11140694 -448911 7486554 2768998 -6118935 -7410590 -5418244 -8256684
45232 -8256684 -6897623 10223977 28959673 23650432 -2192548 -18534281 -14679644 -11924527
45224 -11924527 -22051837 -23903151 1811895 38723360 56389185 49112567 34213073
45217 34213073 23776303 15588542 4295366 -11970892 -30096720 -39096348 -28148788
45210 -28148788 -4533195 9164561 4750741 1291255 16083807 36079300 34875358
45203 34875358 10548376 -10125855 -4036909 22988339 44213319 39701332 15629841
45196 15629841 -3536452 -3539964 4450198 4089055 -200572 6016232 17823208 16252304
45188 16252304 1427910 -6593067 -3195130 -5722792 -16475167 -11468485 17698958 41195124
45180 41195124 32608197 7362538 -5331875 -5542537 -10010732 -17081771 -14846304 -8703620
45172 -8703620 -10817472 -15184091 -11706626 -10720693 -22618458 -27949381 -4232558 28490625
45164 28490625 29116475 -2703495 -27071210 -25253155 -18408858 -20612825 -16569841 1301156
45156 1301156 13542249 9554793 7803356 19274851 22358425 -1385233 -32857858 -42822869
45148 -42822869 -32524356 -21840385 -15343243 -5926413 2656804 2805866 1876623 10003055
45140 10003055 17697963 8501804 -12342164 -23452454 -17232983 -4569431 6612171
45133 6612171 17895299 27035605 26692453 18153257 11760279 12154497 14805872 16870067
45125 16870067 19768470 21208271 15991507 5570980 -2460797 -4663654 -4115964 -4139212
45117 -4139212 -6763484 -14023685 -22754233 -22587492 -9083567 4963360 2594473 -14831080
45109 -14831080 -28943061 -27358141 -15591628 -6222106 -4891130 -7306288 -3540531 13274071
45101 13274071 36691142 49271506 42312540 28143951 24076654 30335613 35169464 35183706
45093 35183706 35040967 30825471 12422538 -15573625 -32462652 -26689552 -9270470 3271869
45085 3271869 6943317 5874541 2848112 1826818 8386163 18918490 20016761 8586888
45077 8586888 2334394 16914837 39799861 42848605 19379743 -6647036 -12029328 -1944981
45069 -1944981 2050081 -6925068 -14288611 -7792587 3300210 595345 -16608597 -27821713
45061 -27821713 -17883193 2064619 9059462 -638360 -6817097 6709362 30284092 41198170
45053 41198170 31193451 12613802 483620 -2548384 -3126172 -6926425 -14524867 -21911498
45045 -21911498 -21097886 -4860965 22904766 43928816 40743240 16843507 -5470387
45038 -5470387 -11130996 -8751880 -14189086 -25273404 -25810222 -11929307 1594705 4954914
45030 4954914 7615398 19856334 33300870 33541276 23124356 16214845 15663408 12268972
45022 12268972 4953940 3401898 7490135 1724699 -21162225 -44681960 -48112066 -32759264
45014 -32759264 -17409182 -13522215 -16415392 -17892278 -15724739 -9456908 3230384 20794987
45006 20794987 33552655 31022772 13518130 -6831440 -18433784 -22347198 -29162930
44999 -29162930 -43680813 -57454585 -59947251 -52426356 -44487115 -40162749 -35926001 -30771898
44991 -30771898 -27895172 -25383009 -16513294 -3244352 1801735 -6137788 -13406810 -5813159
44983 -5813159 9981026 13978754 -2198042 -27767399 -46812291 -49872255 -35052110
44976 -35052110 -10148253 6641355 1020701 -19393453 -32384023 -29853784 -27168449
44969 -27168449 -37667893 -50896775 -48701178 -34192256 -28192808 -38833072 -51067442
44962 -51067442 -50053779 -40149261 -32201726 -24440379 -9924194 4105267 1807237 -15385985
44954 -15385985 -24616041 -10642537 12901371 21572932 11050981 -2202126 -6174018
44947 -6174018 -5309581 -7769400 -14040806 -21624321 -29867882 -34998482 -30173568 -17148801
44939 -17148801 -9189781 -14028758 -21425059 -18090459 -9118686 -10974067 -24642308 -31112456
44931 -31112456 -18967257 -3439686 -6346161 -24065372 -30692234 -14360136 4323325
44924 4323325 97246 -20303188 -25849777 -4925031 17156741 13736431 -5201970 -7901169
44916 -7901169 14478517 39067987 46416526 42551264 39617509 34709324 20785963 3453112
44908 3453112 -8339410 -17353477 -28645656 -34352712 -24055563 -3288723 14298676
44901 14298676 26593772 37968700 42145199 31411950 18119518 22074908 36831301
44894 36831301 35667971 16023102 9138162 33043388 62798581 66571236 49046416
44887 49046416 35806780 32258255 24793247 11148102 1682234 -3793455 -13442024 -19488259
44879 -19488259 -3835479 28714363 47395987 34361604 7635502 -4335891 3794384
44872 3794384 14943435 11691679 -9454415 -35561121 -44519519 -25538733 5180905
44865 5180905 21417393 19410573 16567697 18178458 10032031 -9484791 -18139780 -6061632
44857 -6061632 3362694 -8952641 -23327590 -13823251 3968317 -5596602 -38515232 -52453723
44849 -52453723 -29232069 376607 3268988 -15871927 -33801649 -40574730 -36339090
44842 -36339090 -19834792 1634666 9385509 -1774284 -11917931 -5633714 3745588
44835 3745588 -1627411 -12494950 -8760163 5360371 9073683 827582 -816758 9270132
44827 9270132 14301103 4646574 -6768011 -5386495 5845802 15352034 16809054 8273057
44819 8273057 -9578245 -28682075 -38435847 -39178384 -39196589 -36493277 -19416506 9352715
44811 9352715 26754031 17937054 -2718584 -11289599 -4130552 4778047 7281750 6941287
44803 6941287 5629412 -1406797 -15232366 -26707966 -24054325 -5181501 17973310 29003980
44795 29003980 24150289 16497292 16557807 15011174 -942751 -18723955 -10831349 21867926
44787 21867926 42721726 28154080 739859 -5755951 6147813 10640725 3568781
44780 3568781 3524747 14923054 21175162 15361555 9664906 9576522 4165867 -10036206
44772 -10036206 -17809173 -7987739 10656331 25008557 31963476 29401908 11591805 -15665894
44764 -15665894 -32355335 -28667078 -17388256 -11866064 -8634212 -3632276 -5919845 -17608188
44756 -17608188 -18153117 8288207 42449179 51495839 33041215 13384268 7342422 5813263
44748 5813263 2113861 3373878 9974970 8136051 -6112407 -15229386 -5736875 9750883
44740 9750883 10668003 -2435971 -12254592 -11298418 -8708950 -12218803 -16734024 -14075161
44732 -14075161 -5544891 -32393 -3329657 -12722020 -20647060 -21471158 -15402766 -8096473
44724 -8096473 -6762927 -13508452 -19913024 -11777900 14472777 41636693 46557310 26635901
44716 26635901 2889566 -5954463 -2195471 2248063 3551860 3841388 3131196 4739996
44708 4739996 18006366 42220570 57956437 49937722 29127672 14870731 5713906
44701 5713906 -9632918 -21836595 -11169759 14073290 21477635 2312429 -14768707
44694 -14768707 -7586362 11125338 22716215 31348731 44708450 51963977 44664577 38298343
44686 38298343 47449170 57494495 48182843 29814191 26134743 33024388 26307665 4178219
44678 4178219 -10328928 -7262355 899695 9005141 27065189 51716371 58661207 35813465
44670 35813465 2507560 -15373578 -12083740 3219077 19387729 23410202 6856930
44663 6856930 -18891366 -31050163 -25591094 -19978085 -20830191 -14078280 2601157 6213742
44655 6213742 -13779846 -29975283 -15130984 13898454 19511513 -2157084 -19475918
44648 -19475918 -11249220 12353331 30750380 30216177 3898270 -39675429 -68942662
44641 -68942662 -56171426 -15252036 10470821 1628397 -18969630 -25380834 -19424402
44634 -19424402 -13037020 -5771628 3816814 5370635 -5643327 -14176203 -9346219 -7135792
44626 -7135792 -25997150 -50732456 -48486713 -18234951 3406533 -8265095 -34430690
44619 -34430690 -42650966 -29728530 -17811849 -19245567 -24805962 -24282635 -21164346 -22183724
44611 -22183724 -24580223 -22143054 -17515327 -19490687 -29376344 -37462717 -35256986 -26414185
44603 -26414185 -21116923 -20935336 -14507134 7867354 36837585 47622862 26212817 -10773894
44595 -10773894 -30395819 -19440220 1574845 5389452 -8926063 -19536605 -13068635
44588 -13068635 1631895 11257108 15021215 17918256 19002871 15958410 13261683 15332327
44580 15332327 16447305 7457954 -10001290 -24282107 -26642219 -16842158 190735 15190160
44572 15190160 16251466 389851 -18006144 -20558295 -6966067 5293200 3439463
44565 3439463 -7399949 -13884279 -8645733 5381720 15835656 6947040 -23703359 -53653351
44557 -53653351 -54275589 -25084234 3534696 7259196 -6283961 -16494579 -19213412 -22383273
44549 -22383273 -23895588 -13883344 4043839 12901049 6421275 -2502306 -2732121 -497908
44541 -497908 -5707811 -14084903 -15097801 -10785192 -12381107 -19758404 -19197384 -6120951
44533 -6120951 3538515 -4677470 -20014428 -20289413 -5834101 -1132292 -18227271 -36473632
44525 -36473632 -30955282 -7558627 7376635 4454759 -1456187 477300 1736044 -7235046
44517 -7235046 -19888668 -24050976 -18551330 -10636586 -4884019 -2133178 -2476432 -2828497
44509 -2828497 1839738 9189057 8897133 -2233829 -11996637 -7273815 9037026 22709097
44501 22709097 24491253 15397298 1710886 -8137717 -6949465 3969491 15213243 21919804
44493 21919804 29515696 41447757 49941286 47350012 38656451 32789058 28809577 21929980
44485 21929980 16905339 22616595 36874881 48263376 50658505 46324974 38756330 32522130
44477 32522130 34612356 43696424 43492397 21261000 -11008160 -29172249 -27595616 -20616814
44469 -20616814 -15653359 -4583530 15755919 33865862 40641167 39864804 35235090 22873100
44461 22873100 4748346 -5835477 -2541811 3282607 1051182 -2115818 4257340 12647706
44453 12647706 5804249 -17626560 -38442820 -37875712 -16256841 8166721 15220860 920353
44445 920353 -17665405 -20132396 -5863984 8441582 14238957 20767495 34874559 46334176
44437 46334176 43276744 29932747 17023618 4543182 -12872051 -31291289 -41378504
44430 -41378504 -41247747 -34101420 -19589851 468767 14472628 12956534 3498384 467711
44422 467711 4148945 3719657 -2681739 -5686563 -1218174 4190110 4240510 -2446249 -16454437
44413 -16454437 -34146468 -42685420 -32229005 -11811750 37826 -1694333 -8569282
44406 -8569282 -17057513 -28089849 -31302088 -14007962 10495499 9125404 -25284110 -56648510
44398 -56648510 -50181109 -17095899 3677236 -4172579 -22353495 -29193029 -22746957 -12818470
44390 -12818470 -5454876 95518 6394265 12659536 13435534 5681871 -2397343 1765104
44382 1765104 16279427 24013075 16736866 7677840 10683918 19737634 22405319 21797234
44374 21797234 27654157 33893295 25272660 3756357 -10796739 -7504566 3799402 9679550
44366 9679550 7975078 3304346 200465 2785824 10310819 12990508 4255487 -4083494
44358 -4083494 6354461 33330845 54448840 56182043 45712694 32082973 15658904
44351 15658904 2151739 6001278 28617016 50723584 57685923 55564765 51158915 36775789
44343 36775789 11203724 -4801330 3495790 18168963 15345004 3798998 6963983
44336 6963983 17622540 6535600 -26027348 -44356093 -29416367 -3397412 9253640
44329 9253640 14234885 24566349 33420427 30992020 26086155 28310830 27520106 14535665
44321 14535665 5685692 20264543 45854418 53825306 41642200 32282009 35938146 39966285
44313 39966285 36485967 33105562 32828667 28074016 20281201 22408425 34846903 40923246
44305 40923246 34845544 32063074 40639011 43969767 27404621 3465142 -7709693 -8554847
44297 -8554847 -15347277 -29700769 -38154577 -34338851 -24753433 -15900785 -9001339 -3956553
44289 -3956553 1997363 13781276 26888731 25579733 4942145 -16030760 -19256937 -14541456
44281 -14541456 -21543689 -34267939 -29480426 -6925921 7489461 2460453 -2374509 9016255
44273 9016255 22799899 19456827 5320961 1042670 10432734 19061600 17756904 12245616
44265 12245616 11764091 18547087 26896589 27099845 15304601 3370350 9163772 30667528
44257 30667528 42077403 26557375 806881 -8446728 -2719706 -6425348 -26801445
44250 -26801445 -40650241 -25972898 9054857 36348325 37186795 15819969 -7442698
44243 -7442698 -11864925 6922955 30408072 33774281 13221222 -9535401 -13616026 -1942582
44235 -1942582 7869060 7510166 3093349 462783 -3290837 -12324270 -24575683 -35383964
44227 -35383964 -42753321 -44991486 -38138678 -21894256 -5474342 -26606 -4361663 -5130112
44219 -5130112 5693075 19698409 23371554 14936015 2701457 -8811151 -20930218
44212 -20930218 -30384851 -28226994 -12382299 7232127 19681950 22255936 17023579 7162621
44204 7162621 -467562 379439 3453125 -6618074 -31851380 -52660740 -51422231 -34017159
44196 -34017159 -16989846 -4067244 9949542 21338184 22159227 17763854 20034002 24695595
44188 24695595 15198820 -9267289 -29510678 -34681447 -35350699 -40359787 -39643661 -22974898
44180 -22974898 -500243 11167431 12966762 17757129 27653955 32597650 28241473 21105807
44172 21105807 16247527 11387783 4327000 -3000785 -9175401 -14498050 -16238925 -9012598
44164 -9012598 8040128 28091375 41360789 41272327 28459415 12180158 4847175 10484251
44156 10484251 20770268 26605171 30065232 38740476 50797155 53878827 40503880 19025065
44148 19025065 6045391 9549462 21038957 24516491 13606997 -1389008 -5806238
44141 -5806238 1873306 9973215 10066650 5592562 2374847 -867566 -8087835 -18863663
44133 -18863663 -29889490 -36657985 -30877122 -6617948 25363777 41432767 32744979
44126 32744979 18023222 16932085 22419131 16314585 2740098 3164287 20417714 31298836
44118 31298836 20434195 1616244 -4070992 4141012 12128896 12069288 6167430 -2660739
44110 -2660739 -11788210 -14901510 -7745557 3106405 5063744 -6075441 -21100780 -27621771
44102 -27621771 -22775719 -14437125 -10037444 -6462037 4441727 20496547 28223661 22273854
44094 22273854 15699866 20313852 25923483 14732166 -9538833 -25877253 -27240940 -26671673
44086 -26671673 -30148331 -25628136 -6888947 11789378 15662369 7350487 -5617229 -23181387
44078 -23181387 -40528664 -42666208 -27819980 -18706878 -30807146 -45573405 -38290962
44071 -38290962 -17776941 -10069253 -13557096 -4167870 18009345 23954836 4489060 -10775814
44063 -10775814 484861 17237524 8616989 -17137362 -25184054 -5353763 16505523
44056 16505523 17678567 5526483 -1095586 467173 -699120 -8429009 -14578407 -13146298
44048 -13146298 -8644582 -6689126 -3648249 6702048 19452901 21488969 9859221 -2362472
44040 -2362472 -3497087 2271050 4794217 3403060 2479775 -352676 -8391376 -13616745
44032 -13616745 -5195025 12061376 22013550 18729969 9906729 1104188 -6986199 -7108964
44024 -7108964 8580227 28938931 31797188 17227531 10458950 22437130 31785029 21530407
44016 21530407 9724181 19550313 37830655 33806369 9120168 -3892524 7058549
44009 7058549 17432030 8260346 -3004438 8146995 32037453 35659103 8616979
44002 8616979 -21424560 -22669357 3465630 26546898 24304008 6785685 -280593 10287402
43994 10287402 20543785 15333289 2810618 -1485263 632813 -4568215 -19361864 -32594722
43986 -32594722 -37986690 -37830390 -29249011 -5664216 23532188 33256841 13208999 -15411913
43978 -15411913 -25347566 -14936867 -2192009 3328519 7192022 13166978 15965002 12709214
43970 12709214 9225323 10699557 14914648 19097370 25975783 37209266 45876363 42304701
43962 42304701 25982280 6802182 -4970734 -5816670 3324496 20175021 38262970
43955 38262970 45507385 33395081 8994984 -8200308 -5974943 7024142 12071078
43948 12071078 2792856 -9136930 -11156451 -6230846 -7710811 -20853383 -34857019 -34199740
43940 -34199740 -15014892 11290557 29062359 31433123 23834899 17563993 20200576 29288023
43932 29288023 33680307 23789106 2992539 -13833025 -16443492 -10744434 -9449596 -15020293
43924 -15020293 -19860477 -21052316 -23487149 -26641620 -20680799 -2395919 15239113 18995587
43916 18995587 13465586 12230629 15893694 11708255 -5176275 -22031028 -24533013 -14777516
43908 -14777516 -7075218 -8596165 -10172829 1263026 23919813 40940827 41313083 33447437
43900 33447437 29623067 24022863 2142577 -29375843 -42543827 -24868204 1446113
43893 1446113 8682822 -3008439 -14451556 -15199901 -6772857 8635398 24485073 26204181
43885 26204181 10725703 -480922 11091449 30566174 31005397 16242229 13671500
43878 13671500 29021125 39809000 34436554 25904687 21892885 13427208 2500877 8855238
43870 8855238 34427022 50126495 36651403 13608024 8355575 18056521 23020255 17604789
43862 17604789 7159190 -7034553 -19112629 -13637666 9044278 21044178 3782649
43855 3782649 -22099246 -29142547 -25474292 -33359041 -43088758 -27423189 6711760 21975981
43847 21975981 6819328 -9495168 -4561799 7692683 5608818 -10430721 -28919031
43840 -28919031 -44064663 -49571320 -36310641 -8557868 14146486 21069940 20916259 22005626
43832 22005626 19959549 12970970 10440647 15882477 18205274 11250625 6398690 13733864
43824 13733864 24528929 24918789 15605851 6593127 2161496 941521 1930805 2501103
43816 2501103 -433486 -1552852 9078963 27781701 36842308 30076241 24010706 33081285
43808 33081285 47603088 49517301 38933205 30912869 33016038 38269853 36339139 23884604
43800 23884604 7965186 2105620 11420345 21730973 16598100 4716380 10491488 34384527
43792 34384527 48166389 39171358 30640407 40138239 46705770 27549586 3478062 11024641
43784 11024641 43112159 56818896 36267167 10060563 2986162 6053078 4829481
43777 4829481 5718202 16537094 24586506 14357484 -7074295 -19283146 -13770289 2780944
43769 2780944 22064704 39047652 49250517 51397749 49912007 48903095 46945891 40794692
43761 40794692 29661185 14669464 344337 -3646824 8577996 27742616 37270291
43754 37270291 33719176 28038101 25431663 18578497 4923636 -5366286 -6769044 -8481964
43746 -8481964 -16268455 -18769276 -6421678 8460997 8618294 -7171 2149877 14754051
43738 14754051 16669070 1339604 -9368969 2698931 23504092 25985945 6650471
43731 6650471 -14559266 -25579145 -34133309 -46191447 -50678347 -36318772 -12461963
43724 -12461963 604612 -2370569 -8063101 -5877474 73217 3114187 5897029 12366433
43716 12366433 16113937 7028621 -12990183 -29089485 -28530356 -12389130 6921066 16552664
43708 16552664 13458234 6794768 8058568 16926064 21015858 12237747 -2440936 -10582168
43700 -10582168 -7797621 4002990 23472029 45009140 54056650 41048904 17788105
43693 17788105 6252371 10624871 13662454 3287745 -10802657 -13111637 -3374003 6809920
43685 6809920 9706227 4511353 -8595340 -26326402 -37048773 -28988039 -5675020 14730058
43677 14730058 18870541 11229325 4347550 2387685 1613980 2898102 11874985 24559714
43669 24559714 25568510 9727631 -4761598 1072468 17894897 20186885 5404481
43662 5404481 -1938413 8812854 13642255 -10116082 -45728228 -56840436 -34644334
43655 -34644334 -3880873 11964273 10719867 -57915 -14393914 -26162829 -31412359
43648 -31412359 -33159945 -32480844 -20240945 6558796 27004557 16761687 -15659257
43641 -15659257 -35760144 -27110465 -6375841 7085989 12088547 11758992 4994307 630832
43633 630832 15065599 43960771 60071896 52368905 42673737 47215665 47922491 25171061
43625 25171061 -4371328 -12222963 -3369226 -4589190 -18038747 -20640239 -7075243 -359643
43617 -359643 -14277085 -32839022 -36359276 -25938854 -11861414 3292387 17453243
43610 17453243 19929003 4263929 -17513061 -25947896 -16411489 -1415285 8207673 16636380
43602 16636380 33576437 54461574 58923733 36718276 9607439 11295969 42737670
43595 42737670 66042507 53620516 25017229 16263055 28002391 30722630 14060377
43588 14060377 119175 4493142 12554859 6396556 -6673636 -8437447 2622649 14442051
43580 14442051 22164839 29784341 36253092 34747423 25374404 17531577 17827998 23246821
43572 23246821 28488296 34046746 42840550 51725519 51593224 37293054 13989243 -9174464
43564 -9174464 -28067389 -40872739 -40809307 -22910830 1686736 11925720 2609966 -8921727
43556 -8921727 -9436864 -8796617 -20000134 -33843096 -31622725 -14919505 -3390314 -6426264
43548 -6426264 -14616197 -17667614 -14580433 -7214568 861010 728662 -11045285 -20195729
43540 -20195729 -10571142 9721111 17282107 8302715 3131667 12810452 22951287 18813701
43532 18813701 7342029 3763074 10804487 20696490 26220650 22962606 11380525 739089
43524 739089 -92907 3640677 1969173 976632 13940906 32383939 32055181 12702018
43516 12702018 3717965 19654084 38088985 37085073 27964875 31135417 42991644 48722329
43508 48722329 46930341 39216337 16668882 -17771146 -33980368 -11899352 21665804
43501 21665804 24943257 -2157389 -24725250 -25625079 -17678614 -9715439 3829985 19444333
43493 19444333 23374734 17387160 17475402 24524289 23783046 15092505 14370165 21914369 19635373
43484 19635373 5117421 -2676680 918074 -2648776 -17502435 -20174904 -365034 16840534
43476 16840534 10446223 -3445412 -2465867 4032212 -3646101 -16894493 -12711328 7331578
43468 7331578 21221404 20042913 11110694 -3175531 -22761339 -33684922 -22377471
43461 -22377471 -2422079 -7568 -14222742 -18503475 -2140911 17109359 26175499
43454 26175499 34946612 51139533 60665953 48341050 22159690 2779350 -317516
43447 -317516 7935308 17689627 17440733 -1192547 -31247807 -51502517 -49419342 -35672255
43439 -35672255 -27637737 -26929346 -23245015 -13088035 -2614837 4799980 12945807 24341967
43431 24341967 34156403 33975136 20438378 2369900 -2039607 16714765 43086626 49335015
43423 49335015 29083753 5171726 -3368408 -6135737 -18089600 -26429252 -6235943
43416 -6235943 35062240 56621117 35090377 -4769639 -22202058 -7111161 18695065
43409 18695065 33834086 34663473 27570513 19731566 15734897 12719945 1687309 -17588559
43401 -17588559 -29122570 -20281761 -2819062 1497949 -7288116 -9306611 280963 713052
43393 713052 -20577654 -43245392 -39657220 -12516049 11547201 18645063 18698687 21980950
43385 21980950 23999714 18919978 13332943 17142510 27951571 32591777 21867770 -175935
43377 -175935 -19903933 -25353425 -16120472 -3040214 3281087 2302473 -247198 -2836357
43369 -2836357 -9845811 -24356929 -43693986 -60566851 -65231557 -50902024 -23194679
43362 -23194679 -58587 5447660 -1081482 -6409978 -8640591 -13671496 -18088894 -12144279
43354 -12144279 848811 5632997 -1419664 -7017969 -4365777 -3511786 -9241875 -7363876
43346 -7363876 11712299 30606877 25567885 1039082 -15351204 -8640180 9422727
43339 9422727 20732799 19890172 11873408 3276780 -1859898 -6058466 -17774965 -38584816
43331 -38584816 -53890952 -47189324 -22200967 -96213 4725535 -3502420 -12201527 -11686490
43323 -11686490 1925475 22747358 34652580 26926401 10152581 4411917 12591379
43316 12591379 19076675 14262831 4597979 -2387577 -5458805 302152 21008431 45423863
43308 45423863 49413093 29265699 11449038 16101040 29340934 28568088 18101578 18149593
43300 18149593 30876137 41140253 43487836 44769558 43710144 31368620 12083367
43293 12083367 1981336 3576793 1736572 -10696601 -22349480 -24463542 -24056311 -27183074
43285 -27183074 -26200766 -15706095 -7239630 -13907478 -29282054 -34664300 -21828416 1592984
43277 1592984 23883882 36865628 36740112 26803714 16265048 9625379 2064404 -7968269
43269 -7968269 -8943216 9949241 39254065 55242512 45149289 17746282 -9973289
43262 -9973289 -27116856 -30219642 -21384426 -9559782 -6220167 -13930158 -22454080 -20227837
43254 -20227837 -7793207 3296206 4247574 -922104 -489466 10633304 24569335 30295109
43246 30295109 26196660 17841058 6558337 -10530687 -29109081 -37569291 -32539596 -24048659
43238 -24048659 -19160726 -11692820 2335400 10291554 -1081508 -21817350 -27534577 -10462307
43230 -10462307 13641992 30023549 40804681 52027350 58697669 51679950 32554008
43223 32554008 14732814 12381746 29441737 55229551 71337961 68310697 53789354
43216 53789354 38691876 21581820 -2072580 -21821650 -21831835 -7458716 -1602796 -10487937
43208 -10487937 -14126416 362755 16582269 13946803 -2716336 -15798672 -22332346
43201 -22332346 -28516179 -27786665 -7766137 24382961 44547643 40983415 25402268 14166159
43193 14166159 12698670 19209218 29679333 36479183 33723296 26720550 26847342 36018916
43185 36018916 44685818 44429084 33930128 15298313 -4923236 -14305488 -6527860 7605530
43177 7605530 13735870 14583585 21442289 29129706 20305340 -4069206 -20261239 -13630343
43169 -13630343 4339940 17608828 24671663 27762602 23909632 19458881 33432729 68858995
43161 68858995 97167665 91425862 62915428 43536743 41244924 36464313 18854900
43154 18854900 3460995 5848633 19216835 24466713 13368103 -4128425 -11140055
43147 -11140055 -1059350 14218723 17163905 8224117 6909162 22451060 36400320
43140 36400320 28397836 7747331 -409905 6945746 10185525 3160613 4304953 23858978
43132 23858978 41163276 29181804 -9419252 -43237411 -44908036 -16792721 12588322
43125 12588322 16254245 -2856628 -14234444 2214088 28185068 32156220 15389284
43118 15389284 8695233 23739056 37001810 31713064 25768319 37805698 50894770
43111 50894770 38815780 11909824 3801330 19404960 29413591 18303099 6323867
43104 6323867 13188240 25930521 20069669 -4333598 -25581937 -28954811 -16715607 3250900
43096 3250900 23279307 33427999 27197453 11158015 -345771 -1156871 3050851 6563576
43088 6563576 10406027 15418995 16806160 11063206 4049873 6205275 20035416 36102842
43080 36102842 42882776 39156826 34563648 37115541 42439668 39368639 26213471 15602081
43072 15602081 19299626 33237195 44026051 46491738 45760059 43987785 37339315 28773243
43064 28773243 30601396 46216395 60246665 58072192 45890576 37339407 28635849 7152645
43056 7152645 -18300361 -20332137 7324937 35287425 36889638 22842556 20352284 32186258
43048 32186258 37869256 27140869 10000825 -3448561 -12485832 -15430475 -9456145 -2593852
43040 -2593852 -7407582 -19860810 -23173044 -16440259 -18407351 -35062814 -45391825 -32984968
43032 -32984968 -12554894 -7028094 -13450877 -12390426 -704755 7025228 4306669 -693055
43024 -693055 -2227909 -2025579 1577890 11234249 17374661 6781277 -12927180 -17321676
43016 -17321676 -330917 13872886 5421296 -11617273 -10169125 10778550 26581083
43009 26581083 21623464 5823937 -4524180 -7275099 -10080709 -15995227 -21501495 -23946813
43001 -23946813 -23994753 -22604189 -20937258 -22243003 -28161723 -32303205 -23677892 -944720
42993 -944720 21091135 26048000 15369440 5453023 5594449 8843593 8151146 9856911
42985 9856911 21438661 34565987 34147718 20929988 11346601 14843741 24371772 31489764
42977 31489764 37670867 45175684 48460506 43002400 34204697 28880302 24340291 14676712
42969 14676712 2888321 -2432053 288773 4708028 7005674 9792919 15484328 21500441
42961 21500441 22931049 17056535 6432714 -194117 6285195 24369009 40471386 43407602
42953 43407602 36391324 28991574 22816630 14611074 9363023 17248606 36694339 52452787
42945 52452787 53684116 43192499 25421335 -1221993 -31555544 -45675050 -28690073
42938 -28690073 6916074 32855306 37442751 33800081 36121642 41772524 40959590 32160147
42930 32160147 21406773 15199975 19855986 38307818 60320155 66049712 49973373
42923 49973373 32818619 36722013 55112947 62384166 48735383 27570849 10457662
42916 10457662 -3646883 -11099676 106799 25070978 35301619 16230382 -5954129
42909 -5954129 1565219 29747471 40730712 22692884 1016247 -6019211 -9850632 -19372806
42901 -19372806 -17121685 10862669 43877448 51535552 36348698 25112060 26392230
42894 26392230 24870466 16336146 18986076 41242766 61538095 54632276 23905803 -5409933
42886 -5409933 -14842285 -3574298 19041328 38803054 41489159 26055776 10193580
42879 10193580 11727096 26986640 38027391 38161133 37180913 41369897 43180680 36597706
42871 36597706 30657936 37416850 52680968 59228087 48195472 29604728 20239879 25668032
42863 25668032 36447970 40486915 37164852 37149254 46927801 57437437 55006713 42694437
42855 42694437 40280182 58004191 79431761 79409680 53508332 20514840 277342 -1024726
42847 -1024726 11946741 28630069 36718844 34573427 38464603 62534517 91509834 92401451
42839 92401451 58818044 23774023 17482870 31227824 38826778 36213409 37042879 40935138
42831 40935138 32972414 11783918 -6054277 -10885718 -8481690 -2110653 13113259 34124591
42823 34124591 47667708 49283029 47109669 43961102 35836389 31203650 46583470 75125496
42815 75125496 86549554 71081073 55613410 58562758 58483832 34378344 9860744 20450877
42807 20450877 55620092 74811809 70925031 73693821 91118806 93224254 64967501
42800 64967501 34985576 32624524 48271509 57606704 58528193 60717594 60448031 51055776
42792 51055776 43165823 50794360 67748828 77573312 77248967 73516685 66494424 55197088
42784 55197088 48935437 54240042 60021167 55027429 50106389 61249786 79014628 79671884
42776 79671884 62332964 49594302 51967460 56419255 52611310 46803013 44459342 40853388
42768 40853388 36128363 40243669 55195197 69767144 78437748 87246722 94678294 88206786
42760 88206786 69908783 62943242 77056980 88360746 73691532 47952855 43226692
42753 43226692 63044793 83864556 94856679 107493607 125150197 131460025 118545489
42746 118545489 104930622 110835296 129500970 137731671 126883413 109856727 100733107
42739 100733107 99262966 96816413 89929079 83688240 83219819 84567106 77310775 58860342
42731 58860342 43218431 48650969 75482364 103062766 113047120 110176510 113140294 127638900
42723 127638900 137572889 125839578 97108344 73343313 69240118 79272312 89152537
42716 89152537 91741514 87637062 78332883 67738690 65570205 77725328 93879255 95943162
42708 95943162 81173265 66654309 67146555 78364825 87265155 89024057 86673362 82676946
42700 82676946 79510362 81510240 87285262 86472213 72910821 55203377 45408393 43983226
42692 43983226 46179000 55810757 78364493 104526977 116006938 108022379 93787659
42685 93787659 86665981 88943737 96917244 104668865 103846094 93200941 87802513 103674155
42677 103674155 132139800 145394876 130882448 104802828 87875998 84263483 89617994
42670 89617994 101714434 114037286 115481121 106784821 101584030 101403745 88699590 58564432
42662 58564432 36229907 41908643 57122527 53904725 43386615 60835572 107107719
42655 107107719 141573378 139076721 120660569 114759936 117317906 110121501 95710571
42648 95710571 90014963 94815506 100420539 105665594 113435903 114420278 99037544 81634485
42640 81634485 87771543 115423696 132886852 122647286 105393175 108018420 126374093
42633 126374093 136777717 131098423 121003257 115261181 112483496 112901679 118518167 122246608
42625 122246608 115257419 106190503 113605548 135404649 146682382 136323790 124234431
42618 124234431 128321021 135107446 123793997 102735659 96067273 104746248 109202291 105513423
42610 105513423 109042894 121313735 123238780 108466260 96532510 102344795 116699921
42603 116699921 128689926 143309131 162065555 169357811 156745213 140908635 138378401
42596 138378401 141601827 140362864 146014941 168102697 185023609 169504344 131612196
42589 131612196 104935378 99004382 98304035 101081449 120720003 148300431 153698266 133592055
42581 133592055 122691823 142097541 167584103 167811669 147270845 130132685 124037215
42574 124037215 123226310 129732944 146281980 159237307 152240878 131946601 121667365
42567 121667365 131746095 149403174 155404280 142044477 119505644 110104135 127216664
42560 127216664 154659105 160373589 137692140 115633529 116867364 125826634 117741942
42553 117741942 100521476 99913113 113787448 112966284 87743942 64931279 70303527 95907235
42545 95907235 116608499 123931146 129745617 143892450 160545967 167107991 160405549 150057527
42537 150057527 144707509 138910427 121677370 97635564 86994340 98697745 116560211
42530 116560211 122477911 121636156 130466518 148972471 162293058 164592282 163800616 164250334
42522 164250334 161126600 153075722 145419963 138202349 124241172 103315958 87469331
42515 87469331 86732036 96620363 104217128 102467669 95971928 94783444 102870555 112855138
42507 112855138 115501273 113165118 115616882 122781265 124838483 122504442 130044896 149633728
42499 149633728 160996901 150386780 132790979 128246059 132695726 133142963 135503661 150940611
42491 150940611 166778717 161148980 140159136 130712607 139377354 147362904 144811420 140349112
42483 140349112 136076042 123768958 109223808 109502159 120437488 118365401 102209361
42476 102209361 100741972 124776457 144556916 133914751 108775845 99178085 106100789
42469 106100789 109948035 103842998 95352155 88958643 87290981 97766121 119856576 136998374
42461 136998374 137147993 129763079 128164410 128948092 124397030 120919323 127697353 139537642
42453 139537642 147931496 156995994 171522474 181226788 174709880 159049747 149179702 147301525
42445 147301525 147039148 146763133 144782625 133928381 115272786 103908158 107366703 113773382
42437 113773382 115012978 122047645 140541344 153621814 150044742 146308893 155723115 160155314
42429 160155314 143545315 128801948 142431458 163469038 153617037 123749213 119309117
42422 119309117 145461880 160302891 145997806 133669993 144842353 157723565 152383925
42415 152383925 145833461 156149642 168288590 164116949 156402495 163592784 174968719
42408 174968719 169886740 153209715 145097979 150182235 159724891 170457110 179862726 176057627
42400 176057627 153643563 128866429 120318113 124909646 129182687 131997074 138953630 147030575
42392 147030575 152743414 163516546 182998587 197562609 196364721 191692772 197543548
42385 197543548 200352534 177577023 138334259 117295016 128002802 147424200 151312143
42378 151312143 143193595 140091714 146215840 151488259 146978139 133676624 120179154 115114201
42370 115114201 119088202 124342562 124897655 123390359 124108010 125587051 126988778 135447566
42362 135447566 157147755 184094215 198817359 191782037 169012000 144873056 131570974
42355 131570974 132238761 140368487 148771641 158823906 173788077 184828096 177589767 155324657
42347 155324657 139373436 140088966 143680860 137025621 128236495 130054742 139642095 149910370
42339 149910370 163878343 179207476 175631321 142792342 108399220 110081773 144365793
42332 144365793 171300992 168907271 155522776 153637667 157815955 150924830 133969517
42325 133969517 124591030 133789678 154470163 170428169 172433576 166466471 165167642 170701405
42317 170701405 173127912 168775694 168220451 177614702 185356521 180382844 171185649 170757666
42309 170757666 174930427 174326685 175253403 185590248 190877256 172342540 142345923 132080851
42301 132080851 146013247 158506924 156424706 153639579 158293830 157798611 147328300 143872771
42293 143872771 156686025 168475810 162771820 149623723 147815855 158832398 173099209
42286 173099209 185962145 194006835 191190333 181462003 180143231 191381224 200157667 196977345
42278 196977345 191928384 192706662 189598166 177021208 168493694 171985622 171275177 153559622
42270 153559622 136577370 143257930 165009299 176691522 175414085 176731010 181821131
42263 181821131 177518789 164608182 159168939 166862291 178700621 189981597 200784469
42256 200784469 200648191 177752000 143780152 125757237 130554754 139211225 138717844 137205321
42248 137205321 143707087 154544638 165388201 176957675 183526755 175666384 159845352
42241 159845352 154715600 161712608 161485627 148058275 142506558 158501367 176386034 171071452
42233 171071452 149117812 136864834 143136837 154637168 160840632 163029094 161973120
42226 161973120 155254021 147256944 147040633 154683759 161167875 162541462 163742430 167566492
42218 167566492 169835692 167459903 162835228 157955101 151588698 145353819 146438026 159792016
42210 159792016 180353107 196450503 200707862 196525065 193675705 197844102 205974470 212752866
42202 212752866 217753428 221337167 217453729 200351944 178452490 169941303 179859805 191433274
42194 191433274 186810009 168179117 151257900 145956404 151809605 164854593 179195111
42187 179195111 188100895 193144148 204836110 223002293 225983240 197026250 156043834
42180 156043834 143521037 171234426 209174191 226202513 223066532 215867967 207948203
42173 207948203 195594994 186548498 191508048 204556938 211524228 213470372 222446779 235454859
42165 235454859 233185235 208765607 180199934 167377960 170921346 180482584 189910286
42158 189910286 195624563 193084877 185433121 184514633 192520631 193812263 177749232 158931864
42150 158931864 158952286 176338257 192062528 198322838 201875731 202592821 191933816 175257497
42142 175257497 173211494 192772405 215165221 222122981 218225002 216998013 220148813 222989866
42134 222989866 227286676 234981567 239591801 236803554 233917166 236319584 235222899 222931445
42126 222931445 209464255 207290572 209189526 200294218 183998889 174241725 168004636 150735886
42118 150735886 128195430 125852732 150373015 176053511 180369720 172371274 172521809 182163314
42110 182163314 189179078 190715405 193038019 196918297 198478630 199324785 202875292 204856868
42102 204856868 199041982 188923514 183182590 182718377 182124016 181276555 185455447 195002018
42094 195002018 203245217 204548690 198964299 191019813 188376511 196753542 210058909 211859175
42086 211859175 195475903 176859223 176310163 191385562 200730656 193390541 180763527
42079 180763527 177512456 183271333 188474581 188564193 185952842 184570392 188317899 199796826
42071 199796826 214958022 222805324 216247606 201984058 195163470 203511290 218699918
42064 218699918 224812229 215873344 203510431 203536132 215042550 219983879 207685231 191705918
42056 191705918 193070481 212306706 230213463 233508020 225596692 212090448 192652450
42049 192652450 172935206 168047860 182293995 197507260 195411648 182717133 178895440
42042 178895440 186009557 188848572 182431868 179592489 188073168 198520919 202396325 204837657
42034 204837657 209071069 204147066 184333932 168334815 178148927 204359485 214799689
42027 214799689 198493898 179043856 177858044 184820002 178534545 159286592 144193962
42020 144193962 140012426 140234124 144413787 160370660 185789810 205263877 211330505 214462229
42012 214462229 224653358 234832014 232583036 220191606 211426105 211602870 211516015 202471696
42004 202471696 189700885 186177501 195528118 206032459 204496196 193672498 189047237
41997 189047237 196349895 201510538 191403610 176482993 177823795 194278992 200691038
41990 200691038 183475105 161269260 159888177 179141786 196891081 197470903 183515764
41983 183515764 165544907 152522899 150041543 157216283 166382581 172663609 179860661 189941311
41975 189941311 193733219 183115820 167024473 162230239 171046893 181190821 185806092
41968 185806092 189299748 192786830 188544960 173476099 156587668 147737096 147128092 149419464
41960 149419464 150975628 151526328 156056825 173758629 204195135 225860087 214046602
41953 214046602 173482207 137802778 130404753 140546037 146098134 144149655 146111613
41946 146111613 154764898 161375383 158405038 142894269 115128389 86517646 79971709
41939 79971709 106250808 145077077 165526861 161599876 152129855 149409353 146799334 137650196
41931 137650196 127089490 119916259 113047524 106350863 106525317 113322336 115771432 110143681
41923 110143681 108393490 119446923 135022360 145008190 154104243 169337209 182822598
41916 182822598 184442882 182673457 191931048 203792408 194351106 162479753 137946861
41909 137946861 142672993 162823203 171529345 163511967 151989448 143746366 135735030 129516044
41901 129516044 130335971 133939710 131078148 124752798 126345501 133385340 129385351 111011040
41893 111011040 97035717 100491165 109175751 108159984 105999595 118260884 135971053
41886 135971053 136036156 120284867 117228178 138986847 160951104 157463358 138129429 130643233
41878 130643233 141165300 152384306 153694541 152466500 156555310 163880962 171492838 179555751
41870 179555751 183346952 175804758 161923980 155834872 157915429 150666279 126998729 107004282
41862 107004282 111094777 128112020 129881293 111912975 98199713 104427897 117237386
41855 117237386 117987760 109904219 108478571 116443592 123707881 126304469 129663412 133744980
41847 133744980 129951745 117816394 113221510 130764946 163250077 187598059 189922692
41840 189922692 177483426 165204105 157941307 150991713 143117924 140336756 145631713 152332157
41832 152332157 152719667 148474768 146026544 144651042 137918788 126978702 123031328 133144628
41824 133144628 151396320 168460094 181966654 190981596 188506178 170161495 146101272
41817 146101272 133141213 135751896 143461328 145651457 139897000 127189924 109568999
41810 109568999 93201772 84563099 83348554 87435944 100836377 123022128 134716250
41803 134716250 116171018 82154332 73606928 103919432 138228013 142918160 130716296
41796 130716296 130833317 136700036 120812365 90096792 83201018 110073681 135606696
41789 135606696 136219031 134519842 154973572 177254082 165762240 125378705 94345538
41782 94345538 92131946 105253851 119153641 133047131 141991181 133355609 109651666
41775 109651666 92666322 94875193 103966762 104604691 99244776 97168166 97755751 97028927
41767 97028927 98776782 105595495 107689650 94499630 72021309 55914427 51249296 51363304
41759 51363304 54312577 66945587 90471572 112831888 120692760 113427396 101837649
41752 101837649 97197041 103727835 117638041 130558991 136296360 136165972 136050505 137814650
41744 137814650 136783749 129187337 118817993 113099409 114064462 116671857 116135846 113900277
41736 113900277 115039292 121904175 132083866 140815330 143509969 138804948 133165367 139291672
41728 139291672 162002053 186004183 188119828 165666137 141965151 136051006 138254760
41721 138254760 129047288 112292200 109483627 123740057 132538862 121576056 104740121
41714 104740121 99855208 103349492 103957266 105651414 117770915 133332960 137765517 132362580
41706 132362580 128583865 124140159 107443925 84447049 76593579 87754505 96305849
41699 96305849 88524719 78510452 82895317 94984302 99619408 98067396 100554571 106158881
41691 106158881 108377157 111293580 121447378 130717676 126661875 114979072 111504990 114342072
41683 114342072 105548482 82426554 66076685 72299509 91653279 106477803 112015558
41676 112015558 111090889 102220660 85705393 71703802 69651411 75358224 78251374 76134818
41668 76134818 74139199 74045279 73432600 72365430 73846169 79475060 88480830 97677711
41660 97677711 100639282 93351992 82587250 79862532 84766430 86194775 84298704 95338650
41652 95338650 124550990 149523975 146025211 119010491 91886236 75871922 68701494
41645 68701494 73252342 93040144 113716147 114723443 100491265 96155634 108866808
41638 108866808 117751464 109641184 100451212 107968439 123910486 129606238 124062262 119236087
41630 119236087 118450563 115739185 109091459 101004636 92721412 88588504 96860985 114348011
41622 114348011 120602152 102178147 74415334 63438826 72884794 84142857 84287198
41615 84287198 77612225 73106052 76069580 89268849 107568992 115190427 104308242 92171686
41607 92171686 100991692 123750265 131821522 116858715 101100641 101316028 107672774 108955708
41599 108955708 114268652 131992446 146712729 139366859 118085265 106600178 109055002
41592 109055002 107952231 94250574 78995091 73384007 74658961 76135707 77714339 81679693
41584 81679693 88567139 100659506 119939925 139899003 149105939 145515402 137513643 129161591
41576 129161591 116857479 104211434 105103309 122664982 138203550 133925298 117132338
41569 117132338 107722037 109523203 110921620 109246583 114661665 128197799 134974440 126595499
41561 126595499 115213731 115710737 125449557 131708416 129518224 121465347 107857177 88808067
41553 88808067 71132567 62985998 65069655 74001377 88061627 102400022 107619051 102944581
41545 102944581 100978940 107673105 109024320 92726796 70487372 59331296 53827706
41538 53827706 42261750 37652237 58624896 87272557 87568138 65568778 64265053 90069348
41530 90069348 97735729 70517772 58984262 99132319 142409913 126070009 76928966
41523 76928966 74575461 129018206 169580826 156493035 130935078 135983048 152882645
41516 152882645 148147668 131730556 128799102 132151354 122619392 108303414 105842079 104932590
41508 104932590 87329905 63986214 59743744 74179060 87858490 95608617 104662660
41501 104662660 110410682 102661732 88146287 80733695 76882025 65248092 52141021
41494 52141021 52673785 65024345 77697953 92030264 111140669 118412567 98818042
41487 98818042 72952796 74658128 98915231 108221956 90179380 71113648 68608045
41480 68608045 68848110 60557463 54642476 56238297 51549827 39095791 40940269 62857718
41472 62857718 75547783 60653394 45940486 63484561 96267664 101661375 73271736
41465 73271736 44680743 39717794 51494725 67377860 83809802 94314198 89803203
41458 89803203 76396369 71215848 75416726 71720365 54816600 44117505 55975379
41451 55975379 79424682 92519022 91906641 92462281 102460889 111460950 104615697 82883455
41443 82883455 64829688 66991775 83666654 91776354 79409676 62890642 66465028
41436 66465028 88916587 103035646 90022372 62210483 44784425 44284432 46539484
41429 46539484 42194205 40479881 52246561 69471596 73914745 63671059 56950074 64987512
41421 64987512 75181208 72349906 64843424 71426911 88518804 92784267 77367313 62868702
41413 62868702 65112456 73249277 71871970 65747160 66384990 69910531 67348223 64682027
41405 64682027 71940859 80893709 75115493 57520615 47301990 51656773 59422827 60970895
41397 60970895 55691433 41804854 19668733 5131570 16742956 45929521 62347646
41390 62347646 55098098 45917801 52471960 62487005 58934818 48637943 45794715 45459061
41382 45459061 37577627 33667183 51325251 78664562 83771890 61523279 43737252
41375 43737252 53963064 75159307 76371112 54430746 32269893 26621512 34669803
41368 34669803 47326064 59224525 65623366 62502049 52616473 43387808 38072075 36137928
41360 36137928 40239152 51961305 61414983 55306714 38808045 34003734 48711513 62839376
41352 62839376 59416195 53887891 70597173 99426169 104015046 74266464 42710517
41345 42710517 38834474 51885464 55032814 45318080 37552425 33660692 24269042 13750083
41337 13750083 17368919 33235949 40624467 31427989 23329136 32862703 51063782 57153943
41329 57153943 46494910 34233442 35817052 51059066 65682257 66144651 54646469
41322 54646469 47364033 53646558 62451794 58445790 45853160 42430645 52672186 63370853
41314 63370853 66024712 66296316 68172544 66286466 59573678 55820869 56176811 52370907
41306 52370907 46587826 54222380 75459695 84851710 66395863 40958202 37826755 53975971
41298 53975971 65599001 67955005 75204212 86335059 81832133 57423245 34730971
41291 34730971 30822852 39033427 48302081 60440511 76267644 83024317 71485542 53203361
41283 53203361 45032297 44736020 36844765 17898486 1868160 1261075 13554604 27415734
41275 27415734 34722192 34657607 30913947 27318328 25338223 25721382 31103560 43235669
41267 43235669 57793375 66902610 67558558 62390718 52083343 34873537 15856990 8046640
41259 8046640 18334888 38029159 52268734 53734852 43347782 25086370 7173698
41252 7173698 1908317 14479369 33960362 43090461 36265236 22753910 14837792 18803080
41244 18803080 34298427 53983193 64467642 56325848 35612028 19533713 18365690
41237 18365690 26188156 31064234 29064259 24798829 22129411 19878652 16932552 17483507
41229 17483507 27323811 44243486 55483272 49124146 27768525 6420212 -3921186
41222 -3921186 -5245583 -3666998 800008 9902550 18749574 20354971 15881953 12068933
41214 12068933 9682689 3193491 -7098839 -10685893 1792092 27169270 51817840
41207 51817840 62184313 53982716 35690963 22243951 19992771 19724155 11782919 4920002
41199 4920002 16937234 44994938 61305241 47872848 22593071 16259632 31381108
41192 31381108 40722635 24873206 -5103494 -25220960 -24230586 -5581132 23383126
41185 23383126 52937473 68726839 61038009 37382420 18148740 16801079 27586890
41178 27586890 34356434 29373440 21396648 24675626 40706973 53779133 47475688 23719404
41170 23719404 839773 -6536653 -166839 8782585 11599631 5033104 -8406574 -17707263
41162 -17707263 -9501280 14356187 31958336 25039181 3535767 -5501193 8221373
41155 8221373 28389384 36582448 32307056 24240289 15717690 7766729 5031587 7593678
41147 7593678 6185933 -2017288 -1523279 21157288 50624035 56328173 34763602 17431458
41139 17431458 28169500 50427849 51617650 27143666 1445668 -8545199 -10461863
41132 -10461863 -15689606 -20533415 -17012078 -9097633 -5457912 -2506152 12172777 39399311
41124 39399311 61387265 59484339 34657698 6820295 -4679082 2181344 13889260
41117 13889260 17379637 12206398 6954362 6925926 9150680 8623885 4807583 845771
41109 845771 152996 4817033 13106647 17536278 11269683 -1126075 -6384281 -657656
41101 -657656 2739054 -8426841 -25973360 -30851351 -17404612 4212475 26452017 49422181
41093 49422181 66856528 65083065 43726775 22840446 18939267 25748133 30006085 34253908
41085 34253908 47936565 64361029 65938598 50599761 35373927 31975769 34531057
41078 34531057 35181762 36756456 42765751 46834641 41054899 27158855 12435109 1444870
41070 1444870 -2286688 5814282 23738115 38683530 38536010 24682296 7848479 -5243336
41062 -5243336 -15497722 -24713356 -30656390 -28316158 -15094211 2285118 8005852 -6592219
41054 -6592219 -26170632 -23557913 5299434 31457459 28397038 5982166 -4835478
41047 -4835478 7672932 27924576 40058721 43935347 43504960 37088370 25150734 15050606
41039 15050606 11793311 12766905 14850136 17573651 17622057 11963518 9296038 24257440
41031 24257440 53310603 69815125 54055433 18638603 -7086716 -10015310 737760
41024 737760 13220958 22934239 26106389 17697307 209409 -14233632 -14730644 -715245
41016 -715245 19579292 34852520 35943040 21679240 1002655 -13888650 -16541959 -8058763
41008 -8058763 4651595 9293043 -4714356 -31398960 -47946557 -40167066 -21388376
41001 -21388376 -12192511 -8773935 7700403 32978237 38054719 13208374 -12736562
40994 -12736562 -13471548 -2374183 -5112300 -14050257 -2215872 26206753 35856627 14415436
40986 14415436 -6681727 1463874 26503048 40720020 41623934 42595218 40953089 24466540
40978 24466540 966858 -7882498 -1370569 -1250027 -14273912 -18581190 1933450 30274632
40970 30274632 38268980 22402657 3722370 1202890 17100195 40672552 55092880
40963 55092880 48070660 27191605 17978208 34386350 57293937 56408117 29207002 1676967
40955 1676967 -8912242 -13402748 -26728519 -40968026 -36512611 -12715235 7899122
40948 7899122 7701614 -4487221 -6460208 7969081 21887593 19286831 7531816 7272881
40940 7272881 23480689 38336528 35777539 22172390 14998989 18802229 22411940 16184023
40932 16184023 2485667 -9507281 -11414766 1020754 24442421 46892959 55602902
40925 55602902 46194502 22123504 -9804806 -37271892 -42431511 -16781408 23632582
40918 23632582 48582694 42989909 20179071 4818061 8445554 22300444 28251445
40911 28251445 15807395 -7203132 -21447102 -17440974 -6541369 -4700020 -10821197
40904 -10821197 -11408253 -2275353 8090650 15794720 26907540 41923412 48356587 36244956
40896 36244956 12697655 -5044084 -5853039 7928688 22802976 23391563 7625271 -7356691
40888 -7356691 -3809583 13137597 22391874 16297071 7914125 7563552 9852474 9697446
40880 9697446 13464298 24319881 31816077 27994683 21591974 24281248 32931664 36513236
40872 36513236 31617324 21817063 11063933 5540518 10490778 17391594 8687143 -14897574
40864 -14897574 -28221090 -15779586 5418585 13154909 12000811 16976181 22492909 14895296
40856 14895296 3828635 10437157 29840760 35532914 20230582 3800487 -1357339
40849 -1357339 -5367709 -16986496 -30568809 -42818054 -57541268 -66518987 -51076194
40842 -51076194 -13457452 16556245 18793349 5766167 -3053278 -7947326 -14996168 -16506931
40834 -16506931 -4575101 11509682 19123468 19490332 15388427 -957290 -27781006 -38820042
40826 -38820042 -14803273 21660224 31591940 14360932 6957795 28108868 53483006
40819 53483006 55873333 43822049 43147948 57400907 66631162 57927449 39593517 25394788
40811 25394788 17708443 10637607 3162998 3292374 18489441 43678361 61805774 59539198
40803 59539198 42071216 28548603 30953025 40132999 36189462 12671703 -13322626
40796 -13322626 -18922946 -1967959 16647227 19299004 12163193 11757521 18324088 16891532
40788 16891532 3547416 -5907471 625978 13299745 15199569 5520006 -2856951 -1785168
40780 -1785168 6917766 19293872 31216935 35728916 29098790 18706420 16070388 22082378
40772 22082378 26469433 22128851 13931648 12627829 23600898 40666411 48926556 38128721
40764 38128721 16866599 7319546 19453648 36633419 35919401 17607666 2744996
40757 2744996 3130594 7391181 888302 -11664588 -12788126 2294648 16014287 8292234
40749 8292234 -17556855 -36144265 -30300809 -12404238 -5730234 -10191304 -4063933 18338013
40741 18338013 32033691 17069875 -9029194 -15074044 -1525693 2723938 -13864284
40734 -13864284 -28531829 -19507874 3139255 14673053 9206741 1050681 539501 3661842
40726 3661842 4407265 4770859 8199057 10624497 5489094 -3343646 -1454373 17387404
40718 17387404 36484061 31117932 417999 -27260021 -28275983 -12420986 -5709433
40711 -5709433 -13303433 -17304776 -8847903 -2131232 -10282533 -23580708 -23454273 -8771545
40703 -8771545 4129600 3921581 -3588014 -5955604 853753 10846222 17535254 20711474
40695 20711474 23032028 23416654 18418685 9438020 2464862 -692784 -3767187 -5961961
40687 -5961961 -32033 13513085 20989517 15049360 9938616 22057219 42007070 44964310
40679 44964310 27334859 12891098 18158502 30131679 27281529 8154403 -11856655
40672 -11856655 -21648018 -21322660 -15382510 -8976220 -6044227 -3736017 6162140 23695554
40664 23695554 35083899 29037411 13648771 7284762 15091970 24388042 23985701 18834085
40656 18834085 20205943 26434186 22014090 -1225846 -28154920 -34615748 -18014104 -3148731
40648 -3148731 -11502786 -34285167 -46384849 -39383277 -26478588 -19161744 -16060125 -15087813
40640 -15087813 -19127868 -24695769 -20177016 -2796477 14800786 21960969 22597935 23421615
40632 23421615 21884390 15204362 10101925 11743851 11469851 -1876844 -23767198 -38723188
40624 -38723188 -39778470 -33115933 -26155849 -20763475 -16783034 -13548846 -8339253 -670103
40616 -670103 2436959 -6941938 -24484848 -33598013 -22334827 2503755 21911633 25258856
40608 25258856 20812095 22633540 30170175 29196004 14065228 -2489199 -8725190 -11437958
40600 -11437958 -21825192 -33766585 -33141912 -22190590 -14996795 -12303947 -2643907 11530500
40592 11530500 12258740 -4568147 -19528877 -15883799 3422366 29085322 53915296
40585 53915296 63503490 44813495 13109150 2610120 17661051 22258453 -5331131
40578 -5331131 -38754223 -46856147 -38806558 -35553058 -26491494 5212779 36985483 32941833
40570 32941833 2921689 -11145510 -1631452 -358492 -17001387 -21899725 -1835045
40563 -1835045 12730597 -2575576 -25659888 -22894975 2708408 23499303 27333182
40556 27333182 22537523 17345725 14283321 14532296 13347340 1874388 -15657017 -20431940
40548 -20431940 -6111424 7843175 3326919 -10569930 -14309370 -7774505 -6084708 -14133316
40540 -14133316 -22061703 -21998081 -15884360 -8271273 -520618 8400980 19171949 27926260
40532 27926260 26206140 12456087 317539 2870191 11786151 9865248 2432029 12338908
40524 12338908 40137242 56399090 44457218 24448598 18583901 16845701 -1148720
40517 -1148720 -29410752 -44291552 -36517862 -14077725 14030317 37630470 42837005
40510 42837005 30370584 23348496 36315058 51141701 46287149 33128928 34317787
40503 34317787 40836980 25927143 -6510791 -25006898 -19940609 -12284300 -10569975 1569210
40495 1569210 25150026 31950560 9832450 -10743277 280042 28753986 41669609
40488 41669609 35653997 31440928 34204688 29859603 15384604 5367727 7388067 12760282
40480 12760282 14884823 18681556 27304410 34501662 35457972 33043370 28505143 17521132
40472 17521132 1527055 -7633023 -2741684 6786484 7283982 394564 254113 12558963
40464 12558963 26283223 28880959 22377508 19292099 26475699 38039165 42711985 34228346
40456 34228346 15418815 -4221955 -15040012 -13953260 -4830381 8198473 24260845
40449 24260845 40285942 47948541 42949623 33376447 30217952 32191504 29812582 22473437
40441 22473437 19051323 21068323 19111714 9884851 3599209 8258229 18305447 25440613
40433 25440613 29317399 30794776 26712447 18997376 16116637 17080044 8843089 -9188303
40425 -9188303 -14340700 9304800 43500478 56908365 43007474 18922462 -2262693
40418 -2262693 -17101109 -19998589 -10219223 -4167975 -16019508 -30940924 -23343396 1899331
40410 1899331 14898926 6626108 -1356577 3614327 8568209 6796116 13794752 34797087
40402 34797087 45584605 28719484 6746585 13438566 45995139 70168064 65111315
40395 65111315 42820670 27482401 31433292 48588557 60520068 52723732 31311226
40388 31311226 16255234 14624615 14280735 8914868 9062096 16917140 12582651 -15114010
40380 -15114010 -42747466 -41058131 -15991552 3383523 6671584 5936575 6662885 3515309
40372 3515309 1188921 11047553 26470907 28088798 16148873 11651881 20354053 22174430
40364 22174430 6242887 -7875948 1395392 26681067 44442615 44477576 32338164 14605520
40356 14605520 -3065751 -11766980 -7781146 -996662 -4104093 -16468659 -26193933 -24246958
40348 -24246958 -10766882 7323693 19341805 17326211 5306396 -3169515 -1089133
40341 -1089133 4986293 7470562 7755470 7638517 1625788 -11942685 -20694637 -11810643
40333 -11810643 9182651 25548117 32174999 38590483 49632241 55789324 46677642 25443797
40325 25443797 5143408 -4041963 -1133303 7458605 13344125 12992306 10872310 13357347
40317 13357347 19769771 23496905 21774765 18774099 17761594 16681599 15096752 19016791
40309 19016791 31714904 43653190 40918774 23726393 7219059 1232643 -699653
40302 -699653 -5878722 -6786372 5975726 21924813 20286582 1687726 -9448089 -1085434
40294 -1085434 7426271 -3527763 -20983041 -18907309 630740 11491723 5039606 531170
40286 531170 9787476 17353738 7481419 -10196577 -17544388 -14680172 -13268636 -15308441
40278 -15308441 -15955565 -18381194 -27879572 -36903260 -33363126 -20890554 -14890288 -19954784
40270 -19954784 -25937939 -25363015 -20267075 -12561763 -2471078 3838994 1043782 -605928
40262 -605928 14610931 40553269 52366867 43424685 36837207 46984743 51291606 22484399
40254 22484399 -25753433 -52508573 -43786723 -26133851 -23849318 -27913259 -18126849 3747691
40246 3747691 19767579 23893892 27129769 37601502 49521955 54041724 51671271 49645084
40238 49645084 51739207 54831351 54178141 49028106 41669381 32133011 17485473 -1145487
40230 -1145487 -14166964 -11976313 2442916 15225271 17178605 12133369 7933363 5384417
40222 5384417 404426 -7520677 -14158331 -15390287 -9773952 1162128 12518472 19350575
40214 19350575 22846630 28497018 35441339 35032163 26045063 23097874 38380060 59277198
40206 59277198 58568104 28794892 -6062091 -18665193 -8161725 5521032 9387836
40199 9387836 8721516 13192002 22311921 28527002 28929162 27902214 28700205 27472810 19133851
40190 19133851 6845156 -35181 1430014 3169349 -1969280 -9384077 -10686253 -8210617
40182 -8210617 -11430304 -19069573 -15802161 7864288 39534780 55910989 47138271 24451242
40174 24451242 4340581 -9239173 -23639026 -41090446 -50503662 -41177385 -20843376
40167 -20843376 -9209458 -11354888 -9994340 7713441 27886950 29053518 15077705
40160 15077705 9613238 19872652 26345547 12458499 -13611186 -33311215 -37809669
40153 -37809669 -26426529 -1785854 22638293 25580370 3100054 -20364981 -19936686
40146 -19936686 63214 17528572 23516924 26134378 31549224 38180403 44919104 49386314
40138 49386314 42668325 21969434 3849740 6331496 20319467 19200118 -2167547
40131 -2167547 -19256069 -13875591 2228186 10072218 12104156 23162953 43979626 59653758
40123 59653758 60411883 51733176 44798163 44747756 47764545 45127727 32151591 16178038
40115 16178038 11493804 22170779 34518773 32202163 15668453 562591 -1627120
40108 -1627120 4561691 6782835 501831 -6686746 -5308052 4901852 16673043 25463671
40100 25463671 31743266 32536877 20326212 -2587086 -16802223 -5661862 19954675
40093 19954675 30356191 13641108 -7927601 -4812312 24256946 51608211 51890196
40086 51890196 26951978 102292 -8856087 -249541 11735332 17616337 21127372 29835592
40078 29835592 42659249 50124880 44516508 27493294 9953517 4861555 15625216
40071 15625216 30539370 34215161 24983442 13717686 6216438 -1027564 -6069914 795611
40063 795611 17610359 26176347 18019517 8315007 10397436 14273422 8297534 3788447
40055 3788447 14473145 27984788 26330339 20606822 31513458 45507079 30054633
40048 30054633 -9775773 -31478220 -17066769 5650481 14164856 22446164 42701589
40041 42701589 55035735 42830506 27427143 36075892 57953915 63686827 52452973
40034 52452973 48749024 61651072 74581037 71719081 54377349 34445741 25471826
40027 25471826 33804280 48112450 48244282 33421977 25870944 36177041 45796541 38852728
40019 38852728 28179097 28956902 28848283 10651331 -13980154 -22326058 -17197304 -16294970
40011 -16294970 -17675056 -6957841 9905947 12565440 891753 -4425549 6400097
40004 6400097 24005123 39232594 47909755 42483727 22592084 7484089 14401772 32410404
39996 32410404 41132783 43711935 53278736 59914562 45843772 23986307 22841940 37797119
39988 37797119 37436228 17241620 5364018 11038688 9428681 -11711185 -29105996 -22544160
39980 -22544160 -3335352 10829397 20291693 28633046 30018307 24469444 22889471 27984864
39972 27984864 32126553 36924238 48781087 55701458 41172914 20393071 23686515 42700775
39964 42700775 38688260 9774283 -1945587 16966485 27850683 10927960 1560540
39957 1560540 22830263 38285827 15959249 -10683264 1704444 31547259 31203002
39950 31203002 8724119 9831462 38742006 55508939 40857347 11953790 -17185559
39943 -17185559 -43175172 -50210560 -26488363 3092141 4760219 -10750095 -5563064
39936 -5563064 23535076 45761888 50393471 52538694 51476948 33427833 12673653 18333768
39928 18333768 40063082 39396124 17674838 17237556 47203647 65439121 49746206 30917813
39920 30917813 32503922 30749202 4079867 -24255025 -26782369 -16081276 -14777204 -15189058
39912 -15189058 -2535061 10960100 8043129 -2478299 -6565281 -12875344 -30692915
39905 -30692915 -42916909 -30826817 -5848288 11088371 22046377 36354652 42123484
39898 42123484 23433271 -8912203 -30832568 -36082278 -31447401 -17449252 2725391
39891 2725391 12435810 4057608 -4974639 -1829079 -3128267 -23360935 -41007118 -29364303
39883 -29364303 -1902302 10045068 9503131 23979339 53312990 68145900 57195778
39876 57195778 38741977 25722572 14241956 6899709 12993363 23189480 17240104
39869 17240104 430783 -368242 18441096 29802702 20910413 11842542 17651418 24075434
39861 24075434 17668053 11829174 22281675 38509183 40596774 28486584 15609304
39854 15609304 6082475 -4184644 -12495998 -10693862 2969779 22407321 39631323
39847 39631323 47770268 44901797 37010632 29641178 19035182 3711437 -351168 23114109
39839 23114109 58787547 70073194 47596710 23145802 24989167 43126270 53374573
39832 53374573 52930593 51558198 45733406 26251342 1816851 -7509977 3384245 21673344
39824 21673344 35925435 43693417 43545271 33630812 17134659 -240420 -15272003 -23314512
39816 -23314512 -17351401 -16131 12273421 8363525 -2540011 -5973765 -2675124 -248501
39808 -248501 5180768 20382941 34985631 31270703 12518480 1433537 8435724 19981771
39800 19981771 22185747 18255400 16013662 14346531 11142984 11366067 17099748 20164640
39792 20164640 14397563 5960918 2081363 -629370 -5522795 -3574808 13225733 33056404
39784 33056404 36516882 24794372 16461426 15524634 4909491 -20119753 -34615975 -17878044
39776 -17878044 12105263 22275101 13048539 15322075 40367782 62465308 59544465
39769 59544465 43543351 34787204 30209510 18866809 9721885 16759055 29066001 25492439
39761 25492439 12662292 17205549 40320828 51608614 34855185 10800180 2793146
39754 2793146 6458186 9181316 15362390 31179419 43031541 35081831 16619445 9912532
39746 9912532 18598185 27622522 28005922 23284009 17137432 12459111 17382040 34374039
39738 34374039 48252243 43262833 27370544 20456747 23565171 22390191 17788674 25552616
39730 25552616 43065462 44526160 19519572 -8520759 -16241276 -10754551 -9224026 -8005482
39722 -8005482 5712784 25103667 30455529 18307835 3111711 -5999550 -10470723 -7228783
39714 -7228783 10563626 35414792 46920857 36961214 19016132 7607361 2899785
39707 2899785 1793472 9406674 28962219 50520839 60342429 54924157 38832828 17509286
39699 17509286 272570 -66839 17139943 32875070 30021528 16609408 13436997 23610880
39691 23610880 31186378 27893623 22365707 20443867 15093864 2913878 -5701406 -2625265
39683 -2625265 5086564 8584242 11706690 21086572 32138407 36222157 32771739 24135234
39675 24135234 8804374 -9025542 -15137654 -4448090 7579074 8623969 10982484
39668 10982484 28410247 45078084 36239330 11624590 4595382 19067903 23560521
39661 23560521 5394137 -6062322 12409239 38707751 39545107 19843937 10190039
39654 10190039 21069937 37026757 46352195 51026449 52134280 47182027 39762483 35277603
39646 35277603 30352624 20128739 10139581 7788444 9941468 12029807 18530325 29374545
39638 29374545 29742679 13117522 637293 13097555 35970602 40949576 32200874 36933528
39630 36933528 54386636 52710995 21900770 -6713123 -6626579 9149320 15471669 10945814
39622 10945814 8989340 14458966 25732453 41783364 53113090 44169781 18159145
39615 18159145 246014 3206581 11604917 14306345 26325365 56295870 77651679
39608 77651679 63051753 29971389 18701381 35499900 50715120 47966819 41769148
39601 41769148 44890290 48786598 43804185 34597799 27100189 19690607 14421397 19061451
39593 19061451 30766051 34350177 24674174 15698675 18732923 25242202 21452758 9845442
39585 9845442 5396494 15490556 31059936 35822361 22143723 79165 -11189766
39578 -11189766 -4992469 5145979 6730257 8340673 23801676 43113115 40449522 12174839
39570 12174839 -13869226 -13416762 7070754 25676027 31461810 26641974 16782209 9507204
39562 9507204 11703697 18821042 17804745 8387949 7898341 24603946 40870069 37535830
39554 37535830 22417652 16232482 19474771 15109604 869462 -4225573 9833937 26768476
39546 26768476 27240173 15431672 9146145 11551437 8504651 -5837837 -14978212 -419339
39538 -419339 30736703 50379193 42423799 20818004 9489579 13992441 22722177 28588747
39530 28588747 35020285 43082153 48312074 51824543 59057483 63355351 47325974 9804307
39522 9804307 -22517070 -23035124 4321912 33635826 47083975 44710902 33033436 19187256
39514 19187256 12363656 16958865 25086338 25950056 19933816 13843968 7508308 -1815337
39506 -1815337 -5967466 6453917 28241145 35815795 18997992 -4176022 -10055155 2063296
39498 2063296 11968019 4099491 -15768202 -28022202 -19781569 2559892 21844055 30130870
39490 30130870 34088897 38494837 35522447 20243099 6282633 9104224 19270326 13006193
39482 13006193 -10383916 -23807978 -11583824 7987413 12017376 6856137 14075226
39475 14075226 34461588 47270852 41816429 30784340 29883485 38517885 45034841 41254509
39467 41254509 27799125 12366597 5670843 12662823 25296334 30014302 24590930 20882206
39459 20882206 27430199 36531668 35706282 27675742 28903172 46326838 63999402 60382814
39451 60382814 36021702 15168991 17520772 35533157 45210139 34129279 11500962
39444 11500962 -5833827 -8119242 4986798 25702158 39628531 36551556 24580206
39437 24580206 24284692 42496525 60735424 58126673 38042417 20906241 16185796 15532873
39429 15532873 12639868 14568569 27269928 41040832 40864248 27185266 16876244 22408660
39421 22408660 36280422 39795271 24691448 1698837 -12945688 -15443270 -15277922 -20334981
39413 -20334981 -27025025 -26638039 -16528741 -1400142 13674069 27602163 41114804
39406 41114804 52051912 53301428 38227491 12397790 -3136517 9655496 41686354
39399 41686354 62016844 53875516 35174775 32620759 45067457 49548290 39404506
39392 39404506 34735682 49251903 66608188 64382649 48494884 44060069 56631096
39385 56631096 63850756 50272872 31382272 29845061 41175016 42414187 29959680
39378 29959680 25901200 41099529 53419360 38856499 9952492 962576 20092579
39371 20092579 40153180 39351510 28544430 27878170 35826727 37863360 32888267 31941837
39363 31941837 36542787 36069122 25834643 13587064 7254576 7540290 12955812 21398553
39355 21398553 26098802 20765660 10851532 10210599 23557248 39640947 44109190 32905094
39347 32905094 12097332 -8623496 -20992452 -23070020 -20660563 -19845205 -19723514 -17577546
39339 -17577546 -17296095 -24561974 -36599527 -45188041 -46620103 -40280020 -23586568 -533450
39331 -533450 11835160 2788403 -11189208 -5926157 12383894 14331798 -4592984 -12396048
39323 -12396048 11004877 41545045 46779437 30743143 18527270 14265688 3756365
39316 3756365 -11609389 -14351522 -2319028 6771506 4851536 3395633 8094794 5665904
39308 5665904 -13706870 -37460596 -46361704 -38441990 -26596830 -19424033 -13913498 -4021966
39300 -4021966 10108541 21633618 24451894 21180069 20165916 22262071 17983142 4499654
39292 4499654 -4046361 3670160 13457042 1160166 -30880487 -52852585 -46678168 -27543535
39284 -27543535 -18524861 -20522103 -19370220 -10283294 -1028664 2564335 1909478 -527685
39276 -527685 -3730098 -6157881 -6917438 -6094424 -7744 18508386 48904102 75980926
39268 75980926 81330774 61533595 31615284 11158893 8277835 15143496 17818660 11085316
39260 11085316 1878938 -3050078 -6670372 -13054150 -16513016 -10274529 -596742 1768363
39252 1768363 595851 7844766 19566391 17895367 -10795 -15560579 -17607607 -16909158
39244 -16909158 -22153554 -23042874 -11869052 -2320246 -7971974 -17874581 -14066817 -737152
39236 -737152 5036209 925590 -3605102 -8066717 -15708455 -15629129 4700710 33691132
39228 33691132 47484312 44625477 43268840 45877433 35868938 12120904 -3734518
39221 -3734518 -3193002 -5061018 -20236323 -29030137 -12348184 16218698 30581849 27793815
39213 27793815 22269994 17845662 8310480 -2090770 -105739 16686012 36318033 45902714
39205 45902714 38503616 14675363 -10680917 -13348248 12206773 38878420 39063849 22430880
39197 22430880 20128925 37350850 47562635 34683218 14426790 5398319 2301522
39190 2301522 -7553279 -18016791 -12358329 10067135 30577655 33013766 19863726 7304503
39182 7304503 8880416 22753047 33714781 30806521 21364986 20666909 29549856 33691378
39174 33691378 26116899 16802622 14961230 15544149 12224599 11633746 22224207 37060699
39166 37060699 40932129 30726164 17783481 12508363 15627021 22125186 25852550 22950687
39158 22950687 17289004 17788492 23617886 19887679 -1335284 -23647177 -24556584 -5427642
39150 -5427642 13942679 26554115 42060516 57944268 52404574 18421528 -15691877
39143 -15691877 -18708900 3368676 19406628 16873619 11073042 12554230 9193688 -10453766
39135 -10453766 -33502754 -37289294 -19469534 605094 8177567 7433958 6955650 3485058
39127 3485058 -9467049 -23489425 -20755480 115873 17752180 16315086 8244445 14339495
39119 14339495 29709486 30021611 9923146 -7962027 -7923314 -1676144 -1941522 1533937
39111 1533937 19376519 34933253 26299698 4432841 -398462 15358816 27345022
39104 27345022 27500153 35100549 55829079 64316338 45173006 22061942 22129715 34990843
39096 34990843 34258546 20786300 13340649 9871036 -6856697 -30579884 -34389557 -14955524
39088 -14955524 -452522 -5790273 -11184930 417746 13319292 7403927 -6700292
39081 -6700292 -6638939 3576850 2974751 -7569714 -5632892 13721055 26840831 17060395
39073 17060395 -1272228 -6654413 -525497 2472594 1504888 6919696 15834646 11624117
39065 11624117 -8046413 -20419510 -6165107 22436399 36178711 26854097 15098103
39058 15098103 19337671 31716847 32291690 16817669 495126 -474559 17221029 43929555
39050 43929555 63090060 62311373 47115948 39018503 50686937 68684670 72555787 64387333
39042 64387333 62005992 66215047 57740207 31960739 14152996 26442227 55590488
39035 55590488 69830816 57539552 34311120 19541834 20406631 32803778 43858709
39028 43858709 37833971 12839231 -11895399 -17447106 -9203596 -6438626 -13273959 -16214840
39020 -16214840 -7946430 3685365 10868781 13893367 12751916 6586735 3180408 11960284
39012 11960284 24619365 21402020 2047608 -9966774 -3516361 1079657 -15447583
39005 -15447583 -38658557 -41483048 -24457318 -10853870 -9660593 -9115090 -5181380 -10364631
38997 -10364631 -28448924 -42479103 -38369772 -24251677 -15217866 -11850036 -6004558 1906234
38989 1906234 4457108 769188 -2407237 -646692 4566507 9194738 8083175 -1890442
38981 -1890442 -14058178 -14016499 2143046 18101596 16590887 3045978 -3301564 1452616
38973 1452616 2277201 -7738406 -14519028 -5726602 7941352 7306511 -7942148 -20395182
38965 -20395182 -19652065 -12825313 -10373281 -12621034 -13302651 -8920516 -1624460 2213416
38957 2213416 -4647147 -22654065 -39947840 -40488863 -20276224 8458737 30079240 37888806
38949 37888806 33542988 21197733 5733761 -7590991 -14840038 -12962239 593138
38942 593138 21877981 36054670 29646780 9303353 -3002683 1546097 6930743 -2546835
38934 -2546835 -17757634 -19386234 -8191511 -2297759 -6721958 -4865144 14751472 38980105
38926 38980105 46762719 35442956 20249602 13083629 11837535 10030940 9114491 16868232
38918 16868232 34579184 49626851 46024679 23766884 1555763 -4602972 720344
38911 720344 3407057 1637381 4189745 11545301 15207576 15763593 23412974 36079356
38903 36079356 36077345 18636522 6009890 17364394 37971507 37727229 12867202 -10458599
38895 -10458599 -11518397 4502198 21715983 31610663 31576006 20495060 3588844 -8296236
38887 -8296236 -11238282 -13004009 -19899642 -25200517 -16448035 8975476 38713888 54081286
38879 54081286 45217314 22247505 8480056 14999287 25375773 16597609 -7451264
38872 -7451264 -19093281 -5411907 13793834 14536521 -571425 -12138545 -12043425 -7170580
38864 -7170580 -4257934 -6482461 -18903447 -41307134 -58987421 -56302176 -38417986 -25132636
38856 -25132636 -23663761 -22879225 -15425984 -8435487 -7037433 -3546479 7369193 15524148
38848 15524148 8819281 -8600301 -22763431 -28070920 -28731755 -27087575 -21171131 -11589579
38840 -11589579 -2034453 6021886 13209826 19639974 27682732 42265456 61300898 71713407
38832 71713407 64774615 50624180 45922863 50208645 47614855 31307132 12684237 4840218
38824 4840218 9892193 24785171 44960607 57293568 45188264 11154120 -17935278
38817 -17935278 -20689759 -7637206 -5238358 -20488350 -35376652 -32916200 -15173985
38810 -15173985 3945313 12657863 8005311 -1944910 -3019512 9558227 22731119 22178130
38802 22178130 13954359 16729472 34031918 49533690 51642804 46460015 40939051 29779246
38794 29779246 9667382 -6725540 -4781244 11700257 26024315 28445293 20262393
38787 20262393 5452158 -9211669 -11630506 3284756 21148511 22031684 6259254
38780 6259254 -7158797 -7674977 -3482337 -1939047 3632461 19069504 34824951 38367071
38772 38367071 32438327 28696642 28944998 25376270 16768372 11711496 14615650 19019517
38764 19019517 18002813 13431371 11577554 15976642 27325801 43399075 55154334 50700793
38756 50700793 30574412 13677139 18348401 39039404 51243155 40891295 20030812
38749 20030812 9448415 13706120 20710641 21167264 18722633 20004650 22708632 19525421
38741 19525421 12019619 14410947 38360858 74036095 93379142 79631992 50157780
38734 50157780 38405900 52277233 65110497 55074430 36753406 36780919 51029596
38727 51029596 51569031 32531878 19962961 29125029 39733754 29964975 12487728 13584583
38719 13584583 31244767 39491576 26953422 7067921 -6491624 -11483424 -5754788
38712 -5754788 11841078 27291987 22305655 4739632 4102838 27835311 46823615 38661883
38704 38661883 20931626 19820328 26326934 13019902 -17589468 -34097903 -23671638
38697 -23671638 -7323026 -2170960 2429195 17476976 27969666 16174458 -3554543
38690 -3554543 1253959 35238993 64815598 58765832 24501562 -3987855 -4957540 13472060
38682 13472060 29945330 34151436 32061157 32576288 35073188 31590900 18335441 1765780
38674 1765780 -6445233 1298841 22455057 43820479 49108876 34428313 17465102 22451439
38666 22451439 50522016 73089089 64011916 32380643 10569246 12491543 20205415
38659 20205415 15484189 6745802 11861902 27158953 32371183 21967938 12258955 14950763
38651 14950763 20965514 18148867 11037877 11622507 19821627 25762268 26066518 25345292
38643 25345292 24020836 17283698 7128245 3882298 11105219 17115205 7898978 -15246036
38635 -15246036 -35585917 -36827340 -16942032 11507519 32147044 36904078 29922662
38628 29922662 21352066 18678028 23252913 31174052 35379969 30464864 18763474 9101051
38620 9101051 7005225 9561120 11828036 12326108 8807970 -3067526 -20284282 -30542298
38612 -30542298 -28989027 -27382905 -34128630 -36003458 -18826949 2368740 424218 -18209020
38604 -18209020 -15833652 19802775 51854229 46120470 20641978 17008614 39987931
38597 39987931 57057421 50436934 38523451 43501511 63014187 80687896 85801302
38590 85801302 75741373 54340666 33990102 26550153 27601623 21920819 7354715
38583 7354715 -1034843 5434503 16722376 21583549 22435315 24529543 24608897 20573912
38575 20573912 19479154 24418902 25572219 17269472 12197150 22506087 36443994 33166024
38567 33166024 15419729 6526768 15151763 23835337 17301092 3258435 -3962494 -4432497
38559 -4432497 -4809747 -1956150 10081158 23757712 25048915 15310513 11467648 21837307
38551 21837307 33943666 31886568 16866332 3599724 2266472 11091023 23447323
38544 23447323 35513212 47403673 60869662 75399990 84611606 79529078 59139373
38537 59139373 34940877 20531601 18551771 21595871 22680428 19454486 11427949 538148
38529 538148 -6699443 -4563056 4828471 15488479 26146681 37738710 45847204 45615356
38521 45615356 41530685 40591739 38250141 25922260 11108211 11052437 23716919 26561994
38513 26561994 12050422 2101876 13701059 30984833 30044137 13955166 2104760
38506 2104760 -323058 577347 7131978 21301496 27667028 13177679 -5111267 -1876387
38498 -1876387 14698811 16698569 6638329 14278666 41902122 55857821 43077059
38491 43077059 32925412 43932942 50241450 28847650 3469911 5874848 22606902
38484 22606902 20011743 1098897 -4255115 8014840 15140916 11721881 13746711 20041722
38476 20041722 10048018 -14850064 -25117212 -8917995 8058683 2225367 -16178095
38469 -16178095 -26066799 -25923452 -24332032 -20103818 -9453312 1938446 9143692 17269406
38461 17269406 27912545 30519104 21212571 16797968 33710417 62584241 79052196
38454 79052196 72620317 51689092 27843148 9613066 5549480 17769914 34289206
38447 34289206 40115049 34558720 27408129 21237207 9985445 -5742035 -15084709 -12212559
38439 -12212559 -5479656 -5949911 -12913619 -16459390 -11369405 -2915365 1426252 1563686
38431 1563686 2504603 4657575 3082134 -1641476 229740 13496019 26924499 26810482
38423 26810482 17275031 13914813 19142873 19791254 11666623 9286196 22767284 39584435
38415 39584435 41952206 32860198 31385751 46625532 67195646 74422550 58574704 25658057
38407 25658057 -4531507 -10761194 11122338 42854603 61302711 58905382 44158334
38400 44158334 28105365 16150511 8328474 1249161 -7697558 -14978740 -14421751 -8131128
38392 -8131128 -6065572 -10889765 -12447395 -3267597 9688860 16065143 15614852 12361974
38384 12361974 5154610 -5378243 -9711735 -1930594 8200277 8988124 5782850 11387379
38376 11387379 22937057 24898682 12980690 -752138 -6513639 -6418984 -5519554 -6691178
38368 -6691178 -13722699 -24904058 -24357897 2550726 42520109 61492647 45458655 17721400
38360 17721400 6783868 13084157 19875626 22405038 28295222 36942694 38026987 30473501
38352 30473501 27134791 36221591 49072124 52244635 44494561 35422693 31602715 30648256
38344 30648256 27788609 22426112 16894967 13026982 12015662 13698396 13124506 2896911
38336 2896911 -15411906 -27199571 -21393543 -7527506 -3600609 -8070383 -804688 23934474
38328 23934474 44480425 42724841 30357132 27413882 29821972 20882636 5103016 3872244
38320 3872244 19561308 30093756 23252156 12748298 12024469 12944638 2540341 -15100188
38312 -15100188 -26690739 -28021210 -22869843 -12846110 1120806 14019684 22224326
38305 22224326 28592923 36410167 43643397 46439408 41674185 25286047 -1725243 -24852432
38297 -24852432 -27346040 -13134137 -3631148 -7208679 -9012746 1452077 11834167 8849284
38289 8849284 1132416 3184429 10491543 9566620 1843633 -2696994 -7545687 -23004599
38281 -23004599 -40609666 -36336885 -2839862 38069381 59984449 57126056 42097013
38274 42097013 29685313 27047977 31574486 34209438 29337358 22386028 23765473 36103992
38266 36103992 51062095 56919185 47140389 25904543 7207639 1735602 2945310 -3575114
38258 -3575114 -14849529 -10506946 15095724 39661126 45181779 44333351 55097338 66590481
38250 66590481 56925024 33271838 23330376 31486317 34456589 21634745 9676262 10775345
38242 10775345 14249625 9976898 5830573 9106849 11256443 4713604 -2313975 -725344
38234 -725344 5150805 9686028 16805040 26558014 26797832 13064708 2828994 12983261
38226 12983261 33285712 39128991 24314506 6045829 1364331 11368157 26169017
38219 26169017 34947949 32348523 22132239 13662220 12468955 18280684 31209240 49688876
38211 49688876 62235818 56101797 37967103 29997735 39201353 47854711 42237077 31240498
38203 31240498 24662110 14122897 -6771113 -22502235 -17945417 -4777797 -1385432
38196 -1385432 -422019 15457037 36065740 34786560 14533159 9413234 34765426 64334432
38188 64334432 67747303 47142484 24027536 9141162 -395254 -7959511 -14817338 -21639706
38180 -21639706 -23799030 -13655122 6494569 23371511 29493491 30402381 31278728 29604770
38172 29604770 26696955 31499526 43703233 47132428 31805234 10428533 -533943
38165 -533943 -5086127 -16184022 -27942977 -20044029 10046316 38278327 44083608 34967622
38157 34967622 30782752 33456567 27195129 6926109 -9207162 -3613918 15144459 24468263
38149 24468263 21553884 27606276 53652114 79362984 78991496 56219066 36015627 29069893
38141 29069893 23945328 12638084 3187968 2112818 1843486 -5513764 -14185329 -13301297
38133 -13301297 -1209057 14871475 26262234 26615906 17376576 12348533 25671000 50464243
38125 50464243 60562221 39950858 1444348 -28717183 -35155301 -19057304 6894925
38118 6894925 23081932 16469578 -1540816 -3547449 18670215 41679090 43989863 35772339
38110 35772339 38552935 50089464 51878578 42396194 37428174 39366023 31294033 6925531
38102 6925531 -14507973 -13302864 5342594 21498166 25756844 23836162 22598976 22179971
38094 22179971 20604428 18285474 15726868 10613948 957791 -8713877 -8522320 4886173
38086 4886173 20156039 22302986 11761650 3777871 7928813 18715572 28663248 37343574
38078 37343574 41720585 32492589 10594393 -5682498 -2645266 11048586 20935037 27649509
38070 27649509 35601355 35138670 17895531 -486429 2192308 20437754 29124189 21733356
38062 21733356 14163797 12378345 5777303 -3996000 1819647 25559193 42366172 36353844
38054 36353844 23204723 21521312 24094610 15616326 -125465 -9985040 -13014597 -14223149
38046 -14223149 -10850359 -2382571 -251262 -9011238 -11462888 6989552 31412494 37401547
38038 37401547 28227338 27247000 39012986 43485392 28788780 6761922 -7826934 -15015935
38030 -15015935 -21506370 -28267540 -30079613 -19100813 8630712 41275145 53861157
38023 53861157 37136838 14706268 12753218 22112396 15017867 -8028104 -20183661
38016 -20183661 -16385436 -22518914 -46014273 -53658864 -21137758 24084266 38667542
38009 38667542 22794652 11907539 19876569 23525845 4149299 -24104811 -36298137
38002 -36298137 -28330159 -16466092 -16669587 -31798191 -50953312 -55739136 -34069212 6328996
37994 6328996 41898041 54661776 47627524 37432071 34755763 34760540 26361321 8619814
37986 8619814 -5701771 -5412475 4267811 9180032 6245793 5084515 8584044 5987783
37978 5987783 -7431550 -17173318 -8679039 9524115 16544868 7502214 -3809973 -7706158
37970 -7706158 -8524613 -11247272 -12614302 -9073743 -2314191 6428647 17669711 26843743
37962 26843743 26649324 19223196 15121281 16272513 11794642 -2689905 -13257988 -5808419
37954 -5808419 11831993 18043177 4866807 -12706756 -14907511 2368189 25807794
37947 25807794 38232203 32708107 16048397 188951 -8044092 -6917347 5618163
$$ [...]
##END NTUPLES=NMR SPECTRUM
##END=
