##TITLE=31Pdec_SR-37
 , 124 sc
 10.2.2021
##JCAMPDX= 6.0         $$ Bruker NMR JCAMP-DX V2.0
##DATA TYPE= NMR SPECTRUM
##DATA CLASS= NTUPLES
##ORIGIN= UXNMR, Bruker Analytische Messtechnik GmbH
##OWNER= root
$$ XWIN-NMR		Version 3.5
$$ Wed Feb 10 12:07:53 2021 Russian Standard Time (UT+4h)  she@DPX200
##.OBSERVE FREQUENCY= 81.013821
##.OBSERVE NUCLEUS= ^31P
##.ACQUISITION MODE= SIMULTANEOUS
##.ACQUISITION SCHEME= undefined
##.AVERAGES= 124
##.DIGITISER RES= 17
##SPECTROMETER/DATA SYSTEM= spect
##.PULSE SEQUENCE= zgpg30
##.SOLVENT NAME= CDCl3
##.SHIFT REFERENCE= (INTERNAL, CDCl3, 0, 222.927)
##AUDIT TRAIL= $$ (NUMBER, WHEN, WHO, WHERE, WHAT)
$$ ##TITLE= Audit trail, XWIN-NMR		Version 3.5
$$ ##JCAMPDX= 5.01
$$ ##ORIGIN= Bruker BioSpin GmbH
$$ ##OWNER= she
$$ F:/spectra/data/she/nmr/P31/1/pdata/1/auditp.txt
$$ ##AUDIT TRAIL=  $$ (NUMBER, WHEN, WHO, WHERE, WHAT)
(   1,<2021-02-10 12:06:20.71 +0400>,<she>,<DPX200>,
      <continue with go, POWCHK disabled, PULCHK disabled
       configuration hash MD5:
       00 E9 B6 7A A2 85 ED C7 34 08 36 98 17 FE 4E 26
       data hash MD5: 32K
       8D A5 E2 26 81 F8 B6 CE 26 E8 3B 98 F8 E0 9C A2>)
(   2,<2021-02-10 12:06:22.75 +0400>,<she>,<DPX200>,
      <Start of raw data processing
       efp BC_mod = 2 LB = 1 FT_mod = 6 PKNL = 1 PHC0 = -1732.822 PHC1 = 5.602172 SI = 64K 
       data hash MD5: 64K
       61 3D DA 9C 75 75 51 01 7E 62 D4 69 20 B4 13 5A>)
(   3,<2021-02-10 12:06:57.06 +0400>,<she>,<DPX200>,
      <pk PHC0 = -10.3879 PHC1 = 15.6 
       data hash MD5: 64K
       D0 B2 CC 4C AE 26 8E 06 16 0A 75 0F 7E BA 23 4F>)
$$ ##END=
$$ 
$$ hash MD5
$$ 75 4E 81 E7 91 52 62 BE 65 F0 E1 A3 EC 24 BB 21
##$RELAX= 
##$RELAX= 
##$RELAX= 
##$RELAX= 
##$RELAX= 
##$RELAX= 
##$RELAX= 
##$RELAX= 
$$ Bruker specific parameters
$$ --------------------------
##$DU= <F:/spectra>
##$EXPNO= 1
##$NAME= <P31>
##$PROCNO= 1
##$TYPE= <nmr>
##$USER= <she>
##$AMP= (0..31)
100 100 100 100 100 100 100 100 100 100 100 100 100 100 100 100 100 100 
100 100 100 100 100 100 100 100 100 100 100 100 100 100 
##$AQSEQ= 0
##$AQ_mod= 1
##$AUNM= <au_zg>
##$AUTOPOS= <>
##$BF1= 81.014009
##$BF2= 200.13
##$BF3= 200.13
##$BF4= 200.13
##$BF5= 200.13
##$BF6= 200.13
##$BF7= 200.13
##$BF8= 200.13
##$BYTORDA= 1
##$CFDGTYP= 0
##$CFRGTYP= 5
##$CHEMSTR= <none>
##$CNST= (0..31)
1 1 145 1 1 1 1 1 1 1 1 1 1 1 1 1 1 1 1 1 1 1 1 1 1 1 1 1 1 1 1 1 
##$CPDPRG= <waltz16>
##$CPDPRG1= <>
##$CPDPRG2= <waltz16>
##$CPDPRG3= <>
##$CPDPRG4= <mlev>
##$CPDPRG5= <mlev>
##$CPDPRG6= <mlev>
##$CPDPRG7= <mlev>
##$CPDPRG8= <mlev>
##$CPDPRGB= <>
##$CPDPRGT= <>
##$D= (0..31)
0 1 0 0 0 0 0 0 0 0 0 0.03 2e-05 3e-06 0 0 0 0 0 0 0 0 0 0 0 0 0 0 0 0 
0 0 
##$DATE= 1612944151
##$DBL= (0..7)
120 120 120 11 120 120 24 19 
##$DBP= (0..7)
150 150 150 150 150 150 150 150 
##$DBP07= 0
##$DBPNAM0= <>
##$DBPNAM1= <>
##$DBPNAM2= <>
##$DBPNAM3= <>
##$DBPNAM4= <>
##$DBPNAM5= <>
##$DBPNAM6= <>
##$DBPNAM7= <>
##$DBPOAL= (0..7)
0.5 0.5 0.5 0.5 0.5 0.5 0.5 0.5 
##$DBPOFFS= (0..7)
0 0 0 0 0 0 0 0 
$$ [...]
##$SUBNAM2= <"">
##$SUBNAM3= <"">
##$SUBNAM4= <"">
##$SUBNAM5= <"">
##$SUBNAM6= <"">
##$SUBNAM7= <"">
##$SUBNAM8= <"">
##$SUBNAM9= <"">
##$SW= 450.49535887171
##$SWIBOX= (0..15)
0 1 3 0 0 0 0 0 0 0 0 0 0 0 0 0 
##$SW_h= 36496.3503649635
##$TD= 32768
##$TD0= 1
##$TE= 0
##$TE2= 300
##$TE3= 300
##$TEG= 300
##$TL= (0..7)
0 120 53 12 22 120 120 120 
##$TP= (0..7)
150 150 150 150 150 150 150 150 
##$TP07= 0
##$TPNAME0= <>
##$TPNAME1= <>
##$TPNAME2= <>
##$TPNAME3= <>
##$TPNAME4= <>
##$TPNAME5= <>
##$TPNAME6= <>
##$TPNAME7= <>
##$TPOAL= (0..7)
0.5 0.5 0.5 0.5 0.5 0.5 0.5 0.5 
##$TPOFFS= (0..7)
0 0 0 0 0 0 0 0 
##$TUNHIN= 0
##$TUNHOUT= 0
##$TUNXOUT= 0
##$USERA1= <user>
##$USERA2= <user>
##$USERA3= <user>
##$USERA4= <user>
##$USERA5= <user>
##$V9= 5
##$VALIST= <valist>
##$VCLIST= <CCCCCCCCCCCCCCC>
##$VD= 0
##$VDLIST= <DDDDDDDDDDDDDDD>
##$VPLIST= <PPPPPPPPPPPPPPP>
##$VTLIST= <TTTTTTTTTTTTTTT>
##$WBST= 1024
##$WBSW= 4
##$XGAIN= (0..3)
0 0 0 0 
##$XL= 0
##$YL= 0
##$YMAX_a= 34209
##$YMIN_a= -50736
##$ZGOPTNS= <>
##$ZL1= 120
##$ZL2= 120
##$ZL3= 120
##$ZL4= 120
##$ABSF1= 0
##$ABSF2= 0
##$ABSG= 0
##$ABSL= 0
##$ALPHA= 0
##$AQORDER= 0
##$ASSFAC= 0
##$ASSFACI= 0
##$ASSFACX= 0
##$ASSWID= 0
##$AUNMP= <proc_1d>
##$AZFE= 0.1
##$AZFW= 0.5
##$BCFW= 0
##$BC_mod= 2
##$BYTORDP= 0
##$COROFFS= 0
##$CY= -3
##$DATMOD= 1
##$DC= 0
##$DFILT= <>
##$DTYPP= 0
##$F1P= 0
##$F2P= 0
##$FCOR= 1
##$FTSIZE= 65536
##$FT_mod= 6
##$GAMMA= 0
##$GB= 0
##$INTBC= 1
##$INTSCL= 5.30512e-09
##$ISEN= 30
##$LB= 1
##$LEV0= 0
##$LPBIN= 0
##$MAXI= 10000
##$MC2= 0
##$MEAN= 0
##$ME_mod= 0
##$MI= 50
##$NCOEF= 0
##$NC_proc= -7
##$NLEV= 6
##$NOISF1= 182.463
##$NOISF2= 159.3651
##$NSP= 0
##$NTH_PI= 0
##$NZP= 0
##$OFFSET= 222.9266
##$PC= 4
##$PHC0= -1743.21
##$PHC1= 21.20217
##$PH_mod= 1
##$PKNL= yes
##$PPARMOD= 0
##$PSCAL= 0
##$PSIGN= 0
##$REVERSE= no
##$SF= 81.014009
##$SI= 65536
##$SIGF1= 159.3651
##$SIGF2= -187.1042
##$SINO= 113.3802
##$SIOLD= 16384
##$SREGLST= <1H.CDCl3>
##$SSB= 0
##$STSI= 65536
##$STSR= 0
##$SW_p= 36496.3503649635
##$SYMM= 0
##$S_DEV= 0
##$TDeff= 32768
##$TDoff= 0
##$TI= <>
##$TILT= no
##$TM1= 0
##$TM2= 0
##$TOPLEV= 0
##$USERP1= <user>
##$USERP2= <user>
##$USERP3= <user>
##$USERP4= <user>
##$USERP5= <user>
##$WDW= 1
##$XDIM= 65536
##$YMAX_p= 406437663
##$YMIN_p= -76005716
$$ End of Bruker specific parameters
$$ ---------------------------------
##NTUPLES= NMR SPECTRUM
##VAR_NAME=  FREQUENCY,     SPECTRUM/REAL,   SPECTRUM/IMAG
##SYMBOL=    X,             R,               I
##VAR_TYPE=  INDEPENDENT,   DEPENDENT,       DEPENDENT
##VAR_FORM=  AFFN,          ASDF,            ASDF
##VAR_DIM=   65536,         65536,           65536
##UNITS=     HZ,            ARBITRARY UNITS, ARBITRARY UNITS
##FACTOR=    0.556898609368483, 1,           1
##FIRST=     18060.178002006, 0,             0
##LAST=      -18436.1723629575, 0,           0
##MIN=       -18436.1723629575, -76005716,   0
##MAX=       18060.178002006, 406437663,     0
$$ Real data points
##PAGE= N=1
##DATA TABLE= (X++(R..R)), XYDATA
$$ [...]
57387a0863435p190118L963095J3625057R940916l833349j2700662q314993L139856
57379a2233633J0904277J0005188K264098n515920n434082K010615N256966k454291
57371D803218r542725j704380J3275683J4193866q65511j0949033n086182K507555
57363F632491j531850q868671p412307k215403k586624l048745N020532J3976331
57355c4246J0743692o81303n505169j475928J195717o23070l98402K957369L248511
57346I427171P3489m96141J447457l87003n463448o198925j483969K134474L474139
57337B527244P588611J1966917O342884r048092j8467359j1234753L319282R258212
57329B252946L814474m014010p371814n790796q43626M371770M727758r72337
$$ y = [-10863435, -18053553, -14090458, -465401, 9475515, 5642166, -7058496, -15373489, -12233633, -1329356, 8675832, 10939930, 5424010, -10072, 2000543, 7257509, 4803218, -4739507, -6443887, 6831796, 21025662, 20160151, 9211118, 4124936, 6632491, 5100641, -3768030, -11180337, -13395740, -15982364, -19031109, -14010577, -34246, 10709446, 10028143, 4522974, 3047046, 4242763, 3619693, 3221291, 6178660, 9427171, 9500660, 9004519, 10451976, 10064973, 4601525, -1597400, -3081369, -946895, 2527244, 10115855, 22082772, 28425656, 19377564, 910205, -10324548, -7005266, 2252946, 6067420, 2053410, -5318404, -11109200, -11952826, -7581056, -2853298, -3825635]
57321c825635n801484k528143O064603J0340370O470591N69525m54615K298153
57313A3133365K459441k317910p019465n964338n75104K574920J052992n47282
57305B796619J104379K012263k031452o381816l130042N622083Q535283Q53602
57297I380919q052116p045684K386052R249609P084752n26747o912751r400688
57289c836654q764085n812334j194199L139653N039226M764798M446842M457910
57281B241157K740583p50543j830859K299187P431594P073063J567440k848534
57273A7923088l157700j321522K042691O929971O898796n155558k0765812j9754715
57265a6360761R77147J6679576O931637j3386064j4683528L491656J3101386J488186
$$ y = [-3825635, -9627119, -12155262, -6090659, 4249711, 10720302, 11289827, 10835212, 13133365, 15592806, 13274896, 6255431, 291093, -284011, 2290909, 3343901, 2796619, 3900998, 5913261, 3881809, -2500007, -5630049, -7966, 8527317, 9380919, 1328803, -5716881, -3330829, 5918780, 13003532, 12476785, 5564034, -3836654, -12600739, -18413073, -19607272, -16467619, -11428393, -6663595, -2216753, 2241157, 4981740, 4231197, 2400338, 4699525, 12131119, 19204182, 20771622, 17923088, 14765388, 13443866, 15486557, 22416528, 29315324, 24159766, 3393954, -16360761, -15383614, 1295962, 8227599, -5158465, -19841993, -16350337, -3248951, -1760765]
57257a760765j0933640m859768Q713477Q535023m095484j0906809n415158K096872
57249a8626252M048945L598561L749144K200793j154772k271787o32472n01308
57241i589148l064136m750419m135546l222618j633376K636375O521843M757681
57233a2479344J03783P81410N999999N434685k974834p197455l19457O719368
57225c931845K624252m779307j428166Q188050P113191n788265j2572772l926208
57217a4501070P427538P610322N96141k825069k127595k164646j807139P98460
57209f993058N42023m866830n699443N477444J7445522J4024694q62763q864835
57201A0202754n118909j967642m674633l363944N968233J1229608M015610n928061
$$ y = [-1760765, -12694405, -17554173, -8840696, -305673, -4401157, -15307966, -20723124, -18626252, -14577307, -10978746, -7229602, -5028809, -6183581, -8455368, -9087840, -9589148, -12653284, -17403703, -21539249, -24761867, -26395243, -23758868, -17237025, -12479344, -12375561, -11594151, -5594152, -159467, -3134301, -10331756, -10651213, -3931845, -1307593, -6086900, -7515066, 672984, 7786175, 1997910, -10574862, -14501070, -7073532, 536790, 1132931, -1692138, -3819733, -5984379, -7791518, -6993058, -6451035, -11317865, -17017308, -11539864, 5905658, 19930352, 19067589, 10202754, 5083845, 3116203, -1558430, -4922374, 1045859, 12275467, 16291077, 10363016]
57193A0363016o668565j755219q13364l309534l145946l96113K598031Q412574
57185E284880J6618756J6973577L208201j3081007j5748820o535493q42149m454106
57177A423839q182819m752997J899154N692340O282700N391453K892702j213300
57169I433072n546175q174125o195090J694260R173153O185739n574566j0371614
57161i375346j91526J1483382R519928J09518j951843Q79147l630976j0803231
57153c960947m522444J1495294J3879157l560350j7394574r151052Q634549J3943094
57145I362727N236720m667858j0024701j1708721o810844N152098J3604313R382089
57137I525823p1761j325188M624481N880194m89382n643363m497344j838954k229204
$$ y = [10363016, 3694451, 1939232, 1125868, -2183666, -5329612, -5725725, -3127694, 5284880, 21903636, 38877213, 42085414, 29004407, 13255587, 6720094, 5877945, 1423839, -6758980, -11511977, -9612823, -3920483, 2362217, 7753670, 10646372, 9433072, 3886897, -4287228, -10482318, -8788058, 385095, 6570834, 996268, -9375346, -9566872, 1916510, 11436438, 11545956, 9594113, 10473260, 6842284, -3960947, -8483391, 3011903, 16891060, 13330710, -4063864, -13214916, -4580367, 9362727, 14599447, 9931589, -93112, -11801833, -18612677, -13460579, 143734, 9525823, 9454062, 8128874, 12753355, 18633549, 18144167, 12500804, 8003460, 6164506, 3935302]
57128C935302l493855k070818J766283N261221N672822J900048l548330o228980
57120C193693n339606l879168k107120K605113P366751M206392o617404j3272437
57112a3843786q587567p2027L545803N099624Q636768P506795l621057j3809996
57104a5145443q977390N655994J2577723P948352L772701N512866N134615j284612
57096A5194806n519183k159762K105271Q06902k007910q39198J356550k24810
57088H712666l054849j984078K043190M122741K421634j543579o068610q817856
57080d168741o608300O18343P852977R655903N299408j332040m907590k379508
57072D030452L337025M692405j447395p893015n646848L351768Q572449M998544
$$ y = [3935302, 441447, -1629371, 136912, 5398133, 11070955, 12971003, 9422673, 3193693, -2145913, -6025081, -8132201, -5527088, 1839663, 6046055, -571349, -13843786, -22431353, -22503380, -18957577, -13857953, -5221185, 2285610, -1335447, -15145443, -24122833, -18466839, -5889116, 2059236, 5831937, 11344803, 16479418, 15194806, 9675623, 7515861, 9621132, 10428034, 8420124, 7580926, 8937476, 8712666, 5657817, 3673739, 5716929, 9839670, 12261304, 10717725, 4649115, -4168741, -10777041, -10158698, -2305721, 7350182, 12649590, 11317550, 6409960, 4030452, 7367477, 12059882, 10612487, 2719472, -2927376, 424392, 8996841, 13995385]
57064A3995385k321601p349377q730862o101203O11123O538401N158254j138584
57056F61536k304800M025491P315370k60695j0922525j1506110j250976Q278610
57048e964099Q128932M14683o371164n453259L261300J2138986J1451779r477
57040A7597681j1542988j1588815q88395R134227J0109854M580706k62704k415123
57032A4724443n363908j0053933j1175350m452916N004271P406797J883630j309714
57024c336680M247004J0662153P048806l738635q873049l828297K824542L162264
57016H168108o83257l063931l030162k683538k884750l357438l167369m56057
57008a1158394M092213M811460j666674q295625n247209M821177R019046K893220
$$ y = [13995385, 11673784, 4324407, -4406455, -10507658, -9896535, -3358134, 1800120, 661536, -1643264, 2382227, 9697597, 9436902, -1485623, -12991733, -14242709, -5964099, 2164833, 2579516, -3791648, -9244907, -5983607, 6155379, 17607158, 17597681, 6054693, -5534122, -6422517, 2711710, 12821564, 17402270, 17139566, 14724443, 9360535, -693398, -11868748, -16321664, -11317393, -3910596, -2026966, -3336680, 910324, 11572477, 18621283, 14882648, 6009599, 2181302, 5005844, 8168108, 7484851, 4420920, 1390758, -1292780, -4177530, -7534968, -10702337, -11158394, -7066181, -2254721, -3921395, -12217020, -17464229, -12643052, -3624006, -730786]
57000g30786l732652k550864K268085L827645L312845M443161N355322L300783
56992A5493539J092144K078148L819932K545008p87500l572163n795483p272245
56984G601380o029093k765356r91064l38918K829080O283550L311324l964486
56976E936417m770921K135601M369491k801311o523694J242170P168666j713443
56968E042976j3536172r089522N855565Q493199n183558j5386771r771716J420590
56960c2155409N438521L939129L483290L797329K599590J469549J569824J543424
56952h314753J628218K170337k33930n414047l276896J0964067K0785114P793671
56944B6101781j5545767j7726732M533318J8570241M702497j5112898j4064611
$$ y = [-730786, -4463438, -7014302, -4746217, -918572, 2394273, 6837434, 12192756, 15493539, 16585683, 18663831, 22483763, 25028771, 24241271, 20669108, 14873625, 7601380, 1572287, -1193069, -2184133, -2523051, 306029, 6589579, 9900903, 5936417, 1165496, 3301097, 7670588, 4869277, -1654417, -412247, 6756419, 5042976, -8493196, -17582718, -11727153, -3233954, -8417512, -23804283, -33575999, -32155409, -26716888, -22777759, -19294469, -15497140, -12897550, -11428001, -9858177, -8314753, -6686535, -4516198, -4750128, -10164175, -13441071, -2477004, 18308110, 26101781, 10556014, -7170718, -2637400, 15932841, 20635338, 5522440, -8542171]
56937h542171k55390L439365j562973J158570Q576599L577624j1412350j5505852
56929b0526578l814161N727116L434443J375366Q666349J4866943Q851904k401056
56921A6180326n697362m28913M724221M658198p48118r627938j5680529j1194231
56913a7814346J216904Q536524M862434o02849M65184K524751j686390o487229
56905h985017k853956N099174O437074J050362k068976o18298J76146L25023M751745
56896C313277J0223181O873133m460429j0030333l494427M165540K500946k220743
56888F870145P12628P075174M179716p557413j3613271o578237L724205N360363
56880A73310K16653j450020L402245P550682M367297l675073q403400n567341
$$ y = [-8542171, -8797561, -5358196, -6921169, -5762599, 2814000, 6391624, -5020726, -20526578, -24340739, -18613623, -15179180, -13803814, -5137465, 9729478, 18581382, 16180326, 10482964, 10054051, 14778272, 19436470, 18688352, 9060414, -6620115, -17814346, -16597442, -8060918, -3198484, -3801333, -3336149, -811398, -2497788, -8985017, -11838973, -6739799, -302725, 747637, -1321339, -1939637, -1763491, -1438468, 3313277, 13536458, 20409591, 15949162, 5918829, 2424402, 6589942, 9090888, 6870145, 7582773, 14657947, 18837663, 11280250, -2333021, -8911258, -5187053, 173310, 389963, -1060057, 2342188, 9892870, 14260167, 10585094, 2181694, -3385647]
56872c385647M42252K048807j851796m525735j460624K311522J72838m133537
56864a0381920j157114Q032477J0814549J991361o456638k325190Q182815R365722
56856A8066062j106602r963072q035378j124706J025754k288591m762325k356715
56848a0545573K841680M799971j053313j1110705j4032697l772246R949800J2383807
56840a0539276L604969k632019O1120L265616M40476k226837J433765N658702
56832i33484K814698l883938p199158p260088o769212l208998L847869O295041
56824a6297270L73882k681982O562145J6295878Q942402q974693j3328847J520820
56816g587665J4370039R267420l772740q165299l619438R29279L196598M785145
$$ y = [-3385647, -2943395, -894588, -2746384, -7272119, -8732743, -6421221, -6248383, -10381920, -11539034, -3506557, 7307992, 9299353, 2842715, 517525, 8700340, 18066062, 16959460, 6996388, -1038990, -2163696, -1137942, -3426533, -8188858, -10545573, -7703893, -2903922, -3957235, -15067940, -29100637, -32872883, -22923083, -10539276, -6934307, -9566326, -9505206, -6239590, -5799114, -8025951, -6592186, -933484, 1881214, -2002724, -9201882, -16461970, -23231182, -26440180, -22592311, -16297270, -15923388, -18605370, -12043225, 4252653, 13195055, 4220362, -9108485, -7587665, 6782374, 16049794, 12277054, 4111755, 492317, 1421596, 4618194, 9403339]
56808I403339L407179j241228k809094J033366K305411l637119p822358j632128
56800i92632P922091Q592009R70810n573344q029998q720821n778385K420544
56792i189726Q940164P421535M029927O714188Q779549m11275j3324819j2405976
56784E53567J006940O779513k284859r728987l445921N373705K763511n156304
56776d138835m592538K705094M659461r2822j874736K609049O063869L540484
56768H879026r78136k062777M39384L041697K202910k991645q133835o333644
56760e937020K054157O807484R02027q013930p122624L182331R420868L633752
56752D927045o456995q470739n83836P783690P297130j990559j1309788j1894576
$$ y = [9403339, 12810518, 11569290, 8760196, 9793562, 12098973, 8461854, 639496, -992632, 6929459, 15521468, 16492278, 10918934, 2888936, -5831885, -11610270, -9189726, -249562, 7171973, 11201900, 17916088, 26695637, 26284362, 12959543, 553567, 1560507, 8340020, 6055161, -3673826, -7119747, -1746042, 1017469, -4138835, -8731373, -6026279, -1366818, -1459640, -3334376, -725327, 5338542, 8879026, 7900890, 5838113, 6277497, 9319194, 11522104, 8530459, 396624, -5937020, -3882863, 2924621, 3826648, -4187282, -11309906, -8127575, 1293293, 4927045, -1529950, -10000689, -10584525, -2800835, 4496295, 2505736, -8804052, -20698628]
56744b0698628l552296N575980P851594L027561l963278q717060r013945m389239
56736c3879311K622190P249342P566125O722902P635131Q223499M947217j493333
56728I593762p009470q444023m909440J992775P196045N690525k65183k416880
56720A428111J728001M448910j71799o395705n826062l61038K216413R13698N68258
56711a451213J697750R74776n72252L87115J067888l515202r324151p119419K034364
56702a5820344O387718Q74830n698026m258351L206153R698370J1800815Q432635
56694A4623800k11694q252350p341554R89373M901432o02775n404089r3864Q997196
56685G605475R861706K671250l010708l881723m576758o122893l748050L171250
$$ y = [-20698628, -24250924, -18674944, -10823350, -7795789, -11759067, -20476127, -29490072, -33879311, -31257121, -24007779, -16441654, -9718752, -2083621, 6139878, 11087095, 9593762, 2584292, -5859731, -10769171, -8776396, -1580351, 4110174, 3844991, 1428111, 3156112, 7605022, 7433223, 1037518, -4788544, -5149582, -2933169, -2019471, -1451213, 246537, 1221313, 649061, 1036176, 2104064, -1411138, -10735289, -17854708, -15820344, -9432626, -8557796, -14255822, -18514173, -15308020, -5609650, 6191165, 14623800, 14412106, 6159756, -1181798, -192425, 4709007, 4106232, -1297857, -1391721, 7605475, 17467181, 20138431, 17127723, 13246000, 8669242, 2546349, -1201701, 1969549]
56677A969549P966126N729943p46884o000160p892497o933267l893075l82165
56669a0182430Q45136j472824m654309l599235L777686J1993234J1698554J501504
56661I907316o889265k219605R252758J0224251k839640j3343465q477310K621317
56653a763643M424023j633246k898148K217991L349292k721091p235371m869183
56645a1129376m75613K397063P171645J3766846J3950707M127511o199000o672919
56637A6936864m69032J349646m399664j0318575r529494l416977J649695J792085
56629f405452n89894J69860N366042Q750397M473415l628460o785827m379320
56621c029239l914532p078223o138791J569092O179278J81085q093232o326864
$$ y = [1969549, 9935675, 15665618, 14918734, 8918574, 1026077, -5907190, -9800265, -10182430, -9337294, -10810118, -15464427, -19063662, -15285976, -3292742, 8405812, 9907316, 3018051, 798446, 10051204, 20275455, 17435815, 4092350, -4384960, -1763643, 2660380, 1027134, -1871014, 346977, 3696269, 975178, -6260193, -11129376, -11604989, -9207926, -2036281, 11730565, 25681272, 29808783, 23609783, 16936864, 16467832, 17817478, 13417814, 3099239, -6430255, -9847232, -8197537, -6405452, -6995346, -6825486, -1459444, 7290953, 11764368, 8135908, 1350081, -3029239, -6943771, -14021994, -20160785, -18591693, -12412415, -12231330, -20324562, -26651426]
56613b6651426K717460N950698L98309l621514M81007P036632Q739332N825092
56605H75590J573668k560001m005641J24697N454364K620866p619619j1219805
56597a4755881p84345J0501198O575666o526488q357163N323676J5891995R460943
56589A7329601l790042o539191Q78140M703363J85753l671936o80565L171608
56581A1586731J78903p335068j0444472m707021N535302J1666352P990496l345622
56573A1125601j3465448j4528396o899545K439852P382841O776660L300049J390622
56565b477764L994678P849727N238529m779129j1259892n167565N523311N186887
56557D108782o526382j3767753p992382J115894L031743J387650L306792N398867
$$ y = [-26651426, -23933966, -17983268, -17584959, -21206473, -20725466, -13688834, -4949502, 875590, 2449258, -110743, -4116384, -3991687, 1462677, 4083543, -3536076, -14755881, -15540226, -5039028, 1536638, -4989850, -13347013, -8023337, 7868658, 17329601, 13539559, 7000368, 7878508, 12581871, 12767624, 9095688, 8415123, 11586731, 11765634, 4430566, -6013906, -10720927, -5185625, 6480727, 14471223, 11125601, -2339847, -16868243, -23767788, -21327936, -13945095, -7168435, -3868386, -2477764, 1516914, 9366641, 14605170, 9826041, -1433851, -6601416, -1078105, 4108782, -2417600, -16185353, -24177735, -23061841, -20030098, -18642448, -15335656, -9936789]
56549i936789J469164m466937m739826j370141j325532l443788j662957K622858
56541b2853948L086376N28743J163042N144624P670830Q803970J0704023Q418062
56533B2665722k776906j3251715q552535O692039J2015915J570647p050961j452064
56525I860142O463682J828974q655293r339726j311962K070042j642478k931142
56517c657761O35723J317628k242200j022766P644856J2353412L695079j0832920
56509G891051j5979878q060520J973030L228712k892651o477617k381172L518798
56501a9180247K939857k430203k631026N738132J3270909J0751008K232360j973084
56493H717706p74647j525281n837729o621115p08223N119000M730981J555549
$$ y = [-9936789, -8467625, -12934562, -17674388, -19044529, -20370061, -23813849, -25476806, -22853948, -19767572, -19238829, -18075787, -12931163, -5260333, 3543637, 14247660, 22665722, 19888816, 6637101, -1915434, 4776605, 16792520, 18363167, 11312206, 9860142, 16323824, 18152798, 9497505, 157779, -1154183, 915859, -726619, -3657761, -3022038, -1704410, -3946610, -4969376, 2675480, 15028892, 18723971, 7891051, -8088827, -16149347, -14176317, -10947605, -13840256, -20317873, -22699045, -19180247, -16240390, -18670593, -21301619, -15563487, -2292578, 8458430, 10690790, 8717706, 7943059, 6417778, 580049, -6041066, -6749289, -1630289, 3100692, 4656241]
56485D656241J535679L346448K254286m84173L12743L871740L190594m181465
56477A4502093j1245943j0455100l300513K618395L250172P68906j589126k630843
56469h081959j386649K923712P555527O930266o68689r699286j2947941q475527
56461b3850546J88731P524963Q375391J572273o137003n191540L928428R189697
56453d399606L784532l015406m48917N617799K074370q448232r796026K463924
56445a2167562J3793748J2128248K142162o758655j2355356j2888501l084920
56438a9190836J3201574J9357029P090453r299149j1968148l147814L261169L946883
56430C251161M364116K718992n743382j2706412m571798J3445968J9317802M283556
$$ y = [4656241, 6191920, 9538368, 11792654, 11308481, 11621224, 15492964, 18683558, 14502093, 3256150, -7198950, -10499463, -7881068, -4630896, -3861990, -5451116, -8081959, -9468608, -6544896, 1010631, 7940897, 7272208, -2427078, -15375019, -23850546, -23661815, -16136852, -7761461, -6189188, -12326191, -17517731, -13589303, -4399606, -615074, -3630480, -4079397, 1538402, 3612772, -4835460, -14631486, -12167562, 1626186, 13754434, 15896596, 9137941, -3217415, -16105916, -19190836, -5989262, 13367767, 20458220, 11159071, -809077, -3956891, -695722, 3251161, 7615277, 10334269, 4590887, -8115525, -12687323, 758645, 20076447, 24360003]
56422B4360003j4466968j6975639l944239R145645J1154616K406389r328869j4464798
56414a2113860q788135J783222Q069815Q804884Q580208P316175J928232l466597
56406A2113944j909067K149952k138505j1180401q466316P728152J6756929O174130
56398B1228818p561076m375965P732864O096017j0240788j9226819r121227O647461
56390h820715J1151927M497025l027069n880536m397647J55489M852867N275542
56382C806883J550817m66666K186497M696663K057654l158040n105080l102513
56374B466215j113981j216410j873729j264785J166196N087455P908687M793993
56366A5953641n348432j4414540j1356924L678480J6059074J2275273l213631
$$ y = [24360003, 9893035, -7082604, -11026843, -1881198, 9273418, 11679807, 2350938, -12113860, -20901995, -19118773, -11048958, -2244074, 6336134, 13652309, 15580541, 12113944, 10204877, 12354829, 10216324, -964077, -9430393, -1702241, 15054688, 21228818, 13667742, 9291777, 17024641, 23120658, 12879870, -6346949, -15468176, -8820715, 2331212, 6828237, 3801168, -2079368, -6477015, -6321526, -1468659, 3806883, 5357700, 4891034, 7077531, 11774194, 13831848, 10673808, 5568728, 2466215, 1352234, 135824, -1737905, -3002690, -1836494, 3250961, 11159648, 15953641, 10605209, -3809331, -15166255, -11487775, 4571299, 16846572, 13632941]
56359A3632941j2225012m378520J0761793J5686595N252524r071119j3518680
56352F140522o419449K123758K356579m691694r063649m315282L985654N843867
56344d039694J362010M25364O413843R592998K714042n767988m135681L706720
56336A0271614M735029j687583l762727J638996L787168k308462o616955j953629
56328D103451K647926k690146j0780245q085862L396446Q717608J888989o998047
56320g799880p055841N44574P038917O870582J873995j794224k32939L267208
56312B712392K108888l428459n101913O60625N484646R09946p939357r025311
56304a3618543m05349Q191199R230704M695685J25368j303640J248216N800806
$$ y = [13632941, 1407929, -2970591, 7791202, 23477797, 28730321, 19659202, 6140522, -278927, 1844831, 4201410, -490284, -9553933, -13869215, -9883561, -4039694, -2677684, -2252320, 4161523, 13754521, 16468563, 10700575, 6564894, 10271614, 15006643, 13319060, 9556333, 11195329, 14982497, 12674035, 6057080, 4103451, 6751377, 4061231, -6719014, -14804876, -11408430, -2690822, -801833, -7799880, -14855721, -14311147, -7272230, -401648, 1472347, -321877, -554816, 2712392, 4821280, 1392821, -3709092, -3048467, 2436179, 3346125, -4593232, -13618543, -14023892, -5832693, 3398011, 8093696, 8219064, 6915424, 8163640, 13964446]
56296A3964446P050267J942782m840095o279840k514022P38303J206255Q70485
56288A2138581k32532l292589n184695j962331K786596J749516m143282o802793
56280d943529m321534k854572l644838N9375Q781827J1366231J612318r403617
56272c348339p878656K647256P120066J170730m212412j07253Q700503J2435938
56264A6527833Q860246K704004k164362n116066o117907n215649l854214l477947
56256B145938k986586j37098M462457P267993O273409L101966k80705l877280
56248A5970094o729567n416575M11220M222017M58235n815532m956096K040251
56240A84047L981614k817740q047400l976823K145701J070702k417813J545180
$$ y = [13964446, 21014713, 22957495, 18117400, 11837560, 9323538, 10061841, 11268096, 12138581, 11906049, 8613460, 3428765, 1466434, 4253030, 6002546, 1859264, -4943529, -9265063, -12119635, -15764473, -15705098, -6923271, 4442960, 6055278, -3348339, -11226995, -8579739, -1459673, -288943, -4501355, -4608608, 4091895, 16527833, 25388079, 28092083, 25927721, 20811655, 14693748, 9478099, 5623885, 2145938, -840648, -977746, 3484711, 10752704, 17026113, 20128079, 19847374, 15970094, 9240527, 3823952, 4235172, 8457189, 8915424, 3099892, -1856204, 184047, 4165661, 1347921, -6699479, -10676302, -8530601, -7459899, -9877712, -8332532]
56232h332532R431933Q777780j571269r265046o615109R71315N634873N245467
56224D277412J63024p205579q937210L71466J1008048P228405q355924j4783477
56216a6233835k835596J0900092R643141P59821N20404P038372O089896l474363
56208A2407932q715245m611548L26n34727q25774L003083N740221L123613p23420
56199H864461j208555l70877j042926j239138M25274K69087l707251o045791j248368
56190e304084O754596R066852L873975j868694k376985M03835J158170j616568
56182A0091097m783380n081045k431110J095620M187410P016712R202965Q638606
56174B7936875L735896l658705q937355q570060l125890K815410L713671k094145
$$ y = [-8332532, 1099401, 9877181, 8305912, -959134, -7574243, -6602928, -968055, 4277412, 4440436, -2765143, -11702353, -11330887, -322839, 6905566, -1450358, -16233835, -19069431, -8169339, 1473802, 2233623, 2754027, 9792399, 15882295, 12407932, 3692687, -918861, -918535, -1453262, -2279036, 724047, 6464268, 9587881, 8864461, 7655906, 7285029, 6242103, 5002965, 5428239, 5697326, 1990075, -4055716, -5304084, 1450512, 10517364, 14391339, 12522645, 10145660, 10549495, 11707665, 10091097, 5307717, 226672, -2204438, -1108818, 3078592, 10095304, 19298269, 27936875, 31672771, 28014066, 19076711, 10506651, 7380761, 10196171, 13909842, 11815697]
56166A1815697r578607j1101085n028386J868790K999360N62944J722049P571300
56158H32062J0999988O521206k077509o568444m384622q98774j974958o399582
56150c950633p058752K64935J0482243J3635344O167448m608562q892066n058561
56142I81396M14640J714727q96773l463008k857203Q76172M348372L750144l9720
56133D828747j478044J384890K135266m634782j2264583r511025J440441O033019
56125a2066071j42121k659022Q907344K0838963J2949237r772514k1286665j0575970
56117a3806819M502149N318914k411712l091415K717571K953104k905187l334120
56109a0057515M360276R225606N125368l07379L5842J854951n74084l818650k476025
$$ y = [11815697, 2237090, -8863995, -13892381, -12023591, -9024231, -8461287, -6739238, 832062, 11832050, 18353256, 16275747, 9707303, 5322681, 4423907, 2448949, -3950633, -11009385, -10744450, -262207, 13373137, 19540585, 14932023, 6039957, 981396, 1396036, 3110763, 2213990, -1249018, -4106221, -3230049, 1118323, 4868467, 4828747, 3350703, 4735593, 6870859, 2236077, -10028506, -19539531, -18099090, -12066071, -12208192, -14867214, -5959870, 14879093, 27828330, 18055816, -3230849, -13806819, -9304670, -3985756, -6397468, -9488883, -6771312, -3818208, -6723395, -10057515, -5697239, 3528367, 8653735, 8346356, 8382198, 10237149, 9663065, 5844415, 3368390]
56100C368390R43933J099731j256024k383271k342265k547907j706073K83649
56092d539837o7648l242554m258428j752352j190763l223534L47569J0316761
56084g610786J2289773j457658j3990218n679647J4289520J9531302N134498p961993
56076A4544791o831673j419103j600324j965115K447809N032700J977481L21689
56068A2508255K127844j916893j2596217j4231652j21263J1763927N148572q123361
56060e440788p158875N338840J0349884L153479m291376n290953k917577K617232
56052c640134J2038111J6430668P260452o444125r235507l548408l145934o529534
56044C185589j54557J3205455J5085195L603639p68094J0619575J9414452J0879654
$$ y = [3368390, 4312323, 5412054, 4156030, 1772759, -569506, -3117413, -4823486, -4539837, -4607485, -7850039, -12108467, -13860819, -15051582, -18275116, -17927547, -7610786, 4678987, 3221329, -10768889, -16448536, -2159016, 17372286, 22506784, 14544791, 7713118, 6294015, 4693691, 2728576, 5176385, 10209085, 12186566, 12508255, 14636099, 12719206, 122989, -14108663, -14229926, -2465999, 2682573, -5440788, -12599663, -7260823, 3089061, 6242540, 1951164, -3339789, -6257366, -3640134, 8397977, 24828645, 32089097, 25644972, 16409465, 12861057, 9715123, 3185589, 3031032, 16236487, 31321682, 34925321, 34157227, 44776802, 64191254, 75070908]
56036G5070908k989051n925333l005422o070986j0289314n424452J849660k068047
56028D1147963j3181521j5324573n691927L248129M743424L489705J505380m790307
56020A5146273j2037128j0332708Q2560O419734K579684j944532J015261M371665
56012E300809j514765j1109191j0839961K10481Q977383P783284L762065N141535
56004G711640P827203L564045m680524o014688J212208O274769K296561m368668
55996A3822546n843958m493672n434875n465694L48476P069442O607794K163215
55988H773274L407956R419708R799070K525796l239159l811946o115664j2297260
55980H461775j3467709n369070K481691J591915k436651o38995M707130N528601
$$ y = [75070908, 72081857, 66156524, 63151102, 57080116, 46790802, 41366350, 43216010, 41147963, 27966442, 12641869, 6949942, 10198071, 14941495, 18431200, 19936580, 15146273, 3109145, -7223563, -7141003, -721269, 1858415, -86117, 929144, 5300809, 3786044, -7323147, -18163108, -17952627, -8975244, -1191960, 2570105, 7711640, 15538843, 19102888, 14422364, 8407676, 9619884, 15894653, 18191214, 13822546, 7978588, 3484916, -1949959, -7415653, -7067177, 2265, 6610059, 8773274, 12181230, 21600938, 31400008, 33925804, 30686645, 26874699, 20759035, 8461775, -5005934, -10375004, -7893313, -6301398, -8738049, -9377044, -4669914, 858687]
55972H58687P27775m933847q474889q257196k585487M987966O374609R09496j897713
55963a2290599K507883O237168L894169K920370Q733015J1626997K082356j0938636
55955A4772723j2265842l334694K725935K206149J036465m51248n960869j0228597
55947a1499978m744017N669588Q472976L765896K299238M935583K492803m140412
55939G251677l549659M198974N299760l064496n946494L373689J0089618K057691
55931A9710760r942142j0312815k815042o64872l276819k36107P790988R074809
55923I328760K37097q352980p912386j629142K491093J762882q19456j963392
55915f857524j460231j276117j803777m25343L713011N698104J059918n589748
$$ y = [858687, 1586462, -3347385, -11822274, -20079470, -22664957, -17676991, -11302382, -10392886, -12290599, -9782716, -3545548, 348621, 3268991, 12002006, 23629003, 25711359, 14772723, 2506881, -827813, 1898122, 4104271, 5140736, 4689488, -1271381, -11499978, -16243995, -10574407, -2101431, 1664465, 3963703, 8899286, 11392089, 7251677, 3702018, 7900992, 13200752, 10136256, 4189762, 7563451, 17653069, 19710760, 9768618, -544197, -3359239, -4024111, -7300930, -7537037, 253951, 9328760, 9565857, 1212877, -6699509, -8328651, -5837558, -4074676, -4894132, -6857524, -8317755, -9593872, -11397649, -11822992, -8109981, -2411877, -1351959, -6941707]
55907f941707n527653J161616O292940O889810P311316P530878K020908o848305
55899A1889803q295002j392101O64813p495170j2085823k258396J0226177Q422666
55891c23033l407471p638987j97085P459259Q690759P224169M631190j543733
55883A4895068p319049n010365K247337K604417n446354r121208n00742J1499150
55875C848254J3474772L683518q429646j2800127o532065L557289N902303k793638
55867h9340j1388771q236315K118125O243228K772408K777094R566121J2874044
55859A6636594O493405k058020m964727m973716o320121o003386j801097P87107
55851b203961k005799m031922R25307P871172P626462N5331p076281q347605m191968
$$ y = [-6941707, -12469360, -11307744, -5014804, 1875006, 9186322, 16717200, 18738108, 11889803, 3594801, 2202700, 2867513, -4627657, -16713480, -18971876, -8745699, -323033, -3730504, -11369491, -11566576, -4107317, 4583442, 11807611, 16438801, 14895068, 7576019, 2565654, 4812991, 7417408, 1971054, -7150154, -7650896, 3848254, 17323026, 21006544, 12576898, -223229, -6755294, -3198005, 2704298, -89340, -11478111, -19714426, -17596301, -11353073, -8580665, -5803571, 3762550, 16636594, 23129999, 21071979, 16107252, 11133536, 4813415, -1189971, -2991068, -2203961, -4209760, -8241682, -7316375, 554797, 8181259, 8236590, 1160309, -7187296, -11379264]
55842a1379264J390277K542832l143070p850566p09653J3976177J7176751J730286
55834A3733770j3719780r711099N695346R693988j344821r490412m429350M110565
55826e461793N628841L137882K046301m29406o035043p374732O57816R488986
55818A658852P380411l599195j0610409p317941J82850L605321J523172k190342
55810i367281l557373r17422M330428Q182544P162562J822543l452101m104365
55802I9535O78738O386008O285807j366998r925205j1612453p319118m034433
55794b0808119l010835J749126J0993713J5231899Q408242j113195k168276K296261
55786A1578816J017101o159441p861723q32413L868168o52596n223783l35171
$$ y = [-11379264, -9988987, -7446155, -10589225, -18439791, -19149444, -5173267, 12003484, 13733770, 13990, -9697109, -4001763, 5692225, 4347404, -5143008, -9572358, -5461793, 167048, 3304930, 5351231, 4921825, -1113218, -8487950, -7830134, 1658852, 9039263, 5440068, -5170341, -12488282, -12305432, -8700111, -7176939, -9367281, -12924654, -13842076, -9511648, -1329104, 5833458, 7656001, 4203900, 99535, 778273, 7164281, 13450088, 12083090, 2157885, -9454568, -16773686, -20808119, -23818954, -22069828, -11076115, 4155784, 12564026, 11450831, 9282555, 11578816, 12595917, 6436476, -1425247, -2257660, 1610508, 957912, -4265871, -4601042]
55778d601042O696268L057937p660219r970623r71596N409978J405572k674265
55770i307990K853054R780495N922411k975098j116071J1089515J5559518L930334
55762C5736168q955995o921855L877413M913366p405956j7339798j2221527J748335
55754f569849R672482O386559p74054l789638k617343j995659l768418n036396
55746h492316k903756J699381N869903Q020407P155087J405159q350587j4804152
55738a0400874j0379158J872302R709378O512008j383970n326285n214943m344474
55730a8956016q14418P118871J2527313P599369k493106m857582K128718O440690
55722H693839R74832o631538p080867k401803L13743J88929O24464K031035L044062
$$ y = [-4601042, 2095226, 5153163, -2507056, -12477679, -13449275, -8039297, -6633725, -9307990, -6454936, 3325559, 9247970, 6272872, 5156801, 16246316, 31805834, 35736168, 26780173, 19858318, 23735731, 28649097, 21243141, 3903343, -8318184, -6569849, 3102633, 9489192, 8715138, 4925500, 2308157, 312498, -3455920, -8492316, -11396072, -9696691, -3826788, 4193619, 11348706, 12753865, 4403278, -10400874, -20780032, -18907730, -9198352, -2686344, -4070314, -9396599, -14611542, -18956016, -19770434, -12651563, -124250, 7475119, 4982013, 124431, 2253149, 8693839, 9668671, 3037133, -4043734, -6445537, -6131794, -5942865, -5318401, -3287366, -243304]
55713b43304M232270M968626J541078n977484j0200967o175487J69262K82706
55705a1403300m528602o219439k036980L877057P656418P345155J149079q009903
55697a2170515j0288020p47103J0204275R171426k35303k700488M561515P879036
55689E674823k7908q536345o873105J86087L302536L643946O105231O930666P28811
55680A1134742o514836m471185M815130R300377M529193k214168m918683n358110
55672F302460n535654l498218O16375K424549L09208j802880j141453K95504Q36123
55663a193986J855041L230762K109390j159211j667822K361287N951996M820023
55655A6307480J345275n00953j193592k468576k807196r58581J3949k491695m958757
$$ y = [-243304, 3988966, 8957592, 10498670, 4521186, -5679781, -11855268, -11686006, -11403300, -15931902, -22151341, -24188321, -20311264, -12654846, -5309691, -4160612, -12170515, -22458535, -23205638, -13001363, -3829937, -4065240, -6765728, -2204213, 5674823, 5646915, -2889430, -9762535, -9576448, -6273912, -2629966, 3475265, 10405931, 11134742, 4619906, 148721, 4963851, 14264228, 18793421, 16579253, 11660570, 6302460, 766806, -2731412, -2115037, 309512, 618720, -1184160, -2325613, -2030109, -1193986, 661055, 3891817, 6001207, 4841996, 3174174, 5535461, 11487457, 16307480, 17652755, 17151802, 15958210, 13489634, 10682438, 9723857, 9737806, 7246111, 2287354]
55646B287354k472955L006330M648189J83865n268019n562195M72265Q423145
55638E717979J1162607M636051o123530r990002k960817N360414M240621l198962
55630H844361n646719j286342J029172j850321k234063L381860O272558J02947
55622H613453o647073l408780M828101M959209l606738q969351n840365j248222
55614a1319766p432K257172P485132Q710931J782191o375412q409393o636350
55606a2512927n038084m43101Q733206J3597867O659751m069254o012144j519226
55598f03912j507308m103855J909169J2915897J0611311q043077k0759304j0807779
55590b0388858Q325742J3207651K696118n944476m132356J518948M605122N047644
$$ y = [2287354, -185601, 2820729, 7468918, 7652783, 2384764, -3177431, -2705166, 5717979, 16880586, 21516637, 15393107, 5403105, 2442288, 7802702, 12043323, 8844361, 3197642, 1911300, 2940472, 1090151, -1143912, 2237948, 8510506, 8613453, 1966380, -1442400, 3385701, 8344910, 4738172, -4231179, -10071544, -11319766, -11327198, -9070026, -1584894, 7126037, 8908228, 2532816, -5876577, -12512927, -17551011, -17994112, -9260906, 4336961, 10996712, 6927458, 915314, -603912, -2111220, -6215075, -4305906, 8609991, 19221302, 11178225, -9581079, -20388858, -12063116, 1144535, 3840653, -2103823, -6236179, -4717231, -112109, 4935535]
55582D935535K233796l981068o927235o00841Q037210P071633j513211m739572
55574D516247K50665L051073p37937k934577N04611J741288l160713m945020L082131
55565A367768J1826431R475290j211774q830142r150991n429678L99614O923711
55557E370229Q814158K691807o032184r666451p855418m679914j527597Q77665
55549a2007705j18828k613150J319232J2113871J6319505M868054j0322595j1799290
55541b240906k136698J943617l199511m829697K620105Q990145P033426L193523
55533A1374004L684732M062480J09072l163398j518737O8749k717190m687980
55525G211732q22786L634701J897321k668163k925561k69617j215098n997059
$$ y = [4935535, 7169331, 3188263, -3738972, -4339813, 3697397, 10769030, 9255819, 4516247, 4766912, 7817985, 7080048, 4145471, 4650082, 6391370, 3230657, -1714363, 1367768, 13194199, 22669489, 21457715, 12627573, 3476582, -1953096, -1553482, 5370229, 14184387, 16876194, 10844010, 1177559, -6677859, -11357773, -12885370, -12007705, -12126533, -14739683, -13420451, -1306580, 15012925, 19880979, 9558384, -2240906, -4377604, -2433987, -5633498, -10463195, -7843090, 1147055, 8180481, 11374004, 15058736, 19121216, 19230288, 16066890, 14548153, 14616902, 11899712, 7211732, 6388946, 10023647, 11920968, 9252805, 6327244, 6057627, 4842529, -1154530]
55517a154530r180209q297445m465285J938499Q942658J0356231L469231m033314
55509b424164l137562L312931M988066n62253n784622n213341q86981M004280
55501e703646Q130820Q192671J065469q211372r131404j0611P761513M457719
55493F551159m948167q055933j214088P540692R707810M947931j505224n602701
55485G421479o823497o102794m021303j253299R00445J857995K784338M398641
55477h37995M608754J433839k127807q67471L874556L872363m298492j2628790
55469f971043j1726524l123058M194351N787903L989554J485829k72708R85600
55461e650096M678229M508069k571178p873505j868358R020132R533646p34785
$$ y = [-1154530, -10334739, -18632184, -23097469, -21158970, -12216312, -1860081, 1609150, -2424164, -5561726, -2248795, 2739271, 2177018, -3607604, -8820945, -9707926, -5703646, 2427174, 10619845, 11685314, 3473942, -5657462, -5668073, 2093440, 6551159, 1602992, -6452941, -7667029, -126337, 9581473, 14529404, 13024180, 7421479, 597982, -5504812, -9526115, -10779414, -9878969, -8020974, -5236636, -837995, 3770759, 5204598, 3076791, 2209320, 6083876, 9956239, 5657747, -6971043, -18697567, -21820625, -17626274, -11838371, -7848817, -6362988, -6635696, -5650096, -971867, 3536202, 965024, -6908481, -8776839, 243293, 9776939, 9042154]
55453I042154n780326J438210P836465J860075q352469r408451k891909J938100
55445d318151N257358J1241289J3623804M139879r116796r923960P51566N772082
55437A7427071o06450m980976N26839M701864j850020q741663k919512Q355601
55429A1912754Q135330l535407j0168174l850808N275155N965362J3377m222435
55421I525154l437481k25314J898674J076237j576378k067291J615076N253479
55413A2062156L319530k987572p784660r097342r037740o805537K79197Q455847
55405a1596121R131792J278719n760690n186484j071332Q3597j118837p95286
55397a5034642J249717L639749O692804Q391270L423420p425005j3269286o590222
$$ y = [9042154, 3261828, 4700038, 12536503, 14396578, 6044109, -3364342, -6256251, -4318151, 939207, 12180496, 25804300, 29944179, 20827383, 10903423, 11654989, 17427071, 16820621, 11839645, 12366484, 17068348, 15218328, 6476665, 3557153, 11912754, 20048084, 16512677, 6344503, 2493695, 7768850, 13734212, 13747589, 9525154, 6087673, 5862359, 7761033, 8837270, 7260892, 5193601, 6808677, 12062156, 15381686, 12394114, 4609454, -4487888, -13525628, -20331165, -20051968, -11596121, -2464329, -1185610, -6946300, -12132784, -13204116, -13120519, -14239356, -15034642, -13784925, -10145176, -3452372, 4938898, 8362318, 937313, -12331973, -18922195]
55389a8922195M565052P144900J741319j80752M293065N159196l351346j2215404
55381a1766165r815769K410996J2468991J1907774K862801o181684q073702k457370
55373h644128L854876L574341k661345o886499l956549K002421L534331k79873
55365i462425l113989K0856O211587Q138938L483383j628665p88832L132472J817694
55356G811019n080966p824137j328403N932567M659929p77409m69064L935728
55348F859264K861721l234944l902856K655173N621323N159m995383k256507J849102
55339E462052N13945j399779J382523K552724l930225r710686m444984N115301
55331d459129M717875l739254n848079K51423J674636m489171m041249R411055
$$ y = [-18922195, -14357143, -7212243, -5470924, -5651676, -1358611, 3800585, 449239, -11766165, -21581934, -19170938, -6701947, 5205827, 8068628, 1886944, -6186758, -8644128, -4789252, -1214911, -3876256, -10762755, -14719304, -12716883, -9182552, -9462425, -12576414, -12555558, -6343971, 1794967, 5278350, 3649685, 2860853, 5993325, 7811019, 2730053, -5094084, -6422487, -489920, 4170009, 3392600, 2923536, 6859264, 9720985, 6486041, 2583185, 5238358, 10859681, 10864840, 5869457, 3612950, 5462052, 5975997, 4576218, 5958741, 8511465, 4581240, -5129446, -9574430, -4459129, 258746, -3480508, -9328587, -9077164, -7402528, -11891699, -15932948, -6521893]
55323f521893J9980673J1986062o018030j3575951o144066L378745N562241L027189
55315A1674970L39244j760130j700233K066941M228871k571363j3531634j3512336
55307a4765670J540727J5360306J2106889j742579p306377J7812O869891L904254
55299A5985253k403082l665233k679043m735828n751414K34228Q172263Q375402
55291A3532546K078544j367953o79345k672304o187018j328583J1040793J4698554
55283B9115234K092637j0614057n657572R341658J2331731j153562j3901443j3522089
55275H032537o580045l581993m320916l901066k121644k59124K954519O256538
55267c521194M497192j906801l853661L301344J0380755O288814n786334j2693121
$$ y = [-6521893, 13458780, 25444842, 19426812, 5850861, -293205, 3085540, 8647781, 11674970, 12014214, 10254084, 8553851, 10620792, 14849663, 12278300, -1253334, -14765670, -13224943, 2135363, 14242252, 12499673, 5193296, 5211108, 12080999, 15985253, 13582171, 9916938, 7237895, 2502067, -3249347, -3015119, 5157144, 13532546, 15611090, 14243137, 13563792, 10891488, 4704470, 3375887, 14416680, 29115234, 31207871, 20593814, 14936242, 24277900, 36609631, 35456069, 21554626, 8032537, 1452492, -2129501, -6450417, -10351483, -12473127, -12732251, -9777732, -3521194, 975998, -930803, -4784464, -1483120, 8897635, 15186449, 9400115, -3293006]
55259c293006q796016q22002L433099L500329K763725K675190K280538L19243
55251B061100k948273m626643j720459L309753L288537l489185q116974k411701
55243a4653845Q050367J0554898L267037l135197k594621j627702n843968q831556
55235a4814587k761442P339786J0265098N447367K204730L656695K717648m220831
55227I834464j0184211q517275k268055K591248N700970P945465N720156k647347
55219H175415j0328905j0117044m645415n81035K074292N455322M648961m119949
55211i438358j0757744k892109J1476929J1548004l767231j1281345R43643J3938339
55203b29872P402502q737673j1245931N12483P271554J905862l139637M06588
$$ y = [-3293006, -12089022, -12911024, -9477925, -5977596, -3213871, -538681, 1741857, 2061100, -887173, -5513816, -7234275, -3924522, -635985, -4125170, -12242144, -14653845, -6603478, 3951420, 7218457, 4083260, 1488639, -139063, -5983031, -14814587, -17576029, -10236243, 28855, 5476222, 7680952, 11337647, 14055295, 9834464, -349747, -8867022, -11135077, -8543829, -2842859, 5102606, 10822762, 8175415, -2153490, -12270534, -16915949, -17496984, -15422692, -9967370, -5318409, -9438358, -20196102, -23088211, -11611282, -63278, -3830509, -15111854, -14168211, -229872, 7172630, -1565043, -12810974, -12298491, -5026937, -3121075, -6260712, -5854124]
55195e854124N158356L695528r0865m65205R49086K36800k763500o193816p554276
55186a2882016l545123M940340J0185776P474864K998463K970490J754966o654712
55178G243048j3028586n691157P271393Q749893J263001J623423Q881276M615123
55170B0927414j1845123j7425554l169303J0183550P329157J532142N752937P730163
55162B1015383l855510j2915195k762227J1104643N521388r298171o753206R351066
55154A1408171J1033361n503155j4183256l924619N371670k77459p418080l401169
55146f894536J031575n810648j3136419n541405J0803764J7699459J0647510Q9071
55138H888371n588774n682397j638519L533027M551919J79607m057975m436388
$$ y = [-5854124, -695768, 2999760, 2908895, 2443690, 3392776, 3629576, 866076, -5327740, -12882016, -16427139, -11486799, -1301023, 6173841, 9172304, 12142794, 13897760, 7243048, -5785538, -11476695, -4205302, 4544591, 5807592, 7431015, 16312291, 20927414, 9082291, -8343263, -11512566, -1329016, 6000141, 7532283, 13285220, 21015383, 17159873, 4244678, 1482451, 12587094, 18108482, 8810311, 2057105, 11408171, 22441532, 16938377, 2755121, -1169498, 4202172, 3924713, -3493367, -6894536, -5862961, -11673609, -24810028, -30351433, -19547669, -1848210, 8799300, 8888371, 3299597, -2382800, -4021319, -488292, 4063627, 4243234, 185259, -4251129]
55130d251129m255305o151755o691164l517961j15666J590925N118024J0462067
55122g811964J0161236J298207o762034m846399K452477M294603l20456k858483
55114d392813Q43320M910326K241479n535331q853788j257502J0662620J2606285
55106A1224596J132939r380669n846662M379123N618214p62232k28286Q010305
55098A4147328Q563443k594011r324914k200855N546020Q11956p993041o817500
55090A38426J212209M497817K714966K129222J251970l153694m770791J711505
55082E731630P105117J325925p219143l833719P030345Q101362k196144p639695
55074H405678r87957O048621L241486l883395n758687k348200N33455k29342l511600
$$ y = [-4251129, -8506434, -14658189, -21349353, -24867314, -24982980, -23392055, -18274031, -7811964, 2349272, 3647479, -3114555, -7960954, -5508477, -1213874, -1534330, -4392813, -3549493, 1360833, 3602312, -1933019, -10786807, -12044309, -1381689, 11224596, 12357535, 2976866, -2869796, 1509327, 7127541, 6365309, 6137023, 14147328, 22710771, 20116760, 10791846, 8590991, 14137011, 14948967, 6955926, 138426, 1350635, 5848452, 8563418, 10692640, 11944610, 8790916, 4020125, 5731630, 12836747, 14162672, 6943529, 3109810, 10140155, 18241517, 16045373, 8405678, 7417721, 13466342, 16707828, 12824433, 7065746, 4717546, 5251001, 5021659, 1510059]
55065A510059m687659J295754J0748344R926731o393983k0908561j3639217Q184481
55057a3964051J8522362R610316j95942J610791M301793l026279j1845819j1004989
55049e991818o108047o370669n838377M587198J6425112J4008813J22553p356764
55041C478001k630002J960648j428305m295703J553532R370544Q574163J057705
55033A7640583l616711l456231m186341o833066n494816J469295O955102N486328
55025G964143J025787p05483j620989n746495q960571l962368O192520J0163547
55017D350091M991429P000J100352K281662j581270m857143k328409k1629m134989
55008a92906p888328k103383P874758R673200L360148j031109j709126n124175
$$ y = [1510059, -3177600, -1881846, 8866498, 18793229, 12399246, -8509315, -22148532, -13964051, 4558311, 14168627, 13972685, 15583476, 19885269, 16858990, 5013171, -5991818, -12099865, -18470534, -24308911, -19721713, -3296601, 10712212, 10834765, 3478001, 847999, 2808647, 1380342, -2915361, -1361829, 8008715, 16582878, 17640583, 14023872, 10567641, 6381300, -451766, -5946582, -4477287, 2477815, 7964143, 8989930, 8284447, 6663458, 916963, -8043608, -12005976, -5813456, 4350091, 9341520, 9348520, 10448872, 12730534, 11149264, 6292121, 3963712, 3942083, -192906, -8081234, -10184617, -2309859, 7363341, 10723489, 9692380, 7983254, 2859079]
55000B859079r571849n762147M813356Q494681M96157p389598n457704R12173
54992a0605852L120452K051396J930435J966436J062156J985671N069590O094226
54984A2674510M661929N411675P539172M228221l652148o116050j428142o49053
54976B2670114p674900j0089624l08780R133836N127926m186975l104709O553671
54968A8120559J1301932R173874R034621J1584123R012758J853343l31840M641727
54960G4391097R056444J0316091J5461544K8796447M5902134O0840211O8776243
54953C13540211O1356245L1541207j3899858n5653843p8033436p8021326o0779991
54946A20049209l5988749j6987749j1859011j4175832j1819029m079448L54716
$$ y = [2859079, -6712770, -12474917, -7661561, 833120, 1329277, -6060321, -11518025, -10605852, -7485400, -5434004, -3503569, -1537133, -474977, 1510694, 6580284, 12674510, 17336439, 22748114, 30287286, 34515507, 30863359, 24747309, 23319167, 22670114, 14995214, 4905590, 4596810, 13730646, 18858572, 14671597, 11566888, 18120559, 29422491, 38596365, 47630986, 59215109, 68227867, 70081210, 69749370, 74391097, 83447541, 93763632, 109225176, 138021623, 183923757, 244763968, 313540211, 374896456, 406437663, 392537805, 336883962, 258850526, 180829200, 120049209, 84060460, 67072711, 55213700, 41037868, 29218839, 25139391, 25494107]
54939B5494107J38365K020787N054763K42516j0584257j2088609Q23034J1426692
54931B2527398M248193j1886490j6550420n675867O115946P067799L57329m536668
54923A667220l243977J763487M821408J593090o283453j1221947p256643K950116
54915a5210699J0659036R742540J902022n149051m432646L107191Q697034O083683
54907A5399110o896j010850J975050L13678o532226q124542K29975P985701M013360
54898A4242360o719133j0191026k722470N783152O475017J269696l104604m588088
54890D44904o073307q709348q445397j189041R329393J3207480O967104j32387
54882E399401J250827N808504J650585q995145j0762956P38588J0261545N470401
$$ y = [25494107, 25632472, 27653259, 32708022, 32950538, 22366281, 10277672, 11100706, 22527398, 26775591, 14889101, -1661319, -7337186, -1221240, 5846559, 6203888, 1667220, -1576757, 186730, 5008138, 6601228, 317775, -10904172, -18160815, -15210699, -4551663, 5190877, 7092899, 1943848, -2488798, 618393, 9315427, 15399110, 15392214, 14381364, 16356414, 16670092, 10137866, 2013324, 2243299, 10229000, 14242360, 7523227, -2667799, -5390269, 392883, 6867900, 8137596, 5032992, 444904, -5628403, -14337751, -22783148, -23972189, -14642796, -1435316, 5531788, 5399401, 6650228, 12458732, 14109317, 5114172, -5648784, -4910196, 5351349, 10821750]
54874A0821750m965789o436874n76282J012486k747027l337234L02821J095963
54866d830186j103687J162435P182784O165191m549261j2351533p356776L004577
54858a2676456N808358R72821j711218J416259M761056M291773K633701K865472
54850H361766L904349L506599J138379l123902q236206r915005l759449P052300
54842a071169J1996963N338281n338346q008144j733798K935959q80002p629926
54834d390182q227948j729957O014023J0421398R879863L804234m870328q763160
54826B137943m409224J328371L88625m126272l554864J281039J991457j570938
54818f533863q13412M706354M511615l858337q068761j372784M577495j069256
$$ y = [10821750, 5855961, -580913, -1157195, -144709, -2891736, -6228970, -5926149, -4830186, -5933873, -4771438, 2411346, 8576537, 4027276, -8324257, -15681033, -12676456, -6868098, -5895277, -7606495, -6190236, -1429180, 2862593, 5496294, 8361766, 12266115, 15772714, 16911093, 13787191, 5550985, -4364020, -8123469, -1071169, 10925794, 16264075, 10925729, 2917585, 1183787, 4119746, 3239744, -4390182, -12618130, -14348087, -8334064, 2087334, 11967197, 15771431, 10901103, 2137943, -2271281, -942910, -554285, -4680557, -8235421, -6954382, -4962925, -6533863, -7347275, -2640921, 1870694, -1987643, -10056404, -11429188, -6851693, -7920949]
54810g920949r259554n995260M039509O221618J007058R71938O676325N894454
54802A635139k711411n439322K502641P791257J603719n413076j674322N846929
54794D141554L944129n100254q266897k361478L306766K216749k157275l644496
54786g921202j54222N758538P735373L22987j1751201j4324601j330015J3807845
54778g856498J3888580P50956q678858o168471P01553M523472P135164R574023
54770A3869921O271236l859965j0873900o666201K939152O899203L739975j29099
54762A2190322j534473j705286o57099J148344o90562p417905j0199091j053381
54754i919131J1614236J1230892k558151j1467247m734102N839490N092861l190629
$$ y = [-7920949, -17180503, -23175763, -19136254, -12914636, -11907578, -10935640, -4259315, 1635139, -1076272, -6515594, -4012953, 3778304, 5382023, -31053, -1705375, 4141554, 8085683, 2985429, -5281468, -7642946, -4336180, -2119431, -4276706, -7921202, -8075424, -2316886, 5418487, 5741474, -6009727, -20334328, -21664343, -7856498, 6032082, 6783038, -1895820, -8064291, -7362738, -2839266, 4295898, 13869921, 20141157, 16281192, 5407292, -1258909, 1680243, 8579446, 12319421, 12190322, 10655849, 8950563, 8293464, 9441808, 8751246, 1333341, -8865750, -9919131, 1695105, 12925997, 10367846, -1099401, -5833503, 5987, 5098848, 1908219]
54746A908219n025710J165675M631286Q49493l735969m643786m427517l865069
54738a3143378J88418N761664N654784q0042k237587K217843L735591l939940
54730a842647j1519710p412156M414939J0640743P444012J934848j928150o802795
54722e070916j1607052r287681J717212J2217552J2884287M896145l310544n956065
54714c517062l919681j662491k082213l156362j88430O950289J1465705Q231380
54706A2121135J642705p46151L08149j836011p241173q381912k660932K872067
54698c922123K375843p94111q81140J975285M437681N256014L756014j380499
54690A0822964p552557q238128k578583Q58311l854947r615971n877850N380606
$$ y = [1908219, -3117491, -1951816, 2679470, 3528963, -207006, -4850792, -9278309, -13143378, -12954960, -7193296, -1538512, -1618554, -3856141, -1638298, 2097293, -1842647, -13362357, -20774513, -16359574, -5718831, 1725181, 3660029, 1731879, -5070916, -16677968, -25965649, -24248437, -12030885, 853402, 5749547, 2439003, -3517062, -7436743, -9099234, -11181447, -14337809, -14526239, -7575950, 3889755, 12121135, 13763840, 13017689, 13325838, 11489827, 4248654, -4133258, -6794190, -3922123, -1546280, -2340391, -3221531, -1246246, 3191435, 8447449, 12203463, 10822964, 3270407, -4967721, -7546304, -6687993, -10542940, -20158911, -26036761, -20656155]
54682b0656155J2367129J0183182N245432K883965L92106m441447o590487j522975
54674b139250O047820P796342L067109j507292j727538P23996L380034N099939
54666B0741160L074540m991552j3610337j2115122N67796J0733276O957317l512678
54658G844400n702359j22671j008566j0950965j3514146J497976J9408376J9691892
54650A7143937M204416p871307p640481l735853l717717l714897L86983M042753
54642i02166J868406m106685q637917r320120n557880K044960Q781836Q698021
54634g131545K628539k519152l670980m022459m812114k813105K126440N204755
54626a5009621M608284L516622K603084o44302l657266l29677O602958O244817
$$ y = [-20656155, -8289026, 1894156, 7139588, 10023553, 10415659, 5974212, -616275, -2139250, 3908570, 11704912, 14772021, 13264729, 11537191, 12261187, 15641221, 20741160, 23815700, 18824148, 5213811, -6901311, -6333515, 4399761, 11357078, 7844400, 2142041, 2019370, 1010804, -9940161, -23454307, -21956331, -2547955, 17143937, 21348353, 13477046, 5836565, 2100712, -1617005, -5331902, -4944919, -902166, 966240, -3140445, -11778362, -21098482, -26656362, -24611402, -15829566, -7131545, -4503006, -7022158, -10693138, -14715597, -19527711, -22340816, -20214376, -15009621, -10401337, -6884715, -4281631, -4925933, -8583199, -8912876, -2309918, 3934899]
54618C934899l284298j0094509o174902K040712O538993Q384620Q584790K404148
54610A2334453p827941q731111L243068J1049414J731909j1647196j0132786J441541
54602h538649N420138J758721L819674J0334455P422057l257128m564945N404430
54594A7798753Q110400l606758j2628036o521871K625834P44170m893815j072604
54586E56073P512805P371241r05189n532955k890015N23448J017302J67279k106104
54577E713885o119079p324130k234920L796389L577689o22473j485745J147124
54569c551260J605426p81531j421989L74486N51671j669326k395018j99285J416191
54560f070635k26358k970719k671198J717978N787389L013628o518078j2212833
$$ y = [3934899, 650601, -9443908, -15618810, -13578098, -7039105, 1345515, 9930305, 12334453, 4506512, -4224599, -981531, 10067883, 11799792, 152596, -9980190, -8538649, -3118511, -1359790, 2459884, 12794339, 20216396, 16959268, 12394323, 17798753, 25909153, 22302395, 9674359, 3152488, 5778322, 6522492, 1628677, 556073, 8068878, 15440119, 14534930, 9001975, 6111960, 6635408, 7652710, 7819989, 5713885, -405194, -7729324, -9964244, -6167855, -2590166, -3212639, -4698384, -3551260, -1945834, -2727365, -4149354, -3774868, -3223197, -4892523, -7287541, -7486826, -6070635, -6296993, -9267712, -11938910, -10220932, -4433543, -1419915, -7937993, -20150826]
54552b0150826m447055J0300198J5153696N612742m384128l425674K641588M204217
54544E504758L285092M547975K696158o861009j4069736p342159N811238Q484537
54536B056854O55073k231724M521351Q586847K511561n454677o957766m653542
54528i66023k128373L213884J0371356J0479166K65392j0549206j2662656q716155
54520a0692615m902702q91868M438537O653779L629583J585567M763231O821502
54512A1405014J502970n481405n305379o30185m95856m962173n859857n96336
54504a0423207M864481N926372L691531L3631l973978n312665j825468K687081
54496d332222K545139j488434m024494l688689l379573l440334j763702M11748
$$ y = [-20150826, -24597881, -14297683, 856013, 6468755, 2084627, -1341047, 1300541, 5504758, 8789850, 13337825, 16033983, 9172974, -4896762, -12238921, -6427683, 2056854, 2711927, 480203, 5001554, 13588401, 16099962, 10645285, 3687519, -966023, -3094396, 119488, 10490844, 20970010, 21235402, 10686196, -1976460, -10692615, -15595317, -16487185, -12048648, -5394869, -1765286, -179719, 4583512, 11405014, 12907984, 7426579, 2121200, 1491015, 995159, -3967014, -9826871, -10423207, -5558726, 367646, 4059177, 4092808, 118830, -5193835, -7019303, -4332222, -1787083, -3275517, -7300011, -10988700, -14368273, -17808607, -19572309, -19160561]
54488a9160561L88703R66598P221651J5867926J6349829M940224r231756j5021575
54480B321039j0608112j993521M382799N376931K174560n90060j72273L41501
54472A232864k169593l725124N03628N180859R48484q536002q810188K870121
54464a2504951J0993282M653232o097312o760230K00331L060050P80692Q41568
54456d833338L485888L035337P22534J412737R33676p384602j5787893r833592
54448b8249253O201536J0937170k422918j4822323r782952M489092J2094612J2105707
54440i449329J0814874O131307m026707r786503l454109M191686K53183o587829
54432a1913427N9071J3626974J2592525l116663j0392505q65948O345803j343345
$$ y = [-19160561, -18771858, -17805260, -10583609, 5284317, 21634146, 26574370, 17342614, 2321039, -8287073, -10280594, -5897795, -520864, 1653696, 1063636, 891363, 1232864, -936729, -4661853, -4158225, 1022634, 1971118, -6564884, -15375072, -12504951, -1511669, 3141563, -2955749, -9715979, -9515648, -6455598, -5674906, -4833338, -1347450, 1687887, 2410421, 3823158, 4756834, -2627768, -18415661, -28249253, -22047717, -11110547, -13533465, -28355788, -38138740, -33649648, -21555036, -9449329, 1365545, 7496852, 3470145, -6316358, -9770467, -5578781, -5325598, -11913427, -11854356, 1772618, 14365143, 11248480, 855975, -9973, 6335830, 4992485]
54424D992485r142295k868389N238958r27240j0943627m465528J2931535J6415492
54416A1231391N62138j2844434p785344N652643R807574K522366n763272o941099
54408c558037p27381P046026P726020j563895j1003338q185245L699056Q247478
54400A680684p52023r811621n547458O339514J0437291K626594p519456j0908370
54392a3454845o967162J58215O001171O911964K367002l468443n609216l259184
54384a7320498Q02655L978130N110626M303827L336361L785928L516784j307384
54376F206429r160343j2847047q869574j918826L510769R808535J8517665K1766388
54368B7013996J1024862p718290j7864917j2885801m022178l382017p471229m808602
$$ y = [4992485, -4149810, -7018199, -1779241, -2706481, -13650108, -18115636, -5184101, 11231391, 11793529, -1050905, -8836249, -3183606, 6623968, 9146334, 3383062, -3558037, -4285418, 2760608, 10486628, 8922733, -2080605, -10265850, -6566794, 1680684, 928661, -8882960, -14430418, -8090904, 2346387, 4972981, -2546475, -13454845, -20422007, -20263792, -14262621, -7350657, -4983655, -8452098, -14061314, -17320498, -16517843, -12539713, -7429087, -3125260, 211101, 3997029, 7513813, 6206429, -2953914, -15800961, -24670535, -26589361, -23078592, -13270057, 5247608, 27013996, 38038858, 30320568, 12455651, -430150, -4452328, -7834345, -15305574, -20114176]
54360b0114176N310273J1506031P521023J202638J843366N681915K097598q858361
54352F190307j4901996r059391K94705K202830j362499q50832M774534P477216
54344e235126M390972K011414M127858N372646J497149k310291k28291L509006
54336A3135337J254625m620376m528098K848263P461496K959468l532445k602769
54328A2375501K430925O15268q285080j1032004m92133J1192647Q225460n436875
54320I593709j0960867k452294M606973j817875j1062836o854654O792559J2175954
54312B0669M760365l222625m336214l975545m811425j65555J0844111J6285050
54304A5398831Q392840m084614r515620q830680p883768m824983L073392Q476640
$$ y = [-20114176, -14803903, -3297872, 4223151, 5425789, 7269155, 12951070, 15048668, 6190307, -8711689, -17771080, -17476375, -15273545, -16636044, -17486876, -12712342, -5235126, -844154, 1167260, 5295118, 10667764, 12164913, 9854622, 9626331, 13135337, 14389962, 9769586, 5241488, 8089751, 15551247, 18510715, 14978270, 12375501, 14806426, 15421694, 7136614, -3895390, -4387523, 6805124, 15030584, 9593709, -1367158, -3819452, 787521, -1030354, -12093190, -18947844, -12155285, 20669, 4781034, 1558409, -2777805, -6753350, -11564775, -11730330, -886219, 15398831, 23791671, 19707057, 10191437, 1360757, -6523011, -11347994, -8274602, 202038]
54296B02038L516590m955886l319586P805365J3086415L532763j2015780j8237866
54288a0385947r506992N938412J3561819N960009p524731r112190M828142J6737127
54280A0495649J1154679l274817p114589J222513N763398p63272p695498n338538
54272D449525J870608N601605M729367J230726m350119q489589n593274J965763
54264A414612M258037j142618m537882M7638M974350K379393k454484p93228M318967
54255H464785L601347k556318m764709P13406P450027Q709897M182932l254115
54247B2547252j0643917j3807477r141937Q54241P656992N330120k330718n625264
54239e160708j95893P404176P654928O80018l858484j003268K041686j945689
$$ y = [202038, 3718628, -1237258, -4556844, 3248521, 16334936, 19867699, 7851919, -10385947, -19892939, -13954527, -392708, 5567301, -1957430, -11069620, -6241478, 10495649, 21650328, 18375511, 11260922, 12483435, 18246833, 17483561, 9788063, 4449525, 6320133, 11921738, 16651105, 17881831, 13531712, 5042123, -551151, 1414612, 5672649, 4530031, -7851, 39787, 5014137, 7393530, 4939046, 4145818, 8464785, 12066132, 9509814, 4745105, 5458511, 12908538, 21618435, 25801367, 22547252, 11903335, -1904142, -11046079, -10191838, -2534846, 2795274, 464556, -5160708, -5356601, 2047575, 9702503, 10382521, 6524037, 5520769, 7562455, 5616766]
54231E616766p489936n313915J408463K638006L95515N849726J6331125J3931349
54223C3367099n538577k0101215j1524728O514987P588918r357685k0478570j2213761
54215c1743532L069483Q672397M408534k17205j437876j613193j323356J271237
54207a8913511N866552R412331R181227N010253l61659l472760m038399m902571
54199b218537o450033m859316Q14156M706425K660356j53927K795741Q136548
54191E431413P825667K219735j722612k787279n329581q121059n270340J167028
54183f587028J831293m197050o490459k51326N863604M813422K211479M081691
54175A275626M622811k759051j0841289q006430K905231Q279403L877265j318434
$$ y = [5616766, -1873170, -7187085, -5778622, -3140616, -2745101, 3104625, 19435750, 33367099, 27828522, 7727307, -3797421, 2717566, 10306484, 948799, -19529771, -31743532, -28674049, -20001652, -15593118, -15810323, -17248199, -18861392, -20184748, -18913511, -13046959, -3634628, 5546599, 10556852, 10195193, 6722433, 2684034, -2218537, -8668570, -13527886, -12713730, -8007305, -5346949, -5500876, -2705135, 5431413, 13257080, 15476815, 13754203, 10966924, 5637343, -2483716, -7754056, -6587028, -4755735, -8952785, -15443244, -15694570, -9830966, -5017544, -2806065, 1275626, 5898437, 3139386, -7701903, -15708333, -12803102, -4523699, -646434, -1964868]
54167a964868j219736l26326k720565m150781j24119O010079Q532031P109640
54159A1145355M074514q82453p556060j0796155o063222K171751M188602k127335
54151e845003p694988l970653N585834R555001K677592p747450j0457120k949125
54143b0845912O386369Q405811L434412j28162L147082Q466923O694823l293774
54135A2267572j1511779q175396M052393J2621149R438890j039659q687332q565026
54127D00812k779671M393270Q951733P289058o39944q446604q440356q13259N953275
54118E868314N152853q68887m848814k913331K933884P768735P275094R96562
54110B1364410n827561o302112j40429M816920K256584m307653o868096l864524
$$ y = [-1964868, -3184604, -3510930, -6231495, -10382276, -10506395, -4496316, 4035715, 11145355, 15219869, 14337416, 6781356, -4014799, -10078021, -7906270, -3717668, -5845003, -13539991, -17510644, -11924810, -2369809, 307783, -7439667, -17896787, -20845912, -14459543, -6053732, -2619320, -2747482, 399600, 8866523, 15561346, 12267572, 755793, -7419603, -3367210, 9253939, 18692829, 17653170, 8965838, 400812, -2378859, 2014411, 10966144, 18255202, 17615258, 9168654, 728298, -84961, 5868314, 11021167, 10152280, 5303466, 2390135, 5324019, 13092754, 20367848, 21364410, 15536849, 9234737, 9094308, 13911228, 16167812, 11860159, 4992063, 1127539]
54102A127539j91885K109969N692791R327927N737502o910915j7583571j4193644
54094a4884287L761R757183O929468j527301n651724m388930k034873q4842J825827
54085a0055718K074456r1289j920550k367853m757104q359049m315848J0287766
54077a9505189K0646934J0786649j0641136j7698265k410733J4302581J3297487
54070H778328K075029k225443M0478k869845j0453996j0780758j422628O853421
54062a0005414P062044K937013j320524n343411n941020R52699R692001Q733591
54054F766979j851677q474840l504413M719139N991601J389642l137383n790208
54046c891160n474383L31845P503816N534250o121137j2457798l541772R265359
$$ y = [1127539, 935654, 3045623, 8738414, 18066341, 23803843, 16892928, -690643, -14884287, -14880526, -5123343, 1806125, 278824, -5372900, -9761830, -11796703, -11881545, -10055718, -7981262, -8072551, -9993101, -12360954, -17118058, -25477107, -29792955, -19505189, 1141745, 11928394, 1287258, -16411007, -18821740, -4519159, 8778328, 10853357, 8627914, 8668392, 5798547, -4655449, -15436207, -16858835, -10005414, -2943370, -6357, -1326881, -6670292, -12611312, -11658613, -1966612, 6766979, 4915302, -3559538, -7063951, -2344812, 3646789, 5036431, 1899048, -3891160, -9365543, -9033698, -1529882, 4004368, -2116769, -14574567, -18116339, -8850980]
54038h850980R815130J257496j016904N305866P559831j20232q920548j1111951
54030f082292r710782q335070l671188N758149J2868072J1070067L416107l163857
54022B149206o771923q028749m758890L388676R237537N487950l526710n577959
54014h400862K792857J0479644O420476n182358j0200064l134273O470324P722024
54006F967768K214158q16869J146593K043976j277227m276379l682851l174505
53998h55336n312773n000117J784437Q204641M770957n368449r184684j896167
53990a2857491O935990P612999K224507j661129k222397k553853l242657k108638
53982g872669N07174J429579n58991l082021l431142j245166J878324L808884
$$ y = [-8850980, 964150, 2221646, 1204742, 6510608, 14070439, 13950207, 5029659, -6082292, -15793074, -24128144, -27799332, -22041183, -9173111, 1896956, 5313063, 2149206, -4622717, -12651466, -17410356, -14021680, -4784143, 703807, -2822903, -8400862, -5608005, 4871639, 11292115, 6109757, -4090307, -7224580, -754256, 6967768, 9181926, 8365057, 9511650, 11555626, 10278399, 6002020, 2319169, -855336, -6168109, -11168226, -9383789, -1179148, 3591809, -1776640, -10961324, -12857491, -5921501, 1691498, 3916005, 2254876, 32479, -2521374, -5764031, -7872669, -7365495, -5935916, -6494907, -9576928, -13008070, -14253236, -12374912, -8566028]
53974h566028L363031J638178J114347K301422K573331N0414k635838j118259
53966a279402M299931P785862M806441k032754n967891m112317k69798N18353
53958C748425k004639m083171l109869r2690K183970J743132j070520l159054
53950e844416j156783L680465N225629M22122m841769k905706M076330O300613
53942D956485J58111p311354r268616o650726k101294N085875J2615191J2025341
53934I509013J73959j1814009j0311075L184274J4448406J4287500O145941k003186
53926B3620823n402185l192514J360529K020040k994991o828046l590103J573906
53918F567459M58662m161541l413039J731699K492529r35967M37993O177656M695497
$$ y = [-8566028, -5202997, -3564819, -2450472, -149050, 2424281, 2474695, -161143, -1279402, 3020529, 10806391, 15612832, 13580078, 7612187, 3499870, 3230072, 3748425, 1743786, -2339385, -5449254, -5541944, -3357974, -1614842, -2685362, -5844416, -7001199, -3320734, 1904895, 2327017, -2514752, -5420458, -1344128, 4956485, 5114596, -2196758, -11465374, -18116100, -20217394, -15131519, -2516328, 9509013, 9682972, -2131037, -12442112, -9257838, 5190568, 19478068, 25624009, 23620823, 18218638, 15026124, 16386653, 18406693, 15411702, 8583656, 4993553, 6567459, 7026121, 2864580, -548459, 1183240, 3675769, 2739802, 3177795, 9355451, 14050948]
53909A4050948n606955j0127429j372016P221524K654476o194328l582603P210660
53901D254277J0234919K577379l828911l059781r48367m46195K505768O519459
53893A7808548L484149o049472j0086922l631700K665494l89592o220102m454874
53885f874471K400537N093293L215771K852339L340167j029766p659957o454186
53877e116273M155312J2683519J0202729J876710k447300k150350l482379p904776
53869G817192j0371558p641034j983787L070288N578594M148413p39002m304057
53861d424951j919697L271524L332642k025651l048059N577719J4361745J0439380
53853B5564652m489889j5729885j3730832l218242N577633P510833L297628l397552
$$ y = [14050948, 8443993, -1683436, -3055452, 4166072, 6820548, 626220, -2956383, 4254277, 14489196, 17066575, 13237664, 10177883, 9229516, 8783321, 11289089, 17808548, 21292697, 15243225, 5156303, 1524603, 4190097, 3800505, -2419597, -6874471, -4473934, 619359, 3835130, 6687469, 10027636, 8997870, 1337913, -5116273, -960961, 11722558, 21925287, 23801997, 21354697, 19204347, 15721968, 7817192, -2554366, -10195400, -12179187, -9108899, -3530305, 618108, -120894, -4424951, -6344648, -3073124, 259518, -1766133, -4814192, 763527, 15125272, 25564652, 21074763, 5344878, -8385954, -11604196, -6026563, 1484270, 4781898, 1384346]
53845A384346p157279m397196J806527M630565K456733J45270N27868O29523j814870
53836a788513m351801m953636n054402m588512n94907N652147P157825J594067
53828f927732l710650k696116M85094k7020j494319J068407M752368M392704K652614
53819a504650M159601M972578j68023m899866M8949Q139662L915346j0718184
53811C945413j5317008j399926J3383286J1554768J105042M87382R547949J2389959
53803C5696865L771757m518023l818547l59131k673283q377847j0056671p359139
53795B305981n980798p458629o539331K16961P342325O036554l121919p850009
53787a5048865Q32101J4204317J4423428j799146j7092567j5381016j724576O945833
$$ y = [1384346, -5772933, -10170129, -8363602, -3733037, -1276304, -1131034, -603166, 26357, -1788513, -6140314, -11093950, -16148352, -20736864, -21331771, -15679624, -8521799, -6927732, -10638382, -13334498, -12849404, -12876424, -14370743, -13302336, -8549968, -4157264, -1504650, 2654951, 7627529, 7459506, 2559640, 2608589, 10748251, 14663597, 3945413, -11371595, -12771521, 611765, 12166533, 13271575, 13758957, 23306906, 35696865, 39468622, 34950599, 31132052, 30772921, 28099638, 19721791, 9665120, 2305981, -3674817, -11133446, -17672777, -17455816, -10113491, -4076937, -7198856, -15048865, -14216764, -12447, 14410981, 12611835, -4480732, -19861748, -21586324, -14640491]
53779a4640491M197463k256377m893693l381475J590443J0401905J8212587J5943165
53771B5173527K236356j1717983j4132581n807377K224081J742632m736982p838453
53763a2856780j830708Q334400J1779640M879129l614545m150343J129992L663281
53755G334066K127078J646888J855301k487496q467191n717545N677365J0741061
53747A2709527O50848j2759510j3349198k652048N475592M969593K52874n527200
53739a0229522j1558806j2031133j862324J0921736J2236269K535964k979795
53732a2967611K581077Q281865M314427k649534j945865L569255L427932l473833
53724A137713q579672p165874l014744r16267j512253k855319k014658L421218
$$ y = [-14640491, -10443028, -12699405, -17593098, -20974573, -19384130, -8982225, 9230362, 25173527, 27409883, 15691900, 1559319, -4248058, -2023977, -281345, -5018327, -12856780, -14687488, -6353088, 5426552, 10305681, 6691136, 2540793, 3670785, 7334066, 9461144, 11108032, 12963333, 10475837, 2008646, -3708899, 1968466, 12709527, 13360375, 600865, -12748333, -15400381, -9924789, -4955196, -4702322, -10229522, -21788328, -33819461, -35681785, -24760049, -12523780, -9987816, -12967611, -10386534, -2104669, 2209758, -439776, -2385641, 1183614, 4611546, 1137713, -7441959, -14607833, -17622577, -18538844, -20051097, -22906416, -24921074, -21499856]
53716b1499856J1180602J3970495P691085k459834q270587q012632n382644k461950
53708a5245321R00652L292920K622801p52617n104504q548693o891842L512682
53700b6213922J6481398J7723494L488683j0469017q916346J259308K797633m614125
53692h462894n773390L357742R192024L696651l742071m216178l047827o338489
53684a5334432p745659n22574Q022886O962461q57226m124143l64995L565547
53676a0398135M334442M521664M580638K271823j068106j821287n77000p11771
53668A132268k224579k661979j468392J594871P820450J3764107J0483767l712712
53660B4727801j6420553j6462483r277777n805330l485293O293199J7106617J3100840
$$ y = [-21499856, -10319254, 3651241, 11342326, 8882492, 611905, -7400727, -12783371, -15245321, -14344669, -11051749, -8428948, -9181565, -14286069, -22834762, -29726604, -26213922, -9732524, 7990970, 11479653, 1010636, -7905710, -6646402, -3848769, -8462894, -14236284, -10878542, -1686518, 2010133, -1731938, -5948116, -8995943, -15334432, -23080091, -23602665, -15579779, -8617318, -9474544, -13598687, -13963682, -10398135, -6063693, -1542029, 3038609, 5310432, 4242326, 2421039, 1844039, 1132268, -1092311, -3754290, -5222682, -3627811, 4192639, 17956746, 28440513, 24727801, 8307248, -8155235, -17433012, -23238342, -26723635, -20430436, -3323819, 9777021]
53652I777021m209268j4075600o236028M944050L839681m394620n766826R18235
53644a5203355O625601P803261P571485O464751K306295l756419q556496j0947541
53636g692418r329842q98284J0605578J3477164K590346j0962087j3923912q515646
53628b4649101n354456m458411K728533J4529563J7666403P630202k938873k371122
53620B782738M102221M569604j239792l641725Q43097M902064K408187k877004
53612A1849390l912590p72870M57019k486165m469914p68498N504101P490305
53604A2890778L974349j13685j880097l382319n262926l878910J634224N124075
53596I105489J729457l832342l803036P29190J918886k071485m399937q44846
$$ y = [9777021, 5567753, -8507847, -14743875, -9799825, -5960144, -10354764, -16121590, -15203355, -8577754, -774493, 6796992, 13261743, 15568038, 11811619, 3255123, -7692418, -17022260, -17920544, -7314966, 6162198, 8752544, -2209543, -16133455, -24649101, -30003557, -34461968, -31733435, -17203872, 462531, 8092733, 5153860, 2782738, 6884959, 11454563, 10214771, 6573046, 7416143, 12318207, 14726394, 11849390, 7936800, 7163930, 7620949, 5134784, 664870, -103628, 5400473, 12890778, 16865127, 16751442, 14871345, 11489026, 6226100, 2347190, 3981414, 9105489, 10834946, 7002604, 3199568, 3928758, 5847644, 3776159, -623778, -1468624]
53588a468624L506293K249910k892331m837766m38879O456979R619979N839310
53580A8034871k736684r832150j0044886m186879J497182K330396j49613j386071
53572f473834L45299K746253K722999m98386m384173m605166O50764P043970P226202
53563D773928n08364q866595r381090j976530O059673R084281P326531L096221
53555I608055k080156n406045l134702L673322P685115M108736j894367j981445
53547A0578513L135674M791455o22659p033758q678573p301501n876926k438613
53539a3446388M055384P855714L972321k667556l664298L50092K238888J120133
53531a85710K750094P436113P870165J261102n530717o502019m319778l818217
$$ y = [-1468624, 2037669, 4287579, 1395248, -3442518, -3881397, 2575582, 12195561, 18034871, 15298187, 5466037, -4578849, -8765728, -7268546, -4938150, -5087763, -6473834, -6128535, -3382282, -659283, -1157669, -5541842, -10147008, -9496244, -2452274, 4773928, 4265564, -4601031, -13982121, -15958651, -9898978, -814697, 6511834, 9608055, 7527899, 2121854, -1012848, 2660474, 10345589, 14454325, 12559958, 10578513, 13714187, 18505642, 17882983, 10849225, 2170652, -5130849, -11007775, -13446388, -9391004, -1535290, 2437031, -230525, -3894823, -3544731, -1305843, -185710, 2564384, 10000497, 17870662, 19131764, 13601047, 7099028, 2779250, -1038967]
53523a038967m720121m682420l111312J261322R338324J4997881Q593614p498306
53515A3140015j6369274p697859P038065J0361240K503399k693938k58455J706605
53507G729798j225730l215297p48155P86539j807076k287271M030441R696846
53499A2960095M179861j0211102j9375213j3966689O92629J1985362J3201598
53492e33459P584239J886184p98663j520519j711926j674886j849792k482731
53484a101553k100588M73225K615033N04896m325143o018101l087941k50856L39794
53475a2951234K591094P547821Q785113K907741k466322M98339O586628M567827
53467A8067007n920255j3954501j1970665k486722P915926J3097293Q106311n213970
$$ y = [-1038967, -5759088, -10441508, -13552820, -12291498, -2953174, 12044707, 20638321, 13140015, -3229259, -10927118, -3889053, 6472187, 8975586, 6281648, 6023193, 7729798, 6504068, 3288771, 2540616, 3327155, 1520079, -767192, 3263249, 12960095, 17139956, 6928854, -12446359, -26413048, -25720419, -13735057, -533459, 7050780, 8936964, 8138301, 6617782, 4905856, 3230970, 1381178, -1101553, -3202141, -2728916, -113883, 391013, -3934130, -9952231, -13040172, -13291028, -12951234, -10360140, -2812319, 5972794, 8880535, 6414213, 6912552, 13499180, 18067007, 12146752, -1807749, -13778414, -16265136, -8349210, 4748083, 12854394, 7640424]
53459G640424j4612112r135017N622944J3220383P435463j897344m684535j837870
53451A752336J611878M644197P116491O401252J873998k804890m996541n713927
53443I884794n577021l933210k744886m642792o487864k476953N409096Q348839
53435b219997L596308j987360l053678j631053j6726K642000M187551J2565o957868
53426e428258p390554o14684K676130k113719n413312j34283N678297K774868
53418i965515l287624k083721L783616L758471k708794n937315j660047L863856
53410a4237073M115066k71028m304178l628834J975037O845419M843138j065738
53402e728191j307368M866387N965089l465117j1805348p454117K749998M846532
$$ y = [7640424, -6971688, -16106705, -10483761, 2736622, 10172085, 8274741, 3590206, 1752336, 3364214, 8008411, 15124902, 21526154, 23400152, 20595262, 15598721, 9884794, 4307773, 374563, -2370323, -7013115, -13500979, -15977932, -10568836, -2219997, 1376311, -611049, -3664727, -5295780, -5312506, -2670506, 1517045, 1529610, -5428258, -12818812, -13433496, -10757366, -12871085, -18284397, -18418680, -12740383, -9965515, -13253139, -15336860, -11553244, -7794773, -10503567, -16440882, -18100929, -14237073, -10122007, -10393035, -14697213, -18326047, -16351010, -9505591, -4662453, -5728191, -7035559, -2169172, 3795917, 330800, -11474548, -18928665, -16178667, -11332135]
53394a1332135k09100m33296O142439R677747O133067K288511K405021K351759
53386A7024013r10079m248968n006713m680260m722001n059717o074260o243777
53378a9921762j248425P581896R794324Q70147n938259K928881J7153655J3986781
53370B5207238o987138k0417989j1133253N142164O518435m594709q635940K523724
53362a2377468J6803639J8574236N648969r644769j2893795k602613P459546M840277
53354A5808022n326576q457815k186981J988227j379773m119067l81221L446045
53346f09139J169382k683204k294829l63080r07409j510009N1777O02649l5698
53337f579560M360802J3367231J4542978J815199j1013127q326365L799252O943316
$$ y = [-11332135, -11541235, -11974531, -5832092, 3845655, 9978722, 12267233, 14672254, 17024013, 16113934, 11864966, 6858253, 2177993, -2544008, -7603725, -13677985, -19921762, -21170187, -13588291, -3793967, -2923820, -8862079, -5933198, 11220457, 25207238, 18220100, -2197889, -13331142, -8188978, -1670543, -6265252, -14901192, -12377468, 4426171, 23000407, 28649376, 19004607, 6110812, 3508199, 10967745, 15808022, 10481446, 2023631, -163350, 1824877, 445104, -3673963, -4055184, -609139, 560243, -2122961, -4417790, -4780870, -5688279, -7198288, -7146511, -6543862, -6579560, -2218758, 11148473, 25691451, 27506650, 16493523, 8167158, 11966410, 18909726]
53329A8909726k132329r041075n122908J941057K845718o64272k199853p25913
53321C810151O50497J94431j742084m008146m856635l286692l03868K929085O251000
53312c62261P709851L630768m580163q308753k334062O284842O919969J01021
53304I061212m135050r80259L924428L859198j476523q422973j2987917j1140412
53296b2298296j623920R541278J2455856M228140o476105q434316l38632P526968
53288e419027M819044n924314j0623920j051367J2211307J1607549l178075j3095251
53280a0654054n445336Q849012J1382977Q88486q763340r276038m928625j463279
53272a9410197Q27863K632853L148344L333944N195241P349109O533089L045917
$$ y = [18909726, 16777397, 7736322, 2613414, 4554471, 7400189, 6735917, 4536064, 3810151, 4460648, 4655079, 2912995, -1095151, -5951786, -9238478, -9542346, -6613261, -362261, 7347590, 10978358, 6398195, -1910558, -4244620, 2040222, 8960191, 9061212, 4926162, 3945903, 7870331, 11729529, 10253006, 1830033, -11157884, -22298296, -23922216, -14380938, -1925082, 2303058, -4173047, -12607363, -12945995, -5419027, -599983, -6524297, -17148217, -18199584, -5988277, 5619272, 2441197, -10654054, -16099390, -7250378, 4132599, 5021085, -3742255, -13018293, -17946918, -19410197, -18582334, -15949481, -12801137, -9467193, -4271952, 3077157, 9610246, 12656163]
53264A2656163N5655j193281j498988j630384l621853r395884j4105095q288585
53256b7022252O892954J5595880Q235669k769039j485458N969659K053390j1625497
53248d154694j5468455l301581Q761022R007211N437695O770503O795838j185299
53240A2662240r611297q980420l127356k71081Q17330M005131M941795m63314
53232b6972n102729j168195N462567M543233q94381l33699N050269L964894n495265
53223E999722j2086453q612067q44006L394688L823347K975478N12263l445194
53215h282222n401975k781744K494170O452317O148111Q14388o060409p233985
53207a3851349K79464Q889301Q505253L72147m319259j67455N726691N015594
$$ y = [12656163, 12711818, 11518537, 10019549, 8389165, 4767312, -4628572, -18733667, -27022252, -20129298, -4533418, 3702251, 933212, -552246, 5417413, 7470803, -4154694, -19623149, -22924730, -14163708, -5156497, 281198, 7051701, 13847539, 12662240, 3050943, -5929477, -9056833, -9327914, -8510584, -4505453, 436342, -26972, -5129701, -6297896, -835329, 3707904, 2813523, 2479824, 7530093, 11494987, 5999722, -6086731, -14698798, -15542804, -12148116, -8324769, -5349291, -4837028, -8282222, -13684197, -16465941, -13971771, -7519454, -1371343, -556955, -6617364, -13851349, -13571885, -4682584, 3822669, 4194816, -124443, -291898, 5434793, 10450387]
53199A0450387j066644n970402p087729n882640l007872J204200L588388Q97662
53191f874650m360385n175166J400896R774293J2165001P778077K525574J33992
53183A7367632j828114n069944n292311K63885M171847k683586j4704042j5187142
53175b2961775O8436J4108090J1301702j231379n336196K171088Q240853M997214
53167A1358033j163864k498007O485K449131M242528M771911J733181l471111
53159A7428287n429060l030126j487397k982659k483236K823234O878657L459124
53151A5176824l828276o791631m239909j789658k194158k211108R32810M927492
53143a7614N751921L232896J666842M698360R572284Q331242k585136j5502223
$$ y = [10450387, 9383743, 3413341, -3674388, -9557028, -12564900, -11360700, -7772312, -6874650, -11235035, -16410201, -15009305, -5235012, 6929989, 14708066, 17233640, 17367632, 15539518, 10469574, 5177263, 5441148, 9612995, 6929409, -7774633, -22961775, -22893339, -8785249, 2516453, 1285074, -4051122, -1880034, 6360819, 11358033, 10194169, 7696162, 7702647, 10151778, 14394306, 19166217, 20899398, 17428287, 11999227, 8969101, 7481704, 4499045, 2015809, 4839043, 11717700, 15176824, 11348548, 4556917, 317008, -1472650, -3666808, -5877916, -4945106, -17614, 5734307, 8967203, 10634045, 15332405, 24904689, 33235931, 30650795, 15148572]
53135A5148572j8995245j1876152l808465j065170J022688P745679J4124114J1058980
53127A3355001j363583j3216851j5761975q369421L600433J3041333J4844829
53120F129766J0021584N044634L773103K661732j919191n582642k027910N337915
53112B3438991O416273j111915q853010j0655987r809182r879820o959395K475978
53104a4938067J2245198J3112571N615214j379316l424694m302343o934365p936087
53096g941889l948345K171594N349730M927874L496833J635143j947870o009898
53088b266828o720785k905825J556732K338037J69312j55978L989568R498701
53080E502934J0977474O811266M22616m198224o198400o417774m767158j534923
$$ y = [15148572, -3846673, -15722825, -19531290, -20596460, -19573772, -11828093, 2296021, 13355001, 11991418, -1225433, -16987408, -25356829, -21756396, -8715063, 6129766, 16151350, 21195984, 24969087, 27630819, 25711628, 20128986, 18101076, 23438991, 29855264, 28743349, 19890339, 9234352, -574830, -10454650, -17414045, -14938067, -2692869, 10419702, 16034916, 14655600, 11230906, 6928563, -5802, -7941889, -11890234, -9718640, -4368910, 558964, 4055797, 5690940, 3743070, -2266828, -8987613, -11893438, -10336706, -7998669, -7829357, -7985335, -3995767, 5502934, 16480408, 23291674, 23714290, 19516066, 13317666, 6899892, 2132734, 597811]
53072E97811M62809j133261l392375n59339P392488J2756377R208088k96880p784626
53063A7251092r648815q180067n992686l323161j42059K659934M023119K601126
53055g51517k297983p292485n939158K498522R006955N796780k013471l786569
53047d778926L55670J372382j500974J104553J0145683J2027815q07615j5254537
53039B664051j4848269k597740O160403O645072N985715O155821J528279o731393
53031D961939q945939k705064K386498r874m204481l871605j542996o17460K229164
53022a2319818Q843624J1984891N086798n782225q715968j731844N945105O613885
53014I924448J613722l097795l732161j038065J130389R1154k009044j488165
$$ y = [597811, 1060620, -72641, -3465016, -4024355, 3368133, 16124510, 25332598, 25035718, 17251092, 7602277, -577790, -6570476, -9893637, -10035696, -7375762, -3352643, -751517, -3049500, -10341985, -16281143, -13782621, -4775666, 1021114, -992357, -4778926, -4423256, -3050874, -4551848, -3447295, 6698388, 18726203, 17918588, 2664051, -12184218, -14781958, -8621555, -1976483, 4009232, 10165053, 11693332, 4961939, -3984000, -6689064, -4302566, -4312440, -8516921, -12388526, -13931522, -14548982, -12319818, -3476194, 8508697, 13595495, 7813270, -902698, -2634542, 3310563, 9924448, 11538170, 8440375, 4708214, 3670149, 4800538, 4891692, 2882648, 1394483]
53006A394483k36261m011396j1872375j4324135o321492M339053P382574L300740
52998b0348809j38676L01527K181725M219657O840606Q267929O408367K631304
52990A0363630j046018m935678p345546l184587O669516J1370425M110661o431697
52982I570706q779012n721727n984875o059662K506944J2231051O855578j0256450
52974e637447j6534820l803094R713610R169000L841479N877547Q433502J931720
52966A2991497n109977j645019L579713k299836r767651j662742J3371719J0942890
52958B0400594p703083j4790636j034258Q876314k258038j5197602o281200J3565670
52950d422239J6372481p0575j2407573q309264R42092L712721K893050L739841
$$ y = [1394483, 1158222, -2853174, -14725549, -29049684, -35371176, -31032123, -23649549, -20348809, -20487485, -20185958, -18004233, -13784576, -6943970, 1323959, 7732326, 10363630, 9317612, 4381934, -2963612, -6148199, 521317, 11891742, 16002403, 9570706, 791694, -4930033, -10914908, -16974570, -14467626, -2236575, 4619003, -5637447, -22172267, -25975361, -16261751, -7092751, -3251272, 2626275, 11059777, 12991497, 7881520, 6236501, 9816214, 7516378, -2251273, -3914015, 9457704, 20400594, 12697511, -2093125, -3127383, 5748931, 3490893, -11706709, -17987909, -4422239, 11950242, 11879667, -527906, -8837170, -7895078, -4182357, -1289307, 2450534]
52942B450534L487383o19743m409661l621363J21141L544428N354791M208153
52934A0515663k07277l665702k130983M47709k746944r164416r486797k711791
52926a9150538K110643R57606N47323N558405J0776066J0729861P575512M339790
52918B3444668n50866o773220r099725o240352l822325l669413l54547O055870
52910a009910O042504k581558o841888J430583J0202765N564680n779399q546847
52902a519070l710726k747825m738579q6476P607030N720877k843630k182205
52894d500604Q242765J1032950P02203p537270n650317n142963j1129027q828045
52886b2810308Q303739J9926475Q876700r382632j0822673k93476J384532m876878
$$ y = [2450534, 5937917, 5318174, 908513, -2712850, -2591709, 952719, 6307510, 10515663, 10308386, 6642684, 4511701, 4959410, 2212466, -6951950, -16438747, -19150538, -17039895, -16082289, -15534966, -9976561, 799505, 11529366, 19104878, 23444668, 22893802, 16120582, 7020857, 780505, -3041820, -6711233, -7065780, -1009910, 5032594, 2451036, -4390852, -2960269, 7242496, 12807176, 7027777, -1519070, -5229796, -7977621, -12716200, -12802676, -5195646, 525231, -2318399, -4500604, 3742161, 14775111, 15477314, 7940044, 2289727, -2853236, -13982263, -22810308, -14506569, 5419906, 14296606, 4913974, -5908699, -6202175, -4817643, -9694521]
52878i694521j457757J0117900R742695m991432j3078626n629359Q10778m526439
52870a8706761q079567J902141J3158435J0386881O82570m21744N212230N328288
52862I462473Q4034j116379R82777k294458r374581r726658k448321K109457P8960
52853a2242696j030978K537987M335363O50397k062640J202948M687371J385686
52845e36562n188753o196911K5010P119760R451612O285058n17076p718659j0535143
52836g811664n872379L448733J0246804R584877K918676m059383o747184n093287
52828c384807k527858j594958j064484J797787O593999R154963O058632j314133
52820A3719141p814751r144625n495770j138672r4025j816296k032316J632140
$$ y = [-9694521, -11152278, -1034378, 8708317, 3716885, -9361741, -14991100, -14180322, -18706761, -26786328, -24884187, -11725752, -1338871, -656301, -1078045, 4134185, 9462473, 9546507, 8430128, 9412905, 7118447, -2256134, -11982792, -14431113, -12321656, -12242696, -13273674, -10735687, -6400324, -5749927, -7812567, -6609619, -1922248, -536562, -5725315, -11922226, -11897216, -4777456, 4674156, 10959214, 10442138, 2723479, -7811664, -13684043, -10235310, 11494, 9596371, 12515047, 8455664, 1708480, -3384807, -5912665, -7507623, -8572107, -6774320, -180321, 8974642, 15033274, 13719141, 5904390, -3240235, -8736005, -9874677, -9968702, -11784998, -13817314, -12185174]
52812a2185174O500963Q556376P320585M855284J846186j949555m515023l044708
52804G384934J056802K523771j098985o194628p947198n777323k419051k78214
52796a2749892m83781k763231l943409M17971R284875J3523238N454183r231255
52788d91301j5085845n077398R606748J2705746L005501n265909k409179L905219
52780H93582Q61211r619836j2283148j36059J4508593J5943466N545535k002176
52772A3711168K18652M267226K165335k711785m180338m148637o451057o428826
52764c558262K020538J2226409J0568291k630838j1006067n296655L735190L085335
52756I143941l133118l250606K006433L167192R0085Q26987M503778J546509p691954
$$ y = [-12185174, -5684211, 2872165, 10192750, 15048034, 16894220, 14944665, 10429642, 7384934, 8441736, 10965507, 9866522, 3671894, -4275304, -10052627, -12471678, -12749892, -13233673, -15996904, -19940313, -19522342, -10237467, 3285771, 8739954, -491301, -15577146, -20654544, -11047796, 1657950, 4663451, -602458, -3011637, 893582, 1754793, -7865043, -20148191, -20284250, -5775657, 10167809, 15713344, 13711168, 13929820, 18197046, 20362381, 17650596, 13470258, 9321621, 2870564, -3558262, -1537724, 10688685, 21256976, 18626138, 7620071, 2323416, 6058606, 9143941, 6010823, 2760217, 4766650, 7933842, 8023927, 8850914, 13354692, 14901201, 7209247]
52747G209247j0604906k988050L303458K08358l716367Q9989M412097j30362o878899
52738i095435l702383N901019Q133655J021656l983223p67884M650185N647407
52730G804997J849648m447989q392489k354120J2649545J9964449O779842j3259120
52722B0594763j5205179Q97709R852742k60738j2121025r083482Q13862L158875
52714a352473O86680L012821P572995P004809M171460M556942L715259l005928
52706B6362565q044264m088834O84826l690939r144228k143252J0869970J1210336
52698B2016180k186829j1087561o137383K390284M363780K792362K591446J379988
52690A6122267k835896o493647p583873q242769p741136k662540M341451O080674
$$ y = [7209247, -3395659, -6383709, -3080251, -2871893, -6588260, -6498271, -2086174, -2216536, -9095435, -12797818, -6896799, 1236856, 2258512, -1724711, -2492595, 2157590, 7804997, 9654645, 5206656, -3185833, -5539953, 7109592, 27074041, 33853883, 20594763, 5389584, 6287293, 16140035, 15879297, 3758272, -5325210, -4511348, -1352473, -665793, 2347028, 9920023, 16924832, 21096292, 25653234, 29368493, 26362565, 18318301, 14229467, 14914293, 11223354, 2079126, -64126, 10805844, 22016180, 19829351, 8741790, 2604407, 4994691, 9358471, 12150833, 14742279, 16122267, 13286371, 6792724, -791149, -9033918, -16775054, -19437594, -15096143, -9015469]
52682i015469K442870N77960K854120M752724M679089N112764M566564q9037m391326
52673A1490259j933583K476343l76581o111076k579486P075063O804313n060902
52665A1784350j1803708o100572l13363k028458j428747O665027R844589P40539
52657G359657p314380k818249L900263J29793o836881n301832j344796n091134
52649a7317559q933859j427757R118189Q014512R94359L463021J1205410P586155
52641A2702471n222930q712888M9048M938886J76757k113293K546271K245992
52633F610314p641528j3935724p581590K614309O805491P520317P837360K868107
52625E097056p321292j1351535l322467O768354Q366877M080206L29892k867070
$$ y = [-9015469, -6572599, -5994639, -3140519, 1612205, 6291294, 11404058, 15970622, 15881585, 11490259, 9556676, 12033019, 11656438, 5545362, 2965876, 10040939, 16845252, 11784350, -19358, -6119930, -6433293, -8461751, -9890498, -3225471, 6619118, 7359657, 45277, -2772972, 1127291, 1257084, -5579797, -10881629, -12226425, -17317559, -26251418, -27679175, -18560986, -10546474, -9552115, -6089094, 5116316, 12702471, 7479541, -1233347, -1184299, 3754587, 3931344, 1818051, 4364322, 6610314, -1031214, -14966938, -22548528, -19934219, -13128728, -5608411, 2228949, 5097056, -2224236, -13575771, -16898238, -10129884, -1763007, 2317199, 2647091, -219979]
52617b19979m807662j59412Q994243J0320743l3287q866591n976462O78457P52722
52608F82772j842600j111520l088552j1304791j1810441O578487K7070207K3425934
52600B8599496j159765j7567941j2597578l268954m855664q091681L02563J2978489
52592e661035J3933658L874470k711303l25118K696871R01405j40763M455320
52584A7023505R179746O101185l376571j1030897j2891429j1536057q840481l567721
52576a8938720K636364L990651o57283l750015M74766O274039M690429k089718
52568g369487l882040J635238O355168N546435L823210M676324M014465j167037
52560A3632276o092419n635057j760165J112965J915470M85574l460287n549741
$$ y = [-219979, -5027641, -5187053, 3807190, 14127933, 14094646, 5228055, -748407, -69950, 682772, -1159828, -2271348, -5359900, -16664691, -28475132, -21896645, 5173562, 28599496, 27439731, 9871790, -2725788, -5994742, -10850406, -18942087, -18639524, -5661035, 8272623, 12147093, 9435790, 9110672, 11807543, 12708948, 12568185, 17023505, 26203251, 32304436, 28927865, 17896968, 5005539, -6530518, -15370999, -18938720, -16302356, -12311705, -12968988, -16719003, -16244237, -9970198, -5279769, -7369487, -11251527, -9616289, -3261121, 2285314, 6108524, 10784848, 14799313, 13632276, 7539857, 1904800, 144635, 1257600, 3173070, 3658644, 198357, -5351384]
52552e351384K79096R884249J0371764n38206q054621j959267O911697L823065
52544A5366393o640847r572657m022369j045585k308192O98751P137052N446996
52536E059542n480066j1184313l820977N599422M966296k003953n510460m671661
52528a7046170k551529L364670J3405188J6780581N005323j0541766j0263882
52521a847585N027967J2978976J142868j5139837j5150599j437392O905239K753685
$$ y = [-5351384, -5072288, 4811961, 15183725, 14645519, 6590898, 4631631, 11543328, 15366393, 8725546, -847111, -4869480, -5915065, -8223257, -7524506, -387454, 5059542, -420524, -11604837, -15425814, -9826392, -4860096, -6864049, -12374509, -17046170, -19597699, -16233029, -2827841, 13952740, 18958063, 8416297, -1847585, 3180382, 16159358, 17302226, 2162389, -12988210, -14425602, -7520363, -4766678]
$$ [...]
##END NTUPLES=NMR SPECTRUM
##END=
