##TITLE=31Pdec_SR-167_R23_TFA
 CDCl3
  64 sc
 25.12.2023
##JCAMPDX= 6.0         $$ Bruker NMR JCAMP-DX V2.0
##DATA TYPE= NMR SPECTRUM
##DATA CLASS= NTUPLES
##ORIGIN= UXNMR, Bruker Analytische Messtechnik GmbH
##OWNER= root
$$ XWIN-NMR		Version 3.5
$$ Mon Dec 25 15:10:45 2023 Russian Standard Time (UT+4h)  she@DPX200
##.OBSERVE FREQUENCY= 81.013821
##.OBSERVE NUCLEUS= ^31P
##.ACQUISITION MODE= SIMULTANEOUS
##.ACQUISITION SCHEME= undefined
##.AVERAGES= 64
##.DIGITISER RES= 16
##SPECTROMETER/DATA SYSTEM= spect
##.PULSE SEQUENCE= zgpg30
##.SOLVENT NAME= CD2Cl2
##.SHIFT REFERENCE= (INTERNAL, CD2Cl2, 0, 248.564)
##AUDIT TRAIL= $$ (NUMBER, WHEN, WHO, WHERE, WHAT)
$$ ##TITLE= Audit trail, XWIN-NMR		Version 3.5
$$ ##JCAMPDX= 5.01
$$ ##ORIGIN= Bruker BioSpin GmbH
$$ ##OWNER= she
$$ F:/spectra/data/she/nmr/P31/1/pdata/1/auditp.txt
$$ ##AUDIT TRAIL=  $$ (NUMBER, WHEN, WHO, WHERE, WHAT)
(   1,<2023-12-25 15:09:38.79 +0400>,<she>,<DPX200>,
      <continue with go, POWCHK disabled, PULCHK disabled
       configuration hash MD5:
       00 E9 B6 7A A2 85 ED C7 34 08 36 98 17 FE 4E 26
       data hash MD5: 32K
       94 D7 4C 39 B9 59 EB D1 AE 36 E1 12 25 2C AA 50>)
(   2,<2023-12-25 15:09:40.65 +0400>,<she>,<DPX200>,
      <Start of raw data processing
       efp BC_mod = 2 LB = 10 FT_mod = 6 PKNL = 1 PHC0 = -12699.18 PHC1 = 1523.494 SI = 64K 
       data hash MD5: 64K
       DB 83 CB 8A F5 26 BC 95 A9 C9 93 D3 7C E6 10 51>)
(   3,<2023-12-25 15:10:10.06 +0400>,<she>,<DPX200>,
      <pk PHC0 = 54.58349 PHC1 = -141.8 
       data hash MD5: 64K
       E8 F6 1F B1 6C EB 12 8D 0B 52 B5 05 41 2A F5 F6>)
(   4,<2023-12-25 15:10:13.40 +0400>,<she>,<DPX200>,
      <abs ABSG = 5 
       data hash MD5: 64K
       7B 9D AF 83 FA 55 81 28 8A C1 1D 5C C7 83 87 98>)
$$ ##END=
$$ 
$$ hash MD5
$$ C4 24 1D CB 0E 3A 51 96 55 64 09 2A 34 1E E7 4A
##$RELAX= 
##$RELAX= 
##$RELAX= 
##$RELAX= 
##$RELAX= 
##$RELAX= 
##$RELAX= 
##$RELAX= 
##$RELAX= 
$$ Bruker specific parameters
$$ --------------------------
##$DU= <F:/spectra>
##$EXPNO= 1
##$NAME= <P31>
##$PROCNO= 1
##$TYPE= <nmr>
##$USER= <she>
##$AMP= (0..31)
100 100 100 100 100 100 100 100 100 100 100 100 100 100 100 100 100 100 
100 100 100 100 100 100 100 100 100 100 100 100 100 100 
##$AQSEQ= 0
##$AQ_mod= 1
##$AUNM= <au_zg>
##$AUTOPOS= <>
##$BF1= 81.014009
##$BF2= 200.13
##$BF3= 200.13
##$BF4= 200.13
##$BF5= 200.13
##$BF6= 200.13
##$BF7= 200.13
##$BF8= 200.13
##$BYTORDA= 1
##$CFDGTYP= 0
##$CFRGTYP= 5
##$CHEMSTR= <none>
##$CNST= (0..31)
1 1 145 1 1 1 1 1 1 1 1 1 1 1 1 1 1 1 1 1 1 1 1 1 1 1 1 1 1 1 1 1 
##$CPDPRG= <waltz16>
##$CPDPRG1= <>
##$CPDPRG2= <waltz16>
##$CPDPRG3= <>
##$CPDPRG4= <mlev>
##$CPDPRG5= <mlev>
##$CPDPRG6= <mlev>
##$CPDPRG7= <mlev>
##$CPDPRG8= <mlev>
##$CPDPRGB= <>
##$CPDPRGT= <>
##$D= (0..31)
0 1 0 0 0 0 0 0 0 0 0 0.03 2e-05 3e-06 0 0 0 0 0 0 0 0 0 0 0 0 0 0 0 0 
0 0 
##$DATE= 1703502479
##$DBL= (0..7)
120 120 120 11 120 120 24 19 
##$DBP= (0..7)
150 150 150 150 150 150 150 150 
##$DBP07= 0
##$DBPNAM0= <>
$$ [...]
##$SUBNAM3= <"">
##$SUBNAM4= <"">
##$SUBNAM5= <"">
##$SUBNAM6= <"">
##$SUBNAM7= <"">
##$SUBNAM8= <"">
##$SUBNAM9= <"">
##$SW= 501.771253377433
##$SWIBOX= (0..15)
0 1 3 0 0 0 0 0 0 0 0 0 0 0 0 0 
##$SW_h= 40650.406504065
##$TD= 32768
##$TD0= 1
##$TE= 0
##$TE2= 300
##$TE3= 300
##$TEG= 300
##$TL= (0..7)
0 120 53 12 22 120 120 120 
##$TP= (0..7)
150 150 150 150 150 150 150 150 
##$TP07= 0
##$TPNAME0= <>
##$TPNAME1= <>
##$TPNAME2= <>
##$TPNAME3= <>
##$TPNAME4= <>
##$TPNAME5= <>
##$TPNAME6= <>
##$TPNAME7= <>
##$TPOAL= (0..7)
0.5 0.5 0.5 0.5 0.5 0.5 0.5 0.5 
##$TPOFFS= (0..7)
0 0 0 0 0 0 0 0 
##$TUNHIN= 0
##$TUNHOUT= 0
##$TUNXOUT= 0
##$USERA1= <user>
##$USERA2= <user>
##$USERA3= <user>
##$USERA4= <user>
##$USERA5= <user>
##$V9= 5
##$VALIST= <valist>
##$VCLIST= <CCCCCCCCCCCCCCC>
##$VD= 0
##$VDLIST= <DDDDDDDDDDDDDDD>
##$VPLIST= <PPPPPPPPPPPPPPP>
##$VTLIST= <TTTTTTTTTTTTTTT>
##$WBST= 1024
##$WBSW= 4
##$XGAIN= (0..3)
0 0 0 0 
##$XL= 0
##$YL= 0
##$YMAX_a= 2562
##$YMIN_a= -2544
##$ZGOPTNS= <>
##$ZL1= 120
##$ZL2= 120
##$ZL3= 120
##$ZL4= 120
##$ABSF1= 248.5645
##$ABSF2= -253.2056
##$ABSG= 5
##$ABSL= 3
##$ALPHA= 0
##$AQORDER= 0
##$ASSFAC= 0
##$ASSFACI= 0
##$ASSFACX= 0
##$ASSWID= 0
##$AUNMP= <proc_1d>
##$AZFE= 0.1
##$AZFW= 0.5
##$BCFW= 0
##$BC_mod= 2
##$BYTORDP= 0
##$COROFFS= 0
##$CY= -3
##$DATMOD= 1
##$DC= 0
##$DFILT= <>
##$DTYPP= 0
##$F1P= 0
##$F2P= 0
##$FCOR= 1
##$FTSIZE= 65536
##$FT_mod= 6
##$GAMMA= 0
##$GB= 0
##$INTBC= 1
##$INTSCL= 6.047779e-11
##$ISEN= 30
##$LB= 10
##$LEV0= 0
##$LPBIN= 0
##$MAXI= 10000
##$MC2= 0
##$MEAN= 0
##$ME_mod= 0
##$MI= 50
##$NCOEF= 0
##$NC_proc= -10
##$NLEV= 6
##$NOISF1= 182.463
##$NOISF2= 159.3651
##$NSP= 0
##$NTH_PI= 0
##$NZP= 0
##$OFFSET= 248.5645
##$PC= 4
##$PHC0= -12644.6
##$PHC1= 1381.694
##$PH_mod= 1
##$PKNL= yes
##$PPARMOD= 0
##$PSCAL= 0
##$PSIGN= 0
##$REVERSE= no
##$SF= 81.0140089999694
##$SI= 65536
##$SIGF1= 159.3651
##$SIGF2= -187.1042
##$SINO= 113.3802
##$SIOLD= 16384
##$SREGLST= <1H.CDCl3>
##$SSB= 0
##$STSI= 65536
##$STSR= 0
##$SW_p= 40650.406504065
##$SYMM= 0
##$S_DEV= 0
##$TDeff= 32768
##$TDoff= 0
##$TI= <>
##$TILT= no
##$TM1= 0
##$TM2= 0
##$TOPLEV= 0
##$USERP1= <user>
##$USERP2= <user>
##$USERP3= <user>
##$USERP4= <user>
##$USERP5= <user>
##$WDW= 1
##$XDIM= 65536
##$YMAX_p= 322487711
##$YMIN_p= -38979761
$$ End of Bruker specific parameters
$$ ---------------------------------
##NTUPLES= NMR SPECTRUM
##VAR_NAME=  FREQUENCY,     SPECTRUM/REAL,   SPECTRUM/IMAG
##SYMBOL=    X,             R,               I
##VAR_TYPE=  INDEPENDENT,   DEPENDENT,       DEPENDENT
##VAR_FORM=  AFFN,          ASDF,            ASDF
##VAR_DIM=   65536,         65536,           65536
##UNITS=     HZ,            ARBITRARY UNITS, ARBITRARY UNITS
##FACTOR=    0.620285442955139, 1,           1
##FIRST=     20137.2065510682, 0,            0
##LAST=      -20513.1999529968, 0,           0
##MIN=       -20513.1999529968, -38979761,   0
##MAX=       20137.2065510682, 322487711,    0
$$ Real data points
##PAGE= N=1
##DATA TABLE= (X++(R..R)), XYDATA
$$ [...]
45294 20887622 21462449 21692849 21482482 20803839 19706483 18296774 16700748 15029725 13362569
45285 13362569 11745891 10204281 8750444 7388727 6112317 4900961 3727006 2570788
45277 2570788 1437620 365772 -579929 -1326306 -1813948 -2014235 -1935320 -1617191 -1121130
45268 -1121130 -518780 118522 732094 1288724 1787952 2258406 2743833 3284472 3899214
45259 3899214 4571488 5242035 5814103 6175029 6229382 5928679 5281581 4340479 3176639
45250 3176639 1862245 468111 -930109 -2251644 -3423380 -4399147 -5171685 -5768030 -6230253
45241 -6230253 -6591966 -6862228 -7022994 -7038728 -6871713 -6496019 -5906081 -5118379 -4165283 -3081380
45231 -3081380 -1887079 -579318 862329 2455456 4192463 6029585 7892765 9695466
45223 9695466 11358599 12824383 14060878 15058471 15822243 16363972 16696071 16828914 16773032
45214 16773032 16546093 16180069 15720811 15216511 14701976 14192247 13692549 13216326 12794217
45205 12794217 12464056 12248425 12136250 12080582 12012543 11861965 11573436 11111335 10455579 9596204
45195 9596204 8534333 7289618 5907477 4459364 3033765 1718926 581383 -350218
45187 -350218 -1083782 -1641757 -2032995 -2241038 -2238249 -2012741 -1586023 -1010786 -355937 307564
45177 307564 913768 1405645 1742549 1910581 1925828 1820813 1618188 1311222 869890 271586
45167 271586 -465167 -1267806 -2024783 -2617876 -2955003 -2991986 -2739549 -2257486 -1640168 -996756
45157 -996756 -428779 -9929 224010 270556 146852 -121162 -500960 -952870 -1434718 -1910123
45147 -1910123 -2351254 -2731290 -3012357 -3139334 -3045792 -2670861 -1979597 -976973 290336
45138 290336 1740771 3264338 4725930 5973784 6861913 7282759 7194274 6627542 5673754
45129 5673754 4460601 3130293 1825721 682670 -179404 -672503 -756238 -444308 204863
45120 204863 1109371 2187120 3372365 4620443 5900880 7186196 8447817 9664135
45112 9664135 10831981 11966803 13086935 14193178 15259427 16239555 17082609 17744647 18191964
45103 18191964 18399033 18348073 18033516 17467873 16682299 15720014 14628995 13461974 12283320
45094 12283320 11172432 10213905 9476688 8995369 8764909 8747686 8882298 9086924 9261795
45085 9261795 9301522 9120919 8684137 8020738 7219957 6407970 5719261 5269504 5132834 5328207
45075 5328207 5822277 6549936 7441063 8437326 9493483 10572156 11643250 12688711 13704822
45066 13704822 14696965 15669479 16616010 17513486 18321524 18989259 19468824 19729578 19765466
45057 19765466 19592747 19241497 18746181 18138851 17447221 16699026 15930877 15194524 14551570
45048 14551570 14053807 13717399 13505906 13332979 13083557 12642858 11922373 10878188 9520549
45039 9520549 7912000 6150608 4340721 2563075 859378 -760856 -2296509 -3728643
45031 -3728643 -5006219 -6050105 -6772298 -7102166 -7011584 -6532596 -5762440 -4852479 -3981576
45022 -3981576 -3319253 -2986721 -3025058 -3380208 -3911985 -4426166 -4718882 -4618958 -4018239 -2885276
45012 -2885276 -1260163 767865 3089780 5597438 8187204 10752859 13181159 15357204
45004 15357204 17177015 18561699 19468722 19895830 19873650 19449485 18673190 17596253 16283781
44995 16283781 14826299 13336090 11923896 10667116 9588719 8661079 7834360 7074608
44987 7074608 6391661 5843389 5516301 5494482 5832571 6541963 7588744 8896387 10350344
44978 10350344 11809319 13129282 14197524 14962626 15443265 15709174 15845062 15919234 15973225
44969 15973225 16030660 16109226 16221486 16364870 16512251 16612494 16600461 16410549 15990306 15313989
44959 15313989 14393579 13280323 12051706 10788926 9559107 8414327 7406112 6600994
44951 6600994 6081004 5923710 6171457 6809000 7765819 8944251 10256963 11651598 13112327
44942 13112327 14645616 16263761 17971945 19756574 21575178 23355211 25007479 26448839
44934 26448839 27620498 28491930 29051495 29292428 29202947 28765383 27965560 26809518 25340099
44925 25340099 23643973 21843948 20079624 18484897 17169220 16204253 15615278 15379512
44917 15379512 15436099 15708889 16133893 16677126 17332767 18104205 18980923 19924487 20869252
44908 20869252 21735847 22452179 22975345 23306337 23490415 23601407 23715748 23886781 24129530
44899 24129530 24421526 24717686 24970302 25143582 25217844 25186087 25048705 24809560 24473146 24041436
44889 24041436 23510151 22865890 22086275 21143107 20004979 18636633 16999895 15065732 12838355
44880 12838355 10376008 7789144 5213784 2778757 587386 -1283664 -2781460 -3881008
44872 -3881008 -4594268 -4973295 -5100532 -5068857 -4960009 -4829755 -4704361 -4589164 -4486673 -4417226
44862 -4417226 -4431388 -4604457 -5012079 -5697327 -6645425 -7778713 -8974381 -10096592 -11028076
44853 -11028076 -11687971 -12032619 -12046809 -11736034 -11124222 -10254794 -9192287 -8023939 -6859409
44844 -6859409 -5823304 -5036900 -4593026 -4534098 -4841203 -5435578 -6190611 -6953674 -7576553
44835 -7576553 -7947756 -8014459 -7784338 -7308618 -6658927 -5912021 -5146713 -4445240 -3887506 -3534219
44825 -3534219 -3406692 -3477067 -3678011 -3929272 -4167630 -4364334 -4522233 -4658386 -4786588 -4911275
44815 -4911275 -5032692 -5154094 -5282280 -5420616 -5560641 -5679299 -5744253 -5724134 -5597422 -5355330
44805 -5355330 -4998631 -4532375 -3963466 -3304366 -2582783 -1851942 -1191427 -691036 -422315
44796 -422315 -415245 -657156 -1114321 -1758712 -2579470 -3571943 -4713204 -5939738 -7140208
44787 -7140208 -8169288 -8879730 -9160414 -8962566 -8301530 -7236502 -5844342 -4204305 -2398467
44778 -2398467 -519045 1330505 3046873 4546053 5778338 6729947 7413225 7857560 8110901
44769 8110901 8247787 8368869 8582634 8977331 9601187 10461744 11539130 12799768 14202119
44760 14202119 15696937 17230168 18752552 20231007 21652063 23012586 24303617 25499177
44752 25499177 26557922 27435673 28099616 28535290 28744396 28739049 28539852 28178821 27700635
44743 27700635 27156143 26589931 26029385 25479641 24923242 24323394 23633644 22815672 21858834
44734 21858834 20788586 19654649 18503097 17349263 16169738 14918657 13556130 12069885
44726 12069885 10480121 8831358 7180641 5587563 4106855 2783087 1646672 710054
44718 710054 -35078 -615504 -1066360 -1416694 -1678185 -1841311 -1877554 -1745225 -1399175 -805406
44708 -805406 41560 1104405 2298806 3504549 4591618 5452865 6029219 6316393 6352739
44699 6352739 6197564 5910239 5534532 5088029 4557937 3907602 3095573 2100997 943802
44690 943802 -308480 -1547344 -2639551 -3451379 -3880036 -3885485 -3508355 -2861315 -2094551
44681 -2094551 -1351324 -733926 -290578 -19888 116377 177899 229493 327501 514493 822024
44671 822024 1271810 1866155 2572156 3316221 4000334 4532649 4852212 4934039 4779131 4405173
44661 4405173 3847397 3163320 2427413 1709971 1049742 436483 -186870 -903816 -1793630
44652 -1793630 -2901050 -4218007 -5686557 -7222171 -8744567 -10199705 -11564422 -12836281
44644 -12836281 -14017048 -15097976 -16052396 -16837570 -17403305 -17701392 -17690896 -17338333 -16615553
44635 -16615553 -15498913 -13972827 -12039783 -9736555 -7151047 -4429539 -1764859 636112
44627 636112 2597068 4014363 4882160 5291518 5402761 5399524 5439230 5615090 5939816 6354409
44617 6354409 6758863 7054787 7184476 7151229 7014191 6863385 6789112 6859241 7109964 7546643
44607 7546643 8148292 8872819 9665225 10470919 11251849 11999584 12739995 13526622 14422781
44598 14422781 15477285 16703809 18073420 19522082 20966697 22321912 23512826 24480766
44590 24480766 25180705 25573554 25621445 25292090 24570299 23469308 22035727 20345584 18491752
44581 18491752 16567063 14651256 12807525 11085078 9518733 8123135 6890041 5797907
44573 5797907 4831941 4002354 3348968 2929194 2794949 2967827 3421742 4080559 4834980
44564 4834980 5576372 6235249 6804548 7332237 7885845 8510481 9204883 9925123 10607316
44555 10607316 11193599 11650072 11972684 12181910 12309832 12384494 12415851 12386840 12252885 11951556
44545 11951556 11418540 10601516 9466753 8002784 6229330 4210850 2062130 -66219
44537 -66219 -2020036 -3675714 -4960660 -5856219 -6388628 -6614954 -6608336 -6445978 -6202851 -5951199
44527 -5951199 -5761465 -5698782 -5812480 -6122104 -6608149 -7215922 -7875292 -8529516 -9158989 -9786730
44517 -9786730 -10461884 -11229225 -12098982 -13029738 -13930926 -14684162 -15176245 -15331291 -15127926
44508 -15127926 -14593471 -13780131 -12739576 -11511557 -10128844 -8627031 -7046476 -5424534
44500 -5424534 -3786920 -2147626 -518614 1077790 2602797 4005607 5234811 6247904
44492 6247904 7012385 7500503 7686977 7556871 7120640 6424712 5547724 4583203 3619559
44483 3619559 2728758 1966856 1380880 1014937 911875 1109265 1628287 2457112 3537321
44474 3537321 4764521 6005339 7120576 7982952 8488504 8568366 8202185 7425360 6323240
44465 6323240 5014867 3633694 2308946 1147959 222497 -436079 -833041 -1004132 -1010659
44456 -1010659 -930852 -840335 -784054 -753770 -686697 -489678 -78548 585844 1480893 2530295
44446 2530295 3630819 4684823 5626223 6433788 7132212 7783899 8472821 9280702 10259146
44437 10259146 11407348 12666746 13937520 15110647 16100767 16864325 17394940 17700908 17781421
44428 17781421 17619459 17196443 16516114 15618130 14572190 13459715 12357010 11327482 10420721
44419 10420721 9672634 9103772 8717329 8500123 8428867 8480446 8640702 8905084 9269013 9713722
44409 9713722 10198354 10666267 11063790 11359692 11551986 11658117 11697849 11682447 11614213 11488261
44399 11488261 11288129 10978913 10510717 9839288 8955816 7908997 6806279 5792011 5010127
44390 5010127 4565039 4495441 4770255 5305414 5990726 6714108 7376185 7896543 8217288 8306745
44380 8306745 8160329 7793880 7230436 6487898 5574460 4492214 3245450 1851448 351816
44371 351816 -1181530 -2653012 -3962116 -5022997 -5772588 -6165888 -6168673 -5758811 -4938143
44362 -4938143 -3746888 -2269596 -626279 1049939 2641160 4069138 5307143 6375522
44354 6375522 7324498 8213801 9098711 10025753 11034324 12158202 13422981 14838584 16388725
44345 16388725 18021786 19648678 21151264 22400917 23282825 23719054 23682598 23197652 22327888
44336 22327888 21160387 19793147 18329046 16873094 15526420 14372077 13455708 12773602
44328 12773602 12281607 11925022 11671834 11526630 11515630 11653278 11911758 12211133 12433944
44319 12433944 12453797 12162200 11484271 10384324 8866751 6975177 4790359 2426908 26540
44310 26540 -2257545 -4286876 -5965227 -7253129 -8163960 -8749454 -9084435 -9252523 -9330121
44301 -9330121 -9370837 -9397886 -9409338 -9393081 -9342527 -9264231 -9174105 -9087344 -9012418 -8955378 -8929389
44290 -8929389 -8957406 -9061924 -9249049 -9500105 -9776510 -10031668 -10220636 -10305760 -10262829 -10088601
44280 -10088601 -9803301 -9442984 -9046615 -8647813 -8274740 -7952991 -7706695 -7558814 -7532154
44271 -7532154 -7648215 -7920773 -8346284 -8895673 -9509768 -10100471 -10563424 -10805565 -10778381 -10497033
44261 -10497033 -10031488 -9474127 -8901733 -8348556 -7797892 -7192028 -6456598 -5532273 -4403732
44252 -4403732 -3115219 -1765704 -483915 608582 1432759 1972287 2270226 2404009 2451642
44243 2451642 2466743 2472665 2471346 2454501 2410107 2326814 2199575 2032289 1831097 1591012 1288182
44232 1288182 887645 363075 -285762 -1030789 -1830023 -2647985 -3467633 -4286160 -5098404
44223 -5098404 -5879143 -6574791 -7108946 -7399626 -7380366 -7014270 -6293552 -5227638 -3831765
44214 -3831765 -2125482 -139333 2078429 4458938 6911756 9326461 11583020 13573943
44206 13573943 15229734 16532887 17513221 18230385 18755271 19157558 19499153 19829571 20180854
44197 20180854 20563552 20967307 21366760 21728765 22016792 22194073 22230745 22115570 21865269
44188 21865269 21523829 21151426 20808629 20541465 20370659 20288242 20264364 20262909 20258370 20243879
44178 20243879 20224195 20196727 20133474 19979287 19671950 19172829 18488196 17668515 16788461 15919808
44168 15919808 15108530 14362317 13650619 12916032 12092379 11123232 9975542 8645132 7153173
44159 7153173 5536246 3836345 2097401 369822 -1282486 -2781147 -4043229 -4999114
44151 -4999114 -5609624 -5874100 -5827180 -5527904 -5046771 -4454751 -3816414 -3187953 -2619275 -2157424
44141 -2157424 -1847861 -1730870 -1832895 -2156239 -2673243 -3328965 -4050247 -4755846 -5366192
44132 -5366192 -5815863 -6068843 -6128945 -6037374 -5859098 -5667563 -5534099 -5519743 -5665297 -5980577
44122 -5980577 -6437463 -6969562 -7479086 -7852156 -7983102 -7803119 -7302368 -6534403 -5599237
44113 -5599237 -4612185 -3672885 -2848202 -2173948 -1669534 -1353922 -1253152 -1395730 -1798031
44104 -1798031 -2446504 -3286127 -4222544 -5138113 -5914576 -6453715 -6691693 -6606744 -6220073 -5589202
44094 -5589202 -4795145 -3927713 -3073019 -2304548 -1677889 -1229824 -981988 -946778 -1131660 -1539511
44084 -1539511 -2164347 -2982315 -3939680 -4945149 -5877137 -6610058 -7049770 -7159915 -6967110
44075 -6967110 -6547119 -6002598 -5440641 -4952824 -4599747 -4405201 -4364325 -4463237 -4699937 -5094872
44065 -5094872 -5684777 -6501044 -7540371 -8740335 -9974109 -11072512 -11867842 -12240369 -12146460
44056 -12146460 -11619257 -10749109 -9658996 -8485719 -7366908 -6427031 -5758418 -5402471 -5341510
44047 -5341510 -5506790 -5797221 -6098329 -6296995 -6296371 -6035524 -5509019 -4773609 -3932921 -3104551
44037 -3104551 -2385658 -1832182 -1455030 -1225680 -1084046 -949212 -736716 -379036 161599
44028 161599 895755 1820339 2930834 4222857 5683041 7276591 8940886 10591078 12135949
44019 12135949 13494739 14605679 15425925 15931566 16124805 16045245 15774677 15427806 15130216
44010 15130216 14990861 15076881 15397444 15902391 16497815 17072840 17525318 17776197 17772229 17484630
44000 17484630 16909741 16070037 15009701 13782281 12434133 10990702 9451922 7799546
43992 7799546 6013810 4091720 2058740 -29639 -2094661 -4046502 -5800012 -7290756
43984 -7290756 -8485598 -9383851 -10011072 -10411511 -10642599 -10769306 -10854351 -10943682 -11052231 -11158539
43974 -11158539 -11215286 -11174715 -11016817 -10763443 -10469407 -10197073 -9990518 -9862041 -9793503 -9747916
43964 -9747916 -9685749 -9580866 -9430036 -9250685 -9067321 -8894805 -8729268 -8551791 -8340728 -8083369
43954 -8083369 -7780165 -7441442 -7081731 -6717320 -6369393 -6070913 -5872316 -5840773 -6050494 -6565883
43944 -6565883 -7422659 -8613072 -10080654 -11728163 -13438335 -15101223 -16637853 -18011499
43936 -18011499 -19224355 -20303884 -21285937 -22201112 -23067755 -23890944 -24664178 -25371717 -25992955
43927 -25992955 -26510778 -26921758 -27242127 -27504819 -27747940 -27999175 -28262432 -28513574 -28709656
43918 -28709656 -28808567 -28788035 -28652695 -28427420 -28144548 -27833839 -27518162 -27213306 -26930355 -26680538
43908 -26680538 -26481526 -26361443 -26355763 -26495301 -26789697 -27215392 -27715290 -28210013 -28614240 -28851942
43898 -28851942 -28868740 -28641655 -28184100 -27541810 -26778510 -25956684 -25122521 -24300410 -23494740
43889 -23494740 -22692906 -21867829 -20984906 -20017644 -18966496 -17867748 -16784081 -15782249 -14911978
43880 -14911978 -14196168 -13632615 -13202464 -12881548 -12651249 -12503312 -12433659 -12427782 -12449168 -12442242
43870 -12442242 -12350370 -12137424 -11799539 -11362716 -10871637 -10377509 -9928880 -9565518 -9314691
43861 -9314691 -9189924 -9192905 -9319273 -9567573 -9947313 -10479435 -11185420 -12069148 -13102325 -14222774
43851 -14222774 -15345776 -16380264 -17241548 -17860003 -18191193 -18229405 -18016517 -17634731 -17181825
43842 -17181825 -16742540 -16373111 -16103656 -15948200 -15908782 -15969324 -16085977 -16184204 -16168299 -15941409
43832 -15941409 -15429060 -14598896 -13471964 -12122816 -10666513 -9233148 -7936013 -6843873
43824 -6843873 -5966747 -5258979 -4637607 -4009652 -3298802 -2461514 -1487723 -389774 811545
43815 811545 2096260 3446822 4843088 6254441 7634862 8925501 10063654 10991883
43807 10991883 11662900 12042747 12117211 11900003 11433685 10776812 9982372 9081734 8085217
43798 8085217 6998992 5848349 4695217 3641076 2811600 2326296 2264351 2642575 3416820
43789 3416820 4504750 5813903 7256646 8745908 10183005 11455224 12451025 13084872
43781 13084872 13317371 13163010 12687291 11997388 11226937 10514080 9975834 9686848 9670766
43772 9670766 9907132 10349314 10943787 11641024 12393871 13147751 13833057 14369113 14681445
43763 14681445 14724962 14501130 14059827 13484138 12864800 12276709 11768987 11371653 11110735
43754 11110735 11017874 11124888 11443782 11941358 12522092 13032981 13296846 13164913 12564830
43745 12564830 11520846 10140452 8580812 7012706 5591381 4435680 3615569 3148640
43737 3148640 3003591 3106203 3345891 3586431 3686558 3531158 3064401 2309725 1364624
43728 1364624 371141 -522719 -1191379 -1540671 -1503993 -1039795 -138489 1165726 2789535
43719 2789535 4609302 6482575 8274776 9882492 11246049 12346778 13190536 13787212
43711 13787212 14139300 14246232 14119147 13792770 13323639 12774633 12196465 11618345 11051526
43702 11051526 10499004 9962682 9445579 8951944 8487486 8060276 7683901 7383044 7195068
43693 7195068 7158475 7289199 7560281 7901551 8221097 8435333 8492791 8384125 8137473 7802760
43683 7802760 7432820 7070626 6746540 6481581 6289826 6177114 6138388 6157685 6212493 6280652
43673 6280652 6346395 6404136 6461442 6542031 6685857 6941850 7352592 7935787 8670430 9495537
43663 9495537 10325270 11075541 11688421 12141821 12444624 12628570 12745228 12864216 13063207
43654 13063207 13406782 13921174 14575721 15279120 15893622 16264913 16260314 15803975 14896498 13610092
43644 13610092 12060731 10371684 8647298 6965805 5384608 3946080 2678949 1598088
43636 1598088 705693 -6429 -554189 -957799 -1237789 -1411206 -1487493 -1463134 -1316756 -1008825
43626 -1008825 -488789 290731 1355122 2688682 4222424 5836087 7376668 8688763
43618 8688763 9648113 10187966 10307564 10057233 9508309 8728182 7776649 6719933 5642411
43609 5642411 4639783 3796398 3164950 2765363 2603629 2694543 3068385 3754683 4755532
43600 4755532 6029477 7498003 9069506 10665542 12235929 13757566 15220387 16610275
43592 16610275 17899901 19052606 20035068 20830373 21446305 21917828 22302209 22664313 23054454
43583 23054454 23488696 23942448 24360530 24677874 24841316 24823780 24625346 24261779 23748916
43574 23748916 23093749 22296516 21358947 20291617 19118052 17876782 16621017 15414092
43566 15414092 14320781 13397162 12681073 12183728 11884579 11733797 11665010 11615288 11545387 11453968
43556 11453968 11381571 11400837 11591715 12007990 12650820 13465534 14364858 15264316 16109010 16880181
43546 16880181 17584531 18236706 18843660 19395411 19864256 20212396 20405055 20424210 20277665
43537 20277665 19998717 19634073 19224117 18786869 18317315 17804199 17254199 16708373 16240622
43528 16240622 15937799 15870589 16069093 16514283 17146167 17879148 18613108 19237224 19633882
43519 19633882 19692477 19334644 18540701 17362558 15915802 14356061 12850545 11551172 10569898
43510 10569898 9958971 9705045 9744433 9994109 10381053 10854325 11378817 11922964 12453030
43501 12453030 12936344 13346469 13663231 13867006 13931709 13820741 13488086 12885782 11977565
43492 11977565 10754447 9244916 7515320 5662997 3808209 2086450 636009 -424397
43484 -424397 -1024941 -1168480 -934809 -460025 101286 615363 995704 1209974 1268598 1202160
43474 1202160 1038518 790920 462135 59076 -394660 -857920 -1282562 -1627000 -1863719
43465 -1863719 -1977591 -1958877 -1798116 -1487223 -1025153 -423224 292289 1078238 1872005 2592928
43455 2592928 3155760 3498037 3610978 3556227 3455613 3454850 3675228 4172658 4919870 5817951
43445 5817951 6731892 7535548 8148268 8550088 8772491 8872397 8903318 8896686 8859501 8785636
43435 8785636 8671922 8528890 8379185 8243008 8117443 7962057 7701694 7248235 6531421
43426 6531421 5523821 4250200 2781439 1219186 -323245 -1740980 -2955973 -3929246
43418 -3929246 -4663064 -5192821 -5571908 -5854843 -6085312 -6295441 -6516275 -6788290 -7156503
43409 -7156503 -7646867 -8240823 -8871391 -9448219 -9895766 -10181094 -10319550 -10362955 -10381693 -10448680
43399 -10448680 -10627209 -10960706 -11461994 -12102223 -12804226 -13447381 -13888760 -13998335 -13698142
43390 -13698142 -12990110 -11959205 -10748497 -9516055 -8391171 -7444720 -6679393 -6037786 -5423014
43381 -5423014 -4725899 -3852033 -2742233 -1382590 194969 1917543 3679209 5354139
43373 5354139 6817695 7972320 8767759 9205522 9326855 9193029 8868125 8409007 7862135
43364 7862135 7265712 6655388 6069710 5550350 5135582 4851528 4708125 4702464 4825950 5069852
43354 5069852 5426774 5888342 6440147 7056682 7702222 8342107 8959660 9565270 10187590
43345 10187590 10850902 11553537 12260609 12914679 13459233 13864131 14139400 14327519 14476620
43336 14476620 14609806 14707839 14712777 14548435 14147639 13475771 12541792 11392210 10090626
43327 10090626 8692714 7228897 5702301 4100776 2414420 649070 -1169148 -2998231
43319 -2998231 -4791307 -6509818 -8131369 -9646031 -11043543 -12301920 -13384565 -14241740
43311 -14241740 -14808942 -15004658 -14738292 -13932018 -12545272 -10586803 -8110983 -5208258 -2000119
43302 -2000119 1360453 4690438 7787974 10455342 12528306 13902186 14546712 14507627 13897547
43293 13897547 12878949 11640310 10366744 9209940 8265861 7568603 7102858 6828206 6702827
43284 6702827 6697764 6801606 7020078 7371892 7878165 8545516 9349819 10230247 11097829 11854510
43274 11854510 12413874 12715871 12733677 12476540 11992474 11368815 10723943 10187134 9872240
43265 9872240 9855103 10161276 10765407 11600740 12574753 13584556 14528279 15315340 15880304
43256 15880304 16196687 16278963 16165762 15892336 15470123 14886582 14124808 13189888 12124463
43247 12124463 11002673 9906955 8903633 8030167 7294568 6681625 6165077 5726303 5371720
43238 5371720 5135578 5065129 5200968 5566782 6169054 6997230 8019317 9176961 10384974
43229 10384974 11535258 12503459 13160388 13392070 13127896 12368084 11196716 9770058 8281325
43220 8281325 6914845 5806549 5022530 4558422 4355271 4323526 4367072 4402988 4376217 4267003
43210 4267003 4086856 3863710 3626371 3399278 3206119 3069219 2996795 2967046 2926099 2806419
43200 2806419 2554811 2151654 1610254 959714 225810 -575315 -1426813 -2294165 -3116708
43191 -3116708 -3815329 -4312023 -4550937 -4512697 -4219156 -3728883 -3124538 -2493813 -1907433 -1399985
43181 -1399985 -960013 -533905 -44412 579432 1369073 2292708 3254288 4119822 4761007
43172 4761007 5096085 5110587 4853257 4414891 3901873 3412714 3020840 2765083 2650234 2658573
43162 2658573 2767363 2962099 3237502 3587474 3992412 4411280 4780611 5020790 5050653 4808540
43152 4808540 4270882 3457471 2421423 1233587 -27271 -1277873 -2436209 -3434827 -4234070
43143 -4234070 -4822583 -5202860 -5374694 -5331797 -5072918 -4613633 -3984842 -3218487 -2334251 -1339943
43133 -1339943 -245017 925259 2127612 3312552 4440693 5491233 6457826 7338946
43125 7338946 8135013 8857344 9539647 10235704 10996457 11838309 12724379 13571974 14281940
43116 14281940 14774565 15017616 15038052 14914414 14752982 14658017 14708868 14950399 15393439 16018113
43106 16018113 16777030 17600671 18408005 19121397 19680312 20047296 20204440 20145952 19875322
43097 19875322 19409650 18785334 18058426 17299738 16589041 16008482 15629603 15491495 15578316
43088 15578316 15811091 16063564 16197835 16102999 15718039 15031258 14064707 12860073 11474988
43079 11474988 9984557 8477735 7046069 5771263 4717050 3923649 3401677 3128486
43071 3128486 3053823 3116555 3265591 3475086 3748058 4108072 4582717 5186381 5912596 6742872
43061 6742872 7667332 8700680 9877155 11223329 12725855 14316670 15885929 17314436
43053 17314436 18507266 19413849 20030138 20387376 20536252 20535087 20445797 20333078 20257518 20259071
43043 20259071 20339969 20462354 20566902 20602194 20547031 20415332 20246572 20091128 19997712 20005437
43033 20005437 20140063 20411997 20812925 21310828 21848533 22352160 22749604 22990594 23057735
43024 23057735 22964006 22740406 22421661 22036995 21608660 21155116 20692132 20227482 19752639
43015 19752639 19240226 18652703 17958707 17147680 16235989 15264264 14289551 13374990 12577730
43006 12577730 11936032 11458776 11121906 10874095 10649077 10378866 10002696 9470043 8739253
42997 8739253 7776254 6559716 5096861 3445243 1725991 114215 -1194799 -2030732
42989 -2030732 -2288410 -1953085 -1107698 78602 1378873 2547489 3361052 3654452 3348697
42980 3348697 2467237 1136031 -436096 -1995293 -3291348 -4125593 -4386025 -4061962 -3237677
42971 -3237677 -2069193 -749018 535774 1642391 2495094 3084044 3445152 3635520 3717255
42962 3717255 3751705 3797201 3903663 4105159 4417948 4848555 5406199 6107397 6966576 7979946
42952 7979946 9116564 10323616 11540598 12711936 13792619 14749009 15559465 16216863 16731732
42943 16731732 17133309 17466446 17783674 18133629 18548421 19032606 19555371 20047151 20402925
42934 20402925 20494930 20194654 19398833 18051134 16153537 13766383 10999784 7999958 4933259
42925 4933259 1969114 -738262 -3068495 -4949364 -6359850 -7319058 -7866508 -8044342 -7889628
42916 -7889628 -7437907 -6733086 -5836082 -4826011 -3792354 -2821516 -1982599 -1315410 -822980
42907 -822980 -472153 -204945 41763 315728 635262 985088 1322576 1592275 1742851 1738040
42897 1738040 1557473 1191727 640112 -85200 -953157 -1913042 -2901741 -3855804 -4722787
42888 -4722787 -5468315 -6078259 -6556632 -6919942 -7189876 -7388149 -7536178 -7657179 -7774219
42879 -7774219 -7900613 -8026859 -8113397 -8095898 -7901995 -7471450 -6770083 -5792236 -4554083 -3084763
42869 -3084763 -1420597 397743 2328739 4336489 6397969 8504502 10650859 12813457
42861 12813457 14931080 16904566 18618870 19973196 20901640 21379969 21425952 21098377 20491285
42852 20491285 19719367 18897570 18122318 17459708 16942131 16572081 16329686 16180133 16080182
42843 16080182 15985770 15860249 15678615 15424559 15083887 14641218 14083532 13409141 12637943
42834 12637943 11816916 11014226 10300451 9724807 9298662 8993184 8749746 8498634 8181732
42825 8181732 7772792 7286685 6772986 6297697 5922621 5691270 5625415 5730621 6003816 6435190
42815 6435190 7002974 7667292 8369700 9038427 9595528 9965970 10092476 9954932 9583268
42806 9583268 9050767 8446349 7840377 7264408 6715738 6180881 5661815 5190444 4825843
42797 4825843 4637327 4681746 4985705 5541312 6316334 7270812 8369816 9587283 10901594
42788 10901594 12285216 13691003 15040833 16224780 17115753 17596110 17586152 17063739 16069104
42779 16069104 14695924 13075357 11360104 9710203 8277277 7185538 6514242 6288853
42771 6288853 6483655 7032390 7842250 8808962 9831872 10826957 11735183 12525394 13192957
42762 13192957 13755704 14247270 14706649 15164323 15629725 16087694 16507352 16857159 17114353
42753 17114353 17262812 17285027 17158959 16864791 16396840 15771956 15028729 14217572 13386309
42744 13386309 12567929 11776307 11011962 10275242 9580813 8965881 8485907 8196970 8132567
42735 8132567 8288751 8628278 9101437 9668307 10305712 10994900 11703077 12378797 12971141
42726 12971141 13462663 13892513 14350608 14943591 15752765 16808199 18090036 19549535 21132320
42717 21132320 22789320 24472020 26119742 27651628 28971929 29986654 30620595 30824009
42709 30824009 30567072 29829356 28594183 26854226 24628400 21982505 19040273 15973241
42701 15973241 12969854 10197659 7775674 5765367 4177762 2989439 2160485 1648544
42693 1648544 1414782 1422055 1630561 1997423 2481899 3050957 3676713 4322243 4923273 5381269
42683 5381269 5579672 5420501 4864613 3955786 2817101 1621402 548646 -252899 -689140
42674 -689140 -723094 -362631 359705 1406675 2748074 4360002 6214962 8270790 10463956
42665 10463956 12708015 14897259 16917222 18661318 20048746 21038771 21639786 21911368
42657 21911368 21954832 21891298 21836157 21882909 22099519 22527646 23175903 24012112 24968197 25962448
42647 25962448 26926196 27815892 28605202 29270645 29787934 30141272 30332965 30382758 30320110 30178695
42637 30178695 29994473 29800225 29613315 29423581 29191858 28863780 28395869 27785195 27088952
42628 27088952 26419215 25907484 25651646 25671062 25892166 26169578 26329690 26216474 25724884
42619 25724884 24818105 23531914 21968755 20280861 18642566 17216727 16123389 15417755
42611 15417755 15082034 15033939 15151225 15305143 15390496 15341901 15134344 14773532 14282487 13687440
42601 13687440 13004492 12230649 11344360 10317032 9130208 7789415 6328017 4800069
42593 4800069 3266350 1780501 381593 -905632 -2067934 -3104309 -4030595 -4882253
42585 -4882253 -5710406 -6571436 -7512988 -8559341 -9700647 -10892362 -12066431 -13146500 -14056864
42576 -14056864 -14724762 -15086507 -15104995 -14790449 -14205344 -13441928 -12581527 -11660562 -10665108
42567 -10665108 -9556511 -8311082 -6951247 -5554316 -4237727 -3127961 -2324377 -1871380
42559 -1871380 -1750148 -1892309 -2206432 -2602816 -3006527 -3358289 -3610137 -3723698 -3674570 -3460661
42549 -3460661 -3109608 -2681869 -2268283 -1980862 -1934505 -2219807 -2873943 -3862367 -5081840
42540 -5081840 -6385039 -7616787 -8649217 -9407652 -9883600 -10132312 -10253543 -10359618 -10542023
42531 -10542023 -10849112 -11281846 -11806132 -12373875 -12941098 -13473358 -13938215 -14296304 -14504095
42522 -14504095 -14529228 -14365770 -14036506 -13580758 -13036389 -12425639 -11749743 -10992221 -10126962
42513 -10126962 -9126567 -7969524 -6648140 -5176733 -3593791 -1952281 -302076 1322873
42505 1322873 2903239 4421781 5851048 7150445 8273068 9176527 9832017 10229846 10382433
42496 10382433 10324828 10110247 9798454 9439588 9061213 8666071 8241126 7770099 7239562
42487 7239562 6636140 5943249 5148146 4259471 3321877 2412568 1617264 998483 574323
42478 574323 319425 186824 137061 156520 255218 449746 746116 1132268 1579237 2045453
42468 2045453 2481456 2835147 3057746 3110504 2972242 2645809 2159864 1565079 928285 327185
42458 327185 -157273 -455363 -528199 -383798 -79972 290871 632827 882639 1033907 1136282
42448 1136282 1270812 1515284 1914212 2461099 3096373 3723605 4241432 4579091 4719622
42439 4719622 4702567 4610330 4547974 4623449 4930095 5531430 6449727 7661878 9105360 10693264
42429 10693264 12332435 13936991 15432929 16755651 17846353 18651829 19127150 19237709
42421 19237709 18959897 18284688 17227634 15841219 14219401 12487867 10783403 9231456
42413 9231456 7928479 6931067 6252528 5867611 5723908 5755382 5893720 6076044 6250229
42404 6250229 6379279 6444926 6448898 6409829 6355985 6318069 6327482 6420516 6642041 7040895 7655929
42393 7655929 8499889 9550182 10750466 12021020 13273906 14429809 15432880 16258238
42385 16258238 16908344 17401039 17758112 18002123 18161376 18275642 18394539 18565795 18817678
42376 18817678 19144799 19506135 19837509 20072204 20159653 20076000 19825778 19435744 18941814 18372711
42366 18372711 17738175 17028582 16225411 15314744 14296308 13186530 12018520 10840498 9709961
42357 9709961 8680749 7786282 7029414 6388635 5839317 5375844 5017993 4795847 4722631
42348 4722631 4772613 4878017 4948747 4907182 4721514 4419761 4075847 3775027 3577510 3497780
42338 3497780 3505430 3542066 3544963 3468917 3298912 3048152 2742873 2404082 2039098 1648370
42328 1648370 1241936 854222 548246 406919 515360 941740 1723843 2864762 4336845
42319 4336845 6090619 8064597 10191263 12396115 14592146 16677662 18544203 20092829
42311 20092829 21249822 21973818 22253538 22100966 21544921 20626883 19398188 17917157 16245805
42302 16245805 14446856 12581746 10708939 8881541 7144484 5532784 4071636 2777483
42294 2777483 1659037 718510 -46219 -638620 -1060505 -1309558 -1378333 -1256736 -939191
42285 -939191 -433469 235904 1034606 1932596 2915436 3985166 5151882 6423326 7798092
42276 7798092 9262483 10788579 12333189 13839455 15242487 16478597 17496657 18269248
42268 18269248 18800126 19124146 19297640 19381556 19424343 19453690 19482797 19527925 19625077 19832780
42258 19832780 20217240 20828218 21679190 22740569 23945818 25204885 26419561 27498126
42250 27498126 28368133 28986277 29344520 29471849 29429671 29297021 29144703 29006752 28865585
42241 28865585 28662786 28331124 27828710 27156693 26355248 25485452 24607569 23762652 22961731
42232 22961731 22186506 21402127 20574439 19678490 18691250 17577390 16287091 14776375 13039778
42223 13039778 11132693 9168097 7290303 5639408 4319418 3378569 2807785 2558791
42215 2558791 2573931 2811104 3249514 3875481 4662131 5559935 6504828 7436526 8313682 9118208
42205 9118208 9850546 10521596 11144525 11727150 12266935 12751914 13167738 13506016 13768766
42196 13768766 13968887 14130570 14290583 14495081 14786060 15179900 15649820 16124394 16504707
42187 16504707 16692205 16615609 16248304 15612611 14771810 13814850 12840116 11941989 11199222
42178 11199222 10662736 10343939 10208632 10181578 10162894 10052380 9774253 9293422 8617481 7785577
42168 7785577 6851997 5872806 4897596 3962740 3084290 2255515 1456098 671894 -86630
42159 -86630 -780151 -1352303 -1746993 -1918522 -1830849 -1453560 -765846 227449 1476755 2882584
42149 2882584 4314752 5649568 6805445 7758440 8531698 9166474 9691127 10105522 10388207
42140 10388207 10516456 10479223 10272801 9889518 9318143 8561513 7657754 6686293 5750802
42131 5750802 4946802 4331045 3909338 3648619 3503492 3438737 3434884 3477814 3543129 3586843
42121 3586843 3549170 3370989 3014319 2473853 1771815 940706 7616 -1007411 -2076441
42112 -2076441 -3142195 -4107821 -4851862 -5266188 -5297149 -4966260 -4359736 -3594052 -2774543
42103 -2774543 -1964361 -1175871 -387487 424047 1255862 2073303 2829082 3492936 4071521
42094 4071521 4606546 5153712 5754786 6415373 7095889 7718449 8188425 8423917 8381428 8067550
42084 8067550 7534678 6866176 6157155 5494376 4938317 4512038 4200527 3960456 3737375
42075 3737375 3486605 3193093 2883894 2627479 2517970 2647550 3074732 3799179 4753924
42066 4753924 5820356 6861393 7759390 8443205 8894229 9131253 9184229 9072013 8794845
42057 8794845 8341529 7702682 6881074 5894883 4773623 3548438 2241537 862226 -585449
42048 -585449 -2086629 -3600928 -5057466 -6361212 -7406894 -8096542 -8358463 -8165536 -7548618
42039 -7548618 -6598991 -5455247 -4276134 -3208752 -2365147 -1815414 -1595005 -1716507 -2177193
42030 -2177193 -2961301 -4042304 -5389548 -6976292 -8780505 -10773514 -12902774 -15082451
42022 -15082451 -17200346 -19137466 -20789742 -22084650 -22990845 -23519956 -23719361 -23658369 -23414689
42013 -23414689 -23066620 -22689832 -22353341 -22111372 -21992485 -21990420 -22061538 -22131815 -22112752 -21922502
42003 -21922502 -21508160 -20865351 -20048506 -19162812 -18334500 -17669567 -17220087 -16972443 -16858301
41994 -16858301 -16779633 -16637913 -16359592 -15911118 -15299501 -14560579 -13742572 -12892932 -12052186
41985 -12052186 -11253183 -10521140 -9870826 -9301091 -8790493 -8297601 -7766945 -7140207 -6372410
41976 -6372410 -5450155 -4402874 -3296040 -2203791 -1173474 -202794 756440 1770470 2888357
41967 2888357 4119089 5432387 6780850 8129275 9473173 10834654 12237267 13674234
41959 13674234 15088478 16375124 17404088 18052380 18236477 17938492 17219205 16209483 15077601
41950 15077601 13983268 13038247 12288833 11721619 11283417 10904747 10519692 10077789 9546473
41941 9546473 8906652 8147359 7264649 6265541 5173143 4026548 2870704 1737678 628832
41932 628832 -489568 -1671511 -2963393 -4377114 -5876238 -7380217 -8784565 -9990079
41924 -9990079 -10930947 -11591363 -12005268 -12242253 -12388704 -12532896 -12756684 -13129994 -13702282
41915 -13702282 -14489007 -15458237 -16527236 -17577032 -18483843 -19154775 -19549541 -19676378 -19566477
41906 -19566477 -19245174 -18717887 -17974843 -17004750 -15806133 -14393701 -12803045 -11093830 -9346523
41897 -9346523 -7649536 -6080742 -4690783 -3492481 -2457241 -1520434 -598515 384294 1470178
41888 1470178 2655175 3894848 5122642 6270364 7282676 8123913 8781017 9267065 9624389
41879 9624389 9919806 10225119 10586610 10998526 11396411 11675374 11725017 11465616 10871072 9971453
41869 9971453 8838311 7563298 6239418 4947476 3747336 2677465 1767027 1055123
41861 1055123 600230 466322 691874 1264399 2118816 3158031 4279526 5394386 6436945
41852 6436945 7369493 8183584 8895422 9534771 10132199 10711396 11289276 11880393 12499788
41843 12499788 13160767 13868778 14615251 15374851 16107569 16766103 17308427 17713049 17990530
41834 17990530 18183682 18354331 18563072 18852584 19241202 19725627 20286847 20894270 21507785
41825 21507785 22080795 22565694 22918646 23099517 23068921 22790984 22247347 21455829 20479371
41816 20479371 19416405 18376487 17451753 16693330 16098866 15616203 15164193 14663134 14061205
41807 14061205 13346159 12540856 11688888 10838474 10030338 9290885 8627813 8024160 7430991
41798 7430991 6765318 5921462 4797196 3325151 1494823 -644050 -2994582 -5432202
41790 -5432202 -7821484 -10028602 -11934172 -13451465 -14547834 -15257601 -15671927 -15901741 -16028262
41781 -16028262 -16066220 -15957859 -15598416 -14880948 -13744783 -12211383 -10391941 -8459479 -6596778
41772 -6596778 -4946718 -3588632 -2544787 -1803051 -1338489 -1125084 -1137658 -1347920 -1719509
41763 -1719509 -2207368 -2765309 -3360500 -3987187 -4669775 -5450673 -6367819 -7433414 -8624215
41754 -8624215 -9885892 -11145855 -12326913 -13358559 -14187753 -14789927 -15175070 -15381542 -15457689
41745 -15457689 -15442052 -15355555 -15210113 -15026085 -14845459 -14730567 -14746364 -14933928 -15289134 -15758195
41735 -15758195 -16251693 -16668961 -16922502 -16955594 -16749486 -16319023 -15700160 -14937372 -14077536
41726 -14077536 -13169358 -12262355 -11402569 -10628239 -9969533 -9451599 -9097070 -8925787 -8952316
41717 -8952316 -9181212 -9598643 -10161776 -10792973 -11386451 -11827271 -12013402 -11871385 -11364211
41708 -11364211 -10495962 -9314799 -7909538 -6394875 -4887042 -3477860 -2215814 -1099508
41700 -1099508 -84772 897125 1916239 3022796 4233288 5525557 6842107 8099667
41692 8099667 9202459 10056093 10579263 10712210 10424334 9724453 8672353 7381733 6003211
41683 6003211 4687644 3545987 2626095 1914640 1355875 873102 385097 -180905 -875016
41674 -875016 -1709506 -2649934 -3620508 -4522545 -5254989 -5727102 -5865073 -5621103 -4985811 -3993873
41664 -3993873 -2715079 -1236853 348779 1949331 3474316 4842900 5994138 6892784
41656 6892784 7528776 7914691 8084413 8091295 8002392 7888161 7810531 7813289 7918054 8127583
41646 8127583 8435445 8837253 9336736 9942378 10656177 11460955 12312761 13141527 13859691
41637 13859691 14377550 14623860 14568008 14235952 13710331 13109970 12554527 12129581 11867939
41628 11867939 11753224 11738380 11765146 11775571 11718279 11558901 11298548 10991383 10745166 10695428
41618 10695428 10960390 11597123 12580633 13816093 15176843 16547084 17847516 19035951
41610 19035951 20092992 21009755 21786092 22434213 22977820 23443248 23847913 24194120 24472233
41601 24472233 24670412 24783747 24816609 24777336 24669954 24489249 24223126 23862139 23411710 22899202
41591 22899202 22368807 21864118 21407239 20986511 20559722 20070936 19473667 18752554 17937772
41582 17937772 17109083 16388142 15918322 15833030 16219176 17089659 18378600 19961010 21683435
41573 21683435 23388608 24928690 26174929 27032099 27454667 27453029 27081581 26412262 25505997
41564 25505997 24395019 23083313 21564676 19850492 17994217 16099626 14306227 12755553
41556 12755553 11550955 10726514 10236338 9967118 9769342 9498427 9054807 8410673 7613516
41547 7613516 6765690 5990055 5396395 5059198 5009995 5242009 5721069 6394900 7196035 8041406
41537 8041406 8836362 9486588 9913701 10067729 9932396 9521486 8866572 8001821 6956294
41528 6956294 5758432 4444142 3055286 1627729 183143 -1262934 -2681031 -4012630
41520 -4012630 -5172942 -6071042 -6637052 -6844559 -6719542 -6331863 -5771763 -5120755 -4429591
41511 -4429591 -3712620 -2959112 -2153417 -1292394 -391061 525559 1438368 2345518 3258129
41502 3258129 4180271 5086912 5917124 6588866 7026023 7181969 7049476 6656350 6052694
41493 6052694 5297673 4451322 3571375 2710392 1909856 1193665 566264 16938 -473000
41484 -473000 -923308 -1348295 -1750647 -2118999 -2433739 -2680073 -2859911 -2993528 -3110656 -3240052
41474 -3240052 -3405931 -3629938 -3930348 -4314366 -4768112 -5251008 -5696719 -6019904 -6129564
41465 -6129564 -5948939 -5435948 -4594224 -3469469 -2134479 -670461 849136 2368447 3850887
41456 3850887 5273827 6620327 7871997 9005220 9992339 10809568 11450321 11936989 12322005
41447 12322005 12674331 13056563 13503161 14008485 14527310 14986213 15303468 15415062 15300660
41438 15300660 14998020 14595406 14202723 13915664 13790532 13837612 14027432 14298835 14563383
41429 14563383 14710432 14621757 14198754 13393499 12227938 10790662 9213474 7639214 6192120
41420 6192120 4956853 3968640 3215567 2652266 2221396 1876739 1600465 1408217 1340357
41411 1340357 1444771 1760207 2305765 3075249 4032151 5104863 6187706 7154847 7888316
41402 7888316 8310695 8405282 8210139 7788442 7194303 6455446 5579019 4569227 3441592
41393 3441592 2228517 980666 -231890 -1321500 -2192857 -2760468 -2965640 -2783786 -2219921
41384 -2219921 -1299320 -63014 1429159 3095156 4836140 6551631 8156228 9590545
41376 9590545 10827049 11875312 12785237 13639456 14528523 15514822 16602192 17727958 18781616
41367 18781616 19639435 20197563 20392042 20205023 19661664 18819794 17752722 16530325 15208837
41358 15208837 13835429 12461218 11148596 9964677 8966504 8191766 7663100 7400289 7425703
41349 7425703 7753986 8372193 9227145 10232009 11289752 12320574 13280516 14164789 14996337
41340 14996337 15806114 16615053 17425455 18222719 18983698 19688748 20335295 20946835 21568400
41331 21568400 22245773 22998449 23802667 24594048 25286559 25797243 26067809 26078871 25854248
41322 25854248 25451883 24940393 24368891 23746327 23044328 22222715 21261118 20177623 19027005
41313 19027005 17884843 16829307 15929174 15240301 14806358 14656135 14792605 15178106 15728359
41304 15728359 16326191 16853109 17222993 17399002 17385861 17206701 16883530 16435200 15891586
41295 15891586 15310661 14785151 14434473 14385621 14748389 15588868 16905911 18618183 20569399
41286 20569399 22553284 24350575 25765336 26650621 26920971 26554277 25585865 24096604 22198160
41277 22198160 20020816 17707706 15413385 13298954 11516321 10181201 9344021 8973303
41269 8973303 8962717 9161898 9419005 9618531 9702734 9673927 9581052 9496905 9494587 9632326 9951258
41258 9951258 10481873 11249211 12270141 13544320 15044606 16710637 18446893 20128573
41250 20128573 21620636 22809994 23639303 24124557 24346217 24419977 24463773 24574349 24815869
41241 24815869 25216556 25770650 26445014 27187803 27934439 28609498 29129102 29409820 29384571
41232 29384571 29019525 28323479 27343532 26147021 24798278 23343899 21814643 20238072
41224 20238072 18648030 17084705 15593027 14228534 13065364 12188998 11664817 11496931
41216 11496931 11606449 11848442 12060761 12118482 11968857 11637531 11211672 10810950 10555883
41207 10555883 10540792 10816731 11386576 12210723 13219602 14328411 15449700 16501405 17412041
41198 17412041 18126723 18614221 18869707 18908660 18755156 18433576 17968616 17388902 16725972
41189 16725972 16006849 15246176 14443752 13586240 12647996 11590272 10364735 8926534 7253877
41180 7253877 5364083 3317445 1207745 -855364 -2764767 -4429049 -5778378 -6766082
41172 -6766082 -7371132 -7603729 -7510406 -7172685 -6695945 -6190188 -5748844 -5433793 -5271819 -5260004
41162 -5260004 -5372129 -5561705 -5765867 -5915570 -5948479 -5814063 -5466907 -4858476 -3942488 -2697620
41152 -2697620 -1154200 595102 2410477 4138533 5646163 6840587 7673513 8135643
41144 8135643 8247699 8051148 7601104 6963586 6215580 5441773 4722433 4113820 3630562
41135 3630562 3241873 2887300 2505975 2064809 1573277 1082799 676120 450743 496988 873578
41125 873578 1588643 2593708 3792919 5065334 6295640 7404018 8361818 9184748 9909281
41116 9909281 10568583 11180863 11751289 12280202 12770608 13232156 13681725 14141250 14633290
41107 14633290 15175294 15774399 16424309 17104875 17785104 18431418 19020631 19550032 20033864
41098 20033864 20484447 20890877 21211648 21385174 21349095 21058898 20503320 19715193 18772083
41089 18772083 17782664 16864178 16122756 15644481 15496025 15728571 16379107 17466389 18983218
41080 18983218 20890393 23117359 25569108 28133481 30683993 33080107 35172467 36819103
41072 36819103 37910918 38397406 38302184 37722901 36816345 35772811 34784354 34012561 33563123
41063 33563123 33473773 33717109 34213367 34845686 35474047 35950822 36143302 35962414 35386594
41054 35386594 34466677 33307142 32033213 30759497 29570338 28513522 27604719 26839274
41046 26839274 26206776 25702623 25332406 25108563 25041083 25124955 25328432 25587584 25811636 25899462
41036 25899462 25762914 25349765 24658570 23740106 22685028 21602702 20598662 19757244 19134078
41027 19134078 18760420 18655742 18838001 19320209 20092718 21105434 22267770 23470618 24616214
41018 24616214 25636830 26495201 27174790 27671713 27992713 28155588 28187594 28120847 27986176
41009 27986176 27807024 27594945 27348352 27055147 26698237 26262672 25744951 25165352 24580597
41000 24580597 24089520 23824506 23928528 24525945 25697366 27463824 29780062 32536683 35573636
40991 35573636 38705804 41754201 44571298 47053527 49144084 50833343 52158034 53192754
40983 53192754 54029267 54749187 55401767 55994293 56495036 56846992 56991983 56900197 56591745
40974 56591745 56136716 55634251 55186459 54883254 54799654 54994116 55497735 56296751 57322403
40965 57322403 58462695 59598106 60644917 61580139 62432156 63245866 64048883 64840305 65602325
40956 65602325 66319246 66990550 67636112 68297433 69035274 69919877 71012745 72345614 73905250
40947 73905250 75629213 77412466 79122845 80623895 81801849 82588707 82971091 82980225 82669319
40938 82669319 82092190 81294042 80315505 79202880 78017170 76838566 75765866 74909687 74378469
40929 74378469 74260089 74606812 75431391 76716003 78428308 80536106 83014684 85844956
40921 85844956 89003444 92447945 96106403 99877887 103649548 107323770 110843419 114205400
40913 114205400 117459528 120693924 124009178 127486949 131164569 135028013 139025946 143094712
40905 143094712 147179679 151244964 155272826 159258251 163202976 167110225 170979757 174803662
40897 174803662 178566034 182250138 185851439 189386552 192886113 196368971 199809924 203121435
40889 203121435 206164011 208783676 210858663 212331816 213213706 213558275 213426844 212860439
40881 212860439 211874181 210474525 208686120 206568070 204206858 201690982 199086171 196427984
40873 196427984 193734737 191030525 188363784 185810235 183457041 181375171 179594183 178092285
40865 178092285 176805452 175650056 174549541 173456729 172365724 171310083 170347028 169531423
40857 169531423 168888251 168396637 167996065 167613233 167193536 166718191 166199509 165661242 165116164
40848 165116164 164550659 163922857 163176864 162267121 161178433 159929150 158557802 157105136
40840 157105136 155604028 154082092 152574318 151138315 149861925 148854519 148222542 148041508
40832 148041508 148340043 149102768 150286802 151841720 153726047 155917435 158414247 161226586
40824 161226586 164359091 167793561 171481116 175349166 179321618 183345216 187411496 191563749
40816 191563749 195883921 200464596 205378939 210660247 216295061 222227356 228369581 234616130
40808 234616130 240854994 246976187 252880857 258496016 263793023 268799617 273595287 278288222
40800 278288222 282981226 287737932 292560085 297383427 302093005 306550409 310621215 314193749
40792 314193749 317186358 319544653 321232189 322220653 322487711 322027551 320869714 319092221
40784 319092221 316814818 314170758 311272381 308191745 304965204 301610945 298140691 294558573
40776 294558573 290857499 287026799 283072435 279037378 275008300 271104290 267453626 264169035
40768 264169035 261329751 258973534 257097507 255665645 254621944 253907467 253475899 253300172
40760 253300172 253366962 253663944 254169278 254849994 255668940 256594912 257610539 258715161 259922484
40751 259922484 261254095 262730705 264363507 266147147 268054176 270030491 271993601 273837631
40743 273837631 275447364 276718192 277574431 277978392 277927012 277438880 276539546 275254150 273612117
40734 273612117 271660998 269479880 267181217 264893868 262729003 260741504 258906312 257125068
40726 257125068 255264076 253208967 250913227 248419821 245845782 243336440 241011385 238927135
40718 238927135 237067755 235356577 233675726 231887176 229856313 227477678 224696824 221520821
40710 221520821 218013290 214274691 210413672 206520098 202650361 198827636 195049953 191297458
40702 191297458 187537621 183733680 179859017 175912542 171926971 167966672 164117820 160474243
40694 160474243 157118709 154098826 151402612 148945228 146576970 144112643 141372244 138219631
40686 138219631 134588616 130489765 125995620 121209739 116233458 111145828 106003060 100851051
40678 100851051 95739244 90728302 85890714 81305649 77048959 73180991 69738430 66735531
40670 66735531 64172876 62044708 60337807 59024870 58062830 57402475 57003750 56843875 56911208
40661 56911208 57190620 57652536 58251996 58933808 59636427 60292458 60829283 61173145 61256544
40652 61256544 61027219 60456967 59546871 58323988 56828512 55099264 53169884 51080618
40644 51080618 48896427 46715204 44657410 42842600 41365728 40281722 39599181 39281861
40636 39281861 39258801 39442357 39747219 40100930 40443117 40719810 40880657 40880612 40682868 40261374
40626 40261374 39603958 38715724 37619213 36348400 34938337 33416089 31798256 30096715
40618 30096715 28329743 26532902 24763919 23098653 21619648 20402641 19506728 18969652
40610 18969652 18803898 18989025 19463200 20124215 20846915 21511047 22024757 22333677 22417887
40601 22417887 22285763 21970655 21529281 21037304 20578891 20231263 20048664 20051009 20220887 20510369
40591 20510369 20856608 21200956 21502543 21739313 21897995 21961334 21899584 21668320 21213496 20485867
40581 20485867 19462756 18167678 16677133 15111918 13618119 12343342 11411179 10897891
40573 10897891 10817262 11117465 11689556 12386678 13054178 13566804 13860578 13944282 13885058 13777342
40563 13777342 13711740 13755572 13946163 14291240 14771309 15343357 15947652 16518314 16996092 17341510
40553 17341510 17547134 17646477 17714165 17852052 18162716 18721756 19563862 20688955 22079281
40544 22079281 23710278 25545603 27523288 29549755 31512504 33306168 34855065 36118569
40536 36118569 37080677 37737640 38095264 38173172 38003677 37619420 37038298 36258637 35267707
40527 35267707 34056155 32631669 31031277 29331462 27649224 26126841 24902683 24080195
40519 24080195 23706955 23767282 24185653 24839023 25578836 26260899 26774325 27057915 27098931 26919704
40509 26919704 26561381 26069225 25479025 24806300 24044824 23179020 22205380 21150669 20076598
40500 20076598 19069623 18222038 17611865 17285703 17246258 17447555 17802860 18207724 18572086
40491 18572086 18848206 19042370 19206455 19414131 19731526 20193832 20796774 21504012 22262638
40482 22262638 23016327 23711195 24296457 24724705 24955498 24963122 24745258 24325777 23747168 23055947
40472 23055947 22289583 21469772 20600676 19671202 18665153 17580757 16450623 15346920 14364500
40463 14364500 13589948 13073437 12817295 12784763 12920906 13170390 13479803 13785732 14003938
40454 14003938 14035303 13790168 13217918 12326329 11182715 9897448 8595501 7385606 6337965
40445 6337965 5476337 4781119 4195677 3633278 2989362 2164438 1095128 -217664 -1697075
40436 -1697075 -3203141 -4566896 -5631123 -6280570 -6453427 -6139674 -5377805 -4254813 -2903256
40427 -2903256 -1485933 -166749 922202 1703356 2158697 2319696 2249547 2023655 1712492
40418 1712492 1371628 1041898 755745 540523 414216 378320 414279 482494 519784 438996
40408 438996 141010 -458401 -1399779 -2665703 -4184817 -5845073 -7507855 -9023147 -10249043
40399 -10249043 -11073799 -11434171 -11324948 -10798164 -9952339 -8913242 -7810006 -6752834 -5817998
40390 -5817998 -5042072 -4423373 -3927540 -3496386 -3061073 -2558554 -1945079 -1198789 -309684
40381 -309684 733993 1949460 3347695 4916044 6612419 8379605 10169806 11960068
40373 11960068 13748825 15542332 17346303 19166877 21012016 22885942 24780526 26671319
40365 26671319 28518459 30267362 31849139 33186739 34209111 34867371 35145867 35066488 34686248
40356 34686248 34084879 33340711 32502789 31574119 30515479 29266267 27770477 25996684 23947162
40347 23947162 21657893 19195033 16651554 14142093 11791393 9716715 8010991 6733106
40339 6733106 5904953 5511017 5499002 5784459 6262528 6826113 7385719 7883953 8298602 8633166
40329 8633166 8900354 9107570 9251004 9318962 9299459 9184851 8969259 8641978 8185512 7583496
40319 7583496 6833522 5954096 4980336 3953205 2910784 1885261 903539 -11650 -840737
40310 -840737 -1565041 -2162038 -2599542 -2833205 -2812171 -2493027 -1856015 -915649 278061 1647407
40300 1647407 3102408 4562242 5977309 7341709 8686707 10054824 11466234 12895641
40292 12895641 14273462 15511842 16541703 17341133 17941524 18410814 18823671 19231983 19647218
40283 19647218 20040986 20361592 20555227 20578830 20401267 20001507 19373685 18538241 17548970
40274 17548970 16487628 15446878 14508580 13725809 13115997 12668030 12356925 12153528 12023010
40265 12023010 11919679 11790818 11592594 11309052 10963247 10615589 10349669 10249112 10373393
40256 10373393 10742425 11334151 12090893 12928272 13745349 14437825 14913811 15108417 14992723
40247 14992723 14573343 13881332 12955657 11832652 10549778 9159732 7741707 6399551
40239 6399551 5246412 4381913 3869048 3718064 3883991 4280300 4804233 5364557 5902444
40230 5902444 6399843 6875148 7370433 7935327 8610338 9411823 10323483 11299754 12280486
40221 12280486 13208795 14043249 14761533 15358399 15841831 16229932 16548830 16829221 17098548
40212 17098548 17370285 17637140 17873980 18048731 18134094 18114969 17991264 17777703 17501625 17199562
40202 17199562 16912586 16678848 16522742 16445232 16422965 16418468 16395029 16327867 16209649 16053617
40192 16053617 15894956 15785725 15780069 15914589 16193795 16586310 17028934 17433351 17696276 17718481
40182 17718481 17432440 16826759 15952128 14904145 13793242 12717902 11752045 10948059 10348866
40173 10348866 9997544 9934023 10178007 10709817 11464759 12347054 13255744 14109171 14859137
40164 14859137 15492960 16025588 16485308 16898003 17276495 17620463 17927388 18207595 18492493
40155 18492493 18829066 19263804 19826761 20524417 21341192 22243480 23182322 24096650 24920741
40146 24920741 25594983 26074209 26328716 26339100 26091035 25575403 24794183 23768205 22541624
40137 22541624 21179232 19755587 18339468 16981417 15711298 14545907 13499039 12585195
40129 12585195 11814290 11182398 10666562 10228371 9824119 9414082 8964561 8443252 7815256
40120 7815256 7046931 6118184 5036882 3846750 2622638 1453290 418949 -425197 -1052948
40111 -1052948 -1460818 -1659201 -1666101 -1503617 -1196234 -771339 -261112 296943 861956 1391410
40101 1391410 1840702 2164363 2324881 2307816 2132292 1845798 1503766 1146775 790252 431721
40091 431721 68307 -288647 -611806 -870024 -1046199 -1147133 -1195292 -1205304 -1161776 -1016133
40081 -1016133 -705537 -180194 577320 1545743 2666182 3845144 4960396 5873312 6448773
40072 6448773 6579797 6211519 5357552 4103010 2592846 1008967 -458701 -1642532 -2423969
40063 -2423969 -2751122 -2642734 -2177126 -1468180 -634427 228412 1060671 1834652 2540833
40054 2540833 3176120 3739933 4235751 4672867 5065706 5430328 5778183 6107212 6392199
40045 6392199 6579217 6590897 6347256 5799253 4962848 3936608 2890466 2025210 1516678
40036 1516678 1468406 1894350 2736895 3904130 5301664 6844992 8456800 10062250 11590222
40027 11590222 12979997 14189004 15197228 16005031 16624275 17067397 17340665 17444084 17375462
40018 17375462 17135324 16731096 16178932 15500800 14716644 13836551 12859771 11783305 10615760
40009 10615760 9388264 8155582 6986283 5947576 5093481 4461157 4072463 3934102 4033821
40000 4033821 4336418 4784157 5302276 5808578 6228039 6512718 6660743 6722860 6789628 6963845
39990 6963845 7330209 7932107 8760055 9754202 10822351 11869210 12824395 13655019 14357927
39981 14357927 14939358 15395254 15701276 15814141 15681904 15259837 14527704 13503070 12246054
39972 12246054 10853949 9446452 8143656 7041599 6193550 5604360 5237771 5029177 4897420
39963 4897420 4756463 4530594 4170412 3659889 3007730 2228108 1325139 293551 -863777
39954 -863777 -2113221 -3378989 -4552326 -5517476 -6180477 -6485930 -6415173 -5971057 -5163435
39945 -5163435 -4008656 -2544183 -844494 978522 2794472 4480461 5939325 7105483
39937 7105483 7943518 8445283 8627389 8528721 8206745 7730358 7167823 6572664 5974254 5378783
39927 5378783 4780001 4172286 3555913 2929466 2275320 1552350 706125 -307339 -1499089
39918 -1499089 -2838883 -4263509 -5695446 -7062770 -8311765 -9407424 -10323564 -11030306
39910 -11030306 -11487846 -11651863 -11489998 -11002208 -10232928 -9266006 -8205081 -7152355 -6196110
39901 -6196110 -5405836 -4827552 -4477019 -4335859 -4356024 -4472797 -4621988 -4754702 -4842804 -4871768
39891 -4871768 -4824919 -4669048 -4350721 -3806753 -2985425 -1869454 -489275 1081011 2743046
39882 2743046 4398734 5969245 7403013 8671798 9757491 10637760 11282232 11665411 11789246
39873 11789246 11699597 11485888 11266376 11169174 11315927 11807067 12704747 14014468 15673511
39864 15673511 17555576 19493605 21312285 22857150 24012213 24707303 24920849 24680660
39856 24680660 24059925 23165212 22118523 21039556 20031880 19170894 18490406 17971031 17540412
39847 17540412 17093533 16530883 15799926 14919821 13974872 13078099 12324673 11761793 11389274
39838 11389274 11181886 11110409 11145041 11243978 11343611 11364975 11237832 10930179 10465816 9918714
39828 9918714 9386002 8952682 8663655 8513012 8452180 8412166 8330920 8175261 7948776 7683362
39818 7683362 7420199 7191524 7014176 6898502 6864996 6954015 7217650 7695692 8388949 9244241
39808 9244241 10157823 10996395 11630738 11972835 12001719 11763731 11346225 10842476 10331273 9879130
39798 9879130 9551088 9410620 9504320 9844682 10405466 11131452 11953989 12804231 13621621 14358423
39788 14358423 14981324 15471515 15824124 16045512 16146090 16130331 15990602 15710643 15277422
39779 15277422 14693978 13985789 13197582 12382438 11589231 10856002 10212941 9689825 9317010
39770 9317010 9114196 9073862 9154303 9291499 9424725 9520715 9583177 9644725 9746731 9915511
39760 9915511 10143491 10384487 10568711 10632168 10543713 10313505 9980705 9592425 9186981 8785264
39750 8785264 8387231 7971928 7503373 6944744 6278918 5527916 4760703 4082386 3608892
39741 3608892 3441328 3651971 4280201 5327147 6743702 8420438 10192928 11867272 13257991
39732 13257991 14224436 14693380 14660953 14174810 13305760 12122715 10681826 9031885 7229207
39723 7229207 5351472 3502170 1803037 377233 -671239 -1275834 -1418053 -1126411 -463310
39714 -463310 495612 1681337 3042448 4544225 6159666 7859988 9609748 11366414
39706 11366414 13081648 14703266 16178712 17460145 18510083 19307095 19850380 20159342
39698 20159342 20264745 20195261 19969711 19600520 19101964 18492865 17792666 17019408 16195978
39689 16195978 15361306 14578266 13932259 13518333 13418200 13673986 14270601 15136251 16160954
39680 16160954 17223970 18219107 19070393 19735250 20196666 20449539 20487840 20298441 19864888
39671 19864888 19179875 18259145 17146679 15906425 14606202 13304827 12048881 10876936
39663 10876936 9824708 8925908 8207502 7682267 7344292 7170879 7127941 7172362 7248805 7286179
39653 7286179 7201118 6910708 6350355 5490314 4345382 2974741 1471634 -54836 -1502046
39644 -1502046 -2795391 -3902291 -4832158 -5621444 -6311814 -6933965 -7504918 -8036226 -8542872
39635 -8542872 -9043220 -9548993 -10053963 -10532279 -10949102 -11275291 -11495537 -11607023 -11613988 -11524212
39625 -11524212 -11348632 -11101742 -10800244 -10458588 -10082104 -9661652 -9175341 -8600008 -7928708
39616 -7928708 -7185595 -6429582 -5743091 -5209611 -4889456 -4803024 -4924984 -5187421 -5489022 -5708517
39606 -5708517 -5719948 -5406691 -4674162 -3464298 -1771576 347311 2779443 5378023 7992017
39597 7992017 10492590 12790721 14844070 16652114 18241331 19646790 20898015 22012983
39589 22012983 22998628 23853995 24573543 25150187 25578410 25857059 25990929 25991213 25876399 25674582
39579 25674582 25424858 25173591 24964396 24826436 24768152 24780119 24844707 24946409 25076612 25229563
39569 25229563 25391316 25528683 25587352 25504194 25229199 24744219 24066212 23233385 22284800 21246737
39559 21246737 20130895 18940461 17678909 16360610 15022747 13732667 12582110 11666442
39551 11666442 11058508 10791694 10859897 11230051 11856348 12689134 13679394 14782763 15963069
39542 15963069 17190826 18433972 19645124 20754796 21678666 22339923 22698699 22774117 22645046
39533 22645046 22425583 22225850 22118122 22124775 22230253 22404406 22620125 22856635 23092823 23300920
39523 23300920 23446075 23489703 23393461 23125462 22671805 22050592 21318793 20563477 19878235 19335230
39513 19335230 18965315 18752740 18642722 18556080 18406481 18118098 17640855 16958317 16084756
39504 16084756 15053220 13901337 12662042 11362607 10029718 8694260 7390378 6149913
39496 6149913 4998798 3959373 3054265 2304235 1719252 1290393 990217 782168 633991
39487 633991 529657 476024 502226 652070 971935 1497121 2239948 3184443 4292113 5516554
39477 5516554 6816027 8153088 9482132 10737735 11836779 12695579 13251814 13479332 13390856
39468 13390856 13031185 12466091 11770265 11016089 10265599 9567931 8960755 8469859 8102321
39459 8102321 7836312 7616886 7365160 7000063 6463637 5738045 4845382 3830611 2739734
39450 2739734 1610705 485121 -570542 -1456494 -2057171 -2276566 -2069976 -1455912 -506372
39441 -506372 676472 1987503 3341357 4683628 5987465 7239643 8425087 9517609
39433 9517609 10479160 11265037 11830771 12137185 12153160 11859281 11256058 10375424 9287672
39424 9287672 8095136 6911463 5835312 4930888 4222045 3697381 3319095 3031259 2768646
39415 2768646 2468820 2086679 1606616 1047205 456502 -100603 -559666 -874136 -1027150
39406 -1027150 -1031264 -913263 -690296 -352381 135073 809133 1682840 2730432 3888174
39397 3888174 5065004 6158763 7078513 7769993 8232983 8518260 8702106 8849492 8983802
39388 8983802 9077863 9070131 8896517 8520959 7951128 7235472 6446363 5658668 4934317 4319422
39378 4319422 3850524 3558583 3462988 3559916 3815414 4168044 4537982 4838715 4990920 4938039
39368 4938039 4659455 4175673 3542328 2834360 2126343 1477543 927058 497030 197389
39359 197389 28251 -19202 37806 173087 349953 521496 634994 639716 496088 184383
39349 184383 -290610 -904550 -1629750 -2454404 -3390250 -4459606 -5667369 -6975714 -8298850
39340 -8298850 -9522108 -10534111 -11255754 -11657114 -11762366 -11643433 -11400049 -11128254 -10890251
39331 -10890251 -10702243 -10545524 -10390115 -10214664 -10013689 -9793379 -9561723 -9318161 -9046597
39322 -9046597 -8714931 -8282466 -7712715 -6985413 -6102272 -5086835 -3983951 -2862292 -1815241
39313 -1815241 -951001 -368580 -127555 -226137 -598524 -1132608 -1699499 -2182335 -2494976 -2588790
39303 -2588790 -2451880 -2105327 -1597185 -992210 -356361 261450 845108 1417778 2033899
39294 2033899 2756916 3631129 4660393 5802910 6982088 8105717 9084355 9843820 10331805
39285 10331805 10521389 10413330 10035884 9439292 8685239 7837136 6957980 6115608 5387278
39276 5387278 4855489 4594608 4654584 5048204 5745677 6678698 7753839 8870362 9934958
39267 9934958 10870247 11620315 12156287 12478593 12610735 12585965 12435031 12180838 11838349 11415561
39257 11415561 10915183 10339444 9697311 9009906 8311533 7648373 7078005 6668681 6493022
39248 6493022 6612361 7055250 7800768 8777194 9877860 10985346 11992165 12813095 13392457
39239 13392457 13709574 13779255 13642494 13350043 12948893 12478701 11974772 11469042 10985913
39230 10985913 10537560 10124589 9743204 9396005 9102201 8901981 8849734 8994625 9355421
39221 9355421 9903126 10564130 11246665 11879639 12443626 12975871 13545307 14211033 14987268
39212 14987268 15833242 16671346 17420712 18025796 18465283 18741233 18861066 18826712 18636864
39203 18636864 18298254 17836669 17299464 16746823 16236745 15813279 15504204 15325279 15283046
39194 15283046 15372499 15573561 15851938 16164671 16466753 16717004 16884678 16956915 16943232 16872497
39184 16872497 16782199 16704634 16655515 16628653 16597833 16524376 16365771 16079984 15624847 14958360
39174 14958360 14045859 12872057 11449080 9814590 8022904 6135356 4211100 2296097
39166 2296097 412969 -1439198 -3270288 -5078596 -6840604 -8518599 -10077215 -11493510
39158 -11493510 -12754308 -13847149 -14753832 -15448782 -15899836 -16071546 -15934228 -15478595 -14729862
39149 -14729862 -13754427 -12656857 -11567368 -10619174 -9917450 -9510454 -9378805 -9450361 -9630496
39140 -9630496 -9828202 -9966972 -9985180 -9836769 -9496177 -8963037 -8262146 -7439026 -6553099 -5668193
39130 -5668193 -4839427 -4098092 -3438484 -2810789 -2124421 -1265838 -129711 1347335 3165874
39121 3165874 5263821 7532232 9834732 12023392 13952677 15496247 16566911 17132573
39113 17132573 17217984 16887375 16214618 15255937 14038371 12567579 10849550 8916467 6845586
39104 6845586 4761003 2814640 1153363 -114139 -939701 -1344249 -1414212 -1286507 -1121560
39095 -1121560 -1067630 -1227005 -1637849 -2278502 -3087687 -3986421 -4892820 -5732179 -6447921 -7011908
39085 -7011908 -7426824 -7717273 -7914861 -8045361 -8121206 -8137557 -8070124 -7877251 -7511593 -6942959
39075 -6942959 -6183683 -5300116 -4398864 -3593144 -2968765 -2568270 -2398294 -2450896 -2722748 -3218700
39065 -3218700 -3937944 -4855757 -5918714 -7059300 -8217439 -9350673 -10426383 -11405250 -12231307
39056 -12231307 -12839117 -13178721 -13247544 -13110078 -12888345 -12722250 -12718279 -12912357 -13262590 -13669876
39046 -13669876 -14012663 -14181760 -14107150 -13773019 -13217625 -12515505 -11745908 -10960359 -10164883
39037 -10164883 -9324351 -8383525 -7292159 -6024373 -4589571 -3036102 -1448106 64883
39029 64883 1383766 2396988 3015921 3188542 2910948 2232299 1247976 81689 -1136275
39020 -1136275 -2287958 -3282135 -4064251 -4618846 -4961071 -5119942 -5122291 -4985624 -4721131 -4341570
39010 -4341570 -3867247 -3325902 -2746849 -2153448 -1558582 -964615 -365166 254716 920034
39001 920034 1664601 2522475 3512645 4624775 5815909 7022150 8179568 9242745 10190833
38992 10190833 11018011 11714051 12247496 12563904 12602645 12323617 11729838 10876364 9863859
38983 9863859 8819645 7871356 7121445 6632196 6425649 6493529 6807641 7325501 7993413
38974 7993413 8751376 9540138 10306777 11006234 11600809 12062044 12376743 12553586 12623331 12627364
38964 12627364 12596619 12531974 12400597 12154266 11759387 11218946 10574293 9891609 9246329 8712156
38954 8712156 8351125 8200515 8259558 8483667 8791748 9086693 9283508 9334843 9242894 9052441
38944 9052441 8828720 8629029 8477317 8350610 8185267 7904293 7453993 6830161 6080194
38935 6080194 5283120 4520395 3850133 3292275 2828333 2415607 2008933 1577824 1110233
38926 1110233 604797 61270 -522909 -1149660 -1815999 -2513443 -3232381 -3968351 -4724337
38917 -4724337 -5504765 -6303821 -7097095 -7844205 -8501192 -9034235 -9427705 -9686593 -9837647
38908 -9837647 -9931337 -10041426 -10255981 -10656097 -11285957 -12125594 -13079608 -13988782 -14661348 -14913848
38898 -14913848 -14610592 -13693509 -12197410 -10248409 -8045640 -5828625 -3835494 -2260677
38890 -2260677 -1222266 -746416 -770375 -1161819 -1751255 -2372553 -2901065 -3274646 -3488437
38881 -3488437 -3569057 -3545398 -3430722 -3218476 -2886141 -2403791 -1748159 -920365 40630 1056508
38871 1056508 2021071 2820953 3361213 3589438 3507204 3159972 2610045 1911151 1101416 215274
38861 215274 -699780 -1576442 -2336560 -2912498 -3272306 -3437547 -3483550 -3519083 -3653018 -3962215
38851 -3962215 -4472688 -5158402 -5955673 -6787605 -7589844 -8325828 -8983016 -9554115 -10020063
38842 -10020063 -10350422 -10521087 -10534175 -10425013 -10252807 -10081397 -9958492 -9900655 -9890200 -9886194
38832 -9886194 -9844037 -9732297 -9537844 -9258285 -8888039 -8406908 -7778175 -6958310 -5914248
38823 -5914248 -4639993 -3164476 -1547304 134034 1797224 3361753 4750501 5894848
38815 5894848 6749326 7310077 7622623 7769165 7840629 7909701 8018333 8180995 8395204 8651369
38805 8651369 8941020 9266213 9648923 10132860 10770786 11599208 12611857 13745333 14884883
38796 14884883 15889708 16629544 17019140 17037097 16721727 16146869 15389461 14503859 13513843
38787 13513843 12423327 11236240 9971763 8666760 7367546 6118882 4955831 3899157
38779 3899157 2953604 2110191 1353668 672695 67107 -451989 -868328 -1168362 -1347693
38770 -1347693 -1416266 -1402568 -1353131 -1321890 -1349802 -1445059 -1576961 -1687349 -1710573 -1589785 -1285815
38759 -1285815 -783072 -95036 735611 1647542 2578360 3478294 4313089 5059898 5704818
38750 5704818 6245227 6692168 7066584 7389194 7670239 7906118 8084587 8193909 8229707 8197245
38740 8197245 8111249 7995643 7882427 7807436 7803049 7891282 8081371 8372966 8761402 9238725
38730 9238725 9787126 10369112 10924118 11377239 11655091 11697635 11459861 10907363 10015219 8776718
38720 8776718 7221573 5435677 3568649 1816347 377244 -601162 -1060972 -1040972 -653743
38711 -653743 -46944 636427 1289187 1856062 2330634 2735621 3098043 3433256 3743245 4022675
38701 4022675 4262779 4450292 4566746 4593622 4521754 4357380 4118526 3822952 3476581 3072225
38691 3072225 2600926 2067195 1494461 914018 344804 -219358 -803113 -1426705 -2082749
38682 -2082749 -2727839 -3292494 -3701463 -3893735 -3834922 -3518914 -2959324 -2176342 -1188138 -12603
38672 -12603 1323941 2780187 4301469 5828465 7308063 8702636 9995953 11194474
38664 11194474 12322881 13413302 14489390 15549428 16555747 17437393 18107468 18489227
38656 18489227 18541453 18274966 17755708 17093507 16418891 15853363 15481083 15331172 15377947 15559643
38646 15559643 15807422 16072491 16342745 16645892 17038155 17579244 18300778 19182941 20152469
38637 20152469 21101814 21915609 22488858 22731780 22568854 21943735 20834595 19272040 17344981
38628 17344981 15185775 12940125 10736902 8670216 6795644 5134752 3682037 2412474
38620 2412474 1290299 278210 -656140 -1538740 -2390731 -3227627 -4053916 -4857240 -5608388
38611 -5608388 -6268423 -6797874 -7162297 -7333385 -7289727 -7021610 -6539789 -5882260 -5111506 -4300409
38601 -4300409 -3513739 -2795011 -2162788 -1612975 -1122039 -649726 -143273 454616 1193425
38592 1193425 2100546 3171088 4367984 5632948 6901639 8114566 9220215 10172671
38584 10172671 10928175 11444624 11686339 11633547 11291960 10696255 9904006 8982608 7995983
38575 7995983 6997360 6029236 5126069 4315148 3616705 3048283 2634143 2411739 2425201 2704565
38565 2704565 3241777 3979240 4820298 5658001 6407036 7022339 7497875 7852049 8109777
38556 8109777 8285399 8367280 8310665 8049375 7526843 6729077 5696694 4508402 3249220
38547 3249220 1984185 749139 -443644 -1594179 -2705478 -3778208 -4806119 -5768487
38539 -5768487 -6619812 -7283182 -7656400 -7635852 -7152798 -6206615 -4876948 -3305587 -1654851
38530 -1654851 -62065 1389290 2672544 3800967 4805955 5722063 6580660 7407136 8217803
38521 8217803 9017390 9799068 10546584 11236974 11844113 12344198 12722817 12982195 13147073
38512 13147073 13265806 13401531 13612868 13934644 14373683 14923689 15585661 16375196 17310297
38503 17310297 18389241 19573179 20782495 21908396 22836127 23472863 23771348 23741485 23446342
38494 23446342 22984880 22468337 21998000 21648316 21454982 21408402 21457505 21528873 21557432 21514494
38484 21514494 21417464 21314562 21250676 21230455 21198531 21050793 20674632 19998655 19026758 17841472
38474 17841472 16578567 15386906 14390655 13667077 13244538 13114846 13247433 13595351 14092862
38465 14092862 14653674 15179553 15579942 15792055 15788056 15565247 15128478 14478582 13613460 12538709
38455 12538709 11281766 9905461 8516372 7259999 6296546 5761862 5730042 6195768 7083265
38446 7083265 8274561 9643069 11081139 12515922 13911630 15259557 16562054 17819408
38438 17819408 19024621 20163519 21215612 22156490 22965863 23638682 24187133 24623569 24930960
38429 24930960 25043217 24855592 24265286 23220741 21751619 19963792 18004307 16016228
38421 16016228 14104684 12325581 10695168 9209607 7862427 6652839 5584553 4658779
38413 4658779 3865967 3180881 2565380 1980110 1399954 823533 269998 -234665 -671851
38404 -671851 -1035209 -1323981 -1532150 -1644567 -1645531 -1533973 -1333242 -1088080 -851500 -670082
38394 -670082 -574489 -577826 -681096 -881487 -1176734 -1561519 -2019550 -2519931 -3023532 -3497580
38384 -3497580 -3931449 -4344983 -4782352 -5290621 -5892681 -6570908 -7272031 -7928398 -8480020
38375 -8480020 -8884839 -9116801 -9159955 -9005682 -8653377 -8110549 -7389723 -6503918 -5464565
38366 -5464565 -4284050 -2981592 -1588527 -147871 1294798 2705800 4072564 5397500
38358 5397500 6677458 7882800 8952441 9810410 10395325 10687071 10717336 10559260 10301774
38349 10301774 10021731 9766958 9555198 9382978 9233193 9074303 8854341 8500147 7929534
38340 7929534 7073163 5894748 4400806 2640581 701234 -1300624 -3234621 -4979974
38332 -4979974 -6448939 -7599490 -8432247 -8976833 -9278084 -9388953 -9368293 -9277042 -9169870
38323 -9169870 -9086072 -9044904 -9046021 -9072294 -9094035 -9076030 -8987066 -8808559 -8539068 -8193682 -7798063
38312 -7798063 -7377692 -6946591 -6502626 -6032877 -5524408 -4972511 -4383442 -3774553 -3174927
38303 -3174927 -2625880 -2178701 -1887709 -1797735 -1927222 -2252954 -2706563 -3190360 -3609424 -3905591
38293 -3905591 -4076214 -4169337 -4260858 -4427961 -4730801 -5204449 -5855431 -6657793 -7550406 -8442056
38283 -8442056 -9228809 -9820560 -10166316 -10265841 -10161454 -9915008 -9583959 -9209911 -8823020 -8454327
38273 -8454327 -8144432 -7942713 -7899437 -8056302 -8438708 -9050620 -9872881 -10865650 -11973266
38264 -11973266 -13128766 -14258718 -15292569 -16177573 -16891963 -17446538 -17873209 -18209376 -18486809
38255 -18486809 -18725032 -18924698 -19061867 -19089970 -18952280 -18597924 -17991447 -17113735 -15961195
38246 -15961195 -14549902 -12923520 -11157241 -9350914 -7611063 -6028064 -4657824 -3515198
38238 -3515198 -2580851 -1817659 -1190003 -679117 -288070 -32457 80011 68945 -14103 -99907
38228 -99907 -124783 -47355 149459 467369 902088 1445662 2082932 2790049 3541881 4326481
38218 4326481 5156403 6066953 7100469 8285359 9621533 11079074 12608606 14154604
38210 14154604 15662005 17073743 18327122 19359680 20126585 20619928 20877302 20973911 21000971
38201 21000971 21036880 21118568 21222252 21263729 21123311 20689044 19900731 18775476 17405374
38192 17405374 15931904 14509392 13268681 12288541 11581940 11103593 10777950 10535015 10336272
38183 10336272 10180632 10094096 10114421 10278900 10615565 11135025 11823866 12645328 13551117 14499593
38173 14499593 15469038 16458009 17474823 18524189 19595882 20655083 21635333 22440806 22964893
38164 22964893 23122614 22882902 22284119 21424602 20433124 19433284 18516772 17733528 17096529
38155 17096529 16591508 16183067 15816966 15425624 14941791 14315729 13525162 12572443 11474226
38146 11474226 10253264 8935700 7549649 6121088 4669262 3206505 1743010 291754
38138 291754 -1130942 -2508686 -3827846 -5076868 -6243243 -7311408 -8263292 -9079388 -9737405
38129 -9737405 -10208932 -10458451 -10448415 -10149074 -9548060 -8656308 -7510537 -6173389 -4730083
38120 -4730083 -3279320 -1918835 -730052 231902 938649 1380216 1553973 1458729 1097858
38111 1097858 487995 -334988 -1319526 -2412368 -3577566 -4810897 -6140361 -7609723 -9252284
38102 -9252284 -11068460 -13017872 -15027270 -17008436 -18878776 -20578396 -22078668 -23379738
38094 -23379738 -24498880 -25455071 -26255118 -26885058 -27309301 -27478259 -27342652 -26870940 -26066209
38085 -26066209 -24977022 -23694549 -22331820 -20992815 -19748493 -18631512 -17645290 -16774360
38077 -16774360 -15989982 -15256193 -14541586 -13832502 -13137781 -12481358 -11889445 -11382138 -10972476
38068 -10972476 -10666914 -10460089 -10325446 -10212783 -10062157 -9830439 -9514204 -9153118 -8810747
38059 -8810747 -8543500 -8374377 -8284865 -8228499 -8157228 -8043734 -7885685 -7691020 -7456895 -7158662
38049 -7158662 -6757039 -6218322 -5533481 -4723454 -3828071 -2887196 -1926124 -952642 34127
38040 34127 1027944 2000185 2893668 3631524 4139759 4374327 4340805 4098034 3742343 3374812
38030 3374812 3061911 2807676 2554460 2213995 1709721 1004020 98273 -983468 -2207571
38021 -2207571 -3532877 -4910300 -6290242 -7635580 -8927870 -10158890 -11312593 -12350335
38013 -12350335 -13209598 -13817648 -14113021 -14063151 -13668918 -12956126 -11963678 -10739063 -9342597
38004 -9342597 -7852061 -6359038 -4956613 -3725395 -2724201 -1985969 -1515947 -1290917 -1261377
37995 -1261377 -1358761 -1507082 -1636324 -1695222 -1661726 -1548494 -1399974 -1280160 -1255281 -1378486
37985 -1378486 -1680481 -2164179 -2799672 -3520923 -4230882 -4819424 -5188370 -5270284 -5031797 -4464757
37975 -4464757 -3577246 -2393129 -958452 654032 2349455 4025608 5593488 6996488
37967 6996488 8220972 9293221 10262383 11174926 12050758 12871705 13587389 14134301 14457296
37958 14457296 14523649 14326420 13880398 13216307 12377921 11422690 10421407 9450480 8576075
37949 8576075 7838319 7245433 6778759 6400434 6057196 5683177 5208854 4577289 3760663
37940 3760663 2768550 1644156 450218 -749894 -1908741 -3002988 -4031420 -5004996
37932 -5004996 -5932813 -6808507 -7603177 -8270666 -8765090 -9061450 -9166173 -9110863 -8934493 -8666775
37922 -8666775 -8321941 -7901392 -7396223 -6784241 -6026704 -5075322 -3892594 -2475238 -865113
37913 -865113 859988 2609857 4306075 5894787 7343369 8624888 9700533 10511820
37905 10511820 10989463 11076496 10754629 10060742 9085889 7958258 6817947 5791816 4973483
37896 4973483 4411049 4104841 4016581 4087426 4257424 4477904 4713667 4939805 5141421 5319488
37886 5319488 5496924 5714754 6014061 6410389 6873515 7322597 7638976 7693310 7380767 6654842
37876 6654842 5546555 4157727 2628974 1099386 -318850 -1539142 -2481903 -3060359
37868 -3060359 -3186459 -2795677 -1876287 -485777 1256953 3203768 5220473 7219286 9163776
37859 9163776 11046353 12854642 14546500 16044300 17247224 18053363 18382787 18195275 17499348
37850 17499348 16351719 14848686 13113489 11284018 9501579 7897470 6575706 5597513
37842 5597513 4976623 4688001 4682383 4896507 5256174 5677189 6070564 6353768 6464671 6371903
37832 6371903 6076556 5605276 5000124 4310769 3589680 2887598 2248190 1704127 1276677
37823 1276677 978360 816795 798041 927651 1208303 1635733 2197024 2873270 3644069 4490320
37813 4490320 5395618 6348738 7346151 8388864 9470488 10562937 11612752 12555639 13342158
37804 13342158 13956562 14414689 14742964 14954074 15034254 14945248 14634545 14047966 13143850 11908758
37794 11908758 10370556 8602598 6716029 4842032 3108596 1617985 433111 -420256
37786 -420256 -936625 -1111318 -933805 -400105 464217 1587534 2855795 4138363 5325937
37777 5325937 6364004 7266907 8106043 8977014 9959229 11083814 12320967 13589175 14780475
37768 14780475 15791422 16548622 17019375 17203240 17109697 16736881 16067119 15083197 13793425
37759 13793425 12247645 10534217 8760361 7024732 5391314 3872941 2432103 1002219
37751 1002219 -476525 -2021264 -3586600 -5070116 -6341178 -7280722 -7815427 -7932597 -7671266
37742 -7671266 -7097197 -6278659 -5279227 -4170863 -3053993 -2064946 -1360462 -1084134 -1328260
37733 -1328260 -2104839 -3336711 -4874904 -6537741 -8155270 -9600104 -10796376 -11711236
37725 -11711236 -12338034 -12678771 -12732166 -12492448 -11958381 -11145505 -10094251 -8871325 -7564296
37716 -7564296 -6268857 -5071204 -4033688 -3190811 -2552454 -2104696 -1805459 -1583328 -1347564
37707 -1347564 -1006587 -485964 258419 1231181 2394169 3674547 4984075 6238884 7367939
37698 7367939 8310232 9013054 9442272 9601278 9542946 9361255 9163787 9039350 9035355 9150950
37688 9150950 9344521 9552474 9714343 9794479 9789203 9716202 9595035 9432273 9218851 8937866
37678 8937866 8575741 8129610 7607273 7021690 6385721 5710505 5004834 4271517 3502954
37669 3502954 2683855 1805244 883288 -29960 -853070 -1498195 -1901072 -2045765 -1974872 -1782547
37659 -1782547 -1593498 -1533283 -1695973 -2117617 -2766135 -3554138 -4369460 -5107819 -5692839 -6080959
37649 -6080959 -6260299 -6252366 -6114489 -5932561 -5798915 -5784421 -5921601 -6207311 -6617848 -7122101
37639 -7122101 -7684524 -8260344 -8790139 -9199491 -9406418 -9336618 -8942876 -8221616 -7219879
37630 -7219879 -6030245 -4775720 -3588284 -2584937 -1846187 -1403821 -1244517 -1330550 -1629790
37621 -1629790 -2139992 -2893062 -3934997 -5290989 -6934444 -8777114 -10685871 -12517325
37613 -12517325 -14153958 -15528714 -16633584 -17513608 -18249143 -18930608 -19632808 -20396341 -21219807
37604 -21219807 -22063010 -22861523 -23551556 -24096399 -24498701 -24789076 -24999520 -25142185 -25206952
37595 -25206952 -25173260 -25021849 -24737681 -24306727 -23714335 -22949699 -22015130 -20935201 -19760546
37586 -19760546 -18563176 -17423529 -16412755 -15576149 -14924464 -14437288 -14076208 -13799042 -13566347
37577 -13566347 -13338841 -13072672 -12721009 -12244900 -11629158 -10894627 -10098085 -9316611 -8623131
37568 -8623131 -8066826 -7667570 -7420763 -7302436 -7272073 -7281162 -7292207 -7297937 -7323527 -7407145 -7573373
37557 -7573373 -7818824 -8116325 -8428698 -8720195 -8961507 -9131931 -9222711 -9240865 -9209843 -9165622
37547 -9165622 -9150897 -9210454 -9387064 -9715200 -10213494 -10881368 -11704128 -12664031 -13748873 -14949570
37537 -14949570 -16243898 -17573340 -18828825 -19860568 -20513388 -20671041 -20287464 -19393258 -18080160
37528 -18080160 -16472904 -14698176 -12860364 -11032111 -9260294 -7579072 -6019407 -4610385
37520 -4610385 -3374341 -2320511 -1441513 -715398 -112783 394505 826742 1191787 1481039
37511 1481039 1665937 1698415 1520011 1081264 365618 -595400 -1727720 -2939505 -4148365
37502 -4148365 -5292875 -6325811 -7202753 -7881154 -8332345 -8556120 -8584734 -8470621 -8263573
37493 -8263573 -7990819 -7651788 -7229135 -6707300 -6087666 -5394796 -4673663 -3978969 -3357830
37484 -3357830 -2830835 -2381664 -1964798 -1530929 -1056793 -562150 -105317 237745 399449
37475 399449 342630 73788 -356291 -866888 -1373413 -1814843 -2170012 -2455911 -2711298 -2977382
37465 -2977382 -3287460 -3667475 -4137756 -4705237 -5347897 -6006006 -6593333 -7026323 -7255043
37456 -7255043 -7278479 -7138011 -6896700 -6619013 -6361817 -6177005 -6117330 -6236749 -6582786 -7184743
37446 -7184743 -8043329 -9125033 -10361688 -11655055 -12888427 -13947696 -14748531 -15256839 -15488110
37437 -15488110 -15483900 -15281135 -14894872 -14322839 -13563340 -12631731 -11566756 -10427343 -9284538
37428 -9284538 -8211490 -7271838 -6508100 -5935540 -5547568 -5332707 -5294561 -5462203 -5882408
37419 -5882408 -6594731 -7601101 -8847167 -10227402 -11611343 -12875702 -13927098 -14710432
37411 -14710432 -15206597 -15424659 -15392212 -15147076 -14732143 -14191856 -13568567 -12900582 -12225622
37402 -12225622 -11588931 -11049364 -10676786 -10539927 -10689730 -11145573 -11890115 -12873337 -14020599
37393 -14020599 -15238980 -16422461 -17462186 -18264463 -18768876 -18953855 -18824743 -18394328 -17674290
37384 -17674290 -16688346 -15498204 -14218142 -12998297 -11979124 -11241024 -10776833 -10499978 -10280955
37375 -10280955 -9991511 -9535559 -8857491 -7934719 -6769093 -5385119 -3830644 -2171877 -481779
37366 -481779 1172099 2735133 4168576 5450632 6576819 7558548 8418230 9181233 9868684
37357 9868684 10496304 11080066 11642503 12212174 12815187 13464542 14153393 14854077 15521968
37348 15521968 16102689 16540425 16784138 16790485 16526106 15972206 15129199 14014938 12653958
37339 12653958 11065037 9259522 7255542 5098662 2872133 687125 -1341786 -3122055
37331 -3122055 -4598841 -5758507 -6622347 -7233296 -7638827 -7875239 -7959119 -7888085 -7647273
37322 -7647273 -7216021 -6572767 -5701489 -4603475 -3312765 -1907217 -505958 750434 1731815
37313 1731815 2349587 2573223 2426423 1969671 1282150 450517 -437998 -1303587 -2083625
37304 -2083625 -2740979 -3268554 -3689005 -4047444 -4396022 -4775217 -5200515 -5659177 -6114489
37295 -6114489 -6513440 -6797520 -6917285 -6846879 -6590851 -6178119 -5644868 -5014907 -4289005 -3451417
37285 -3451417 -2491392 -1425907 -307781 786343 1780177 2621288 3295126 3826008 4263990
37276 4263990 4660320 5041076 5392626 5667407 5806917 5770087 5554203 5200175 4780702 4377235
37266 4377235 4057060 3860475 3799782 3864566 4028024 4254024 4505462 4750566 4962969 5117626
37256 5117626 5190990 5170676 5068968 4927486 4805515 4757464 4813578 4974770 5220938 5523418
37246 5523418 5852597 6178222 6465214 6669583 6739852 6628857 6315092 5822738 5224615 4620169
37236 4620169 4096701 3693033 3383342 3088185 2707313 2159539 1411723 484940 -561034
37227 -561034 -1652627 -2723860 -3729767 -4654397 -5514702 -6356826 -7241878 -8225459 -9340387
37218 -9340387 -10588466 -11939127 -13329578 -14665571 -15827802 -16689981 -17149336 -17161800 -16766379
37209 -16766379 -16082223 -15272806 -14490506 -13827959 -13298430 -12849212 -12394845 -11852107 -11165212
37200 -11165212 -10318900 -9341902 -8302672 -7296598 -6424051 -5763243 -5347010 -5152638 -5107529
37191 -5107529 -5106034 -5030210 -4770072 -4242791 -3410739 -2294357 -972088 437845 1809395
37182 1809395 3039859 4065677 4859571 5418677 5755871 5897641 5882224 5751788 5540932
37173 5540932 5269851 4946595 4573602 4150439 3671376 3124364 2497233 1787975 1010275
37164 1010275 189311 -648371 -1482952 -2302262 -3095696 -3845182 -4519353 -5076866 -5479536
37155 -5479536 -5707387 -5763663 -5664898 -5423977 -5040450 -4505624 -3817195 -2991515 -2065135 -1085748
37145 -1085748 -99199 859556 1767674 2610254 3377183 4064534 4676821 5222225 5697375
37136 5697375 6068195 6260435 6171681 5705629 4815671 3536825 1989205 350474 -1190297
37127 -1190297 -2478130 -3420697 -3992779 -4220088 -4153834 -3848871 -3352277 -2701237 -1925300
37118 -1925300 -1050002 -102127 882412 1850130 2727279 3430701 3893719 4096170 4079566 3934789
37108 3934789 3767348 3658834 3642307 3698483 3769726 3784064 3679097 3416059 2980381 2374465
37098 2374465 1612510 722094 -251194 -1242525 -2173062 -2960858 -3535480 -3853682 -3911560 -3747667
37088 -3747667 -3434553 -3060811 -2708487 -2431249 -2239257 -2096438 -1932344 -1664240 -1220999
37079 -1220999 -561959 312222 1358328 2500455 3649102 4721519 5654050 6404375 6950359
37070 6950359 7293048 7463364 7524560 7563198 7669050 7911736 8324090 8898658 9596713 10362949
37060 10362949 11138021 11865206 12492142 12969633 13249812 13288648 13059204 12574046 11900740
37051 11900740 11150296 10434841 9816080 9275977 8726606 8051315 7154209 5995752 4602987
37042 4602987 3055376 1456692 -93623 -1520253 -2780753 -3866097 -4796422 -5613322
37034 -5613322 -6368388 -7109324 -7868953 -8663841 -9503414 -10401143 -11376954 -12448429 -13618705
37025 -13618705 -14870292 -16167022 -17460373 -18696649 -19824375 -20802098 -21605082 -22227210
37017 -22227210 -22674326 -22949882 -23041603 -22920951 -22558752 -21945868 -21102258 -20067635 -18882564
37008 -18882564 -17574776 -16159011 -14648171 -13067928 -11466821 -9915762 -8494333 -7267329
37000 -7267329 -6262001 -5458192 -4796378 -4197073 -3579232 -2869956 -2007398 -944499 340823
36991 340823 1830974 3459252 5117344 6682730 8054290 9177056 10044769 10684001 11132093
36982 11132093 11419961 11566671 11587571 11508715 11372210 11222238 11079834 10927873 10720752 10413551
36972 10413551 9992273 9488408 8971036 8520466 8195909 8011920 7931619 7874654 7734431 7402719
36962 7402719 6800259 5904691 4761120 3466897 2137674 872765 -264380 -1245857 -2064874
36953 -2064874 -2717991 -3194485 -3478489 -3560722 -3448247 -3161079 -2715811 -2109676 -1320135 -322723
36943 -322723 884914 2268792 3762410 5285478 6767413 8164684 9465388 10681389
36935 10681389 11834675 12946625 14035117 15117216 16209678 17321141 18438748 19519825
36927 19519825 20497475 21298568 21864299 22164223 22200409 22002340 21614746 21082692 20439542
36918 20439542 19701762 18871248 17944378 16925482 15839575 14737410 13689449 12770819 12041903
36909 12041903 11529122 11211937 11023322 10866504 10641788 10271567 9713149 8955642 8005728
36900 8005728 6874850 5580006 4157911 2677737 1237115 -58805 -1122040 -1898071
36892 -1898071 -2370792 -2558224 -2502198 -2256926 -1881487 -1435318 -970525 -519766 -88793 336363
36882 336363 769442 1204292 1607310 1924189 2095985 2077818 1854242 1446244 906858 305572
36872 305572 -294478 -858121 -1388052 -1916900 -2485608 -3119785 -3814038 -4526892 -5184743 -5694006
36862 -5694006 -5960407 -5910717 -5509831 -4768562 -3741427 -2515080 -1189198 143753 1409369
36853 1409369 2546832 3495210 4184743 4542846 4512172 4069595 3235942 2073547 675941
36844 675941 -843215 -2358215 -3738732 -4860725 -5620052 -5942995 -5790056 -5155945 -4070032
36835 -4070032 -2596053 -826130 1132224 3171169 5193312 7115682 8868940 10396088
36827 10396088 11654068 12617486 13279364 13644892 13720849 13509095 13011080 12243583 11259128
36818 11259128 10159722 9091670 8216047 7663861 7496704 7692480 8162989 8795287 9498130
36809 9498130 10230788 10999336 11825967 12716117 13646809 14577844 15468470 16283957 16991997
36800 16991997 17557998 17944935 18116565 18040681 17690871 17047613 16101410 14860352 13360793
36791 13360793 11675318 9911210 8196374 6654728 5377974 4404356 3714339 3244784
36783 3244784 2912279 2632509 2329544 1938598 1409744 717049 -128311 -1068606 -2004398
36774 -2004398 -2818721 -3412594 -3734416 -3790555 -3638071 -3368281 -3085942 -2883771 -2815834 -2881082
36764 -2881082 -3027838 -3178580 -3262222 -3238039 -3102587 -2881194 -2612885 -2338275 -2095056 -1919397
36754 -1919397 -1848041 -1917157 -2157488 -2588703 -3216519 -4033481 -5019941 -6140538 -7336177
36745 -7336177 -8518339 -9574321 -10386436 -10859971 -10949424 -10672037 -10102301 -9350258 -8535332
36736 -8535332 -7768028 -7142409 -6732721 -6588032 -6727360 -7142035 -7806270 -8688333 -9753821
36727 -9753821 -10960071 -12248441 -13542003 -14750556 -15779188 -16536500 -16943100 -16943799 -16523082
36718 -16523082 -15716003 -14604730 -13298802 -11908239 -10522569 -9202859 -7985002 -6888839
36710 -6888839 -5928874 -5123534 -4498715 -4081633 -3885706 -3893748 -4049162 -4261010 -4421921 -4432046
36700 -4432046 -4220387 -3757393 -3057713 -2175263 -1191818 -199049 722692 1520239 2170935
36691 2170935 2675347 3047673 3308233 3475407 3555792 3539447 3408559 3157766 2812632 2431724
36681 2431724 2088374 1841960 1715898 1695081 1741229 1811694 1867845 1872377 1786252 1574725 1222073
36670 1222073 746886 208109 -305487 -702789 -924269 -964704 -872107 -725303 -603885 -564030
36660 -564030 -626309 -775522 -969905 -1155141 -1276891 -1286349 -1137570 -781660 -167115 747112
36650 747112 1969612 3460162 5133965 6888004 8634548 10321093 11926196 13438079
36642 13438079 14833705 16072590 17106211 17892863 18408080 18648925 18635351 18408717 18023670
36633 18023670 17533140 16974375 16366153 15719948 15057717 14424586 13887722 13519541 13371846
36624 13371846 13453581 13724454 14107823 14515255 14870537 15124353 15257063 15271625 15181839 15003501
36614 15003501 14754128 14459434 14157029 13888767 13683569 13543266 13444432 13357805 13272685 13208836
36604 13208836 13207444 13308204 13528388 13855103 14250318 14661501 15032777 15316548 15486378 15548654
36594 15548654 15547533 15558344 15669323 15957711 16469637 17210547 18146549 19213203 20328587
36585 20328587 21407946 22374694 23162335 23708572 23951550 23837829 23340214 22472537 21289132
36576 21289132 19868576 18292519 16632018 14945869 13285731 11699054 10225024 8886748
36568 8886748 7687974 6620846 5683474 4897728 4314538 3999662 4004570 4336667 4943826
36559 4943826 5720014 6527876 7226818 7694895 7839017 7596394 6934069 5850255 4376272
36550 4376272 2577676 555568 -1552807 -3581254 -5357153 -6736341 -7635117 -8043648
36542 -8043648 -8017037 -7652655 -7065353 -6367336 -5653989 -4994756 -4428610 -3964698 -3588167 -3268614
36532 -3268614 -2966734 -2636904 -2228377 -1689191 -972668 -41551 1133062 2573429 4289272
36523 4289272 6262620 8433517 10701705 12950696 15084099 17053690 18863348 20548541
36515 20548541 22144552 23659323 25060506 26278817 27225003 27814371 27990311 27738496 27088149
36506 27088149 26102534 24863285 23452092 21932942 20339854 18675609 16922170 15055981
36498 15055981 13059025 10922654 8649622 6260500 3802376 1349764 -1010091 -3203693
36490 -3203693 -5195246 -6993358 -8635520 -10158391 -11570014 -12838321 -13899817 -14681133
36482 -14681133 -15122910 -15200125 -14936804 -14410077 -13735555 -13032771 -12384512 -11812667 -11285059
36473 -11285059 -10747619 -10159778 -9510814 -8811125 -8073139 -7304258 -6520955 -5770130 -5133760
36464 -5133760 -4706164 -4556602 -4701315 -5100873 -5680927 -6361650 -7079309 -7791517 -8469651
36455 -8469651 -9089057 -9625207 -10055823 -10364114 -10539680 -10576901 -10471788 -10218824 -9810269 -9239656
36445 -9239656 -8508237 -7630912 -6638945 -5578315 -4503879 -3471961 -2536446 -1751045 -1172171
36436 -1172171 -852233 -820087 -1058451 -1493727 -2006530 -2459195 -2729112 -2735951 -2454498 -1911118
36426 -1911118 -1169076 -311515 571304 1389297 2056910 2497973 2653469 2492261 2020969
36417 2020969 1286147 364055 -658880 -1704373 -2709444 -3621786 -4392004 -4971913 -5320336
36408 -5320336 -5411587 -5242901 -4841143 -4268588 -3623156 -3028285 -2614355 -2499489 -2775375 -3496861
36398 -3496861 -4671468 -6249920 -8124010 -10137647 -12111398 -13875529 -15303062 -16332874
36390 -16332874 -16975055 -17298072 -17405466 -17411339 -17418314 -17497130 -17669754 -17902771 -18116109 -18204206
36380 -18204206 -18061469 -17605858 -16798230 -15654219 -14242612 -12666967 -11037180 -9445823
36372 -9445823 -7960885 -6632863 -5502482 -4597948 -3924669 -3460284 -3162606 -2984926 -2887875
36363 -2887875 -2843410 -2834367 -2853552 -2902844 -2991341 -3132616 -3341490 -3631174 -4011715 -4488846
36353 -4488846 -5059494 -5702512 -6370634 -6992218 -7483763 -7766442 -7782715 -7514926 -7002500 -6342581
36343 -6342581 -5661394 -5065366 -4599910 -4238375 -3900611 -3483963 -2890808 -2047226 -914062
36334 -914062 508208 2180535 4030248 5955327 7825189 9483200 10762273 11519433
36326 11519433 11679304 11264770 10397237 9264782 8071445 6987077 6114946 5485366 5070974
36317 5070974 4810526 4628922 4449612 4202653 3833083 3311480 2644226 1876669 1081822
36308 1081822 334104 -321379 -887862 -1413697 -1969156 -2616026 -3385009 -4269674 -5236042
36299 -5236042 -6239500 -7239305 -8204394 -9109822 -9928682 -10627259 -11168376 -11520265 -11662785
36290 -11662785 -11585897 -11282863 -10744140 -9954264 -8890255 -7521474 -5814466 -3745765 -1320433
36281 -1320433 1411281 4347798 7344942 10237585 12867919 15114058 16913184 18271493
36273 18271493 19252741 19945321 20421879 20712188 20801062 20647010 20208441 19466117 18435475
36264 18435475 17165984 15729534 14205509 12670612 11194420 9835356 8633981 7606804
36256 7606804 6744779 6015649 5367021 4731079 4034807 3216066 2239749 1107720 -140095
36247 -140095 -1433513 -2688057 -3824716 -4784187 -5527947 -6028607 -6260993 -6203847 -5852015
36238 -5852015 -5230138 -4397135 -3435324 -2426831 -1428925 -462558 479690 1413451 2345259
$$ [...]
##END NTUPLES=NMR SPECTRUM
##END=
