##TITLE=31Pdec_SR-167-R2_TFA
 CDCl3
  24 sc
 21.12.2023
##JCAMPDX= 6.0         $$ Bruker NMR JCAMP-DX V2.0
##DATA TYPE= NMR SPECTRUM
##DATA CLASS= NTUPLES
##ORIGIN= UXNMR, Bruker Analytische Messtechnik GmbH
##OWNER= root
$$ XWIN-NMR		Version 3.5
$$ Thu Dec 21 12:51:07 2023 Russian Standard Time (UT+4h)  she@DPX200
##.OBSERVE FREQUENCY= 81.013821
##.OBSERVE NUCLEUS= ^31P
##.ACQUISITION MODE= SIMULTANEOUS
##.ACQUISITION SCHEME= undefined
##.AVERAGES= 24
##.DIGITISER RES= 16
##SPECTROMETER/DATA SYSTEM= spect
##.PULSE SEQUENCE= zgpg30
##.SOLVENT NAME= CDCl3
##.SHIFT REFERENCE= (INTERNAL, CDCl3, 0, 248.564)
##AUDIT TRAIL= $$ (NUMBER, WHEN, WHO, WHERE, WHAT)
$$ ##TITLE= Audit trail, XWIN-NMR		Version 3.5
$$ ##JCAMPDX= 5.01
$$ ##ORIGIN= Bruker BioSpin GmbH
$$ ##OWNER= she
$$ F:/spectra/data/she/nmr/P31/1/pdata/1/auditp.txt
$$ ##AUDIT TRAIL=  $$ (NUMBER, WHEN, WHO, WHERE, WHAT)
(   1,<2023-12-21 12:49:49.76 +0400>,<she>,<DPX200>,
      <created by zg, POWCHK disabled, PULCHK disabled
       configuration hash MD5:
       00 E9 B6 7A A2 85 ED C7 34 08 36 98 17 FE 4E 26
       data hash MD5: 32K
       82 30 14 E2 B1 2D 68 75 5E DB D1 A1 50 F1 F0 68>)
(   2,<2023-12-21 12:49:57.98 +0400>,<she>,<DPX200>,
      <Start of raw data processing
       efp BC_mod = 2 LB = 10 FT_mod = 6 PKNL = 1 PHC0 = -12583.22 PHC1 = 1171.494 SI = 64K 
       data hash MD5: 64K
       26 8F AE 1A F6 83 C7 D9 84 E4 0A 3E 93 59 F3 63>)
(   3,<2023-12-21 12:50:25.34 +0400>,<she>,<DPX200>,
      <pk PHC0 = -41.31421 PHC1 = 181.8 
       data hash MD5: 64K
       CB CB 12 D8 BE 88 D2 A9 E3 FA C6 C5 C9 11 E3 C3>)
(   4,<2023-12-21 12:50:28.79 +0400>,<she>,<DPX200>,
      <abs ABSG = 5 
       data hash MD5: 64K
       45 FE DD E9 07 09 3F D8 9C 0C 58 E1 87 91 5D 33>)
$$ ##END=
$$ 
$$ hash MD5
$$ D7 C3 17 02 28 FC 77 8A 0F 93 ED C5 04 5E B6 B3
##$RELAX= 
##$RELAX= 
##$RELAX= 
##$RELAX= 
##$RELAX= 
##$RELAX= 
##$RELAX= 
##$RELAX= 
##$RELAX= 
$$ Bruker specific parameters
$$ --------------------------
##$DU= <F:/spectra>
##$EXPNO= 1
##$NAME= <P31>
##$PROCNO= 1
##$TYPE= <nmr>
##$USER= <she>
##$AMP= (0..31)
100 100 100 100 100 100 100 100 100 100 100 100 100 100 100 100 100 100 
100 100 100 100 100 100 100 100 100 100 100 100 100 100 
##$AQSEQ= 0
##$AQ_mod= 1
##$AUNM= <au_zg>
##$AUTOPOS= <>
##$BF1= 81.014009
##$BF2= 200.13
##$BF3= 200.13
##$BF4= 200.13
##$BF5= 200.13
##$BF6= 200.13
##$BF7= 200.13
##$BF8= 200.13
##$BYTORDA= 1
##$CFDGTYP= 0
##$CFRGTYP= 5
##$CHEMSTR= <none>
##$CNST= (0..31)
1 1 145 1 1 1 1 1 1 1 1 1 1 1 1 1 1 1 1 1 1 1 1 1 1 1 1 1 1 1 1 1 
##$CPDPRG= <waltz16>
##$CPDPRG1= <>
##$CPDPRG2= <waltz16>
##$CPDPRG3= <>
##$CPDPRG4= <mlev>
##$CPDPRG5= <mlev>
##$CPDPRG6= <mlev>
##$CPDPRG7= <mlev>
##$CPDPRG8= <mlev>
##$CPDPRGB= <>
##$CPDPRGT= <>
##$D= (0..31)
0 1 0 0 0 0 0 0 0 0 0 0.03 2e-05 3e-06 0 0 0 0 0 0 0 0 0 0 0 0 0 0 0 0 
0 0 
##$DATE= 1703148589
##$DBL= (0..7)
120 120 120 11 120 120 24 19 
##$DBP= (0..7)
150 150 150 150 150 150 150 150 
##$DBP07= 0
##$DBPNAM0= <>
$$ [...]
##$SUBNAM3= <"">
##$SUBNAM4= <"">
##$SUBNAM5= <"">
##$SUBNAM6= <"">
##$SUBNAM7= <"">
##$SUBNAM8= <"">
##$SUBNAM9= <"">
##$SW= 501.771253377433
##$SWIBOX= (0..15)
0 1 3 0 0 0 0 0 0 0 0 0 0 0 0 0 
##$SW_h= 40650.406504065
##$TD= 32768
##$TD0= 1
##$TE= 0
##$TE2= 300
##$TE3= 300
##$TEG= 300
##$TL= (0..7)
0 120 53 12 22 120 120 120 
##$TP= (0..7)
150 150 150 150 150 150 150 150 
##$TP07= 0
##$TPNAME0= <>
##$TPNAME1= <>
##$TPNAME2= <>
##$TPNAME3= <>
##$TPNAME4= <>
##$TPNAME5= <>
##$TPNAME6= <>
##$TPNAME7= <>
##$TPOAL= (0..7)
0.5 0.5 0.5 0.5 0.5 0.5 0.5 0.5 
##$TPOFFS= (0..7)
0 0 0 0 0 0 0 0 
##$TUNHIN= 0
##$TUNHOUT= 0
##$TUNXOUT= 0
##$USERA1= <user>
##$USERA2= <user>
##$USERA3= <user>
##$USERA4= <user>
##$USERA5= <user>
##$V9= 5
##$VALIST= <valist>
##$VCLIST= <CCCCCCCCCCCCCCC>
##$VD= 0
##$VDLIST= <DDDDDDDDDDDDDDD>
##$VPLIST= <PPPPPPPPPPPPPPP>
##$VTLIST= <TTTTTTTTTTTTTTT>
##$WBST= 1024
##$WBSW= 4
##$XGAIN= (0..3)
0 0 0 0 
##$XL= 0
##$YL= 0
##$YMAX_a= 1629
##$YMIN_a= -1753
##$ZGOPTNS= <>
##$ZL1= 120
##$ZL2= 120
##$ZL3= 120
##$ZL4= 120
##$ABSF1= 248.5645
##$ABSF2= -253.2056
##$ABSG= 5
##$ABSL= 3
##$ALPHA= 0
##$AQORDER= 0
##$ASSFAC= 0
##$ASSFACI= 0
##$ASSFACX= 0
##$ASSWID= 0
##$AUNMP= <proc_1d>
##$AZFE= 0.1
##$AZFW= 0.5
##$BCFW= 0
##$BC_mod= 2
##$BYTORDP= 0
##$COROFFS= 0
##$CY= -3
##$DATMOD= 1
##$DC= 0
##$DFILT= <>
##$DTYPP= 0
##$F1P= 0
##$F2P= 0
##$FCOR= 1
##$FTSIZE= 65536
##$FT_mod= 6
##$GAMMA= 0
##$GB= 0
##$INTBC= 1
##$INTSCL= 6.047779e-11
##$ISEN= 30
##$LB= 10
##$LEV0= 0
##$LPBIN= 0
##$MAXI= 10000
##$MC2= 0
##$MEAN= 0
##$ME_mod= 0
##$MI= 50
##$NCOEF= 0
##$NC_proc= -10
##$NLEV= 6
##$NOISF1= 182.463
##$NOISF2= 159.3651
##$NSP= 0
##$NTH_PI= 0
##$NZP= 0
##$OFFSET= 248.5645
##$PC= 4
##$PHC0= -12624.53
##$PHC1= 1353.294
##$PH_mod= 1
##$PKNL= yes
##$PPARMOD= 0
##$PSCAL= 0
##$PSIGN= 0
##$REVERSE= no
##$SF= 81.0140089999694
##$SI= 65536
##$SIGF1= 159.3651
##$SIGF2= -187.1042
##$SINO= 113.3802
##$SIOLD= 16384
##$SREGLST= <1H.CDCl3>
##$SSB= 0
##$STSI= 65536
##$STSR= 0
##$SW_p= 40650.406504065
##$SYMM= 0
##$S_DEV= 0
##$TDeff= 32768
##$TDoff= 0
##$TI= <>
##$TILT= no
##$TM1= 0
##$TM2= 0
##$TOPLEV= 0
##$USERP1= <user>
##$USERP2= <user>
##$USERP3= <user>
##$USERP4= <user>
##$USERP5= <user>
##$WDW= 1
##$XDIM= 65536
##$YMAX_p= 515379729
##$YMIN_p= -23474650
$$ End of Bruker specific parameters
$$ ---------------------------------
##NTUPLES= NMR SPECTRUM
##VAR_NAME=  FREQUENCY,     SPECTRUM/REAL,   SPECTRUM/IMAG
##SYMBOL=    X,             R,               I
##VAR_TYPE=  INDEPENDENT,   DEPENDENT,       DEPENDENT
##VAR_FORM=  AFFN,          ASDF,            ASDF
##VAR_DIM=   65536,         65536,           65536
##UNITS=     HZ,            ARBITRARY UNITS, ARBITRARY UNITS
##FACTOR=    0.620285442955139, 1,           1
##FIRST=     20137.2065510682, 0,            0
##LAST=      -20513.1999529968, 0,           0
##MIN=       -20513.1999529968, -23474650,   0
##MAX=       20137.2065510682, 515379729,    0
$$ Real data points
##PAGE= N=1
##DATA TABLE= (X++(R..R)), XYDATA
$$ [...]
43435B090492J518310J408906J279315J169278J106352J095566J120928J154954
43427A1944101J167893J132710J027912Q41638N77075K56137q2386l92186o33739
43418A5839155p86988q55759q62675q38455q11089p98846q09272q43035q98239
43409H334797r71216j055061j140600j220335j290051j344303j370339j348657
43401a405765j261973j105185q88472o32961l64414j09247J07554K64865L48529
43392e047069L53815K86592J63978J3879j29284k34294k84809k85966k61412k43146
43382e667716k60533l32586m63449o40301q35422j013969j144890j208695j198430
43373a2765991j116137r69304p68236n22756k39292P7544M18147P62133J080515
$$ y = [2090492, 3608802, 5017708, 6297023, 7466301, 8572653, 9668219, 10789147, 11944101, 13111994, 14244704, 15272616, 16114254, 16691329, 16947466, 16865080, 16472894, 15839155, 15052167, 14196408, 13333733, 12495278, 11684189, 10885343, 10076071, 9233036, 8334797, 7363581, 6308520, 5167920, 3947585, 2657534, 1313231, -57108, -1405765, -2667738, -3772923, -4661395, -5294356, -5658770, -5768017, -5660463, -5395598, -5047069, -4693254, -4406662, -4242684, -4228805, -4358089, -4592383, -4877192, -5163158, -5424570, -5667716, -5928249, -6260835, -6724284, -7364585, -8200007, -9213976, -10358866, -11567561, -12765991, -13882128, -14851432, -15619668, -16142424, -16381716, -16304172, -15886025, -15123892, -14043377]
43364a4043377J345179J537639J650635J683633J638502J520081J340602J122574
43356b204532Q95201O85158N08271L67986K60128J78962J21548R0815R6705J51760
43346A152002K60075M06039N52614O52836O67932N81113M00508J52909j25587
43337D700441l97912o33585q16301r48117j044988j123899j189887j232355j232148
43328c918751j172794j048187q63800o32820l70813r2792J85212M42135O50902
43319f821708P84221Q24861P73224O46673M71677K75297Q1811q6095k07206k66500
43309c523745k61640k04660j16212j6633Q0173J67858K45538L14741L76043M26270
43299b512267M57529M58754M19256L33222K04312M8104j10021k41679l22966l38543
$$ y = [-14043377, -12698198, -11160559, -9509924, -7826291, -6187789, -4667708, -3327106, -2204532, -1309331, -624173, -115902, 252084, 512212, 691174, 812722, 903537, 1000242, 1152002, 1412077, 1818116, 2370730, 3023566, 3691498, 4272611, 4673119, 4826028, 4700441, 4302529, 3668944, 2852643, 1904526, 859538, -264361, -1454248, -2686603, -3918751, -5091545, -6139732, -7003532, -7636352, -8007165, -8099957, -7914745, -7472610, -6821708, -6037487, -5212626, -4439402, -3792729, -3321052, -3045755, -2963944, -3050039, -3257245, -3523745, -3785385, -3990045, -4106257, -4122890, -4042717, -3874859, -3629321, -3314580, -2938537, -2512267, -2054738, -1595984, -1176728, -843506, -639194, -591090, -701111, -942790, -1265756, -1604299]
43289a604299k82842j62240J235J70261L02442L67945L63859L15216K61816K39189
43279b7418K64013L30124M14719M90182N35394N41703N12154M56747L88392L22154
43269D228164K75637K66175L03640L83326M85047N80032O41538O53059O10880
43260H427498N21282L95444K45358Q2399q2599k39545l79544m94295n75159o14484
43250G286355o09351n63644m85412l82262k60141j26192R097J33339K35083L05114
43240E541986L37732L34020L04366K64995K29227K01058J76733J51450J23889
43231G665456R6025P1366N4330M9461N8556P7379R5289R8792P6861K5257n1657
43220H317115j41886k28976k96035l29755l24489k86113k32908j90159j78913
$$ y = [-1604299, -1887141, -2049381, -2048146, -1877885, -1575443, -1207498, -843639, -528423, -266607, -27418, 236595, 566719, 981438, 1471620, 2007014, 2548717, 3060871, 3517618, 3906010, 4228164, 4503801, 4769976, 5073616, 5456942, 5941989, 6522021, 7163559, 7816618, 8427498, 8948780, 9344224, 9589582, 9671981, 9589382, 9349837, 8970293, 8475998, 7900839, 7286355, 6677004, 6113360, 5627948, 5245686, 4985545, 4859353, 4868450, 5001789, 5236872, 5541986, 5879718, 6213738, 6518104, 6783099, 7012326, 7213384, 7390117, 7541567, 7665456, 7761481, 7832847, 7887177, 7936638, 7995194, 8072573, 8167862, 8266654, 8343515, 8368772, 8317115, 8175229, 7946253, 7650218, 7320463, 6995974, 6709861, 6476953, 6286794, 6107881]
43211F107881k04907k55252l05780l34626l33234l07870k71249k31234j85503
43202C678226j26381n1710K7022Q6032R9836N4614m3662j71084k96694l96372
43192B859827m61745m98908n18780n26903n20332m92135m37633l57143k55602
43183a209354j41806k7618P4466J54933K09110K35812K34533K03692J40777M4240
43173h1215q3753k35836m01046n68006p25605q59972r52107r80690r28896p89756
43163f606882n67014k73373P0895M38930P99804J123432J386032J572858J676713
43154c78605J694197J624002J469553J243980R72562O89350M28577K14511N4212
43145H012339o3601j62939k69667l98354n42056o72199p52453p60772p05035o21111
$$ y = [6107881, 5902974, 5647722, 5341942, 5007316, 4674082, 4366212, 4094963, 3863729, 3678226, 3551845, 3500135, 3527157, 3613189, 3713025, 3767639, 3723977, 3552893, 3256199, 2859827, 2398082, 1899174, 1380394, 853491, 333159, -158976, -596609, -953752, -1209354, -1351160, -1378778, -1304312, -1149379, -940269, -704457, -469924, -266232, -125455, -81215, -164968, -400804, -801850, -1369856, -2095461, -2955433, -3907540, -4888230, -5817126, -6606882, -7173896, -7447269, -7376374, -6937444, -6137640, -5014208, -3628176, -2055318, -378605, 1315592, 2939594, 4409147, 5653127, 6625689, 7315039, 7743616, 7958127, 8012339, 7948738, 7785799, 7516132, 7117778, 6575722, 5903523, 5151070, 4390298, 3685263, 3064152]
43135C064152n55432n44670o03242p21182q69780j011743j112833j151360j123024
43126d629114j040610r29221q18052p31196o80673o64001o66886o70712o62193
43117a1492658o39526o09895n80071n48065n01768m23534k96630j12011J25088
43108a5079070L92324O55255Q78968J039079J125665J139430J084861R66178P88756
43099g008554N63242L06502L7248k29218m81648p09990r04738j059672j172991
43090a0659819j243728j268106j241700j165765j050372r10799p61296o11951
43082a8913536m69626l39777k26483j31076n1153J8970Q6823J60335K45952L45210
43072a9274361M50600N44724O06285O21027N90749N34349M80382M55304M72988
$$ y = [3064152, 2508720, 1964050, 1360808, 639626, -230154, -1241897, -2354730, -3506090, -4629114, -5669724, -6598945, -7416997, -8148193, -8828866, -9492867, -10159753, -10830465, -11492658, -12132184, -12742079, -13322150, -13870215, -14371983, -14795517, -15092147, -15204158, -15079070, -14686746, -14031491, -13152523, -12113444, -10987779, -9848349, -8763488, -7797310, -7008554, -6445312, -6138810, -6101562, -6330780, -6812428, -7522418, -8427156, -9486828, -10659819, -11903547, -13171653, -14413353, -15579118, -16629490, -17540289, -18301585, -18913536, -19383162, -19722939, -19949422, -20080498, -20131651, -20112681, -20025858, -19865523, -19619571, -19274361, -18823761, -18279037, -17672752, -17051725, -16460976, -15926627, -15446245, -14990941, -14517953]
43063a4517953N30294O10937O95071P68049Q22920Q57515Q71248Q64680Q40263
43054g656976Q00989P46662O70821N62402M13845K32141M4509j08338j89533j83261
43044d666739j01057K5180J57532K66103L37291L74139L90480M03815M30844M84821
43034a897591N71753O86162Q10897R22823J000203J027161R95340R05739P70603
43025E793090O12193M56861L27085K35350J81887J56570J44261J32002J15160
43016H154459R9737R9340J27733J90324K78919L72217M41430M58652M05870K82061
43006A0910742J04720r6229k89015m48645n59788o15863o18347n77180n10179
42997G300216m39422l85262l60514l68368m05197m65108n40819o19893o82154
$$ y = [-14517953, -13987659, -13376722, -12681651, -11913602, -11090682, -10233167, -9361919, -8497239, -7656976, -6855987, -6109325, -5438504, -4876102, -4462257, -4230116, -4185607, -4293945, -4483478, -4666739, -4767796, -4742616, -4585084, -4318981, -3981690, -3607551, -3217071, -2813256, -2382412, -1897591, -1325838, -639676, 171221, 1094044, 2094247, 3121408, 4116748, 5022487, 5793090, 6405283, 6862144, 7189229, 7424579, 7606466, 7763036, 7907297, 8039299, 8154459, 8254196, 8353536, 8481269, 8671593, 8950512, 9322729, 9764159, 10222811, 10628681, 10910742, 11015462, 10919233, 10630218, 10181573, 9621785, 9005922, 8387575, 7810395, 7300216, 6860794, 6475532, 6115018, 5746650, 5341453, 4876345, 4335526, 3715633, 3033479]
42988C033479p04294o69925n77012m38000k75233j15637J5331J01062J38622J35899
42978F44292J02858M5633l0654j14358j84331k15992j92498j13495L411J28808
42968G3674K31989K91067K98074K56962J76845O6017o8217k14070l50132m47383
42958C14826m79309m34183l21683j70530j8930R7812J57882J57940J11222M1347
42948e43606k4287o0331m9895Q903J00898K00259K82588L34313L52983L40395
42938I42220K96486K19623J11486j9730j61009k98445m19492n13890n75917o07526
42928a026194o17604o15202o01375n67161n00216l95046k59130j11006K7479J38501
42918d526954K10559K36828K14882J50218N9235l4080j06803j43939j39168r2817
$$ y = [3033479, 2329185, 1659260, 1082248, 644248, 369015, 253378, 268709, 369771, 508393, 644292, 747150, 792783, 762129, 647771, 463440, 247448, 54950, -58545, -55134, 73674, 305663, 596730, 894804, 1151766, 1328611, 1394628, 1326411, 1112341, 762209, 314826, -164483, -598666, -920349, -1090879, -1109809, -1011997, -854115, -696175, -584953, -543606, -567893, -628224, -678119, -669216, -568318, -368059, -85471, 248842, 601825, 942220, 1238706, 1458329, 1569815, 1550085, 1389076, 1090631, 671139, 157249, -418668, -1026194, -1643798, -2259000, -2860375, -3427536, -3927752, -4322798, -4581928, -4692934, -4665455, -4526954, -4316395, -4079567, -3864685, -3714467, -3655232, -3689312, -3796115, -3940054, -4079222, -4172039]
42908d172039j2533Q4468J73896K34563K60231K63818K70012L01247L65250M49675
42898a781412N25008N54560N08547L76005J67694r0894l69284o36397q59576j005671
42888b611420j048838r80900q16095n86914l34141r5879J01410K47810L48758
42879e776209M17473M64687M91609M90290M50034L64711K36744P7511r4080k54993
42869c132223l84754m73371n24232n47757n49737n24261m57958l43040j88975
42860g126308k3255J20355K17573K61780K60316K25418J68941J02778L9997o727
42850e759132k7344j4884L4610J20751K37401L73706N16888O54063P72862Q63304
42840b227775R21547R52083R64996R69256R66969R52837R18181Q55066P57176
$$ y = [-4172039, -4184572, -4100104, -3926208, -3691645, -3431414, -3167596, -2897584, -2596337, -2231087, -1781412, -1256404, -701844, -193297, 182708, 350402, 259508, -109776, -746173, -1605749, -2611420, -3660258, -4641158, -5457253, -6044167, -6378308, -6474187, -6372777, -6124967, -5776209, -5358736, -4894049, -4402440, -3912150, -3462116, -3097405, -2860661, -2783150, -2877230, -3132223, -3516977, -3990348, -4514580, -5062337, -5612074, -6136335, -6594293, -6937333, -7126308, -7149563, -7029208, -6811635, -6549855, -6289539, -6064121, -5895180, -5792402, -5752405, -5759132, -5786476, -5801360, -5766750, -5645999, -5408598, -5034892, -4518004, -3863941, -3091079, -2227775, -1306228, -354145, 610851, 1580107, 2547076, 3499913, 4418094, 5273160, 6030336]
42831F030336O19440M41082K32100J6246j75246l15328l88581l90874l27037k11846
42821E530292p0450O8625J86349K81436L66185M53145N42918O20851O63256O48337
42811I290944N65750M20711K32678L0874j51712k86002l55148l59747l16329k49652
42801H822367j83193j32486j03158r3383r8890j17980j53778k12688l00254m16979
42791G009578n55891p01800q31540r15989r26525q46169o79483m52685k02299
42782H97197L8409K44103L92581M60505M27950K89377O1974k14688m87532p04332
42772A405544q29449q55527q05245p21092o47320o12842o23089o63202p07713
42763e059935p29201p02974o10927m47354k23085L7915L08691N68118Q02147R99977
$$ y = [6030336, 6649776, 7090858, 7322958, 7339204, 7163958, 6848630, 6460049, 6069175, 5742138, 5530292, 5459842, 5528467, 5714816, 5996252, 6362437, 6815582, 7358500, 7979351, 8642607, 9290944, 9856694, 10277405, 10510083, 10540957, 10389245, 10103243, 9748095, 9388348, 9072019, 8822367, 8639174, 8506688, 8403530, 8310147, 8211257, 8093277, 7939499, 7726811, 7426557, 7009578, 6453687, 5751887, 4920347, 4004358, 3077833, 2231664, 1552181, 1099496, 897197, 935606, 1179709, 1572290, 2032795, 2460745, 2750122, 2812096, 2597408, 2109876, 1405544, 576095, -279432, -1084677, -1805769, -2453089, -3065931, -3689020, -4352222, -5059935, -5789136, -6492110, -7103037, -7550391, -7773476, -7735561, -7426870, -6858752, -6056605, -5056628]
42753e056628J151581J249169J290294J279932J230254J157320J075270R91399
42745D368591R05680Q13856P09582N84190M27979K36508J8297k03564l98841n41608
42735F920670o18184o28662n84657n06549m20440l52684l21384l28350l56554
42726B803206l75723l54244k72654j33442L7437J99445L13660L57827L31917K52710
42716C160139J43505K6168q1919j68399k26849k58390k71957k81220k98619l29660
42706A412799l70945m12592m42728m51727m35173l95106l38354k72247k00873
42697a906946j25271m6975K9467R8207J56119K04168K43439K68968K67617K23407
42687e87800J26540k1291k08423m17001o23974q01077r19835r61883r27004q32470
$$ y = [-5056628, -3905047, -2655878, -1365584, -85652, 1144602, 2301922, 3377192, 4368591, 5274271, 6088127, 6797709, 7381899, 7809878, 8046386, 8064683, 7861119, 7462278, 6920670, 6302486, 5673824, 5089167, 4582618, 4162178, 3809494, 3488110, 3159760, 2803206, 2427483, 2073239, 1800585, 1667143, 1704580, 1904025, 2217685, 2575512, 2907429, 3160139, 3303644, 3329812, 3247893, 3079494, 2852645, 2594255, 2322298, 2041078, 1742459, 1412799, 1041854, 629262, 186534, -265193, -700366, -1095472, -1433826, -1706073, -1906946, -2032217, -2079192, -2049725, -1951518, -1795399, -1591231, -1347792, -1078824, -811207, -587800, -461260, -482551, -690974, -1107975, -1731949, -2533026, -3452861, -4414744, -5341748, -6174218]
42677f174218p05575n75515m67201l95947l63429l57439l55762l31904k61320
42668i988310j27944P0610L22459O05280Q90539J145212J333084J418880J375143
42659b955047J189376Q69819M48550k0549m70718q36142j066458j138470j062052
42650e041691q76418o35518l88632j66758J9287J72486L02392M20503N36567O53966
42640e003816P65506Q53503Q96404Q79361Q02083O78708N30830L79662K41355
42631A023596J24501K7641o1901j64339k97942m67195o54539q20968r16980q99590
42621c107716p47480m68535r9448L00964O64617R32467J071760J083066R93922
42612F23617Q45298O79471N31990M25530L65045L37494L18727K85087K23444J34574
$$ y = [-6174218, -6879793, -7455308, -7922509, -8318456, -8681885, -9039324, -9395086, -9726990, -9988310, -10116254, -10045644, -9723185, -9117905, -8227366, -7082154, -5749070, -4330190, -2955047, -1765671, -895852, -447302, -467851, -938569, -1774711, -2841169, -3979639, -5041691, -5918109, -6553627, -6942259, -7109017, -7089730, -6917244, -6614852, -6194349, -5657782, -5003816, -4238310, -3384807, -2488403, -1609042, -806959, -128251, 402579, 782241, 1023596, 1148097, 1175738, 1113837, 949498, 651556, 184361, -470178, -1291146, -2208126, -3107716, -3855196, -4323731, -4423179, -4122215, -3457598, -2525131, -1453371, -370305, 623617, 1468915, 2148386, 2680376, 3105906, 3470951, 3808445, 4127172, 4412259, 4635703, 4770277]
42602D770277K9643p6351j70258k44054k95987l29212l47687l51660l37292l01697
42592B345722k48453j86802j24775o3906k441N5766R6357J00026N4712l5089j48124
42581A842993k54324l26116l48602l24574k70877k06813j42224p4752J462Q3908
42571a9919J57501K01276J99557J48749N5851o8010k12950l70964n33265o88028
42561a130202q20213r12121r43949q96102p54926n20157k09821J40353M83628
42552e563510P73779R78280J087461J114833J088916J041746R99056R74350R67735
42543C462646R70115R70794R63490R47278R23888Q95369Q63657Q30465P96162
42534A1623864P58495P12584O53093N78285M93940M13337L50821L11742K85955
$$ y = [4770277, 4799920, 4723569, 4553311, 4309257, 4013270, 3684058, 3336371, 2984711, 2647419, 2345722, 2097269, 1910467, 1785692, 1721786, 1719345, 1775111, 1871468, 1971494, 2026206, 1991117, 1842993, 1588669, 1262553, 913951, 589377, 318500, 111687, -30537, -105289, -103827, -19919, 137582, 338858, 538415, 687164, 743015, 675005, 462055, 91091, -442174, -1130202, -1950415, -2862536, -3806485, -4702587, -5457513, -5977670, -6187491, -6047138, -5563510, -4789731, -3811451, -2723990, -1609157, -520241, 521505, 1520561, 2494911, 3462646, 4432761, 5403555, 6367045, 7314323, 8238211, 9133580, 9997237, 10827702, 11623864, 12382359, 13094943, 13748036, 14326321, 14820261, 15233598, 15584419, 15896161, 16182116]
42525A6182116K50735J82320O9217q0911k44611l93469n04882n66667n75520n34190
42515A3784138m51317l43129k33393j49263j13758j38058k17629l34804m66735
42506A1336052n94234p06680q01196q77988r35273r67104r65314r24063q44215
42497C719985p35757o18018n16653m56022m48505m87252n48808o04982o35645
42488a331657o34033o02719n45953m65583l63144k44197j18397O316J29832K59008
42478c910527L99460N47111O86443P95995Q56511Q57810Q02671P06877N94857
42469B337208M92124M17698L79515L73922L88864M09474M23737M25738M15015
42460F063295L93191L60624L15273K54256J76718Q6115r454r9034j72034k21486
$$ y = [16182116, 16432851, 16615171, 16684388, 16603477, 16358866, 15965397, 15460515, 14893848, 14318328, 13784138, 13332821, 12989692, 12756299, 12607036, 12493278, 12355220, 12137591, 11802787, 11336052, 10741818, 10035138, 9233942, 8355954, 7420681, 6453577, 5488263, 4564200, 3719985, 2984228, 2366210, 1849557, 1393535, 945030, 457778, -91030, -696012, -1331657, -1965690, -2568409, -3114362, -3579945, -3943089, -4187286, -4305683, -4299367, -4169535, -3910527, -3511067, -2963956, -2277513, -1481518, -625007, 232803, 1035474, 1742351, 2337208, 2829332, 3247030, 3626545, 4000467, 4389331, 4798805, 5222542, 5648280, 6063295, 6456486, 6817110, 7132383, 7386639, 7563357, 7649472, 7640018, 7540984, 7368950, 7147464]
42450G147464k46049k49856k40393k25650k12006k03628k03016k11799k31267
42441E123800k62889l08742l70580m46231n25074n87732o13579n92580n32665
42432H83728m56458l89885l50938l44791l65551m00855m35723m54867m44906l97764
42422c158010l14061k03501q1239L7264J39492K16591K63283K77709K60532K13679
42412b348261J40701M9531m5045j22750j63812j56536j02232j5139Q1752J62674
42402b519117K05181J96367J38117M7963m7394j23621j68573j84648j83461j76797
42392b815983j68690j52801j17142n3331L6777J42187K49581L49473M38122N16629
42382a575178N89342O61827P38309Q19823R03749R83833J049925J088830J087491
$$ y = [7147464, 6901415, 6651559, 6411166, 6185516, 5973510, 5769882, 5566866, 5355067, 5123800, 4860911, 4552169, 4181589, 3735358, 3210284, 2622552, 2008973, 1416393, 883728, 427270, 37385, -313553, -658344, -1023895, -1424750, -1860473, -2315340, -2760246, -3158010, -3472071, -3675572, -3756811, -3719547, -3580055, -3363464, -3100181, -2822472, -2561940, -2348261, -2207560, -2158029, -2203074, -2325824, -2489636, -2646172, -2748404, -2763543, -2681791, -2519117, -2313936, -2117569, -1979452, -1931489, -1978883, -2102504, -2271077, -2455725, -2639186, -2815983, -2984673, -3137474, -3254616, -3307947, -3271170, -3128983, -2879402, -2529929, -2091807, -1575178, -985836, -324009, 414300, 1234123, 2137872, 3121705, 4171630, 5260460, 6347951]
42373F347951J037345R37379P94821O23479M39836K58041Q6875o8613k03003l09243
42363I944868l82328m23767m40993m41152m24524l83279l06809j90288m1043J20669
42353G031354K66194L65176L92296L34269J97029R343j82252l27409l88322l50667
42343G347011k25752m5401J47942L13582M23855M69463M56261L96742L03475J89680
42333I776858P4283j6869n9392m3971J5660Q7380J34563J30130O4079n6731k15089
42322I890901l92837n77469p61011r32598j072702j156500j165888j101964r88290
42313A741642q61041p51230o70485o09612n49497m75735l88143l02072k42299
42304c108472k31781k79431l73522m85270n80779o34575o37906n98522n32917
$$ y = [6347951, 7385296, 8322675, 9117496, 9740975, 10180811, 10438852, 10525727, 10457114, 10254111, 9944868, 9562540, 9138773, 8697780, 8256628, 7832104, 7448825, 7142016, 6951728, 6910685, 7031354, 7297548, 7662724, 8055020, 8389289, 8586318, 8595661, 8413409, 8086000, 7697678, 7347011, 7121259, 7075858, 7223800, 7537382, 7961237, 8430700, 8886961, 9283703, 9587178, 9776858, 9851141, 9834272, 9774880, 9730909, 9746569, 9833949, 9968512, 10098642, 10162721, 10105990, 9890901, 9498064, 8920595, 8159584, 7226986, 6154284, 4997784, 3831896, 2729932, 1741642, 880601, 129371, -541114, -1150726, -1700223, -2175958, -2564101, -2866173, -3108472, -3340253, -3619684, -3993206, -4478476, -5059255, -5693830, -6331736, -6930258, -7463175]
42295g463175m56367l77797l02017k34434j81268j44694j18920r2117n2652O146
42285i417295Q6227J88552L14886M63391O20380P57405Q40431Q46639P75908O48763
42275c874713M94774L41086K06377R9573K2234k5750m0385j3447N9677J69946
42265b560628K91818L91732M42409M32804L67906K61164J27175k0463j67189k95747
42255g29019l87441m25832m00641l10123j61898K7005K31047M20078N67425O59350
42245e10049O99880P07052P02599P01303P05626P07471O95157O61294O07066N40706
42235F218105M71889M05451L37674K56897J49216P524j60831l33166m79202n73592
42225F299965o06148n84092n26042m53048l83390l33220l18251l50362m29268
$$ y = [-7463175, -7919542, -8297339, -8599356, -8833790, -9015058, -9159752, -9278672, -9370789, -9423441, -9417295, -9331068, -9142516, -8827630, -8364239, -7743859, -6986454, -6146023, -5299384, -4523476, -3874713, -3379939, -3038853, -2832476, -2732903, -2710669, -2736419, -2776804, -2790251, -2730574, -2560628, -2268810, -1877078, -1434669, -1001865, -633959, -372795, -245620, -266083, -433272, -729019, -1116460, -1542292, -1942933, -2253056, -2414954, -2387949, -2156902, -1736824, -1169399, -510049, 189831, 896883, 1599482, 2300785, 3006411, 3713882, 4409039, 5070333, 5677399, 6218105, 6689994, 7095445, 7433119, 7690016, 7839232, 7846756, 7685925, 7352759, 6873557, 6299965, 5693817, 5109725, 4583683, 4130635, 3747245, 3414025, 3095774, 2745412, 2316144]
42216B316144n36955o42005p12429p28095o85506n95199m76456l52031k42724
42207b655256j62870j19461j14351j45047k02180k68907l27980l72115m06274
42198d774441m37664m63685m71095m47571l93864l25573k64401k27510k22479
42189h028283k48584k99732l65036m27937m68087m67568m17744l21871j92736
42180a1237578m8093R3949K19321L21207L99823M58163M96429N09415M89201M31728
42170g866435L42869K39247J42694P1960L6550L4991N7318R1149J29777J77377
42160f542503K45867L43963M66441N92574O95460P55800P71172P55476P29501
42151a186249P08824O95898O79570O40716N60780M30439K55504N7593j30975k75658
$$ y = [2316144, 1779189, 1137184, 424755, -303340, -988846, -1584045, -2060501, -2412532, -2655256, -2818126, -2937587, -3051938, -3196985, -3399165, -3668072, -3996052, -4368167, -4774441, -5212105, -5675790, -6146885, -6594456, -6988320, -7313893, -7578294, -7805804, -8028283, -8276867, -8576599, -8941635, -9369572, -9837659, -10305227, -10722971, -11044842, -11237578, -11285671, -11191722, -10972401, -10651194, -10251371, -9793208, -9296779, -8787364, -8298163, -7866435, -7523566, -7284319, -7141625, -7069665, -7033115, -6998124, -6940806, -6849657, -6719880, -6542503, -6296636, -5952673, -5486232, -4893658, -4198198, -3442398, -2671226, -1915750, -1186249, -477425, 218473, 898043, 1538759, 2099539, 2529978, 2785482, 2843075, 2712100, 2436442]
42141B436442l48504l35351k39878q2849J03984K86658M36855N36955N82594N82750
42131C959656N56097N22797M94239M66266M21247L39040K10167M2894j39012l04106
42121F569285m21603m68248m34003l25507j65416J2533J70864K76456L08506K64566
42111E787433J61749L1454r0755j76009k09603j93040j41061p5708j9188J3126
42101E088398J7559K067j9321l4334l7429k9975j7629p711p811k5557o9065j46550
42089D712642k62800m12731n76602p22552q17197q38233p81239o57714m87840
42080h44266k93437r3600R7997K74877M37266N88120P27373Q48601R40720R93637
42070C677288J004122R78158R28302Q67434Q02820P33734O53026N50333M15488
$$ y = [2436442, 2087938, 1752587, 1512709, 1429860, 1533844, 1820502, 2257357, 2794312, 3376906, 3959656, 4515753, 5038550, 5532789, 5999055, 6420302, 6759342, 6969509, 7012403, 6873391, 6569285, 6147682, 5679434, 5245431, 4919924, 4754508, 4767041, 4937905, 5214361, 5522867, 5787433, 5949182, 5980636, 5889881, 5713872, 5504269, 5311229, 5170168, 5094460, 5075272, 5088398, 5105957, 5108024, 5088703, 5054369, 5016940, 4986965, 4969336, 4961625, 4953814, 4928257, 4859192, 4712642, 4449842, 4037111, 3460509, 2737957, 1920760, 1082527, 301288, -356426, -844266, -1137703, -1231303, -1133306, -858429, -421163, 166957, 894330, 1742931, 2683651, 3677288, 4681410, 5659568, 6587870, 7455304, 8258124, 8991858, 9644884, 10195217, 10610705]
42061A0610705K42491L3782j97950m32769o49483q29637r56889j014852r88407
42052E816991q70089o67867m08746j34633J09340K89873L97084M46272M68251
42043E446476M93630N39947O07875O85752P56233P99719P94516P18171N53806
42034A1396125L00100k1113l65953o80299r18021j056537j101114j076087j009941
42025E467160r24337q31361p35609o36208n28577m07960k73761j30874J2908J49886
42015A161267K72845L74170M46678M86256M93639M73520M31743L72643K98229
42006D810990K09686J09633K654j06725k16317l25802m33729n35206o23272o93145
41996B198767p45505p84859q13067q23058p99279p26632o02199m41465k74833
$$ y = [10610705, 10853196, 10886978, 10689028, 10256259, 9606776, 8777139, 7820250, 6805398, 5816991, 4946902, 4279035, 3870289, 3735656, 3844996, 4134869, 4531953, 4978225, 5446476, 5940106, 6480053, 7087928, 7773680, 8529913, 9329632, 10124148, 10842319, 11396125, 11696225, 11675112, 11309159, 10628860, 9710839, 8654302, 7553188, 6477101, 5467160, 4542823, 3711462, 2975853, 2339645, 1811068, 1403108, 1129347, 998473, 1011381, 1161267, 1434112, 1808282, 2254960, 2741216, 3234855, 3708375, 4140118, 4512761, 4810990, 5020676, 5130309, 5132963, 5026238, 4809921, 4484119, 4050390, 3515184, 2891912, 2198767, 1453262, 668403, -144664, -967722, -1767001, -2493633, -3095832, -3537297, -3812130]
41987c812130j36626n1793k5817m1864o6552o1954Q12J30280L08904M96686O46104
41976b613950P23031P21679O64037N85287N15991M71529M52104M49609M54982
41967B424299M61374M62759M51908M21592L68656K97064K17276J43195Q9175O7194
41957E404492Q3023J32137J98676K59845K94453K90943K50181J81227R3107j1114
41947G176970j33282k73595m25111n74524p07945q16446q98128r57329j002097
41938A388513j040198j075004j104237j122210j122266j096848j038317r44230
41930g154797q23899o97663n86614n01769m42725m04878l85430l82294l89926
41921a1769995l98854l99826l88398l66314l39344l12653k85512k48490j86578
$$ y = [-3812130, -3948756, -4000549, -4026366, -4068230, -4134782, -4196736, -4195924, -4065644, -3756740, -3260054, -2613950, -1890919, -1169240, -505203, 80084, 596075, 1067604, 1519708, 1969317, 2424299, 2885673, 3348432, 3800340, 4221932, 4590588, 4887652, 5104928, 5248123, 5337298, 5404492, 5487515, 5619652, 5818328, 6078173, 6372626, 6663569, 6913750, 7094977, 7188084, 7176970, 7043688, 6770093, 6344982, 5770458, 5062513, 4246067, 3347939, 2390610, 1388513, 348315, -726689, -1830926, -2953136, -4075402, -5172250, -6210567, -7154797, -7978696, -8676359, -9262973, -9764742, -10207467, -10612345, -10997775, -11380069, -11769995, -12168849, -12568675, -12957073, -13323387, -13662731, -13975384, -14260896, -14509386, -14695964]
41912a4695964q8057M6137J99428L45642M60287N29741N53410N40068N03436M60579
41902a1145293M31082M32825M74034N47314O31876P03325P43285P41503O91092
41893e748957N85191M21726K13633n939j91401l02387l19780k50477j20311L8658
41883e680044K00273L51986M95690O41094P95314R55357J107542J231833J307180
41874A406225J316560J252819J123422R49784P59395N75236M09815K66640J45592
41865H205488M5992l5118j06115j79779k66737l68416m75731n73968o48592o87809
41855D909215o83637o35175n53163m60005l81877l37000l28470l46519l77283
41846H06086m10641m42235m70768m94592n09527n06908m72161l87360k39671l1359
$$ y = [-14695964, -14784021, -14737884, -14538456, -14192814, -13732527, -13202786, -12649376, -12109308, -11605872, -11145293, -10714211, -10281386, -9807352, -9260038, -8628162, -7924837, -7181552, -6440049, -5748957, -5163766, -4742040, -4528407, -4534346, -4725747, -5028134, -5347914, -5598391, -5718702, -5680044, -5479771, -5127785, -4632095, -3991001, -3195687, -2240330, -1132788, 99045, 1406225, 2722785, 3975604, 5099026, 6048810, 6808205, 7383441, 7793256, 8059896, 8205488, 8251480, 8216362, 8110247, 7930468, 7663731, 7295315, 6819584, 6245616, 5597024, 4909215, 4225578, 3590403, 3037240, 2577235, 2195358, 1858358, 1529888, 1183369, 806086, 395445, -46790, -517558, -1012150, -1521677, -2028585, -2500746, -2888106, -3127777, -3159136]
41836c159136K16439M69566O92091Q56155R46840R62482R11682Q08655O68982
41827C373756N07558L38585J75929L2733p9644j52803j81620j62855r3148L0048
41817C788539K02512M06133O08173P70343Q62905Q75352Q18261P16000N93425
41808I641643M62997L20442J53304m3161k54957m51665n99502o75099o71911n98112
41798G283979m70392l08713j34314L0601J64374K49505K76605K46437J69565O3611
41788G571258n1968j62371k61394l49765m29620n00673n61317o12298o58113p03967
41778C279772p50228p88258q01421p72573o94650n76715m39458l02362j72169
41769b018062m1200J04365K73265M62281O56522Q35419R80654J081412J134408
$$ y = [-3159136, -2942697, -2473131, -1781040, -924885, 21955, 984437, 1896119, 2704774, 3373756, 3881314, 4219899, 4395828, 4428561, 4348917, 4196114, 4014494, 3851639, 3758491, 3788539, 3991051, 4397184, 5005357, 5775700, 6638605, 7513957, 8332218, 9048218, 9641643, 10104640, 10425082, 10578386, 10535225, 10280268, 9828603, 9229101, 8554002, 7882091, 7283979, 6813587, 6504874, 6370560, 6401161, 6565535, 6815040, 7091645, 7338082, 7507647, 7571258, 7519290, 7356919, 7095525, 6745760, 6316140, 5815467, 5254150, 4641852, 3983739, 3279772, 2529544, 1741286, 939865, 167292, -527358, -1104073, -1543531, -1845893, -2018062, -2059262, -1954897, -1681632, -1219351, -562829, 272590, 1253244, 2334656, 3469064]
41760C469064J140133J099487J012912Q80603P02493M79635K18525o4399l42991
41751H595462n87331p71267q77892r03123q58070p68234o67013n84835n38672
41742B039025n26420n28145n14199m57649l45733j84908K235J85428L36259M35421
41732D41314M75735M61199M03914L20767K29400J43072O7036Q20n3509q3580o7369
41721B338799J6179J72602L82823O05589P91028Q98427R09300Q29918O83593M98020
41711H126278K95219Q9469j07673k82814m23588n26827o01924o63261p17859p60291
41701D426729p79211p67977p28904o68383n89058m87078l56952j99626k7015J39854
41691c7621K76264L59042L70912L05448J71429p209j97653l67805m94272n65976
$$ y = [3469064, 4609197, 5708684, 6721596, 7602199, 8304692, 8784327, 9002852, 8938453, 8595462, 8008131, 7236864, 6358972, 5455849, 4597779, 3829545, 3162532, 2577697, 2039025, 1512605, 984460, 470261, 12612, -333121, -518029, -515794, -330366, 5893, 441314, 917049, 1378248, 1782162, 2102929, 2332329, 2475401, 2542437, 2543257, 2489748, 2406168, 2338799, 2354978, 2527580, 2910403, 3515992, 4307020, 5205447, 6114747, 6944665, 7628258, 8126278, 8421497, 8510966, 8403293, 8120479, 7696891, 7170064, 6568140, 5904879, 5187020, 4426729, 3647518, 2879541, 2150637, 1482254, 893196, 406118, 49166, -150460, -177475, -37621, 238643, 597685, 968597, 1274045, 1445474, 1438265, 1240612, 872807, 378535, -187441]
41681a87441n83399n55056m93607m13916l33156k69863k38896k43943k73725l07010
41671c900012l24507l19424k98919k76207k60713k53897k51945k50146k44427
41662f380197k30495k03769j60861j00331k1720P4677J84677K95652L86390M34710
41652e721267M28913L74748K92655K08193J42853J10131J15931J59587K33599
41643c654657L23317M08786M69138M87689M55461L72152K45388Q9043p9099k40174
41633a122956l76752m74239n21869n14307m53475l48745k15091p1136O1135J56774
41623c880661J92417J56047N6871p2794j88304k52526k54428k15019j75742j74753
41613d808892k24882l06362l77938l97771l40757k04174l749K32445M67773O60452
$$ y = [-187441, -770840, -1325896, -1819503, -2233419, -2566575, -2836438, -3075334, -3319277, -3593002, -3900012, -4224519, -4543943, -4842862, -5119069, -5379782, -5633679, -5885624, -6135770, -6380197, -6610692, -6814461, -6975322, -7075653, -7097373, -7022696, -6838019, -6542367, -6155977, -5721267, -5292354, -4917606, -4624951, -4416758, -4273905, -4163774, -4047843, -3888256, -3654657, -3331340, -2922554, -2453416, -1965727, -1510266, -1138114, -892726, -803683, -882782, -1122956, -1499708, -1973947, -2495816, -3010123, -3463598, -3812343, -4027434, -4098570, -4037435, -3880661, -3688244, -3532197, -3475326, -3548120, -3736424, -3988950, -4243378, -4458397, -4634139, -4808892, -5033774, -5340136, -5718074, -6115845, -6456602, -6660776, -6664525, -6432080, -5964307, -5303855]
41603e303855P71217P75557O74534M96402K86679R2232n1855j27278j30104o5308
41593b581779N7566K25243M18317O08952P63205Q49643Q50128P66029O16223M29131
41583C002658K33602N1716j05656k39647l59235m72757n79289o65473p10332o95557
41573e39970o15533m82079l21891j68146m9831J6880L2153J0500k5106n0672m7974
41562b241669q997O2561J51859K34830K82691K70862J90532N6226r6786k24827
41552a322718k90944k75675j81069k9134J44101K98662M03015M44098M29386L79179
41542a099L13262K40251J56042N1646p5563k14275l39426m19816m29898l61632
41532a080508k31910q1103L9147Q5351L9134q7988k64165m53417o27689p69802
$$ y = [-5303855, -4532638, -3757081, -3082547, -2586145, -2299466, -2207234, -2259089, -2386367, -2516471, -2581779, -2524213, -2298970, -1880653, -1271701, -508496, 341147, 1191275, 1957304, 2573527, 3002658, 3236260, 3287976, 3182320, 2942673, 2583438, 2110681, 1531392, 865919, 155587, -539970, -1155503, -1637582, -1959473, -2127619, -2177450, -2160570, -2128417, -2117917, -2143023, -2193695, -2241669, -2250666, -2188105, -2036246, -1801416, -1518725, -1247863, -1057331, -1001105, -1097891, -1322718, -1613662, -1889337, -2070406, -2099540, -1955439, -1656777, -1253762, -809664, -380278, -1099, 312163, 552414, 708456, 760102, 684539, 470264, 130838, -288978, -718876, -1080508, -1312418, -1393521, -1354374, -1269023, -1229889, -1317877, -1582042, -2035459, -2663148, -3432950]
41522c432950q70349r24949r35500r13528q80194q58918q63113q87400r09949
41513a1476850r04990q56727p65550o43893n06033l58984k00322k3706J73117
41504a5563938L85155O03615Q20168J025251J201653J321888J355832J285548
41496g564828J116719Q78417O11741L55138J34587l8607j64395k48274k95407
41487e214909l06618k78552k08669j01507K9277J65061K88557L86601M48581M65038
41477d327140M30011L44896K18887O5367j01385k65857m09470n11441n52987n22934
41467e632053m23250k73448j09956K4412R8852J09914Q2003N1481M4777O4608
41457e962660R2071J01623P8317K6526l3939q0021r7718q7906o3668m1899l4514
$$ y = [-3432950, -4303299, -5228248, -6163748, -7077276, -7957470, -8816388, -9679501, -10566901, -11476850, -12381840, -13238567, -14004117, -14648010, -15154043, -15513027, -15713349, -15737055, -15563938, -15178783, -14575168, -13755000, -12729749, -11528096, -10206208, -8850376, -7564828, -6448109, -5569692, -4957951, -4602813, -4468226, -4506833, -4671228, -4919502, -5214909, -5521527, -5800079, -6008748, -6110255, -6080978, -5915917, -5627360, -5240759, -4792178, -4327140, -3897129, -3552233, -3333346, -3267979, -3369364, -3635221, -4044691, -4556132, -5109119, -5632053, -6055303, -6328751, -6438707, -6414295, -6315443, -6205529, -6123526, -6072045, -6027268, -5962660, -5870589, -5768966, -5690649, -5664123, -5698062, -5778083, -5875801, -5963707, -6027375, -6069274, -6103788]
41446f103788m3875o2985p8188p2794l2029N1395J74474L26228M92796O60759
41436d688007Q17310R50184J050035J113922J145924J152318J133788J081422
41428C756896R81356Q25263O17328L71720J04505j71266m44137p01178r28307
41419D412180j113503j248984j330347j354181j317647j222370j080591r16494
41411e171937p57103o17007m90062l57091k04136l6394J22395K42917L05521L08363
41401f654534K64829J93562J08978J9076o9348j45068j93189k02421j72261j13572
41391f963948m1884L1212J02121J72374K41704L02557L40229L39572K95184K18986
41381d961893J39231Q9637R4487J58797K68754L99683N24326O16696O53467O17806
$$ y = [-6103788, -6147663, -6210648, -6288836, -6361630, -6393659, -6342264, -6167790, -5841562, -5348766, -4688007, -3870697, -2920513, -1870478, -756556, 389368, 1541686, 2675474, 3756896, 4738252, 5563515, 6180843, 6552563, 6657068, 6485802, 6041665, 5340487, 4412180, 3298677, 2049693, 719346, -634835, -1952482, -3174852, -4255443, -5171937, -5929040, -6546047, -7036109, -7393200, -7597336, -7633730, -7511335, -7268418, -6962897, -6654534, -6389705, -6196143, -6087165, -6068089, -6137437, -6282505, -6475694, -6678115, -6850376, -6963948, -7005832, -6974620, -6872499, -6700125, -6458421, -6155864, -5815635, -5476063, -5180879, -4961893, -4822662, -4733025, -4638538, -4479741, -4210987, -3811304, -3286978, -2670282, -2016815, -1399009]
41371a399009N06585L35338J34379o3299k33802l66161m58875n16084n47154n66825
41361c174907n91011o28485o73802p07053p01695o37113n09978l38453j55975
41352h118472L799J23549K10172K87620L78529M87325N96715O78587P09756O82072
41342c960348O03571M93441L74489K66004J80008J22059R3793R2762J09641J27762
41332a496818J28622J00581M4866k4006q2876j08145q5696j8462P2483J54020
41322a315431J91214J58750N1936j06300k68131l75752l83074k73675o6705J91472
41312b195696M45536O50450P82439Q38250Q27405P64778O66463N47382M19757
41303C746764K93746J79704Q8626K8713N47m787k598p582k5815n0437o5158n4860
$$ y = [-1399009, -892424, -557086, -422707, -486006, -719808, -1085969, -1544844, -2060928, -2608082, -3174907, -3765918, -4394403, -5068205, -5775258, -6476953, -7114066, -7624044, -7962497, -8118472, -8114673, -7991124, -7780952, -7493332, -7114803, -6627478, -6030763, -5352176, -4642420, -3960348, -3356777, -2863336, -2488847, -2222843, -2042835, -1920776, -1826983, -1734221, -1624580, -1496818, -1368196, -1267615, -1222749, -1246755, -1329631, -1437776, -1523472, -1541934, -1469451, -1315431, -1124217, -965467, -913531, -1019831, -1287962, -1663714, -2046788, -2320463, -2387168, -2195696, -1750160, -1099710, -317271, 520979, 1348384, 2113162, 2779625, 3327007, 3746764, 4040510, 4220214, 4308840, 4337553, 4338100, 4333313, 4330715, 4323133, 4297318, 4246881, 4181723, 4126863]
41291D126863j6071M0156R3922J25232J20052P1854j9719j50006l07684m71222
41281C613377o08617o85443o79012n89607m40807k69213j10783Q493P4726Q3560
41271C96674L8037n0142j58383k55412l10164l02894k31595j10452L7580J89791
41261g56960L30600M54306N63427O64703P65221Q69312R75096J071209J136816
41252F073730J147785J087227R54401P66328N51260L38020J46513j7022j58963
41243A0889279k92414m29265n74154p23123q66083r89580j077621j112503j079407
41234C745129r75101q15478o34855m74995l69379l31595l52862m07094m59245
41225a075475m74619m28198l11635j34701P9199K99985M97466O47369P36699P65865
$$ y = [4126863, 4110792, 4150948, 4244870, 4370102, 4490154, 4562008, 4542289, 4392283, 4084599, 3613377, 3004760, 2319317, 1640305, 1050698, 609891, 340678, 229895, 238388, 313114, 396674, 434711, 384569, 226186, -29226, -339390, -642284, -873879, -984331, -946751, -756960, -426360, 27946, 591373, 1256076, 2021297, 2890609, 3865705, 4936914, 6073730, 7221515, 8308742, 9263143, 10029471, 10580731, 10918751, 11065264, 11048242, 10889279, 10596865, 10167600, 9593446, 8870323, 8004240, 7014660, 5937039, 4824536, 3745129, 2770028, 1954550, 1319695, 844700, 475321, 143726, -209136, -616230, -1075475, -1550094, -1978292, -2289927, -2424628, -2345429, -2045444, -1547978, -900609, -163910, 601955]
41215F01955P45537O90511O14859N29155M37935L37682K18864P2928j00287k90078
41205C859061m77908o42757p66096q35065q42852p86780o67302m90244k69749
41196a919692k7340K12791M27674N96581P03115P41119P19989O62554N95855N42157
41186C254803N15349N20776N54511O02599O43654O55149O20025N30591L89604
41177H287061K09809J2488j75454l26722m21476m55704m44965m19015m08803m33680
41167E423539m96051n83991o76723p49070p75494p35819o22212m43905k26301
41158A13973m221J87419L21064L79983L58932K64585J15908n8175k25722l60948
41148A092798m50009m89757m81733m27527l29603j95917m2964J06511K30264L13708
$$ y = [601955, 1347492, 2038003, 2652862, 3182017, 3619952, 3957634, 4176498, 4249426, 4149139, 3859061, 3381153, 2738396, 1972300, 1137235, 294383, -492397, -1159699, -1649943, -1919692, -1947032, -1734241, -1306567, -709986, -6871, 734248, 1454237, 2116791, 2712646, 3254803, 3770152, 4290928, 4845439, 5448038, 6091692, 6746841, 7366866, 7897457, 8287061, 8496870, 8509358, 8333904, 8007182, 7585706, 7130002, 6685037, 6266022, 5857219, 5423539, 4927488, 4343497, 3666774, 2917704, 2142210, 1406391, 784179, 340274, 113973, 109752, 297171, 618235, 998218, 1357150, 1621735, 1737643, 1679468, 1453746, 1092798, 642789, 153032, -328701, -756228, -1085831, -1281748, -1324712, -1218201, -987937, -674229]
41138f74229L53258L53857L22068K59320J60838K2139j51119l37367n02582o11632
41128h05449o40929n85223m55351k70391n0494J86228M24805O54854Q70459J064809
41118C93318J221702J312575J305246J180263R43696O28453K85436k8787k62856
41109F979046l79868l66353k39009m3381J59542L14559L89778L80908L02735J76440
41099G674397K1325j46461l10439m50084n41076n61304m99812l62882j73006L8354
41089D689012K39968M08122N30433O05998O42313O50175O39162O16274N88023
41080I609480N62962N50680N56707N77485O00630O11278N99987N66533N17542
41071A4753284M60701M00331L37224K71529K04879J39744P7893K0608l0205p3033
$$ y = [-674229, -320971, 32886, 354954, 614274, 775112, 797251, 646132, 308765, -193817, -805449, -1446378, -2031601, -2486952, -2757343, -2807837, -2621609, -2196804, -1541950, -671491, 393318, 1615020, 2927595, 4232841, 5413104, 6356800, 6985253, 7270689, 7241902, 6979046, 6599178, 6232825, 5993816, 5950435, 6109977, 6424536, 6814314, 7195222, 7497957, 7674397, 7695722, 7549261, 7238822, 6788738, 6247662, 5686358, 5186546, 4823664, 4650658, 4689012, 4928980, 5337102, 5867535, 6473533, 7115846, 7766021, 8405183, 9021457, 9609480, 10172442, 10723122, 11279829, 11857314, 12457944, 13069222, 13669209, 14235742, 14753284, 15213985, 15614316, 15951540, 16223069, 16427948, 16567692, 16645585, 16666193, 16635988, 16562955]
41061A6562955j10224j49837k02578k75587l68159m72243n75973o66620p31435
41052A3010299p58239p38680o74140n79778m81367m04955l66041l65855l96240
41043H245004m48057n16104n97470o85794p67510q24432q40815q08433p25620
41034B030769n93617m16559k06494J2703K09323L55497M38606M63882M47238M05600
41024C146948L52707L00524K59660K34982K21147K05176J75839J31936Q2717M1417
41014E153053J7513J2356J9843L1142M0447M7753N7323P4322J02905J45764K02606
41003E905027K66479L20552L39580K98187J83434M974k03985l96517n27607n67464
40993E622660n07441l58698j46846R4316L28840N25060O62493P37243P62156P59703
$$ y = [16562955, 16452731, 16302894, 16100316, 15824729, 15456570, 14984327, 14408354, 13741734, 13010299, 12252060, 11513380, 10839240, 10259462, 9778095, 9373140, 9007099, 8641244, 8245004, 7796947, 7280843, 6683373, 5997579, 5230069, 4405637, 3564822, 2756389, 2030769, 1437152, 1020593, 814099, 826802, 1036125, 1391622, 1830228, 2294110, 2741348, 3146948, 3499655, 3800179, 4059839, 4294821, 4515968, 4721144, 4896983, 5028919, 5111636, 5153053, 5170566, 5182922, 5202765, 5233907, 5274354, 5322107, 5379430, 5453752, 5556657, 5702421, 5905027, 6171506, 6492058, 6831638, 7129825, 7313259, 7318233, 7114248, 6717731, 6190124, 5622660, 5115219, 4756521, 4609675, 4703991, 5032831, 5557891, 6220384, 6957627, 7719783, 8479486]
40983H479486P50140P41569P28124O97060O39194N54845M51789L38816K21378
40974A3602401J02250j5644j28397k33205l31082m27505n30016o43428p65034
40965A0630340q82691r77581j030549j029200r72496q70661p40134n96860m52816
40956C077352l17474k00009j06782l4955L0714J12367K27433L78714N51753P19419
40946D438532Q50292R17484R05831Q16033O64784M80161K92933J27297l402r2990
40936I396955j35041j20341m3321Q8342K51097M13480N48158O38833O78868O65737
40926A2382767N97055M71179K91776P3522j55486l57985m98025n52936n20536
40917A1731331m17993k72900j11665M8445J99984L40938M70712N89673P00434
$$ y = [8479486, 9229626, 9971195, 10699319, 11396379, 12035573, 12590418, 13042207, 13381023, 13602401, 13704651, 13689007, 13560610, 13327405, 12996323, 12568818, 12038802, 11395374, 10630340, 9747649, 8770068, 7739519, 6710319, 5737823, 4867162, 4127028, 3530168, 3077352, 2759878, 2559869, 2453087, 2418132, 2448846, 2561213, 2788646, 3167360, 3719113, 4438532, 5288824, 6206308, 7112139, 7928172, 8592956, 9073117, 9366050, 9493347, 9489945, 9396955, 9261914, 9141573, 9098252, 9186594, 9437691, 9851171, 10399329, 11038162, 11717030, 12382767, 12979822, 13451001, 13742777, 13816299, 13660813, 13302828, 12804803, 12251867, 11731331, 11313338, 11040438, 10928773, 10977218, 11177202, 11518140, 11988852, 12578525, 13278959]
40908A3278959Q07821R16767J029339J141874J242954J313863J333048J283725
40900B2348350J161325R77109P55653N26789L16097J39598M691q6313j34389j42957
40890B5865953j14937m9632N4513J90794L37805M64495N44121N66001N37724M79812
40880B8876649M18110L76720L72633M13944N01948O33975Q03933J001778J215361
40871C4615051J434585J653860J870407K080650K278377K455260K602454K713360
40863E1704004K788847K843097K904223L005365L170009L401751L686357M004706
40855G7508359M348045M727300N172509N722351O407054P232492Q174930R189943
40847A28482983J0228165J1246228J2206933J3071121J3785821J4270855J4407425
$$ y = [13278959, 14086780, 15003547, 16032886, 17174760, 18417714, 19731577, 21064625, 22348350, 23509675, 24486784, 25242437, 25769226, 26085323, 26224921, 26229612, 26143299, 26008910, 25865953, 25751016, 25701384, 25755897, 25946691, 26284496, 26748991, 27293112, 27859113, 28396837, 28876649, 29294759, 29671479, 30044112, 30458056, 30960004, 31593979, 32397912, 33399690, 34615051, 36049636, 37703496, 39573903, 41654553, 43932930, 46388190, 48990644, 51704004, 54492851, 57335948, 60240171, 63245536, 66415545, 69817296, 73503653, 77508359, 81856404, 86583704, 91756213, 97478564, 103885618, 111118110, 119293040, 128482983, 138711148, 149957376, 162164309, 175235430, 189021251, 203292106, 217699531]
40840B17699531J4037836J2987712J1114992Q375257M877427Q97746l167556o899752
40832B59923193r963790j2176684j3516891j4087118j4059215j3623853j2954075
40825A69541567j2182944j1393332j0618524r852992r071302q249245p379090
40818A00794138o474391n566636m698460l915210l254502k735985k356349k092677
40810F9699928j911799j780481j672663j572885j476764j389041j318796j272016
40802E7305483j244557j220991j181638j112851j011746q81815p24885n37979
40794D9389021l17870o8651J94488M48265O68981Q40317R57406J026183J059935
40785E4198075J075822J092897J130573J205847J329674J505124J729167J996332
$$ y = [217699531, 231737367, 244725079, 255840071, 264215328, 269092755, 269990501, 266822945, 259923193, 249959403, 237782719, 224265828, 210178710, 196119495, 182495642, 169541567, 157358623, 145965291, 135346767, 125493775, 116422473, 108173228, 100794138, 94319747, 88753111, 84054651, 80139441, 76884939, 74148954, 71792605, 69699928, 67788129, 66007648, 64334985, 62762100, 61285336, 59896295, 58577499, 57305483, 56060926, 54839935, 53658297, 52545446, 51533700, 50651885, 49927000, 49389021, 49071151, 49002500, 49196988, 49645253, 50314234, 51154551, 52111957, 53138140, 54198075, 55273897, 56366794, 57497367, 58703214, 60032888, 61538012, 63267179, 65263511]
40777F5263511K300633K635257K993225L370963L771280M200893M662815N150136
40769I4348713N646962O136232O609741P075902P562994Q116970Q793890R648019
40761A53939423J0718207J2016664J3525212J5201989J6995680J8858997K0753428
40754B62009600K2642402K4474648K6161267K7552310K8422182K8474905K7377814
40747D47115128K4827242K0641911J4863160P820119J12169p508964j4319681
40740D93551084j9790232k3668596k5967094k6885750k6720785k5789055k4376510
40733C20353062k2708646k0940723j9165561j7433035j5771899j4205082j2754373
40726A97373743j1436457j0256152r202630q251859p375305o551440n773736n049638
$$ y = [65263511, 67564144, 70199401, 73192626, 76563589, 80334869, 84535762, 89198577, 94348713, 99995675, 106131907, 112741648, 119817550, 127380544, 135497514, 144291404, 153939423, 164657630, 176674294, 190199506, 205401495, 222397175, 241256172, 262009600, 284652002, 309126650, 335287917, 362840227, 391262409, 419737314, 447115128, 471942370, 492584281, 507447441, 515267560, 515379729, 507870765, 493551084, 473760852, 450092256, 424125162, 397239412, 370518627, 344729572, 320353062, 297644416, 276703693, 257538132, 240105097, 224333198, 210128116, 197373743, 185937286, 175681134, 166478504, 158226645, 150851340, 144299900, 138526164, 133476526]
40718A33476526m391023l803290l280469k807000k361432j918907j454040r46568
40710A12513797l87672K18078Q57855J520224K203511K918290L682833M514273
40702A28041189N419924O392582P410841Q442107R444915J0369582J1159997J1759731
40694A98440868J2121608J2216998J2043087J1629506J1042902J0381752R755101
40687B77631822R250146Q903655Q689101Q519747Q260706P745873O802116N285673
40679C41088839L129379L86481k754259o001787r037900j1600072j3534294j4803385
40671B86873002j5462614j5622812j5414290j4958115j4349314j3653618j2913525
40664A84498714j2156646j1402071j0664482r956480r288345q664733q080577
$$ y = [133476526, 129085503, 125282213, 122001744, 119194744, 116833312, 114914405, 113460365, 112513797, 112126125, 112344203, 113202058, 114722282, 116925793, 119844083, 123526916, 128041189, 133461113, 139853695, 147264536, 155706643, 165151558, 175521140, 186681137, 198440868, 210562476, 222779474, 234822561, 246452067, 257494969, 267876721, 277631822, 286881968, 295785623, 304474724, 312994471, 321255177, 329001050, 335803166, 341088839, 344218218, 344604699, 341850440, 335848653, 326810753, 315210681, 301676387, 286873002, 271410388, 255787576, 240373286, 225415171, 211065857, 197412239, 184498714, 172342068, 160939997, 150275515, 140319035, 131030690, 122365957, 114285380]
40657A14285380p520727o966559o407024n846856n305629m808485m375363m014911
40649F9039826l724143l491401l299752l129251k958141k764701k531471k250767
40641D4890199j928268j582536j241433r36737o96887n38899m63078m54400m89660
40632C6558301n45150o00127o35853o34326n80928m71228l16951j44894J2276
40623C2641120J27673J87130J89097J40409N1974o3303j90118l09687m01257m47459
40613C1925579m40412l83106k84595j53365N488J87468L83416N76554P45260Q70720
40603C3433007R43989R66244R41672Q69433P41873N49779K89677l1334l94064
40594C8310276p68181j116201j400708j593041j680152j667620j578718j449555
$$ y = [114285380, 106764653, 99798094, 93391070, 87544214, 82238585, 77430100, 73054737, 69039826, 65315683, 61824282, 58524530, 55395279, 52437138, 49672437, 47140966, 44890199, 42961931, 41379395, 40137962, 39201225, 38504338, 37965439, 37502361, 37047961, 36558301, 36013151, 35413024, 34777171, 34142845, 33561917, 33090689, 32773738, 32628844, 32641120, 32768793, 32955923, 33145020, 33285429, 33337403, 33274100, 33083982, 32774295, 32373038, 31925579, 31485167, 31102061, 30817466, 30664101, 30669589, 30857057, 31240473, 31817027, 32562287, 33433007, 34376996, 35343240, 36284912, 37154345, 37896218, 38445997, 38735674, 38704340, 38310276, 37542095, 36425894, 35025186, 33432145, 31751993, 30084373, 28505655, 27056100]
40586B7056100j319994j221446j165779j141627j121750j078456r98479q89331
40578A8119238p75466o88651o57523o98504q09169r66755j134346j272953j353190
40569I762681j360862j295634j166272r86237p71207n37909l03027q1231J17591
40560C377893K91037M45413N93721P48952R13920J073346J195404J244735J200192
40551A1084613J066802Q75420O71117M96240L75377L08627K75865K49094K06341
40542A5609496J41464O7297J0722M1M9722J52204K82511M11103N14195N75918
40532A7814673N86269N41538M47896L23201J92874Q1337L985l6466m9074n0792
40522A9855441o0584r2123j47801k18667k91670l59042m22086m86951n57373o30517
$$ y = [27056100, 25736106, 24514660, 23348881, 22207254, 21085504, 20007048, 19008569, 18119238, 17343772, 16655121, 15997598, 15299094, 14489925, 13523170, 12388824, 11115871, 9762681, 8401819, 7106185, 5939913, 4953676, 4182469, 3644560, 3341533, 3260302, 3377893, 3668930, 4114343, 4708064, 5457016, 6370936, 7444282, 8639686, 9884421, 11084613, 12151415, 13026835, 13697952, 14194192, 14569569, 14878196, 15154061, 15403155, 15609496, 15750960, 15818257, 15828979, 15829020, 15878742, 16030946, 16313457, 16724560, 17238755, 17814673, 18400942, 18942480, 19390376, 19713577, 19906451, 19987788, 19991773, 19955307, 19906233, 19855441, 19794857, 19702734, 19554933, 19336266, 19044596, 18685554, 18263468, 17776517, 17219144, 16588627]
40512A6588627o97198p44344p58528p31005o62552n64117m51126l34698k16287
40503A1428772q9762N0618K01912L49042M68080N34653N33587M65675L48505K11305
40493A4502387Q6645K238k5681K648O8613J39491J79488J63283Q5105m0819j87456
40482A4975942l25252m30595m89544m97280m56107l73858k61728j30334J4063
40473A2025307J68920L29684M83899O11354O91300P11917O75482N95984M91010
40464A6784857L73528K49001J18737j4865j46582k71592l90456n11008o44417
40455A5547203p96676r60792j116119j237016j305540j319042j288037j227807
40447F296174j150890j064125r68916q62697p41721o05821m63042l30175k27485
$$ y = [16588627, 15891429, 15147085, 14388557, 13657552, 12995000, 12430883, 11979757, 11645059, 11428772, 11339010, 11389628, 11591540, 11940582, 12408662, 12943315, 13476902, 13942577, 14291082, 14502387, 14589032, 14591270, 14565589, 14568237, 14636850, 14776341, 14955829, 15119112, 15204217, 15163398, 14975942, 14650690, 14220095, 13730551, 13233271, 12777164, 12403306, 12141578, 12011244, 12025307, 12194227, 12523911, 13007810, 13619164, 14310464, 15022381, 15697863, 16293847, 16784857, 17158385, 17407386, 17526123, 17511258, 17364676, 17093084, 16702628, 16191620, 15547203, 14750527, 13789735, 12673616, 11436600, 10131060, 8812018, 7523981, 6296174, 5145284, 4081159, 3112243, 2249546, 1507825, 902004, 438962, 108787, -118698]
40438a18698j70726j65620k07784k86372l87835m97544o00545o83893p40906p73825
40428d633748p90498p95705p84128p42004o56206n22238l44869j34283R5629L25524
40418h982526N30604O85897P73970P89824P41012O44524N22192L95328K80037
40409c619138J84992J12176N9183K1444o332k9293n1355p3861r4718j09150j11066
40398c717118r3233m6343L9853J71452L44434N43087P43705R19883J046879J106303
40388A058902J092115J014589Q97719P70146O54541N60655M84382M13031L34645
40379G280725K46270J55405P3643Q334m0436p6444j02883j22276j39983j65650
40369G116705k08939k72225l46972m17694m70737n01264n14355n21194n33754
$$ y = [-118698, -289424, -455044, -662828, -949200, -1337035, -1834579, -2435124, -3119017, -3859923, -4633748, -5424246, -6219951, -7004079, -7746083, -8402289, -8924527, -9269396, -9403679, -9308050, -8982526, -8451922, -7766025, -6992055, -6202231, -5461219, -4816695, -4294503, -3899175, -3619138, -3434146, -3321970, -3262787, -3241343, -3247675, -3276968, -3328323, -3402184, -3496902, -3606052, -3717118, -3810351, -3856694, -3816841, -3645389, -3300955, -2757868, -2014163, -1094280, -47401, 1058902, 2151017, 3165606, 4063325, 4833471, 5488012, 6048667, 6533049, 6946080, 7280725, 7526995, 7682400, 7756043, 7764377, 7723941, 7647497, 7544614, 7422338, 7282355, 7116705, 6907766, 6635541, 6288569, 5870875, 5400138, 4898874, 4384519, 3863325, 3329571]
40360C329571n59985n99855o43516o73924o74134o35182n59162m55862l37113
40351a809162k14070r8303k596O2091R2100R4209Q3908Q0678J03029J63649K64213
40340a180254L92543N26426O43894P32628P90716Q19304Q15751P74450O93228
40331E008686N77172M35888K78462J12622n1939k02421l27502m22927m90565n30992
40321D386484n38195n03459m25483l17289k04363j16372p7529r8936j75159k87253
40311A642446m11582n28814o27204o99902p41193p45352p07517o24771m97474
40302c941363l31393j39431N9064K41422L85821M75332N01393M65765L80051K63167
40292a640172J38046K8116m6922p5588n7421k854O9144J34392J68073J51494P9506
$$ y = [3329571, 2769586, 2169731, 1526215, 852291, 178157, -457025, -1016187, -1472049, -1809162, -2023232, -2121535, -2124131, -2062040, -1969940, -1875731, -1791823, -1711145, -1608116, -1444467, -1180254, -787711, -261285, 382609, 1115237, 1905953, 2725257, 3541008, 4315458, 5008686, 5585858, 6021746, 6300208, 6412830, 6360891, 6158470, 5830968, 5408041, 4917476, 4386484, 3848289, 3344830, 2919347, 2602058, 2397695, 2281323, 2203794, 2104858, 1929699, 1642446, 1230864, 702050, 74846, -625056, -1366249, -2111601, -2819118, -3443889, -3941363, -4272756, -4412187, -4353123, -4111701, -3725880, -3250548, -2749155, -2283390, -1903339, -1640172, -1502126, -1474010, -1520932, -1596520, -1653941, -1656795, -1587651, -1453259, -1285186, -1133692, -1054186]
40281a054186l5542j66655k81065l50863l61044l12454k19194j01621K1588J38216
40271b722820K42736L34856M19407N06132O05156P18543Q35237R35933J004813
40262B879993J037342J037217J006614R40023Q27540O64499M59405K33932J5175
40253I101740j73584l16755m04346m29930l93786l08162j97017q8107l956M1126
40243F827223L8775j4461j13291k38456l56523m28190m22683l31206j71648J8839
40233D808379J99395L40763M33338M86020N18661N52611O03259O75993P65203
40224I383622Q56141R30028R70961R70511R27031Q41846P17022N56089L65330
40215A6518581J53939o5721k77642m63397o05804o92835p20415o95438o38136
$$ y = [-1054186, -1089728, -1256383, -1537448, -1888311, -2249355, -2561809, -2781003, -2882624, -2861036, -2722820, -2480084, -2145228, -1725821, -1219689, -614533, 104010, 939247, 1875180, 2879993, 3917335, 4954552, 5961166, 6901189, 7728729, 8393228, 8852633, 9086565, 9101740, 8928156, 8611401, 8207055, 7777125, 7383339, 7075177, 6878160, 6790053, 6786097, 6827223, 6865998, 6851537, 6738246, 6499790, 6143267, 5715077, 5292394, 4961188, 4789540, 4808379, 5007774, 5348537, 5781875, 6267895, 6786556, 7339167, 7942426, 8618419, 9383622, 10239763, 11169791, 12140752, 13111263, 14038294, 14880140, 15597162, 16153251, 16518581, 16672520, 16606799, 16329157, 15865760, 15259956, 14567121, 13846706, 13151268, 12513132]
40206A2513132n78022n39963n27638n18041m73275l62456j80481M5495K63878
40197I642629M17049M62102L84528J99806n4423l29717n77932p60958q57672q66009
40187G659403p99766o82298n39731l95128k63946j51296n2178M3808J43938K44754
40177E207560L31619L86632L98552L66879K99286K08060J09056J9999m5948q8406
40167G193289j21702j66750k38661l39339m58710n80646o87776p63219p91134
40158C045352p58569o59591n00207l00482r0084J02477K60973L85703M88720N84215
40148B558507O79877P72824Q51643R04498R29388R38265R48938R69012R84909
40139A0537861R66326Q83666P25743N06626K60231K8696j49583k50128k69494
$$ y = [12513132, 11935110, 11395147, 10867509, 10349468, 9876193, 9513737, 9333256, 9378751, 9642629, 10059678, 10521780, 10906308, 11106114, 11051691, 10721974, 10144042, 9383084, 8525412, 7659403, 6859637, 6177339, 5637608, 5242480, 4978534, 4827238, 4775060, 4818868, 4962806, 5207560, 5539179, 5925811, 6324363, 6691242, 6990528, 7198588, 7307644, 7327643, 7281695, 7193289, 7071587, 6904837, 6666176, 6326837, 5868127, 5287481, 4599705, 3836486, 3045352, 2286783, 1627192, 1126985, 826503, 736419, 838896, 1099869, 1485572, 1974292, 2558507, 3238384, 4011208, 4862851, 5767349, 6696737, 7635002, 8583940, 9552952, 10537861, 11504187, 12387853, 13113596, 13620222, 13880453, 13909149, 13759566, 13509438, 13239944]
40130A3239944k26357j53968q6311m5197l5111m6923o5959p9318q0074o8420n0151
40119A2302155l3009k2818k2301l3447o0679j10592j87381k87565l98588n02549
40109A0643226n82195o25481o27031n87856n15259m22412l25031k34529j52510
40100F570922p2402J2709J04470K01288L02900M08697N09766N84524O05384N52470
40090I780728M24176K38397K6073j77960l42470m44463m72325m29243l35348k24404
40080H043161j33353q9071r9119j50309k15131k64005k78908k61158k28156k01385
40070F122566j93896k04123k17144k10962j64940o7806P7533K54187M36514N98672
40060F430601P23017Q03977Q45344Q53719Q33418P85498P09731O07439M84120
$$ y = [13239944, 13013587, 12859619, 12773308, 12728111, 12693000, 12646077, 12580118, 12500800, 12420726, 12352306, 12302155, 12269146, 12246328, 12224027, 12190580, 12129901, 12019309, 11831928, 11544363, 11145775, 10643226, 10061031, 9435550, 8808519, 8220663, 7705404, 7282992, 6957961, 6723432, 6570922, 6498520, 6511229, 6615699, 6816987, 7119887, 7528584, 8038350, 8622874, 9228258, 9780728, 10204904, 10443301, 10469374, 10291414, 9948944, 9504481, 9032156, 8602913, 8267565, 8043161, 7909808, 7820737, 7721618, 7571309, 7356178, 7092173, 6813265, 6552107, 6323951, 6122566, 5928670, 5724547, 5507403, 5296441, 5131501, 5063695, 5141228, 5395415, 5831929, 6430601, 7153618, 7957595, 8802939, 9656658, 10490076, 11275574, 11985305, 12592744, 13076864]
40051A3076864L50383K19578J03231Q171o2030j03524j10941q0269j3616P8223
40041A3466070J78240K69937L43302L94899M22374M19462L76747K86685J47367
40032A6305083l7980k63806n24128q11627j114356j412342j677788j880989j999113
40023F582954k021766j949972j791349j556982j262565r31278n94081k84859l2088
40014c841986J48797K58380L10801L27940L32791L43261L66888L97956M19252
40005i35920M09265L52691K49377J16971j4468j13184j56005j33064m6182R5230
39995a75289K76344M76462O69414Q27944R31156R70749R52567Q92913Q11615P24871
39985G358746O41231N62398M87239M15509L49083K91541K47393K20698K12461
$$ y = [13076864, 13427247, 13646825, 13750056, 13758227, 13696197, 13592673, 13481732, 13401463, 13387847, 13466070, 13644310, 13914247, 14257549, 14652448, 15074822, 15494284, 15871031, 16157716, 16305083, 16267103, 16003297, 15479169, 14667542, 13553186, 12140844, 10463056, 8582067, 6582954, 4561188, 2611216, 819867, -737115, -1999680, -2930958, -3525039, -3809898, -3841986, -3693189, -3434809, -3124008, -2796068, -2463277, -2120016, -1753128, -1355172, -935920, -526655, -173964, 75413, 192384, 177916, 64732, -91273, -224337, -270519, -175289, 101055, 577517, 1246931, 2074875, 3006031, 3976780, 4929347, 5822260, 6633875, 7358746, 7999977, 8562375, 9049614, 9465123, 9814206, 10105747, 10353140, 10573838, 10786299]
39976A0786299K17812K25371K20052J88900J27741M4903m1822j14949j67546k05934
39966A1280827k42611k85577l32478l73176l97641m03154l96123l87613l85831
39957H076623l90675l93519l80937l39155k57629j32522L0274K14847L99473N63123
39947G389903O90151P71283Q02842P86443P28637O38250N21547L78851K06758
39938A2914665O375k07618m04563n46470o04318n72314m70999l37591k10244j15416
39928I451507o3561n2223p1926j10886j57388k01282k35508k56844k64762k59152
39918G777975k38949k02328j47431p3006K0605J30118K48516L65162M65908N33534
39908H880104N50571N05046L95841K33546L6734j72821l73863n49311o90647q00793
$$ y = [10786299, 11004111, 11229482, 11449534, 11638434, 11766175, 11811078, 11769256, 11654307, 11486761, 11280827, 11038216, 10752639, 10420161, 10046985, 9649344, 9246190, 8850067, 8462454, 8076623, 7685948, 7292429, 6911492, 6572337, 6314708, 6182186, 6212460, 6427307, 6826780, 7389903, 8080054, 8851337, 9654179, 10440622, 11169259, 11807509, 12329056, 12707907, 12914665, 12921040, 12713422, 12308859, 11762389, 11158071, 10585757, 10114758, 9777167, 9566923, 9451507, 9387946, 9335723, 9263797, 9152911, 8995523, 8794241, 8558733, 8301889, 8037127, 7777975, 7539026, 7336698, 7189267, 7116261, 7136866, 7266984, 7515500, 7880662, 8346570, 8880104, 9430675, 9935721, 10331562, 10565108, 10601842, 10429021, 10055158, 9505847, 8815200, 8014407]
39898H014407q92313r80399j073783j168371j247259j287427j269615j186229
39890a090989j043976q61227o62166m70210l02968j70070p3374q568L1749N3022
39880d598777N4234K8705k8408j11570k02936k78759l18682l12081k59939j73872
39870f202085p3348J9019Q3146J06294Q5406K6521n8079j53440k44047l13618
39860f724231l44014l16266k15267l6577K08534M93356P81517J035220J222454
39851c895274J322443J330096J257988J132354R82778Q31708O91036N66323M62272
39842D681724L83765L32439L02683K80217K44534J74622N5286j19061l43354o01126
39832E391729q64240j097855j273143j381121j436369j465842j489338j503481
$$ y = [8014407, 7122094, 6141695, 5067912, 3899541, 2652282, 1364855, 95240, -1090989, -2134965, -2996192, -3658358, -4128568, -4431536, -4601606, -4674980, -4683548, -4651799, -4598777, -4544543, -4515838, -4544246, -4655816, -4858752, -5137511, -5456193, -5768274, -6028213, -6202085, -6275433, -6256414, -6173268, -6066974, -5981568, -5955047, -6013126, -6166566, -6410613, -6724231, -7068245, -7384511, -7599778, -7636355, -7427821, -6934465, -6152948, -5117728, -3895274, -2572831, -1242735, 15253, 1147607, 2130385, 2962093, 3653129, 4219452, 4681724, 5065489, 5397928, 5700611, 5980828, 6225362, 6399984, 6455270, 6336209, 5992855, 5391729, 4527489, 3429634, 2156491, 775370, -660999, -2126841, -3616179, -5119660]
39824e119660j478380j369904j142609p91217l48058J26917N65907R12059J131820
39815g513125J219542J193891J087365R34277P63202N95626M48004L34280K67140
39806f69798K56356L04143M00784N25069O50206P51860Q14674Q35466Q21539P83482
39796E473781P25777O41601N15309L30245P7021k40624o03831r81798j339533
39787D597948j646464j881708k035039k105085k095730k011600j855199j628834
39779a0661711j340878j011757o74438l68341j29665J7032O2731J3067j14593
39770a4208553k93281m87872o58458p67729p90262p18731n63171l43964q3361
39761a8915382J99773M90465P74813J036080J251908J394645J436147J356133
$$ y = [-5119660, -6598040, -7967944, -9110553, -9901770, -10249828, -10122911, -9557004, -8644945, -7513125, -6293583, -5099692, -4012327, -3078050, -2314848, -1719222, -1271218, -936938, -669798, -413442, -109299, 291485, 816554, 1466760, 2218620, 3033294, 3868760, 4690299, 5473781, 6199558, 6841159, 7356468, 7686713, 7763734, 7523110, 6919279, 5937481, 4597948, 2951484, 1069776, -965263, -3070348, -5166078, -7177678, -9032877, -10661711, -12002589, -13014346, -13688784, -14057125, -14186790, -14169758, -14107027, -14093960, -14208553, -14501834, -14989706, -15648164, -16415893, -17206155, -17924886, -18488057, -18832021, -18915382, -18715609, -18225144, -17450331, -16414251, -15162343, -13767698, -12331551, -10975418]
39753a0975418J151422Q42609M74577J07590k00568m13571n25113n51717n16601
39744a0606790m37257l23416j82178k3500J37484K81170L86789M38132M29794
39735i899772L70100K78433J78992R5384M8199N3330J18703K40877M05272N90502
39725g519980P72769R27102J027141J047630R71075P95855N41249K45613m3439
39716a234985k82845m44185n15090m94977l92142k24485j9884J88036L67930M98811
39706b553816N75364O08489O19922O31948O56640O89750P11599O94627O15178
39697C249701M65250K58324K5906j93478l67305m78295n26387n22941m81470m11555
39687A017750l19458k12086r8914R081J00303J62153J82308J53886Q1850j4492
$$ y = [-10975418, -9823996, -8981387, -8506810, -8399220, -8599788, -9013359, -9538472, -10090189, -10606790, -11044047, -11367463, -11549641, -11573141, -11435657, -11154487, -10767698, -10329566, -9899772, -9529672, -9251239, -9072247, -8976863, -8928664, -8875334, -8756631, -8515754, -8110482, -7519980, -6747211, -5820109, -4792968, -3745338, -2774263, -1978408, -1437159, -1191546, -1234985, -1517830, -1962015, -2477105, -2972082, -3364224, -3588709, -3608593, -3420557, -3052627, -2553816, -1978452, -1369963, -750041, -118093, 538547, 1228297, 1939896, 2634523, 3249701, 3714951, 3973275, 3999181, 3805703, 3438398, 2960103, 2433716, 1910775, 1429305, 1017750, 698292, 486206, 387292, 396373, 496676, 658829, 841137, 995023, 1076873, 1062381]
39677A062381j06304j66399j81668j59488j23388j00507j08919j51115k14108
39668b49515k74229l05841k92236k33152j43526m4817M4109J11220J51278J64353
39658a072356J53540J21746O9339m582r7813k01910l04695l97667m82287n68900
39648b785585o68099p81308q97771r98781j064088j076561j025418r09049p35414
39639a0942074n18213k71318o681K62833N19270P38389Q92848R59112R26145Q01886
39629f637803O12425L92833J75012k0231j84215l16996m22485n03451n57870n78856
39619h041637n58465m92260l81044k29582m5754J57035L55691N17083O05926N98381
39609g514626M92189L05682O7411j94332m55467o95451q97197j048798j144107
$$ y = [1062381, 956077, 789678, 608010, 448522, 325134, 224627, 115708, -35407, -249515, -523744, -829585, -1121821, -1354973, -1498499, -1543316, -1499207, -1387987, -1236709, -1072356, -918816, -797070, -727731, -732313, -830126, -1032036, -1336731, -1734398, -2216685, -2785585, -3453684, -4234992, -5132763, -6131544, -7195632, -8272193, -9297611, -10206660, -10942074, -11460287, -11731605, -11738286, -11475453, -10956183, -10217794, -9324946, -8365834, -7439689, -6637803, -6025378, -5632545, -5457533, -5477764, -5661979, -5978975, -6401460, -6904911, -7462781, -8041637, -8600102, -9092362, -9473406, -9702988, -9748742, -9591707, -9236016, -8718933, -8113007, -7514626, -7022437, -6716755, -6649344, -6843676, -7299143, -7994594, -8891791, -9940589, -11084696]
39600a1084696j180899j158583j077266r37688p41513m93131k03467J06676M07468
39591a6363099O66635Q59321R75806J021965J012373R62258Q85580P98814P22367
39582h457980O73816O57766O62585O67678O54940O16203N54368M80422M08046
39573c082156L46443K93880K36302J53577L0824j31624l15783m92261o30521p06671
39563d297990p06535o26439m74214k69308l9300J86722L84660N39427O46377P10649
39553c945951P44149P61036P73628P90029Q12486Q35706Q46979Q30757P76725
39544C225544O86073N71042M48619L34326K40990J81221J67892K09086L00217
39535F365010M19897N33753O05025O06745N29984L85344J97974j337j85871l40438
$$ y = [-11084696, -12265595, -13424178, -14501444, -15439132, -16180645, -16673776, -16877243, -16770567, -16363099, -15696464, -14837143, -13861337, -12839372, -11826999, -10864741, -9979161, -9180347, -8457980, -7784164, -7126398, -6463813, -5796135, -5141195, -4524992, -3970624, -3490202, -3082156, -2735713, -2441833, -2205531, -2051954, -2021130, -2152754, -2468537, -2960798, -3591319, -4297990, -5004525, -5630964, -6105178, -6374486, -6413786, -6227064, -5842404, -5302977, -4656600, -3945951, -3201802, -2440766, -1667138, -877109, -64623, 771083, 1618062, 2448819, 3225544, 3911617, 4482659, 4931278, 5265604, 5506594, 5687815, 5855707, 6064793, 6365010, 6784907, 7318660, 7923685, 8530430, 9060414, 9445758, 9643732, 9642395, 9456524, 9116086]
39525I116086m63501n62359o43960p07869p47080p55482p35308o98563o62135
39516C139829o40196o37336o44560o39737n93736m81235k92188l8451K48233N26223
39506e3154P56962R15188R93704J002943R65763R07837Q46910P87384P23973O50587
39496H498097N66357M74920L80586K86419J94868J07970K5698n5420j41151k36400
39486A0101944l42536m56759n72894o82727p77846q52055r02526r27666r22640
39477C664295q77682p83462o41127m68712k96845j55155n8536k776K8239N0440
39467D58679P2079R5003J20543J52696J95786K50004L09724L65849M10401M40855
39457B871619M62381M85999N22296N73814O31764O80159P04280O96889O57837
$$ y = [9116086, 8652585, 8090226, 7446266, 6738397, 5991317, 5235835, 4500527, 3801964, 3139829, 2499633, 1862297, 1217737, 578000, -15736, -496971, -789159, -827610, -579377, -53154, 703808, 1618996, 2612700, 3615643, 4581406, 5489243, 6336153, 7123537, 7847510, 8498097, 9064454, 9539374, 9919960, 10206379, 10401247, 10509217, 10534915, 10479495, 10338344, 10101944, 9759408, 9302649, 8729755, 8047028, 7269182, 6417127, 5514601, 4586935, 3664295, 2786613, 2003151, 1362024, 893312, 596467, 441312, 382776, 380000, 408239, 458679, 530758, 625761, 746304, 899000, 1094786, 1344790, 1654514, 2020363, 2430764, 2871619, 3334000, 3819999, 4342295, 4916109, 5547873, 6228032, 6932312, 7629201, 8287038]
39448H287038N89071M91146L65240K18525O6784o9733j74806k43025k80999l03887
39438H945354l30515l79141m63946n91994p60629r55501j150299j310149j399898
39429A603282j395107j290398j100743q55367n87663l25144q2791J37314L39188
39420c557429N22622O77009P84749Q32000Q18340P58504O76524N96884N36463
39411B645666M98919M73565M41291L86209L06093K14516J34508R0011J00084J74756
39401E465618L09735M82095O52561P75943Q14119P44906N65798K95042l0254l62621
39391I712942o58745q91758j052683j142020j161545j114001j008033q59853o88287
39382A136017n08285l29378j59512q839J11132J92685K36969K55170K64895K83887
$$ y = [8287038, 8876109, 9367255, 9732495, 9951020, 10017804, 9948071, 9773265, 9530240, 9249241, 8945354, 8614839, 8235698, 7771752, 7179758, 6419129, 5463628, 4313329, 3003180, 1603282, 208175, -1082223, -2182966, -3038333, -3625996, -3951140, -4033931, -3896617, -3557429, -3034807, -2357798, -1573049, -741049, 77291, 835795, 1512319, 2109203, 2645666, 3144585, 3618150, 4059441, 4445650, 4751743, 4966259, 5100767, 5190778, 5290862, 5465618, 5775353, 6257448, 6910009, 7685952, 8500071, 9244977, 9810775, 10105817, 10075563, 9712942, 9054197, 8162439, 7109756, 5967736, 4806191, 3692190, 2684157, 1824304, 1136017, 627732, 298354, 138842, 130003, 241135, 433820, 670789, 925959, 1190854, 1474741]
39372A474741L23671L84888M55451N13059N32711M96620M01348K58401Q9280q1100
39362D849070k29680l38544l96439l98667l46041k43774j00348P3801K66877M64785
39352C601040O50285Q04782R12464R63306R52711Q79398P44029N48878K98112
39343A0355005n21l32573o75181r99377j275346j477484j588921j606571j544666
39334H54365j431702j299678j171458j054109r41125q21078o87363n43697m02388
39325g498233k77373j77625j04612n2425q053M6948J30481K50685L99442N54221
39315f736544O88240P83367Q38200Q66578Q87768R15132R50223R84756J007748
39306A185468J013138J003654R88233R74406R61113R37689Q89585Q06408O87376
$$ y = [1474741, 1798412, 2183300, 2638751, 3151810, 3684521, 4181141, 4582489, 4840890, 4930170, 4849070, 4619390, 4280846, 3884407, 3485740, 3139699, 2895925, 2795577, 2869378, 3136255, 3601040, 4251325, 5056107, 5968571, 6931877, 7884588, 8763986, 9508015, 10056893, 10355005, 10354484, 10021911, 9346730, 8347353, 7072007, 5594523, 4005602, 2399031, 854365, -577337, -1877015, -3048473, -4102582, -5043707, -5864785, -6552148, -7095845, -7498233, -7775606, -7953231, -8057843, -8110268, -8118321, -8071373, -7940892, -7690207, -7290765, -6736544, -6048304, -5264937, -4426737, -3560159, -2672391, -1757259, -807036, 177720, 1185468, 2198606, 3202260, 4190493, 5164899, 6126012, 7063701, 7953286, 8759694, 9447070]
39297I447070N42071L86593K36711J01521j8617j29195k36295l41587m38397n10274
39287I039601n35001m94932l88935k38183q0915M2090J04083J02108N4546j1261
39277G593201p2427j16718j40290j42230j21527p7866j3937O4035J48739K34849
39267G355829L19030L96042M55145M81593M63171L96851K91158J63468L3969q1543
39257A0274713j77019k56893l31656m10853m97022n82641o51449o84392o68301
39248F014487o02743n01369l87182k83976k06835j55529j15183o5257Q349J06666
39238C811428K20824L41151M64031N91264P23219Q52220R61553J030415J040183
39229A0036288R78389Q41178O36457L85972J21670j24463l31129m92046o12961
$$ y = [9447070, 9989141, 10375734, 10612445, 10713966, 10695349, 10566154, 10329859, 9988272, 9549875, 9039601, 8504600, 8009668, 7620733, 7382550, 7301635, 7343725, 7447808, 7549916, 7604462, 7593201, 7520774, 7404056, 7263766, 7121536, 7000009, 6922143, 6908206, 6972241, 7120980, 7355829, 7674859, 8070901, 8526046, 9007639, 9470810, 9867661, 10158819, 10322287, 10356256, 10274713, 10097694, 9840801, 9509145, 9098292, 8601270, 8018629, 7367180, 6682788, 6014487, 5411744, 4910375, 4523193, 4239217, 4032382, 3876853, 3761670, 3696413, 3704762, 3811428, 4032252, 4373403, 4837434, 5428698, 6151917, 7004137, 7965690, 8996105, 10036288, 11014677, 11855855, 12492312, 12878284, 12999954, 12875491, 12544362, 12052316, 11439355]
39220A1439355p05404p80783q45593q98709r32902r40926r22390q86213q46851
39211C679584q16982q01234p94062p82151p49756o84544n81838m45852k87453
39202b264288j19926M4059J91505L05893L67348L59862K81506J48100j4802j85827
39192h86570l55388n20370o71697p87888q42813q23160p41549o33329n37651m76209
39182g276624m45177m25149l99598l66901l38349l26516l34556l54086l72029
39173a0638985l80783l83946l92268m11639m32178m28367l71658k46614n9116
39164a3745554J67324M01633O13770P78392Q76053Q95307Q35949P10189N38790
39155g928147L43733J42658n0502k20255l45980m05262l83556k84141j31707L3423
$$ y = [11439355, 10733951, 9953168, 9107575, 8208866, 7275964, 6335038, 5412648, 4526435, 3679584, 2862602, 2061368, 1267306, 485155, -264601, -949145, -1530983, -1976835, -2264288, -2384214, -2340155, -2148650, -1842757, -1475409, -1115547, -834041, -685941, -700743, -886570, -1241958, -1762328, -2434025, -3221913, -4064726, -4887886, -5629435, -6262764, -6800415, -7276624, -7721801, -8146950, -8546548, -8913449, -9251798, -9578314, -9912870, -10266956, -10638985, -11019768, -11403714, -11795982, -12207621, -12639799, -13068166, -13439824, -13686438, -13745554, -13578230, -13176597, -12562827, -11784435, -10908382, -10013075, -9177126, -8466937, -7928147, -7584414, -7441756, -7492258, -7712513, -8058493, -8463755, -8847311, -9131452, -9263159, -9229736]
39145i229736J68019K40032K38512J76327Q4688K95n0783o4136n5233m5724m8521
39134h586260o2975q1107r6010j04285j03285q9924o4026l1938m115J3304K5581
39123i185040M8115R7700J83564L03870M46994N94545P25263Q20230Q67614Q64294
39113d232851Q15006P31351O30203N28546M35883L51047K68040J86454J17065
39104a69256P7906Q3880J36527K19376L01661L49391L38248K61750J31640k7722
39094A703401j87423l21545m12025m50403m38197l87352l18605k54662k09724
39085a276535j82452j57632j14846l8745P2667K03470L21860L91162L86401L06878
39075h7772J76414L1523r3957j78672k15041k05353j56904p7651K7339J56399
$$ y = [-9229736, -9061717, -8821685, -8583173, -8406846, -8322158, -8321863, -8372646, -8436782, -8492015, -8537739, -8586260, -8649235, -8730342, -8826352, -8930637, -9033922, -9123846, -9187872, -9219810, -9223925, -9210621, -9185040, -9136925, -9039225, -8855661, -8551791, -8104797, -7510252, -6784989, -5964759, -5097145, -4232851, -3417845, -2686494, -2056291, -1527745, -1091862, -740815, -472775, -286321, -169256, -91350, -7470, 129057, 348433, 650094, 999485, 1337733, 1599483, 1731123, 1703401, 1515978, 1194433, 782408, 332005, -106192, -493544, -812149, -1066811, -1276535, -1458987, -1616619, -1731465, -1770210, -1697543, -1494073, -1172213, -781051, -394650, -87772, 88642, 120165, 26208, -152464, -367505, -572858, -729762, -807413, -780074, -623675]
39065f23675L06692M67359O17409P31959P92313P91878P35071O32942M99960L52591
39055E304499K07866Q0913j7760q4084j20545j34337j33931j25062j07811p6892
39045D792856k5819M7616J38894K38916L37354M23092M82295M98508M57457L54516
39035G745685K00704K4155j34532k33256k43153j60947j1957J59355L07722M05001
39025H058777M48193M54406M47989M48110M61083M77232M72640M17777K91446
39016A1977653R2365j59770m33847o99499r33614j119525j243386j293478j264435
39007D922464j163066j009928q33764o61691n11092l86915k84263j94128j09691
38998b32074l0513L7205Q3385R7190O9654k322j10096k29841l27257l70414l43032
$$ y = [-623675, -316983, 150376, 767785, 1499744, 2292057, 3083935, 3819006, 4451948, 4951908, 5304499, 5512365, 5593278, 5575518, 5491434, 5370889, 5236552, 5102621, 4977559, 4869748, 4792856, 4767037, 4814653, 4953547, 5192463, 5529817, 5952909, 6435204, 6933712, 7391169, 7745685, 7946389, 7970544, 7836012, 7602756, 7359603, 7198656, 7186699, 7346054, 7653776, 8058777, 8506970, 8961376, 9409365, 9857475, 10318558, 10795790, 11268430, 11686207, 11977653, 12070018, 11910248, 11476401, 10776902, 9843288, 8723763, 7480377, 6186899, 4922464, 3759398, 2749470, 1915706, 1254015, 742923, 356008, 71745, -122383, -232074, -262587, -225382, -141997, -44807, 24847, 22525, -87571, -317412, -644669, -1015083, -1358115]
38987a358115k49745j11703M2616J85908K98088L69714M01704M00665L72561L19330
38977F71023K40160J34877N841j42119l01898m63329o12004p29363p95454p94965
38967b787231p24660n97731m40944k85255j55539o5421j8045q633k5046m7584
38957e156089n2483k0213N6636J72446L14636M69997O25802P67536Q78800R45249
38947i97683R59338R22256Q42863P34955O13692M91931L77818K74302J79616Q7767
38937D486855r463j17416k32345l40092m23578m75439n06056n39434n99161o94841
38927E49030q18571r52370j079145j189145j279264j348358j393338j407888j383264
38918a0302313j310240j182539j001211p77062n27697k70283j6066K28696M57708
$$ y = [-1358115, -1607860, -1719563, -1676947, -1491039, -1192951, -823237, -421533, -20868, 351693, 671023, 911183, 1046060, 1051901, 909782, 607884, 144555, -467449, -1196812, -1992266, -2787231, -3511891, -4109622, -4550566, -4835821, -4991360, -5056781, -5074826, -5083459, -5108505, -5156089, -5208572, -5228785, -5172149, -4999703, -4685067, -4215070, -3589268, -2821732, -1942932, -997683, -38345, 883911, 1726774, 2461729, 3075421, 3567352, 3945170, 4219472, 4399088, 4486855, 4477392, 4359976, 4127631, 3787539, 3363961, 2888522, 2382466, 1843032, 1243871, 549030, -269541, -1221911, -2301056, -3490201, -4769465, -6117823, -7511161, -8919049, -10302313, -11612553, -12795092, -13796303, -14573365, -15101062, -15371345, -15387411, -15158715, -14701007]
38909a4701007O62150Q33415R66966J062518J121005J142494J126980J076110
38901f709369R93551Q84195P53293O05872M46012K76664J01147p4282k39058l80165
38891c342140m86512n53341n84340n90739n87302n85541n86562n78483n42384
38882h437344m64593l47048k08156p4139L2428J00239J31215J37835J36888J41113
38872h851562J52868J64384J64490J46192J09696O0875Q606l7479o9671q5053
38862h236654q5826p5892n6345k3727K8366J06816K17553L64639N48163P60577
38852f452330R83728J190089J349792J440539J454633J399373J292149J153706
38844C811679J002285Q50534P06732N79101M78056M12638L84123L83841L97441
$$ y = [-14701007, -14038857, -13205442, -12238476, -11175958, -10054953, -8912459, -7785479, -6709369, -5715818, -4831623, -4078330, -3472458, -3026446, -2749782, -2648635, -2722917, -2961975, -3342140, -3828652, -4381993, -4966333, -5557072, -6144374, -6729915, -7316477, -7894960, -8437344, -8901937, -9248985, -9457141, -9531280, -9498852, -9398613, -9267398, -9129563, -8992675, -8851562, -8698694, -8534310, -8369820, -8223628, -8113932, -8053057, -8044451, -8081930, -8151601, -8236654, -8322480, -8398372, -8454717, -8478444, -8450078, -8343262, -8125709, -7761070, -7212907, -6452330, -5468602, -4278513, -2928721, -1488182, -33549, 1365824, 2657973, 3811679, 4813964, 5664498, 6371230, 6950331, 7428387, 7841025, 8225148, 8608989, 9006430]
38835I006430M11050M14651M02922L75636L36923K91716K40906J79509J00153
38826A1759896l34j16582k36983l51964m61435n74292o99902q39117r81249j106404
38816F391634j189794j207959j147746j014061q29957o27992m39027k84671j74947
38807e24520j10410q7474j03741j58405k46761l54378m57486n30218n53795n22419
38797c649607m43341l31458k01851o5292P0870J99257L11137L98299M55718M82871
38787b773397M83922M67256M44443M28405M30546M56325N00743N48093N78853
38778A565189N79707N48055M87775M02235K92916J64514K9787r2194j83864k36864
38768C557256k53573k42056k09918j62998j08497n6071j3154K0647N1907Q4425
$$ y = [9006430, 9417480, 9832131, 10235053, 10610689, 10947612, 11239328, 11480234, 11659743, 11759896, 11759562, 11642980, 11405997, 11054033, 10592598, 10018306, 9318404, 8479287, 7498038, 6391634, 5201840, 3993881, 2846135, 1832074, 1002117, 374125, -64902, -349573, -524520, -634930, -722404, -826145, -984550, -1231311, -1585689, -2043175, -2573393, -3127188, -3649607, -4092948, -4424406, -4626257, -4691549, -4620679, -4421422, -4110285, -3711986, -3256268, -2773397, -2289475, -1822219, -1377776, -949371, -518825, -62500, 438243, 986336, 1565189, 2144896, 2692951, 3180726, 3582961, 3875877, 4040391, 4070178, 3977984, 3794120, 3557256, 3303683, 3061627, 2851709, 2688711, 2580214, 2524143, 2510989, 2531636, 2583543, 2667968]
38758B667968J12098J21688J02897N6499n176o3565j00836j06174q0307l5831
38748B669261Q374L6414M2830L3461J9340P640m317k7537p3325j45432k39009
38737B327700l46404m62975n86933p14289q34964r33957r96481j013819r87282
38728d549404r28232q53208p76254p03785o35866n71794n14225m68545m39543
38719a0440856m29098m35890m55542m80251m99111n00297m74010m13703l15122
38710a4443880j75486M580K17320M46193O68973Q64275J017606J123759J184841
38701i091819J205016J184860J118824R98168Q18133N85639L23519O9069j33691
38692b922282k46058k46285j35630O2957L10862N61393P67821Q91925R11668Q25595
$$ y = [2667968, 2780066, 2901754, 3004651, 3061150, 3055974, 2992409, 2891573, 2785399, 2705092, 2669261, 2677635, 2714049, 2756879, 2790340, 2809680, 2817320, 2813003, 2785466, 2712141, 2566709, 2327700, 1981296, 1518321, 931388, 217099, -617865, -1551822, -2548303, -3562122, -4549404, -5477636, -6330844, -7107098, -7810883, -8446749, -9018543, -9532768, -10001313, -10440856, -10869954, -11305844, -11761386, -12241637, -12740748, -13241045, -13715055, -14128758, -14443880, -14619366, -14614786, -14397466, -13951273, -13282300, -12418025, -11400419, -10276660, -9091819, -7886803, -6701943, -5583119, -4584951, -3766818, -3181179, -2857660, -2788591, -2922282, -3168340, -3414625, -3550255, -3487298, -3176436, -2615043, -1847222, -955297, -43629, 781966]
38682G81966O52838M28715J96431l726j43623k10108k00960j19103K8825K28913
38672A640168M56378O76953Q53983R57916R74529R09210P85278O35269M87735
38663H377419L56385K38685J24726R273j02261j97259k64429l00264l09572l01125
38653G631578k81817k52360k06544j34920l2244R4499K22497L18100L49605L01286
38643H009680J80115J1322j73377l46370m87754n83160o21819n99178n22302m12257
38633D454900k99911k17254j89041k27115l26619m64163o00974o93439p07900
38624G28484o32066m77445k73372n7301J34529K73928L43974L38473K59616J16841
38614G55661p2895k86549n00375o96127q62520r90946j071075j092201j049405
$$ y = [781966, 1434804, 1863519, 2059950, 2056224, 1912601, 1702493, 1501533, 1382430, 1411255, 1640168, 2096546, 2773499, 3627482, 4585398, 5559927, 6469137, 7254415, 7889684, 8377419, 8733804, 8972489, 9097215, 9106488, 9004227, 8806968, 8542539, 8242275, 7932703, 7631578, 7349761, 7097401, 6890857, 6755937, 6723693, 6818192, 7040689, 7358789, 7708394, 8009680, 8189795, 8201117, 8027740, 7681370, 7193616, 6610456, 5988637, 5389459, 4867157, 4454900, 4154989, 3937735, 3748694, 3521579, 3194960, 2730797, 2129823, 1436384, 728484, 96418, -381027, -654399, -711700, -577171, -303243, 40731, 379204, 638820, 755661, 682766, 396217, -104158, -800285, -1662805, -2653751, -3724826, -4817027, -5866432]
38605e866432r48292q03961o35636m60914k91725j32447J8954J65888L06038M26921
38595h221606N07946N28395M77265L60292K01316L6550r7965j81364k17262k30098
38585f836531k49551k93367l60282m36261n06928n66365o17300o64357p05485
38576a1236427p27039p06002o18930m52572k10376Q7288M07027P07994R48888
38567a1800149J096907J136894J076675R45194P83187O29993N12576M42114M18516
38558d758093M37652M94776N82521O87495P90180Q68927R05791Q91756Q30157
38549A731162P36827O35670N50279M94626M66435M46251M04046L12445J60657
38540E938398l9567k59830m67528o35232p43091p78262p36273o23467m56687k59353
$$ y = [-5866432, -6814724, -7618685, -8254321, -8715235, -9006960, -9139407, -9120453, -8954565, -8648527, -8221606, -7713660, -7185265, -6708000, -6347708, -6146392, -6109842, -6207807, -6389171, -6606433, -6836531, -7086082, -7379449, -7739731, -8175992, -8682920, -9249285, -9866585, -10530942, -11236427, -11963466, -12669468, -13288398, -13740970, -13951346, -13864058, -13457031, -12749037, -11800149, -10703242, -9566348, -8489673, -7544479, -6761292, -6131299, -5618723, -5176609, -4758093, -4320441, -3825665, -3243144, -2555649, -1765469, -896542, 9249, 901005, 1731162, 2467989, 3103659, 3653938, 4148564, 4614999, 5061250, 5465296, 5777741, 5938398, 5898831, 5639001, 5171473, 4536241, 3793150, 3014888, 2278615, 1655148, 1198461, 939108]
38530I39108n6858J26972K73094L70362M16053M12556L63347K73248J53410K5447
38520C296739q1770j43744j54383j33003j17503j45362k33411l69779n23051o60248
38510G34485p59703q11904q13195p61455o56929n04429l12680r1202J52236M11449
38500c413327O78746R39922J170212J335767J403217J353621J192765R51962O80195
38491F293080M31927K53627J70889J80333K51485L39760M04313M21689L89568
38482I136671L20961K33382J38929L9996o8189j90999l28192m70794o01804p00872
38472G509089p52021p51192p09060o46881n87697n47746n32046n35277n46176
38463A900993n52442n44059n15229m65784m01393l30725k60125j89152j10692
$$ y = [939108, 882250, 1009222, 1282316, 1652678, 2068731, 2481287, 2844634, 3117882, 3271292, 3296739, 3214969, 3071225, 2916842, 2783839, 2666336, 2520974, 2287563, 1917784, 1394733, 734485, -25218, -837122, -1650317, -2411772, -3068701, -3573130, -3885810, -3977012, -3824776, -3413327, -2734581, -1794659, -624447, 711320, 2114537, 3468158, 4660923, 5612885, 6293080, 6725007, 6978634, 7149523, 7329856, 7581341, 7921101, 8325414, 8747103, 9136671, 9457632, 9691014, 9829943, 9869939, 9801750, 9610751, 9282559, 8811765, 8209961, 7509089, 6757068, 6005876, 5296816, 4649935, 4062238, 3514492, 2982446, 2447169, 1900993, 1348551, 804492, 289263, -176521, -577914, -908639, -1168764, -1357916, -1468608]
38454a468608j5881R8962K27316L52389M52871N11528N21752M89160M29189L62624
38444A961302L09426K81587K78402K87654K92090K77083K36129J73186J01483
38435D198342L8579o20r331R444M5023Q4055J16858J41709J63334J86382K09802
38424E183577K27241K32248K22814K01535J72563J38731J01292O1695K2402j5201
38414F548897n4121j01699j64294k40291l17614l78547m09850m12334m03606m10480
38404C656061m54204n37526o41726p34598p83355p65700o75377n22482l30898
38395a789805j34641K7727J22894J34844P1260m2233j76558l11125m35648n44588
38385c077873o32281o92930p23416p24510o98620o46760n69349m72064l71063
$$ y = [-1468608, -1484489, -1385527, -1158211, -805822, -352951, 158577, 680329, 1169489, 1598678, 1961302, 2270728, 2552315, 2830717, 3118371, 3410461, 3687544, 3923673, 4096859, 4198342, 4236921, 4236301, 4226970, 4236414, 4281437, 4365492, 4482350, 4624059, 4787393, 4973775, 5183577, 5410818, 5643066, 5865880, 6067415, 6239978, 6378709, 6480001, 6541696, 6564098, 6548897, 6494776, 6393077, 6228783, 5988492, 5670878, 5292331, 4882481, 4470147, 4066541, 3656061, 3201857, 2664331, 2022605, 1288007, 504652, -261048, -936425, -1458907, -1789805, -1924446, -1896719, -1773825, -1638981, -1567721, -1609954, -1786512, -2097637, -2533285, -3077873, -3710154, -4403084, -5126500, -5851010, -6549630, -7196390, -7765739, -8237803, -8608866]
38376h608866k90145k49405k54191k93277l46623l95455m27886m38333m23347
38367a1727528l77822k95334j73469k0696J40829K79830L66486L83790L33640
38358a1090274K34137J10363j4158j19423j86066j94446j29647J1019K14099M52493
38348a0711903O92948R05824J073556J193504J272845J319059J333761J314319
38340a606087J259845J174622J066237R41831Q06757O65947N25211L91083K69959
38331E495405J67511Q7554K9877j1582m7504q8162j37282j89439k33300k58313
38321D814765k59452k36635j90682j20462k3541J01452K52907M24710O04460P73312
38311F140834R10064R98189J030414J007299R32618Q11040O49829M61217K62519
$$ y = [-8608866, -8899011, -9148416, -9402607, -9695884, -10042507, -10437962, -10865848, -11304181, -11727528, -12105350, -12400684, -12574153, -12594849, -12454020, -12174190, -11807704, -11423914, -11090274, -10856137, -10745774, -10759932, -10879355, -11065421, -11259867, -11389514, -11378495, -11164396, -10711903, -10018955, -9113131, -8039575, -6846071, -5573226, -4254167, -2920406, -1606087, -346242, 828380, 1894617, 2836448, 3643205, 4309152, 4834363, 5225446, 5495405, 5662916, 5750470, 5780347, 5768765, 5721261, 5633099, 5495817, 5306378, 5073078, 4814765, 4555313, 4318678, 4127996, 4007534, 3983993, 4085445, 4338352, 4763062, 5367522, 6140834, 7050898, 8049087, 9079501, 10086800, 11019418, 11830458, 12480287, 12941504, 13204023]
38302A3204023P4471q0864j83701k22769k01691j40667p1443k8064l7178j10235
38292A2201882k39801m02429n67560p07683q04442q50156q47290q07049p45688
38283F229784o78880o17471n67094n29910n05336m89510m76003m58824m35458
38274A471298m06877l74089l34045k78653j98694r0589L8765J73188K94150L88429
38264F82883M50879M81201M79438M45607L83640L03797K18676J34884M7996n3778
38254C575223j79208l24282m69865n88522o56303o61866o07300n01828l55599
38245g69550j79463J0891J93676L47077M59032N32534N81903O23167O65824P10470
38235C175561P51458P81044P92891P84011P54009P01205O18538M94468L20903
$$ y = [13204023, 13278494, 13197630, 13013929, 12791160, 12589469, 12448802, 12377359, 12349295, 12312117, 12201882, 11962081, 11559652, 10992092, 10284409, 9479967, 8629811, 7782521, 6975472, 6229784, 5550904, 4933433, 4366339, 3836429, 3331093, 2841583, 2365580, 1906756, 1471298, 1064421, 690332, 356287, 77634, -121060, -211649, -172884, 304, 294454, 682883, 1133762, 1614963, 2094401, 2540008, 2923648, 3227445, 3446121, 3581005, 3629001, 3575223, 3396015, 3071733, 2601868, 2013346, 1357043, 695177, 87877, -413951, -769550, -949013, -938122, -744446, -397369, 61663, 594197, 1176100, 1799267, 2465091, 3175561, 3927019, 4708063, 5500954, 6284965, 7038974, 7740179, 8358717, 8853185, 9174088]
38226I174088J03615j32667l49198n06631n80544n71269n02492m08872l20069
38217E905961k51106k04233j78348j76675k05973k68979l58030m56497n46904
38208C259216o18621o69328p00586p12446p01443o63148n97546n13583m28896
38199b346381l63402l30073l28719l46173l61697l54070l07860k18074r2379N0508
38189d998320J86871K96094L66638L97279L95316L74977L56079L60054M02544
38180a862468M86919O03191P31675Q46977R20983R27815Q52658P00126M95446
38171D703322K76157P9059p0576j63510k05326k11469j99753j81882j58366j21608
38161C746048o5815N320Q1554J56823K35789L28356M37769N54742O62995P49706
$$ y = [9174088, 9277703, 9145036, 8795838, 8289207, 7708663, 7137394, 6634902, 6226030, 5905961, 5654855, 5450622, 5272274, 5095599, 4889626, 4620647, 4262617, 3806120, 3259216, 2640595, 1971267, 1270681, 558235, -143208, -806356, -1403902, -1917485, -2346381, -2709783, -3039856, -3368575, -3714748, -4076445, -4430515, -4738375, -4956449, -5048828, -4998320, -4811449, -4515355, -4148717, -3751438, -3356122, -2981145, -2625066, -2265012, -1862468, -1375549, -772358, -40683, 806294, 1727277, 2655092, 3507750, 4207876, 4703322, 4979479, 5058538, 4987962, 4824452, 4619126, 4407657, 4207904, 4026022, 3867656, 3746048, 3680233, 3685553, 3767107, 3923930, 4159719, 4488075, 4925844, 5480586, 6143581, 6893287]
38151F893287Q10997Q49275Q66891Q61676Q25693P45864O06521L95427J12575
38142A2968206k23682n78799r12362j189820j388827j498915j518354j451893
38134D205554j310590j112372q81370o44320m24435k36044q4103L0977J08021
38125c48682J45442J47931J32887J28243J60252K38967L51843M69760N60603O01454
38115B588700N83001N05882L73913J90751l6850k92238n45785p60786r06324r69179
38105G31085r56543q87879p82319o51651n03370l48605k05550r4840l2032k3751
38095c755455o8248j57073k76261m08448n36621o48118p37256q05591q58951r01319
38085i153341r28922r29382q87155p90886o36896m27300j66514J38586M73014
$$ y = [6893287, 7704284, 8553559, 9420450, 10282126, 11107819, 11853683, 12460204, 12855631, 12968206, 12744524, 12165725, 11253363, 10063543, 8674716, 7175801, 5657447, 4205554, 2894964, 1782592, 901222, 256902, -167533, -403577, -487680, -456703, -348682, -203240, -55309, 77578, 205821, 366073, 605040, 956883, 1426643, 1987246, 2588700, 3171701, 3677583, 4051496, 4242247, 4205397, 3913159, 3367374, 2606588, 1700264, 731085, -225458, -1113337, -1895656, -2547307, -3050677, -3399282, -3604832, -3699672, -3731704, -3755455, -3823703, -3980776, -4257037, -4665485, -5202106, -5850224, -6587480, -7393071, -8252022, -9153341, -10082263, -11011645, -11898800, -12689686, -13326582, -13753882, -13920396, -13781810, -13308796]
38076a3308796Q07532J100679J312582J422076J433065J365093J238397J067195
38068c562177Q63165O40165M13229J95266k336j65500k76198l18469k88274j98962
38058b700091p6736N1664J70409K76990L75092M64966N38802N82805N82836N30162
38048G96899M26383K87081J41880K7949k3097O83Q5214J96834K97755L60712L75404
$$ y = [-13308796, -12501264, -11400585, -10088003, -8665927, -7232862, -5867769, -4629372, -3562177, -2699012, -2058847, -1645618, -1450352, -1452688, -1618188, -1894386, -2212855, -2501129, -2700091, -2776827, -2725163, -2554754, -2277764, -1902672, -1437706, -898904, -316099, 266737, 796899, 1223282, 1510363, 1652243, 1680192, 1657095, 1657778, 1742992, 1939826, 2237581, 2598293, 2973697]
$$ [...]
##END NTUPLES=NMR SPECTRUM
##END=
