##TITLE=31Pdec_SR-167-R2K-AK
 D2O, 24 sc
 1.8.2023
##JCAMPDX= 6.0         $$ Bruker NMR JCAMP-DX V2.0
##DATA TYPE= NMR SPECTRUM
##DATA CLASS= NTUPLES
##ORIGIN= UXNMR, Bruker Analytische Messtechnik GmbH
##OWNER= root
$$ XWIN-NMR		Version 3.5
$$ Tue Aug  1 16:39:32 2023 Russian Standard Time (UT+4h)  she@DPX200
##.OBSERVE FREQUENCY= 81.013821
##.OBSERVE NUCLEUS= ^31P
##.ACQUISITION MODE= SIMULTANEOUS
##.ACQUISITION SCHEME= undefined
##.AVERAGES= 24
##.DIGITISER RES= 16
##SPECTROMETER/DATA SYSTEM= spect
##.PULSE SEQUENCE= zgpg30
##.SOLVENT NAME= CDCl3
##.SHIFT REFERENCE= (INTERNAL, CDCl3, 0, 248.564)
##AUDIT TRAIL= $$ (NUMBER, WHEN, WHO, WHERE, WHAT)
$$ ##TITLE= Audit trail, XWIN-NMR		Version 3.5
$$ ##JCAMPDX= 5.01
$$ ##ORIGIN= Bruker BioSpin GmbH
$$ ##OWNER= she
$$ F:/spectra/data/she/nmr/P31/1/pdata/1/auditp.txt
$$ ##AUDIT TRAIL=  $$ (NUMBER, WHEN, WHO, WHERE, WHAT)
(   1,<2023-08-01 16:38:08.23 +0400>,<she>,<DPX200>,
      <created by zg, POWCHK disabled, PULCHK disabled
       configuration hash MD5:
       00 E9 B6 7A A2 85 ED C7 34 08 36 98 17 FE 4E 26
       data hash MD5: 32K
       12 AB EB 11 C2 6C 47 79 DE 95 69 06 8A 66 DE 66>)
(   2,<2023-08-01 16:38:29.25 +0400>,<she>,<DPX200>,
      <Start of raw data processing
       efp BC_mod = 2 LB = 5 FT_mod = 6 PKNL = 1 PHC0 = -10685.17 PHC1 = 40.28482 SI = 64K 
       data hash MD5: 64K
       66 40 03 01 FE AE A8 46 6D 71 7F CC 78 23 5E 0F>)
(   3,<2023-08-01 16:38:45.95 +0400>,<she>,<DPX200>,
      <pk PHC0 = 27.2 PHC1 = 0 
       data hash MD5: 64K
       0A E8 78 E0 D9 19 3F ED 87 6B EE 0F A7 6B B6 5E>)
$$ ##END=
$$ 
$$ hash MD5
$$ 01 45 61 21 6B F4 B3 D5 7F 5B E6 E7 F7 41 18 14
##$RELAX= 
##$RELAX= 
##$RELAX= 
##$RELAX= 
##$RELAX= 
##$RELAX= 
##$RELAX= 
##$RELAX= 
##$RELAX= 
$$ Bruker specific parameters
$$ --------------------------
##$DU= <F:/spectra>
##$EXPNO= 1
##$NAME= <P31>
##$PROCNO= 1
##$TYPE= <nmr>
##$USER= <she>
##$AMP= (0..31)
100 100 100 100 100 100 100 100 100 100 100 100 100 100 100 100 100 100 
100 100 100 100 100 100 100 100 100 100 100 100 100 100 
##$AQSEQ= 0
##$AQ_mod= 1
##$AUNM= <au_zg>
##$AUTOPOS= <>
##$BF1= 81.014009
##$BF2= 200.13
##$BF3= 200.13
##$BF4= 200.13
##$BF5= 200.13
##$BF6= 200.13
##$BF7= 200.13
##$BF8= 200.13
##$BYTORDA= 1
##$CFDGTYP= 0
##$CFRGTYP= 5
##$CHEMSTR= <none>
##$CNST= (0..31)
1 1 145 1 1 1 1 1 1 1 1 1 1 1 1 1 1 1 1 1 1 1 1 1 1 1 1 1 1 1 1 1 
##$CPDPRG= <waltz16>
##$CPDPRG1= <>
##$CPDPRG2= <waltz16>
##$CPDPRG3= <>
##$CPDPRG4= <mlev>
##$CPDPRG5= <mlev>
##$CPDPRG6= <mlev>
##$CPDPRG7= <mlev>
##$CPDPRG8= <mlev>
##$CPDPRGB= <>
##$CPDPRGT= <>
##$D= (0..31)
0 1 0 0 0 0 0 0 0 0 0 0.03 2e-05 3e-06 0 0 0 0 0 0 0 0 0 0 0 0 0 0 0 0 
0 0 
##$DATE= 1690893487
##$DBL= (0..7)
120 120 120 11 120 120 24 19 
##$DBP= (0..7)
150 150 150 150 150 150 150 150 
##$DBP07= 0
##$DBPNAM0= <>
##$DBPNAM1= <>
##$DBPNAM2= <>
##$DBPNAM3= <>
##$DBPNAM4= <>
##$DBPNAM5= <>
##$DBPNAM6= <>
##$DBPNAM7= <>
##$DBPOAL= (0..7)
0.5 0.5 0.5 0.5 0.5 0.5 0.5 0.5 
##$DBPOFFS= (0..7)
$$ [...]
##$SUBNAM2= <"">
##$SUBNAM3= <"">
##$SUBNAM4= <"">
##$SUBNAM5= <"">
##$SUBNAM6= <"">
##$SUBNAM7= <"">
##$SUBNAM8= <"">
##$SUBNAM9= <"">
##$SW= 501.771253377433
##$SWIBOX= (0..15)
0 1 3 0 0 0 0 0 0 0 0 0 0 0 0 0 
##$SW_h= 40650.406504065
##$TD= 32768
##$TD0= 1
##$TE= 0
##$TE2= 300
##$TE3= 300
##$TEG= 300
##$TL= (0..7)
0 120 53 12 22 120 120 120 
##$TP= (0..7)
150 150 150 150 150 150 150 150 
##$TP07= 0
##$TPNAME0= <>
##$TPNAME1= <>
##$TPNAME2= <>
##$TPNAME3= <>
##$TPNAME4= <>
##$TPNAME5= <>
##$TPNAME6= <>
##$TPNAME7= <>
##$TPOAL= (0..7)
0.5 0.5 0.5 0.5 0.5 0.5 0.5 0.5 
##$TPOFFS= (0..7)
0 0 0 0 0 0 0 0 
##$TUNHIN= 0
##$TUNHOUT= 0
##$TUNXOUT= 0
##$USERA1= <user>
##$USERA2= <user>
##$USERA3= <user>
##$USERA4= <user>
##$USERA5= <user>
##$V9= 5
##$VALIST= <valist>
##$VCLIST= <CCCCCCCCCCCCCCC>
##$VD= 0
##$VDLIST= <DDDDDDDDDDDDDDD>
##$VPLIST= <PPPPPPPPPPPPPPP>
##$VTLIST= <TTTTTTTTTTTTTTT>
##$WBST= 1024
##$WBSW= 4
##$XGAIN= (0..3)
0 0 0 0 
##$XL= 0
##$YL= 0
##$YMAX_a= 2876
##$YMIN_a= -2776
##$ZGOPTNS= <>
##$ZL1= 120
##$ZL2= 120
##$ZL3= 120
##$ZL4= 120
##$ABSF1= 0
##$ABSF2= 0
##$ABSG= 0
##$ABSL= 0
##$ALPHA= 0
##$AQORDER= 0
##$ASSFAC= 0
##$ASSFACI= 0
##$ASSFACX= 0
##$ASSWID= 0
##$AUNMP= <proc_1d>
##$AZFE= 0.1
##$AZFW= 0.5
##$BCFW= 0
##$BC_mod= 2
##$BYTORDP= 0
##$COROFFS= 0
##$CY= -3
##$DATMOD= 1
##$DC= 0
##$DFILT= <>
##$DTYPP= 0
##$F1P= 0
##$F2P= 0
##$FCOR= 1
##$FTSIZE= 65536
##$FT_mod= 6
##$GAMMA= 0
##$GB= 0
##$INTBC= 1
##$INTSCL= 6.047779e-11
##$ISEN= 30
##$LB= 5
##$LEV0= 0
##$LPBIN= 0
##$MAXI= 10000
##$MC2= 0
##$MEAN= 0
##$ME_mod= 0
##$MI= 50
##$NCOEF= 0
##$NC_proc= -7
##$NLEV= 6
##$NOISF1= 182.463
##$NOISF2= 159.3651
##$NSP= 0
##$NTH_PI= 0
##$NZP= 0
##$OFFSET= 248.5645
##$PC= 4
##$PHC0= -10657.97
##$PHC1= 40.28482
##$PH_mod= 1
##$PKNL= yes
##$PPARMOD= 0
##$PSCAL= 0
##$PSIGN= 0
##$REVERSE= no
##$SF= 81.0140089999694
##$SI= 65536
##$SIGF1= 159.3651
##$SIGF2= -187.1042
##$SINO= 113.3802
##$SIOLD= 16384
##$SREGLST= <1H.CDCl3>
##$SSB= 0
##$STSI= 65536
##$STSR= 0
##$SW_p= 40650.406504065
##$SYMM= 0
##$S_DEV= 0
##$TDeff= 32768
##$TDoff= 0
##$TI= <>
##$TILT= no
##$TM1= 0
##$TM2= 0
##$TOPLEV= 0
##$USERP1= <user>
##$USERP2= <user>
##$USERP3= <user>
##$USERP4= <user>
##$USERP5= <user>
##$WDW= 1
##$XDIM= 65536
##$YMAX_p= 314399231
##$YMIN_p= -11070220
$$ End of Bruker specific parameters
$$ ---------------------------------
##NTUPLES= NMR SPECTRUM
##VAR_NAME=  FREQUENCY,     SPECTRUM/REAL,   SPECTRUM/IMAG
##SYMBOL=    X,             R,               I
##VAR_TYPE=  INDEPENDENT,   DEPENDENT,       DEPENDENT
##VAR_FORM=  AFFN,          ASDF,            ASDF
##VAR_DIM=   65536,         65536,           65536
##UNITS=     HZ,            ARBITRARY UNITS, ARBITRARY UNITS
##FACTOR=    0.620285442955139, 1,           1
##FIRST=     20137.2065510682, 0,            0
##LAST=      -20513.1999529968, 0,           0
##MIN=       -20513.1999529968, -11070220,   0
##MAX=       20137.2065510682, 314399231,    0
$$ Real data points
##PAGE= N=1
##DATA TABLE= (X++(R..R)), XYDATA
$$ [...]
41702A410938J96146Q1979l5775j60523k84453l71265l79705k98452j57779j5781
41692a4670O9945P5025K3974l1362n3558l8043L289N9003J12171J33780J00094
41681D39648J5669r0584j90142k65185k95359k51788j21425O2274K26583L09465
41671a60844L03565K48671J86612J31908Q0760L1751o220j2246M3020J68773L14197
41660A329947L82161L17875J80223R2567J14227J83288J94127J08168k4428j29380
41650B748775j71234j64402j47947j53339j82723k10972k11070j80730j49492
41641A176866j63929k54427l94967m94778m57478k69384k1395J67981K43731K26960
41631b40820J63060Q2040k012q1077j47207j84002j69234j02228k2262K2979K9004
$$ y = [1410938, 1607084, 1689063, 1653288, 1492765, 1208312, 837047, 457342, 158890, 1111, -14670, 55275, 130300, 154274, 122912, 69354, 31311, 34600, 93603, 205774, 339554, 439648, 455317, 364733, 174591, -90594, -385953, -637741, -759166, -696892, -470309, -160844, 142721, 391392, 578004, 709912, 790672, 822423, 816203, 803957, 846977, 1015750, 1329947, 1712108, 2029983, 2210206, 2302773, 2417000, 2600288, 2794415, 2902583, 2878155, 2748775, 2577541, 2413139, 2265192, 2111853, 1929130, 1718158, 1507088, 1326358, 1176866, 1012937, 758510, 363543, -131235, -588713, -858097, -879492, -711511, -467780, -240820, -77760, 4280, 2268, -78809, -226016, -410018, -579252, -681480, -703742, -680763, -651759]
41620f51759L5661P4371J33389J80284J98708J92014J66692J27181P9046K6618
41610E62205k5903o4168o6289k8990J6349K9396J189m3172q0079j10343j42413
41599D7782j67250j63710j27183q3045o6224q6200j11733r2889n603J20816K23575
41588e11664K58189K30187J77044J30160J02894J02948J31993J70090J83340J60028
41578A135209J22849R1054M8781k5161j09015j52871j43227j22015j30058j56493
41568E59053j61857j34321j02998j01419j29248j44877r3464M0783J99932K88270
41558B19854K62180J73867J08237Q7347O0699j4140j08265j49883j04156j4171
41548E21569L7771R080o3043j02707p1880M197P9920J29808J40619R8743J3617
$$ y = [-651759, -616098, -541727, -408338, -228054, -29346, 162668, 329360, 456541, 535587, 562205, 536302, 472134, 405845, 376855, 393204, 422600, 423789, 380617, 300538, 190195, 47782, -119468, -283178, -410361, -493406, -559630, -645830, -757563, -850452, -856055, -735239, -511664, -253475, -23288, 153756, 283916, 386810, 489758, 621751, 791841, 975181, 1135209, 1258058, 1349112, 1397893, 1372732, 1263717, 1110846, 967619, 845604, 715546, 559053, 397196, 262875, 159877, 58458, -70790, -215667, -309131, -268348, -68416, 219854, 482034, 655901, 764138, 851485, 912184, 898044, 789779, 639896, 535740, 521569, 559340, 568420, 505377, 402670, 330790, 334987, 414907, 544715, 685334, 784077, 797694]
41537G97694o8720j09372j22478j45424j73062j60225r0896p232M2098N2991N1270
41526F6644N1612M7808K6154k6728j14918k16918k87848k91867k32211j49145
41516a127417r4254r8959j47750j79674j34895p876J52407K87042L54535L29118
41506f67723K13162N7817o5956j32621j70129j94611j78804j07700k2186L2929
41496a235822P3319J40502K22569K60836K30466J66485J04725M0288m0996j25817
41486a63445j90258k31203k59684k73284k49158j62435j4035J47949K40711K06473
41476i48369O9835p7929j56090j45140p0279L1305J16256J42338J01964L9426
41466h96683J1451L1222O3488O9377M1839Q93k8814l0323M438P3120J57141K19937
$$ y = [797694, 728974, 619602, 497124, 351700, 178638, 18413, -72483, -79715, -37617, 15374, 66644, 118256, 166064, 192218, 165490, 50572, -166346, -454194, -746061, -978272, -1127417, -1221671, -1320630, -1468380, -1648054, -1782949, -1790825, -1638418, -1351376, -996841, -667723, -454561, -396744, -462700, -595321, -765450, -960061, -1138865, -1246565, -1268751, -1235822, -1162503, -1022001, -799432, -538596, -308130, -141645, -36920, 3368, -37628, -163445, -353703, -584906, -844590, -1117874, -1367032, -1529467, -1543502, -1395553, -1154842, -948369, -878534, -956463, -1112553, -1257693, -1327972, -1296667, -1180411, -1038073, -936109, -896683, -885232, -854010, -790522, -721145, -679306, -678413, -707227, -737550, -733112, -659992, -502851, -282914]
41454b82914K22494J53844M7282m3279q7138r3774r0390r3399j00730r9083p7103
41443e44190m2799k6420m9468r2253j17249j30480j87457l15322m54073n08356
41433b468067m45547l10791j56095J425J46360K40021K61670K47445K49960K69150
41423a964469K58982K03205J48585J45829J80622J86930J20727K689j06937j57978
41413i81815j37198o7781P510N5733P9293J07979J58538K08853K21234J84758
41403a62896J21746N6304n477n9244q4799o4282j5071J5243o46l2198k1111M6730
41391b05701J14588J13401L5962o7959j62193k53028l35994l56565k68725j15793
41381a502007r14K9564K8618N8732J05468J15894Q8485P3808R7843J35514J65086
$$ y = [-282914, -60420, 93424, 140706, 97427, 10289, -83485, -173875, -267274, -368004, -467087, -544190, -586989, -613409, -662877, -755130, -872379, -1002859, -1190316, -1505638, -1959711, -2468067, -2913614, -3224405, -3380500, -3379075, -3232715, -2992694, -2731024, -2483579, -2233619, -1964469, -1705487, -1502282, -1353697, -1207868, -1027246, -840316, -719589, -716900, -823837, -981815, -1119013, -1186794, -1179284, -1123551, -1044258, -936279, -777741, -568888, -347654, -162896, -41150, 15154, 9677, -49567, -134366, -198648, -213719, -198476, -199122, -231320, -252431, -205701, -91113, 22288, 58250, -9709, -171902, -424930, -760924, -1117489, -1386214, -1502007, -1502921, -1473357, -1444739, -1386007, -1280539, -1164645, -1076160, -1002352, -904509, -768995, -603909]
41370f03909K02157K59029L04875K95698K26810J32956N0020k674j5841P065M3339
41359H99525O6705O7273M1163k9032j55854l08475m19919m43707l87948k90939
41349i61208j86722j02197n7961m6689k6609L8049J36296K26323K79329K86549
41339d14840K39626J42032M0303M146N5382J38684J80547J60951J10933N7323
41329G15087m110q3055j60787j87570j13513O5799K83198M30813M39138L32411
41319A717411J99705J10967O5004J4394o9597j61546k11007k05019j90028k16961
41309A053323k72622k93559k51849j93041j70137j72891j56311j14865q3360p5253
41299g30565p0447o8563j02879j76768k24736j73686k8472J29778K21716K28350
$$ y = [-603909, -401752, -142723, 162152, 457850, 684660, 817616, 867636, 864962, 849121, 856186, 899525, 966230, 1033503, 1074666, 1045634, 889780, 581305, 161386, -282321, -670269, -961208, -1147930, -1250127, -1308088, -1354777, -1381386, -1343337, -1207041, -980718, -701389, -414840, -175214, -33182, 7121, 11267, 66649, 205333, 385880, 546831, 657764, 715087, 710977, 627922, 467135, 279565, 166052, 231851, 515049, 945862, 1385000, 1717411, 1917116, 2028083, 2093087, 2107481, 2037884, 1876338, 1665331, 1460312, 1270284, 1053323, 780701, 487142, 235293, 42252, -127885, -300776, -457087, -571952, -655312, -730565, -801012, -869575, -972454, -1149222, -1373958, -1547644, -1576116, -1446338, -1224622, -996272]
41289i96272J84730J39127J15849J01427O5684J857o1524r5250j03556j11674
41279g59602j30706j50808j61600j61424j48123j16345o6922r656M5579R6454
41269a563153J47829K03836K52063K54541J72420J5272j43481k18163j78632o1258
41259a118726P5534J89650K57318K64246K09639J12878O968p9081j35510j70131
41249c87215j86792j69632j04740j9249K5846m72n8870q3283n3138k988K6067
41238a014466K0166j0188l8079l3985l098j193p3267j75404k01918j03238O3251
41227a571419K14883L28187M10301M33833L59997K09594N4074o5467j63306k47237
41217c6560k82089k43014j73647j55012k21410l23672l69815k94161j02928J27666
$$ y = [-996272, -811542, -672415, -556566, -455139, -389455, -387598, -449122, -544372, -647928, -759602, -890308, -1041116, -1202716, -1364140, -1512263, -1628608, -1695530, -1705186, -1659607, -1563153, -1415324, -1211488, -959425, -704884, -532464, -517192, -660673, -878836, -1057468, -1118726, -1043192, -853542, -596224, -331978, -122339, -9461, -2493, -81574, -217084, -387215, -574007, -743639, -848379, -867628, -841782, -842254, -901124, -984407, -1037545, -1040533, -1014466, -994300, -1004488, -1042567, -1076552, -1079650, -1080843, -1154110, -1329514, -1531432, -1634670, -1571419, -1356536, -1028349, -618048, -184215, 175782, 385376, 439450, 373983, 210677, -36560, -318649, -561663, -735310, -890322, -1111732, -1435404, -1805219, -2099380, -2202308, -2074642]
41207b074642L02129L72129L61648L31243L25392L49567L73467L43207K13128
41198H97268n308k31642l78012m24269m15190l89294l38733k43135j11475K6249
41188a613541J44070K16588K15595J43508N7302K0923L1795K6940l0164r9470
41178h86454j16273o8921n623J8708j5575q7074j48016j57058j20199r1526j13146
41167a791157j62162j78313j35519n9523K0148J01852J87238K54287K74394K43491
41157a245264J84543J29316J03813J17313J54759J87184J94002J67499J00102
41148I3267j0933j40564k39083k71666k44383j87899j32953j03147j03030j00664
41138a441055n0256M8254J35913J60589J30136P8959J7632m5465o5975q063Q2731
$$ y = [-2074642, -1772513, -1400384, -1038736, -707493, -382101, -32534, 340933, 684140, 897268, 891960, 660318, 282306, -141963, -557153, -946447, -1285180, -1528315, -1639790, -1613541, -1469471, -1252883, -1037288, -893780, -836478, -815555, -783760, -756820, -786984, -886454, -1002727, -1071648, -1077271, -1058563, -1074138, -1161212, -1309228, -1466286, -1586485, -1678011, -1791157, -1953319, -2131632, -2267151, -2326674, -2306526, -2204674, -2017436, -1763149, -1488755, -1245264, -1060721, -931405, -827592, -710279, -555520, -368336, -174334, -6835, 93267, 82334, -58230, -297313, -568979, -813362, -1001261, -1134214, -1237361, -1340391, -1441055, -1491311, -1443057, -1307144, -1146555, -1016419, -937460, -919828, -965293, -1031268, -1039331, -956600]
41127i56600J12469N1843l7303r9528j51094k18928k67717k37845j29045r89R5228
41116a839509J50132J75763J93217K33622L11023L89768M11680L63997K93335
41107F83028K42856K00753J27408J8253p7537r8425k6720Q9371J66624J46431
41097A472042K8102j53027l62995n68790p15656p40794o25122m19690k13306p7708
41087b376944l3198m3576m3182P616Q7136J49534J93662K61026L57482M19887
41077a020557L91578L00879K24675J91067J59797R1936l785r6749j65212j89203
41067a15574j51724p2929j6736l0782q8250j13770o4749L0799J14327J54661J60282
41056a94445J49418J24660Q0611K6892j1439k2215k3719m1700p6531j08526j28939
$$ y = [-956600, -844131, -792288, -829591, -929119, -1080213, -1299141, -1566858, -1804703, -1933748, -1934737, -1839509, -1689377, -1513614, -1320397, -1086775, -775752, -385984, 25696, 389693, 683028, 925884, 1126637, 1254045, 1272298, 1194761, 1096336, 1069616, 1158987, 1325611, 1472042, 1500144, 1347117, 984122, 415332, -300324, -1041118, -1666240, -2085930, -2299236, -2376944, -2410142, -2453718, -2496900, -2489284, -2402148, -2252614, -2058952, -1797926, -1440444, -1020557, -628979, -328100, -103425, 87642, 247439, 339375, 335590, 238841, 73629, -115574, -267298, -340227, -356963, -387745, -475995, -589765, -654514, -623715, -509388, -354727, -194445, -45027, 79633, 160244, 187136, 175697, 153482, 129763, 88063, 11532, -96994, -225933]
41045b25933j43511j46618j17785n0473L9097J38237K42709L20031L03127J58497
41035E17378n2843k17038k67674k22935j37000n1204Q977K9556J7915n572l5498
41024d15938p7890j10823q1687K8113J52923J90925J08058k1449q4478l4439P2409
41013b74276J41486J38229J18383J58352K65338L68376L89854L07043J49949l1444
41003A731290j89579k95891l54294l88687m12044m22730m28629m41027m32711
40994a634302l41879j51935N6545J72598J65978J04196P0673R6451J61102K21292
40984a079281K36313J98938J47707J22861J09313N4040n5605j64263k10625j88304
40974h28906j32290p3623k5387J0110L9590O7895P9100N3238J2461J4651P5815
$$ y = [-225933, -369444, -516062, -633847, -684320, -645223, -506986, -264277, 55754, 358881, 517378, 464535, 247497, -20177, -243112, -380112, -431316, -422339, -392783, -374868, -380440, -415938, -493828, -604651, -686338, -658225, -505302, -314377, -206319, -227768, -312246, -346685, -274276, -132790, 5439, 123822, 282174, 547512, 915888, 1305742, 1612785, 1762734, 1731290, 1541711, 1245820, 891526, 502839, 90795, -331935, -760564, -1201591, -1634302, -1976181, -2128116, -2071571, -1898973, -1732995, -1628799, -1558126, -1461675, -1300573, -1079281, -842968, -644030, -496323, -373462, -264149, -210109, -265714, -429977, -640602, -828906, -961196, -1034819, -1060206, -1050096, -1010506, -942611, -863511, -810273, -797812, -783161, -707346]
40963g07346J33077J22157O3220K1611L026m9844j52907k33919k15679j01048
40953a117652N4888K14376L51499M06982L18159J09963q9359j55731p8743M9803
40943F4185J35024J43277Q5562k0780j55923k81180l42128k98233j56815J4696
40933h12315J19640J03116P543n8573k7529N8631J02595O5741K782j4771K2017
40922d31123O9391R2899R2795P8544M6071j3813r9251j96519k87286l50396l60895
40911a359583k97480j60203J7715J85914L14904M11012M80015M86306L78704J63949
40901F21253p4421k48953l38787l69273l50209k74283j64736p5499k9835P042
40891a297701P3569J54791K04003K04391J79555J47380R4218P291q6297j34199
$$ y = [-707346, -574269, -452112, -388892, -367281, -364255, -414099, -567006, -800925, -1016604, -1117652, -1062764, -848388, -496889, -89907, 228252, 338215, 248856, 93125, 14382, 64185, 199209, 342486, 428048, 407268, 251345, -29835, -371963, -670196, -827011, -812315, -692675, -589559, -582016, -640589, -668118, -609487, -506892, -441151, -438369, -453140, -431123, -361732, -268833, -176038, -97494, -51423, -65236, -164487, -361006, -648292, -998688, -1359583, -1657063, -1817266, -1799551, -1613637, -1298733, -887721, -407706, 78600, 457304, 621253, 546832, 297879, -40908, -410181, -760390, -1034673, -1199409, -1274908, -1304743, -1297701, -1224132, -1069341, -865338, -660947, -481392, -334012, -239794, -232503, -318800, -452999]
40881d52999j11289m3140K6596P9350J21857J54128J58742J26168P3196K5629
40871A58238n236j8117o563L4684R3199J42213J57033J21055L0260q8815j77012
40860D40939j87193j33377p3960m3934k4566J7791Q6850J56318J91087J60889
40850E90844O0070o9179j55715j64928j35158j33240j84791k60008l10358l00188
40840a062651k19336r2420K9586J09598J54735J91736K21663K19673J71255Q3347
40830a92814l5172j74124k99952l61458l30255k21411p3204P1664J64681J66393
40820a285652Q3476k8268j14700j60511j64683j09628J0871J47072K16632J81372
40810a224019Q0417j5394o1597n2031k138O1836J13821J49181J90400K56566L29036
$$ y = [-452999, -564288, -607428, -580832, -501482, -379625, -225497, -66755, 59413, 132609, 158238, 153002, 134885, 128322, 163006, 256205, 398418, 555451, 676506, 706766, 617951, 440939, 253746, 120369, 46409, 2475, -22091, -4300, 82550, 238868, 429955, 590844, 650914, 581735, 426020, 261092, 125934, -7306, -192097, -452105, -762463, -1062651, -1281987, -1374407, -1344821, -1235223, -1080488, -888752, -667089, -447416, -276161, -192814, -227986, -402110, -702062, -1063520, -1393775, -1615186, -1688390, -1616726, -1452045, -1285652, -1202176, -1230444, -1345144, -1505655, -1670338, -1779966, -1769095, -1622023, -1405391, -1224019, -1143602, -1158996, -1220593, -1272624, -1274762, -1212926, -1099105, -949924, -759524, -502958, -173922]
40799a73922L61283L25760K41185J48880P1695P790l8072l6378L5583J45564K10129
40788A299497J62975J6322j55565k89319l76476m38900m82225m85268m23370k88760
40778a461089r6826J09472K64195L12966K61475J82028J53360J89227K34433K30852
40768C80093J73083R3722J4017o7016j41316j80891j70593j30227q6457m0048
40758a55633J5461N5981M2098k4653q9581j00189n2497K6410J14608J94332K38191
40747B64528K27699J78473J21848O4985r031j04962k02226k76555l11958k92444
40737c39643k10865r4345N070N9837Q8391J14650J26010R0263J607j06884j87749
40726d53658k05326j53470o5728J549J2852k5262r2102j79106k68658l14067k83404
$$ y = [-173922, 187361, 513121, 754306, 903186, 974881, 982671, 944599, 908221, 943804, 1089368, 1299497, 1462472, 1478794, 1323229, 1033910, 657434, 218534, -263691, -748959, -1172329, -1461089, -1557915, -1448443, -1184248, -871282, -609807, -427779, -274419, -85192, 149241, 380093, 553176, 646898, 660915, 593899, 452583, 271692, 101099, -29128, -115585, -155633, -140172, -84191, -42093, -66746, -156327, -256516, -309013, -282603, -167995, 26337, 264528, 492227, 670700, 792548, 857533, 848502, 743540, 541314, 264759, -47199, -339643, -550508, -644853, -639783, -579946, -491555, -376905, -250895, -160632, -159025, -265909, -453658, -658984, -812454, -878182, -876633, -863781, -889043, -981145, -1160251, -1428909, -1742976, -2026380]
40715b026380k17200j98247k51800l08451k83402j68304k6578Q1264J43608J79597
40705c075893J99713J92234J45297P8846M1956O2001J05823J21830J22171J81797
40695a824225L32080M90465N38815M58574L46533K97645L12096L28083L07258
40686A587324K58692J98809J23188K2813r0653j86399k37984k42664k18655j83036
40676A031435j33542n9143K6562P0921J9240j22789k70942l23953k51494j15275
40666a28980o11N8942P9287P0547K1128n9226j17920j09788n5205k3081n9277
40655c24184j47695k34882k73897k48890j79142j02556m1009J6397P9727J15993
40645a340138P4104l6709j24580j02078J2159J03387P5147o0168k04619k71533
$$ y = [-2026380, -2243580, -2441827, -2693627, -3002078, -3285480, -3453784, -3480362, -3399098, -3255490, -3075893, -2876180, -2683946, -2538649, -2459803, -2417847, -2355846, -2250023, -2128193, -2006022, -1824225, -1492145, -1001680, -462865, -4291, 342242, 639887, 951983, 1280066, 1587324, 1846016, 2044825, 2168013, 2190826, 2100173, 1913774, 1675790, 1433126, 1214471, 1031435, 897893, 838750, 865312, 936233, 955473, 832684, 561742, 237789, -13705, -128980, -129591, -70649, 8638, 79185, 100313, 41087, -76833, -186621, -241826, -264907, -324184, -471879, -706761, -980658, -1229548, -1408690, -1511246, -1552255, -1535858, -1456131, -1340138, -1266034, -1302743, -1427323, -1529401, -1517242, -1413855, -1338708, -1398876, -1603495, -1875028]
40635a875028k50926j91318j36290q7742k3621O5835J69744K74411L68682M24401
40625a261852L88178K17226o4349l50773n12406m86144l19389j26247K905N5881
40615b456970Q0049J26868K11566L03998L47362L01974J85983O2948j9881o3301
40605i19404p6788m3573L7293J03621Q8888K7175L0414J34508K29517J94118N9782
40594a34449k1061M3113J88303K82221K56850J42047Q433r5155j61808k02845
40584C05649k08533j45293o739J49711K48725K72377K55651K13844J23711j1919
40574A197184j32234j85239j92585k09700k43667k50698k03179j19381k7573O4282
40564c02790J54238K25908K53659K18467J21055n357j00716j21793q7566o5380
$$ y = [-1875028, -2125954, -2317272, -2453562, -2541304, -2564925, -2499090, -2329346, -2054935, -1686253, -1261852, -873674, -656448, -720797, -1071570, -1583976, -2070120, -2389509, -2515756, -2512851, -2456970, -2376921, -2250053, -2038487, -1734489, -1387127, -1085153, -899170, -836222, -856103, -919404, -996192, -1039765, -1002472, -898851, -809963, -782788, -752374, -617866, -388349, -194231, -134449, -155510, -112397, 75906, 358127, 614977, 757024, 765457, 670302, 508494, 305649, 97116, -48177, -54916, 94795, 343520, 615897, 871548, 1085392, 1209103, 1197184, 1064950, 879711, 687126, 477426, 233759, -16939, -220118, -339499, -367072, -302790, -148552, 77356, 331015, 549482, 670537, 665180, 564464, 442671, 355105, 289725]
40554B89725j06313k04554l16367l97332m18910l75793k94587k21588j85668j77098
40544b408485j66799j34248p1331K2444J32127K25533K75997K82708K59403K14618
40534a368033J58772J18888J20021J50274J66864J46108J11382R9822J12246J10079
40524g3577N9498k9808j08833j28751q2625j6162O463m1614j24024j73878j52499
40513h65810p3216K6814J23512K09800K78436L19587L32901L23550K82470J91137
40503A149181O2170l9162m1516N8152J81601K38480K02841J22628O7292O9354
40493B071021J02780J09250N3635m0993j20739j61559j84191k05516k04482j58812
40483A260394r4373o5979r6498j62271k31171k81509k85513k17020r4765J2296
$$ y = [289725, 183412, -21142, -337509, -734841, -1153751, -1529544, -1824131, -2045719, -2231387, -2408485, -2575284, -2709532, -2780863, -2758419, -2626292, -2400759, -2124762, -1842054, -1582651, -1368033, -1209261, -1090373, -970352, -820078, -653214, -507106, -395724, -295902, -183656, -73577, -14079, -43887, -152720, -281471, -364096, -380258, -373795, -415409, -539433, -713311, -865810, -939026, -912212, -788700, -578900, -300464, 19123, 352024, 675574, 958044, 1149181, 1211351, 1172189, 1130673, 1188825, 1370426, 1608906, 1811747, 1934375, 2001667, 2071021, 2173801, 2283051, 2336686, 2295693, 2174954, 2013395, 1829204, 1623688, 1419206, 1260394, 1166021, 1100042, 1003544, 841273, 610102, 328593, 43080, -173940, -268705, -256409]
40473b56409M8439K5168l674j636L2850Q4699J26419J16106K6555j19115k63253
40462a83851l67193m28650m46502l97749k64906o8595J43382L27824M52414M83728
40452g50098L98204K16885J5923j16697j44778j06803p7335j06570j89938k78353
40442a139560l05695k20961k6530K01462L51274L57834K47612R8214k9937j09878
40432e76165j24760p2311N398L6025j6294j13369j83411j82543j07585K5337J86528
40421a123150L27445L99333L85271L03895J83086M1633j05370k37806l33503l77486
40411e36652l71904l40503l12532k90362k43468j53150n5620j4155m5690j01257
40401b465293j28172j23244j04827o0210L9560J78108K85606L04823K42957J49472
$$ y = [-256409, -207970, -182802, -186476, -188112, -155262, -70563, 55856, 171962, 198517, 79402, -183851, -551044, -979694, -1426196, -1823945, -2088851, -2157446, -2014064, -1686240, -1233826, -750098, -351894, -135009, -119086, -235783, -380561, -487364, -564699, -671269, -861207, -1139560, -1445255, -1666216, -1692746, -1491284, -1140010, -782176, -534564, -436350, -466287, -576165, -700925, -773236, -767838, -731813, -748107, -861476, -1044887, -1227430, -1335015, -1309678, -1123150, -795705, -396372, -11101, 292794, 475880, 517513, 412143, 174337, -159166, -536652, -908556, -1249059, -1561591, -1851953, -2095421, -2248571, -2304191, -2318346, -2364036, -2465293, -2593465, -2716709, -2821536, -2881746, -2842186, -2664078, -2378472, -2073649, -1830692, -1681220]
40391a681220O7809K3234L0059P8279J22691J16725O1283K457j6740J6704R8050
40380a080669K07855K94904K93059J82923K0173j18219k01534k42894k53374k31413
40370a129189j86908j40244r5327m0338K1679O6453P6021N3534J3126k2662k3927
40359a407782J1870K8378l7371j54522j98133q3900J30555L13877L96275L92678
40349f08075L27897K14632J04870Q4328J74176K79652K79097J48001l0571j59002
40339H15005k00369j77119j30728q6941m2123J9617Q9185J22409Q1797k0523j38419
40328C31791k40301l19137l61699l41077k49136j12248L5919J73751K70898K78976
40318e32263J79000K8992p1233p0700l443O5245J00975J01770P0975J6910l5558
$$ y = [-1681220, -1613411, -1590177, -1560118, -1481839, -1359148, -1242423, -1181140, -1178683, -1195423, -1178719, -1080669, -872814, -577910, -284851, -101928, -81755, -199974, -401508, -644402, -897776, -1129189, -1316097, -1456341, -1551668, -1592006, -1570327, -1503874, -1427853, -1374319, -1361193, -1383855, -1407782, -1395912, -1367534, -1404905, -1559427, -1757560, -1841460, -1710905, -1397028, -1000753, -608075, -280178, -65546, 39324, 123652, 297828, 577480, 856577, 1004578, 974007, 815005, 614636, 437517, 306789, 219848, 177725, 197342, 286527, 408936, 490733, 470210, 331791, 91490, -227647, -589346, -930423, -1179559, -1291807, -1255888, -1082137, -811239, -532263, -353263, -324271, -395504, -466204, -469647, -404402, -303427, -201657, -130682, -113772, -149330]
40307a49330o2701p1289r1309j37516j89969k10841j71391p1819M9083J32975
40297i74107J53564J44811J53737J70527J39125L9628p9914j68829k30446k85200
40287i37104l14053k82566j99255j00429J4209J78187L82674N50754O08567N51969
40277D52953M27546K81609J49760O0256P289o0064j77917k98572l21080k02848
40267C18932j3692J35857J98206K02349J83276J32633K8988j04889k00875k07970
40257F72815j44356p6312m9676n4858n8846n1277m3063l1902L776O9600J33853
40246C69754J58206J42807J25152J34305J58699J62654J26281O6407K5998M3659
40236A513922J19699K04086K30377J75296P8116r571q0297j56251k29582k53214
$$ y = [-149330, -212031, -283320, -374629, -512145, -702114, -912955, -1084346, -1156165, -1107082, -974107, -820543, -675732, -521995, -351468, -212343, -172715, -252629, -421458, -651904, -937104, -1251157, -1533723, -1732978, -1833407, -1819198, -1641011, -1258337, -707583, -99016, 452953, 880499, 1162108, 1311868, 1372124, 1379413, 1319349, 1141432, 842860, 521780, 318932, 305240, 441097, 639303, 841652, 1024928, 1157561, 1186549, 1081660, 880785, 672815, 528459, 452147, 402471, 347613, 288767, 237490, 194427, 162525, 166301, 235901, 369754, 527960, 670767, 795919, 930224, 1088923, 1251577, 1377858, 1444265, 1470263, 1513922, 1633621, 1837707, 2068084, 2243380, 2321496, 2311925, 2231628, 2075377, 1845795, 1592581]
40226A592581k01901j14716n7886o3498j21499k11708l16545m11371m68717m73115
40216h48375m17769k95737j16220P5968K23288L01550L25580L11361K58158J74512
40206g684R6723O1591O6205O3979K145j28056k67283l25071k63982j44510o3946
40195i09889n3799o4625m9036k0184j6945n0473j08158j75375k20168j85141m1665
40184a895458J53640K96543L36966L18093L08422L17804K93703J89540K5128j21783
40174B22598j83292j57745r3518k6160M5564J23207J86519K27911K73647L33128
40164I51859L50197K53514N2733j56841k90778l43506l58070l68731l88741m19029
40154g17393m40596m15119l15083j47569N5510K51360L85351M08795L24154J94879
$$ y = [1592581, 1390680, 1275964, 1218078, 1154580, 1033081, 821373, 504828, 93457, -375260, -848375, -1266144, -1561881, -1678101, -1602133, -1378845, -1077295, -751715, -440354, -182196, -7684, 89039, 150630, 216835, 280814, 282959, 154903, -112380, -437451, -701433, -845943, -909889, -963688, -1028313, -1077349, -1097533, -1114478, -1164951, -1273109, -1448484, -1668652, -1853793, -1895458, -1741818, -1445275, -1108309, -790216, -481794, -163990, 129713, 319253, 344381, 222598, 39306, -118439, -211957, -238117, -192553, -69346, 117173, 345084, 618731, 951859, 1302056, 1555570, 1608303, 1451462, 1160684, 817178, 459108, 90377, -298364, -717393, -1157989, -1573108, -1888191, -2035760, -1980250, -1728890, -1343539, -934744, -610590, -415711]
40144d15711Q3520r763j22316k51725l35790l18672k16728j05281m8555n0901
40134a791922o8493n4378J0761J18155K40297L32702L42354K40723N9095j18750
40124f89456k10966j89700q6142M5191J64665K58565L20805L32033K70204J46865
40114C62064J5331p5360j23044j48573j45585r2142r973L3463j1p6792j43253
40103d03875j83784k00094j73047r5969k4986l5922j25592k04412k02809j44953
40093a795443r5272o8857l1923K7960P5171P5428M2907K0535K5272L2769K0500
40082a670953J1209N3032J51010K35721K20787R1693p6193j89691k16884j95601
40072a585870j80736j92140k04383j77570j01424j3399L0640O209o2145j28412
$$ y = [-415711, -332191, -341954, -464270, -715995, -1051785, -1370457, -1587185, -1692466, -1741021, -1791922, -1860415, -1914793, -1904032, -1785877, -1545580, -1212878, -870524, -629801, -570706, -689456, -900422, -1090122, -1176264, -1131073, -966408, -707843, -387038, -55005, 215199, 362064, 377395, 302035, 178991, 30418, -115167, -207309, -217282, -183819, -183830, -260622, -403875, -587659, -787753, -960800, -1056769, -1081755, -1117677, -1243269, -1447681, -1650490, -1795443, -1890715, -1959572, -1991495, -1963535, -1888364, -1812936, -1770029, -1749494, -1724222, -1691453, -1670953, -1659744, -1606712, -1455702, -1219981, -999194, -907501, -983694, -1173385, -1390269, -1585870, -1766606, -1958746, -2163129, -2340699, -2442123, -2455522, -2424882, -2418673, -2480818, -2609230]
40062b609230j57580j30778l9915J02803K52857L46526L36759K23810N9752p7288
40052a692284j29475r5783k2923M3041Q9243J18478J18791P2997o956p9535j13676
40041a698082j12183q8999m3105L0361J18227J98938K65207L14049L18514K40934
40031d56139Q9124o1414j24418p7966K8046J28351J88880K06606J91043J54571
40021B66684J05651M4169k6201q1003r0570o1539m2678p1423j27495j59804j50553
40010c94762j28720j21100j15295q1598j4485O1741J19262J44644J34796R0225
40000c05292J7530o9342j57202k39511l07206l36882l02557k07323r2277P28P0052
39989a929282J41800K20176K72028K64356J96019Q7359l4558j27145j39466n8148
$$ y = [-2609230, -2766810, -2897588, -2937503, -2834700, -2581843, -2235317, -1898558, -1674748, -1614996, -1692284, -1821759, -1917542, -1940465, -1897424, -1808181, -1689703, -1570912, -1497915, -1504871, -1584406, -1698082, -1810265, -1899264, -1942369, -1912008, -1793781, -1594843, -1329636, -1015587, -697073, -456139, -367015, -428429, -552847, -630813, -602767, -474416, -285536, -78930, 112113, 266684, 372335, 416504, 390303, 309300, 218730, 157191, 114513, 43090, -84405, -244209, -394762, -523482, -644582, -759877, -841475, -855960, -794219, -674957, -530313, -395517, -305292, -287762, -357104, -514306, -753817, -1061023, -1397905, -1700462, -1907785, -2000062, -1999334, -1929282, -1787482, -1567306, -1295278, -1030922, -834903, -747544, -782102, -909247, -1048713, -1106861]
39979a106861O9088J80185K53331K91828K82152K11998J15619M6519K596o7866
39969B78589j72158k39628k11650j19900l7087J2774M8732O7660M4616o299k5499
39958c59850K2070J02454J50913J32839O1370k1502p1875p0927l5676N700M7060
39947c7424R7884J49225J70958J46719R0251K3736l6729o8568m4399L4826J25092
39936F51571J75123J66886J09936J1691j27375k94963m58031n70736n86886m79834
39926a402618k70342l3167J42003K08132J83554J22892O9398L1644k70k1841o682
39915i77297O1149J55979K28672K55521K52041K36488K02277J39491O6903K3525
39905F44749L2302Q1055J32671J48270J13075N1768J0809J5879N2633R1728J15469
$$ y = [-1106861, -1037773, -857588, -604257, -312429, -30277, 181721, 297340, 343859, 346455, 278589, 106431, -133197, -344847, -464747, -501834, -489060, -440328, -372668, -328052, -334351, -359850, -337780, -235326, -84413, 48426, 109796, 88294, 16419, -54508, -90184, -84484, -37424, 60460, 209685, 380643, 527362, 617613, 641349, 604620, 536052, 491653, 526479, 651571, 826694, 993580, 1103516, 1115207, 987832, 692869, 234838, -335898, -922784, -1402618, -1672960, -1706127, -1564124, -1355992, -1172438, -1049546, -980148, -948504, -948774, -970615, -977297, -916148, -760169, -531497, -275976, -23935, 212553, 414830, 554321, 621224, 644749, 677051, 758106, 890777, 1039047, 1152122, 1203890, 1214699, 1230578, 1283211, 1374939, 1490408]
39894A490408J10384N6745m8015j63035k24946j98503r9173K4230J16440J39921
39884A204456R6060J9126o5283j64030k79723l68674l72216k86319j64401m9232
39874d30236O0022J64393K30009K20848J39106J0220j46633l07375m26935m69706
39864i56287m45524l86494k99320j73657l0767P7054J26933J55856K13975L05688
39854a412543L91435M33868M27982L94456L56341L20074K74622K12778J50599
39845A549612J11605Q9204M4338m5660j49374k11005k13057j93568k02068k51475
39835E28552l12576l41803l11170k22835j01262L2015J72164L08970L97077L76061
39825E25193K36977N2845q0675j31457j39608j45014j34664p5464K0717R1067
$$ y = [1490408, 1600792, 1657537, 1609522, 1446487, 1221541, 1023038, 923865, 948095, 1064535, 1204456, 1300516, 1319642, 1254359, 1090329, 810606, 441932, 69716, -216603, -381004, -430236, -370214, -205821, 24188, 245036, 384142, 394362, 247729, -59646, -486581, -956287, -1401811, -1788305, -2087625, -2261282, -2292049, -2214995, -2088062, -1932206, -1718231, -1412543, -1021108, -587240, -159258, 235198, 591539, 911613, 1186235, 1399013, 1549612, 1661217, 1750421, 1794759, 1749099, 1599725, 1388720, 1175663, 982095, 780027, 528552, 215976, -125827, -436997, -659832, -761094, -729079, -556915, -247945, 149132, 525193, 762170, 815015, 734340, 602883, 463275, 318261, 183597, 108133, 128850, 219917]
39815B19917Q4350J7535l6857j9989N5760J18636J10427M7389K864L0345J13574
39804G43951J93057K25606K08651J61951J05474N1616K526m7012r4772j21737
39794A429311j09467o6993l0618l5644r1829j78043k50026k63756k11653j33761
39784E7521p5211l5946J5286Q0058J16049R4165L8886j0872n7912j34306k44273
39773a56555l48700m04531l96081l28517k17737r6757r961K0516J8130K6528N8679
39762a834986Q2367O3489J6135n812L0404J00616J61146K05415K57325L15580
39752f08321L40232L06052K40756J91355J73809J75255J84537J93889J85379J45910
39742A528853R0139M3529O941l9770j06021j87237k84349l92245m68549m52207
$$ y = [219917, 304267, 321802, 284945, 264956, 320716, 439352, 549779, 597168, 600032, 630377, 743951, 937008, 1162614, 1371265, 1533216, 1638690, 1690306, 1692832, 1645820, 1551048, 1429311, 1319844, 1252851, 1222233, 1186589, 1094760, 916717, 666691, 402935, 191282, 57521, -17690, -53636, -38350, 41708, 157757, 251922, 290808, 279936, 222024, 87718, -156555, -505255, -909786, -1305867, -1634384, -1852121, -1948878, -1958839, -1938323, -1920193, -1893665, -1834986, -1752619, -1689130, -1672995, -1678807, -1648403, -1547787, -1386641, -1181226, -923901, -608321, -268089, 37963, 278719, 470074, 643883, 819138, 1003675, 1197564, 1382943, 1528853, 1618992, 1662521, 1669462, 1629692, 1523671, 1336434, 1052085, 659840, 191291, -260916]
39732b60916l29958j60466j7056P6795J45819K16450K82509L00025K10822j398
39722D62626k61349m32664m26355k73768q0304P6926J88856K74775L39098L68489
39712B36330L47335K70358J54416L8652m1664q2935j04001j13706j06833r4038
39702E03914j13277j94339l17674m19933m42354l73014k45693j02024M1997J88615
39692a473782L20414L86226L42304K05855N1251n3924j01215j27442j60581j89296
39682h00190j82360j30890p0398n8979j24187k25933k80848k35338j14099J0248
39672b212974R1293J41893J97436K66537L27779L58639L48332K90096J85542O1860
39662E6433l4849p5480o8083l8602q661r97m1932j30237k14155k32575j83982
$$ y = [-260916, -590874, -751340, -768396, -691601, -545782, -329332, -46823, 253202, 464024, 462626, 201277, -231387, -657742, -931510, -1011814, -934888, -746032, -471257, -132159, 236330, 583665, 854023, 1008439, 1047091, 1005427, 922492, 818491, 704785, 597952, 503914, 390637, 196298, -121376, -541309, -983663, -1356677, -1602370, -1704394, -1662397, -1473782, -1153368, -767142, -424838, -218983, -167732, -221656, -322871, -450313, -610894, -800190, -982550, -1113440, -1183838, -1242817, -1367004, -1592937, -1873785, -2109123, -2223222, -2212974, -2121681, -1979788, -1782352, -1515815, -1188036, -829397, -481065, -190969, -5427, 56433, 21584, -53896, -121979, -160581, -169242, -170239, -212171, -342408, -556563, -789138, -973120]
39651i73120j28715j13401j17000q8773k1915L4744L4355j8481p9223j11359j16401
39640a699289j23032j53132j95928k09058j45584Q255K09125L74219M42517M27641
39630a064266L95319L78115L32393K03400J9092j15973j25508l5429O2413R5866
39620A45422N3062l5459j31592k13757k79534l24221l23069k54111j40010m1828
39610a545097J425R689K8708P8363J43411J94804K07959J79727J39281J21257
39600d40473J18573R0308K8729k1078l5014n9963j41373k30535k25016r4500Q6079
39589i24263K25383K84508K58782J58942L7324k2639J1402P6328Q7110L5130j6348
39578B11659j5151L3671R0271J14063Q0651k639r3139j47942j69196j97239k52263
$$ y = [-973120, -1101835, -1215236, -1332236, -1421009, -1442924, -1408180, -1373825, -1392306, -1471529, -1582888, -1699289, -1822321, -1975453, -2171381, -2380439, -2526023, -2517768, -2308643, -1934424, -1491907, -1064266, -668947, -290832, 41561, 244961, 264053, 148080, 22572, -12857, 49556, 145422, 198484, 163025, 31433, -182324, -461858, -786079, -1109148, -1363259, -1503269, -1545097, -1543672, -1533983, -1505275, -1426912, -1283501, -1088697, -880738, -701011, -561730, -440473, -321900, -231592, -202863, -223941, -258955, -318918, -460291, -690826, -915842, -1010342, -924263, -698880, -414372, -155590, 3352, 40676, 18037, 29439, 105767, 192877, 228007, 211659, 196508, 230179, 320450, 434513, 515164, 512525, 419386, 271444, 102248, -94991, -347254]
39567c47254k97651k71944j51265K4645J81275K58963K44489J71609R6619O0302
39557c0212N6591L7877l5263j45843k33935k60428k39681k03703j61917j16460
39547a332974q9143r4261r7281m4329O3848J64143K04780J93488J63769J30169
39537g37791R5580P0853O1183N3359L6200J1921l1337j28553k84566m28388m60433
39526a741972l49431j62134L27P8085P5595M0304K4775M9530R2057J17214J16764
39515a658886J10990J16550J25608J16428P6047J3390m5503p9848r4094j05147
39505a424465j06245o1701M8377J90837L00894L30523K67115J26737m7459j96149
39495e71536k83710l22870l36264l03151j78991K8658K36500L53156L52090K68553
$$ y = [-347254, -644905, -916849, -1068114, -1043469, -862194, -603231, -358742, -187133, -90514, -30212, 26379, 64256, 28993, -116850, -350785, -611213, -850894, -1054597, -1216514, -1332974, -1422117, -1516378, -1613659, -1657988, -1594140, -1429997, -1225217, -1031729, -867960, -737791, -642211, -571358, -510175, -456816, -420616, -408695, -440032, -568585, -853151, -1281539, -1741972, -2091403, -2253537, -2253210, -2175125, -2099530, -2059226, -2034451, -1984921, -1892864, -1775650, -1658886, -1547896, -1431346, -1305738, -1189310, -1113263, -1099873, -1145376, -1225224, -1319318, -1424465, -1530710, -1592411, -1544034, -1353197, -1052303, -721780, -454665, -327928, -375387, -571536, -855246, -1178116, -1514380, -1817531, -1996522, -1967864, -1731364, -1378208, -1026118, -757565]
39485g57565J48302K2589p5594r9459j5499J48580K91522L01027J53407n0117
39475F7193j62832j13170N3110K31382L35880L32777K38291J03835j5961r9663
39465I70842j58910j97757j88902j06746K3779J31300J58935J16508O7577O4874
39455H81500J01738J29411J17754Q8705Q6573J23891J62993J46723M6843j06490
39445A779641k38276k84263k42213j60992q0901p900M8492N0194k4095j30520
39435G09167j94176j82123j12868j0517J04880J86492J74720O3266q1940j87879
39425D69022k32807k29054j82766r6821P430R6431J44423J39672R0207L1730L182
39414B40649j297k9292r8598j56851j42969o7269P036N1322J00283J89265K96190
$$ y = [-757565, -609263, -586674, -662268, -761727, -777226, -628646, -337124, -36097, 117310, 67193, -95639, -208809, -155699, 75683, 411563, 744340, 982631, 1086466, 1070505, 970842, 811932, 614175, 425273, 318527, 342306, 473606, 632541, 749049, 816626, 881500, 983238, 1112649, 1230403, 1319108, 1405681, 1529572, 1692565, 1839288, 1886131, 1779641, 1541365, 1257102, 1014889, 853897, 772996, 765096, 813588, 863782, 839687, 709167, 514991, 332868, 220000, 209483, 314363, 500855, 675575, 738841, 656901, 469022, 236215, 7161, -175605, -272426, -264996, -168565, -24142, 115530, 205737, 237467, 240649, 239352, 210060, 111462, -45389, -188358, -255627, -248591, -197269, -96986, 92279, 388469]
39403C88469L62173L54085K93441K28962J87659J53412R3985M195q9704j66670
39393A810007k28235k68442k53850j64757m6224J6635j5409r1702j22702o7455
39383E67866L2243R7295Q6610K6979l1513p7541j34739k00086k25359j82694j16470
39372a57409r1643j09199j16574r2087o6944n6732k5482N2374J34134J54621J10233
39361b64708N8370M2247N3953P1963R7478J38929J87181K25082K42524K22087
39351A075106J28583n3791k74988m40896m93606m50018l52952k15009l8830J30252
39341i86149K20061K09186J55641J29600J36256J21200L9120r5360k13795k41512
39331e25752j54365k041J33206K07103K30614K19322J60942N4291n1104r3994
$$ y = [388469, 750642, 1104727, 1398168, 1627130, 1814789, 1968201, 2062186, 2066381, 1976677, 1810007, 1581772, 1313330, 1059480, 894723, 848499, 865134, 849725, 758023, 635321, 567866, 600109, 697404, 784014, 810993, 779480, 701939, 567200, 367114, 141755, -40939, -157409, -249052, -358251, -474825, -566912, -633856, -690588, -716070, -663696, -529562, -374941, -264708, -206338, -164091, -110138, -38175, 59303, 198232, 385413, 610495, 853019, 1075106, 1203689, 1149898, 874910, 434014, -59592, -509610, -862562, -1077571, -1116401, -986149, -766088, -556902, -401261, -271661, -135405, -14205, 24915, -70445, -284240, -525752, -680117, -682158, -548952, -341849, -111235, 108087, 269029, 323320, 272216, 178222]
39321A78222o8642j8719K7807P9230J34769J60782J33072P8094M7267N6648O5914
39310H74444J7868j00168k27641k68905j77239n652J34788J67881J00977k216
39300E14137p5770q9187o1847m2247m9203l6501N1613J87168K61602K02132N3001
39289I14898q3787j58656j91662k03984j82582j18596m4768j4547n4326j41880
39279b79890k22238k44103j94204j02590j1623N5680R0955Q0317J7160o2521q8906
39268i61963k8682O3056Q8462J2581r2815j23312m8955P0112J68680K46959L39701
39257b66176M38432M82038M30294L18281K17876J57733J02046P880j12481j95788
39247A580135j91755j16089l5159p86j0237l1777m9939o6820p2241m4832J1698
$$ y = [178222, 109580, 90861, 118668, 197898, 332667, 493449, 626521, 704615, 751882, 808530, 874444, 892312, 792144, 564503, 295598, 118359, 112707, 247495, 415376, 516353, 514137, 438367, 349180, 287333, 245086, 195883, 159382, 210995, 398163, 659765, 861897, 914898, 831111, 672455, 480793, 276809, 94227, -24369, -69137, -83684, -138010, -279890, -502128, -746231, -940435, -1043025, -1054648, -998968, -908013, -827696, -810536, -873057, -961963, -990645, -927589, -839127, -826546, -919361, -1042673, -1091628, -1021516, -852836, -605877, -266176, 172256, 654294, 1084588, 1402869, 1620745, 1778478, 1880524, 1888404, 1775923, 1580135, 1388380, 1272291, 1237132, 1236346, 1226109, 1194332, 1144393, 1077573, 1005332, 960500, 972198]
39236I72198N9005O3992L1464j4313o4527j27557k05734k81541l19010k74438
39226a60461j24120J02399L25436M63357M73847L53214J27980j31541l17959l52164
39216G59988k50627j09878k2508j7296o6207j20549j39805j12131n9594j4460
39206a53067J1073K3531K5380J2800p264j9564k2363k8725m4072n8873o2126m1604
39194c64874K6008J53461L01238L87190L59329K44050J09379J557o5480q5527
39184A066331o2016k5742j4354k8708l6595k6711l0388p1828j20085j21730p6239
39173D51935m7330q6023j61672j89420j19022K0859J60365K45552K55649J95551
39163G26444R6702J0710k6544k5033j8337j6531j428L6897Q6440J37841J93078
$$ y = [972198, 1031203, 1095195, 1126659, 1112346, 1047819, 920262, 714528, 432987, 113977, -160461, -284581, -182182, 143254, 606611, 1080458, 1433672, 1561652, 1430111, 1112152, 759988, 509361, 399483, 376975, 359679, 293472, 172923, 33118, -79013, -138607, -153067, -141994, -118463, -93083, -80283, -87547, -107111, -129474, -158199, -202271, -261144, -323270, -364874, -338866, -185405, 115833, 503023, 862352, 1106402, 1215781, 1217338, 1151858, 1066331, 1004315, 978573, 964219, 935511, 898916, 872205, 841817, 769989, 649904, 528174, 451935, 404605, 318582, 156910, -32510, -151532, -130673, 29692, 275244, 530893, 726444, 823146, 833856, 807312, 782279, 763942, 747411, 745983, 782880, 869320, 1007161, 1200239]
39152A200239K41392K57721K43063K37969K68952L03458K92272K43036K10506
39143C498608K12145J94147J01195m6691j74116k36665k63060l10101l93532m72417
39133B109513m93377m39115l34802k20750j30305q6798r9525j51273k02391k22771
39123b71594k16562k05933j96700j72073j16096l1870N7928J17265J15882O7383
39113h52370M4300J22276K95278M68377N50842N39012M91380M43486L78810K77690
39103B759081J61430P4042L5386K3457m406p8033j91992l06268l72888l71682
39093A728127l24785k76371k56596k61085k60962k31457j71037r3610r236P6411
39083h0601J45797J73265J58466J41199J60221K00416K03550J37903M1624j2007
$$ y = [1200239, 1441631, 1699352, 1942415, 2180384, 2449336, 2752794, 3045066, 3288102, 3498608, 3710753, 3904900, 4006095, 3959404, 3785288, 3548623, 3285563, 2975462, 2581930, 2109513, 1616136, 1177021, 842219, 621469, 491164, 404366, 304841, 153568, -48823, -271594, -488156, -694089, -890789, -1062862, -1178958, -1210828, -1152900, -1035635, -919753, -852370, -808070, -685794, -390516, 77861, 628703, 1167715, 1659095, 2102581, 2481391, 2759081, 2920511, 2994553, 3029939, 3053396, 3048990, 2970957, 2778965, 2472697, 2099809, 1728127, 1403342, 1126971, 870375, 609290, 348328, 116871, -54166, -147776, -157012, -80601, 65196, 238461, 396927, 538126, 698347, 898763, 1102313, 1240216, 1281840, 1269833]
39073A269833J5985R8804J71341J85244J46516J01737P9690N1973k9355j56492
39063A935276k56945k71788k16021j40646o0732M4379J71864K75351L08522K62240
39053B051500J55655J8088j12351j98358k28060k17751j85812j42583j08497j10619
39043I21212j41907j49019q8753J6360J03580J39894J38989J16502O4848j5730
39033A105976q7432r9954m2761L8120P8273N2894K382k957O7211J69048K27134
39022A507934K07703J39669O8983J2820l4285o6231n4901K6858J79026L67922
39012B355498N36930O24194N85454M22071J98339J8499l9873J8248J23146K13173
39002E055679K71444K89887K36821R5847q1667k06790k39914k17858j92184j72789
$$ y = [1269833, 1285818, 1384622, 1555963, 1741207, 1887723, 1989460, 2069150, 2121123, 2091768, 1935276, 1678331, 1406543, 1190522, 1049876, 989144, 1033523, 1205387, 1480738, 1789260, 2051500, 2207155, 2225243, 2112892, 1914534, 1686474, 1468723, 1282911, 1140328, 1031831, 921212, 779305, 630286, 541533, 557893, 661473, 801367, 940356, 1056858, 1121706, 1105976, 1018544, 918590, 875829, 913949, 992222, 1045116, 1047498, 1044541, 1111752, 1280800, 1507934, 1715637, 1855306, 1924289, 1937109, 1902824, 1836593, 1781692, 1808550, 1987576, 2355498, 2892428, 3516622, 4102076, 4524147, 4722486, 4740985, 4701112, 4719360, 4842506, 5055679, 5327123, 5617010, 5853831, 5949678, 5868011, 5661221, 5421307, 5203449, 5011265, 4838476]
38992D838476j42184r5343m7309j9950l2768q6764j46770j63044j25690p7211
38982C901443n6785n3908l2732K3036J09014K14381L06041L22947K28190O1731
38972E023358q6315j45021q4587R8062L60906N95520O89330O30159N09666M10804
38962H001882L34960K57343K03486K27093L35338M74575N82792O33945O41485
38953A1692899O39407O54599O86968P24425P76894Q73992J029238J239679J523938
38944A9842039J911826K376838K833648L242798L673089M215673M884462N659534
38936D8639907O575796P673756Q872974R957729J0637033J0506872R025931N811732
38928A17701730J155361l848721p884850j0210777j0911006j0516640r542215
$$ y = [4838476, 4696292, 4600949, 4553640, 4533690, 4500922, 4414158, 4267388, 4104344, 3978654, 3901443, 3844658, 3790750, 3758018, 3781054, 3890068, 4104449, 4410490, 4733437, 4961627, 5023358, 4937043, 4792022, 4707435, 4805497, 5166403, 5761923, 6451253, 7081412, 7591078, 8001882, 8336842, 8594185, 8797671, 9024764, 9360102, 9834677, 10417469, 11051414, 11692899, 12332306, 12986905, 13673873, 14398298, 15175192, 16049184, 17078422, 18318101, 19842039, 21753865, 24130703, 26964351, 30207149, 33880238, 38095911, 42980373, 48639907, 55215703, 62889459, 71762433, 81720162, 92357195, 102864067, 111889998, 117701730, 118857091, 115008370, 107123520, 96912743, 86001737, 75485097, 65942882]
38921F5942882q337296p132966o054682n122525m323842l676438l188733k803572
38913B5302828k443780k098392j815238j614957j452861j265628j025989p54801
38905A2831182n09503l60099l43233m24017n16629n50563n10640m18933l00471
38896H897094j74713o2205J9871O9187R6622J09918J01283N4302l4713j42327
38886H934319k27587k59323k38545k00413j94094k46272l29330l70783l13795
38877F554177j74793l0739N4014P8540Q4143J00239J20616J22818J01479Q4155
38867G094649J10098J81823K44758K40737J86314J68569K44344L64319M20638
38858I256249L58051K17278P9910j497j7829K3998J18980K49690L65062L98811
$$ y = [65942882, 57605586, 50472620, 44417938, 39295413, 34971571, 31295133, 28106400, 25302828, 22859048, 20760656, 18945418, 17330461, 15877600, 14611972, 13585983, 12831182, 12321679, 11961580, 11618347, 11194330, 10677701, 10127138, 9616498, 9197565, 8897094, 8722381, 8660176, 8680047, 8749234, 8845856, 8955774, 9057057, 9111359, 9076646, 8934319, 8706732, 8447409, 8208864, 8008451, 7814357, 7568085, 7238755, 6867972, 6554177, 6379384, 6348645, 6402659, 6481199, 6565342, 6665581, 6786197, 6909015, 7010494, 7094649, 7204747, 7386570, 7631328, 7872065, 8058379, 8226948, 8471292, 8835611, 9256249, 9614300, 9831578, 9911488, 9909991, 9892162, 9916160, 10035140, 10284830, 10649892, 11048703]
38848A1048703L32558K33095J97161K54790L54250M44262N29990O31715P35212
38839A4761736Q21941R14202J041182J177989J267195J296346J314574J374703
38831B3969868J493181J664351J882586K151782K495290K942072L477750M037305
38823D4114185M589522N204410N985832O961482Q101226R421531J0995349J2870639
38815A08244176J5058037J7581459K0433188K3452664K6281080K8306470K8438519
38808B67795593K5080273J6959395M563970r295782k0846078k7640011k9670767
38801B26946593k8525038k5845105k2615131j9362094j6433383j3981013j1950448
38794H8234381j0241516q820170p658652o677499n801678n013990m324530l741409
$$ y = [11048703, 11381261, 11614356, 11811517, 12066307, 12420557, 12864819, 13394809, 14026524, 14761736, 15583677, 16497879, 17539061, 18717050, 19984245, 21280591, 22595165, 23969868, 25463049, 27127400, 29009986, 31161768, 33657058, 36599130, 40076880, 44114185, 48703707, 53908117, 59893949, 66855431, 74956657, 84378188, 95373537, 108244176, 123302213, 140883672, 161316860, 184769524, 211050604, 239357074, 267795593, 292875866, 309835261, 314399231, 305103449, 284257371, 256617360, 226946593, 198421555, 172576450, 149961319, 130599225, 114165842, 100184829, 88234381, 77992865, 69172695, 61514043, 54836544, 49034866, 44020876, 39696346, 35954937]
38786C5954937l288249k988215k799943k615298k349474k002567j623172j257140
38778A7030879r48149p36209o20306n56544n21113n39469o21873p07845p21342
38769A1058029o60446n87375n41564n07609m65816m27407m05820l88327l57027
38760F716638l14699k68234k04240j09808j4386J8778l9214j35211j77026j28092
38750E344506m0878J6090M6420J13795K46504L87708M54328M20138L21537K04537
38740G514685R7109K2863M987M4773J11022J54172J23327j4875k42130m72986
38730G342947o09676o31232o07043o07377o23243n95299n00754l80806k89777
38721B497740k44528k22939j89145j19362k4074N2822P7118P0473R2978J71626
$$ y = [35954937, 32666688, 29678473, 26878530, 24263232, 21913758, 19911191, 18288019, 17030879, 16082730, 15346521, 14726215, 14169671, 13648558, 13109089, 12487216, 11779371, 11058029, 10397583, 9810208, 9268644, 8761035, 8295219, 7867812, 7461992, 7073665, 6716638, 6401939, 6133705, 5929465, 5819657, 5805271, 5824049, 5784835, 5649624, 5472598, 5344506, 5303628, 5319718, 5366138, 5479933, 5726437, 6114145, 6568473, 6988611, 7310148, 7514685, 7611794, 7634657, 7639644, 7684417, 7795439, 7949611, 8072938, 8058063, 7815933, 7342947, 6733271, 6102039, 5494996, 4887619, 4264376, 3669077, 3168323, 2787517, 2497740, 2253212, 2030273, 1841128, 1721766, 1697692, 1750514, 1827632, 1898105, 1991083, 2162709]
38711B162709K64337L05026K68216J78582P5251j4651p9335j22333j58286j93466
38701B686050k11190j89820j34755p9713n5230o6554j00780j38116j50365j07645
38691A451882p166J08122J78337J82202J55762J49269J73407J99449K07136K11553
38681C009953K32647K55619K46232K04713J80685K22226L24880M47050N66764
38672E690769O99991Q53616R71227R42585O82326K13278l22147p42079r36719
38663H052847r22283q02523o84197o16726n85467n44248m60703l47479k54654
38654B834567k24075k46326k67152k42595j87964j64471k08264k75700k76126
38645G41894j69019j4647Q8496J05701Q4252Q0508J01302J17552R9789L1123p6812
$$ y = [2162709, 2427046, 2732072, 3000288, 3178870, 3254121, 3239470, 3160135, 3037802, 2879516, 2686050, 2474860, 2285040, 2150285, 2070572, 2015342, 1948788, 1848008, 1709892, 1559527, 1451882, 1444716, 1552838, 1731175, 1913377, 2069139, 2218408, 2391815, 2591264, 2798400, 3009953, 3242600, 3498219, 3744451, 3949164, 4129849, 4352075, 4676955, 5124005, 5690769, 6390760, 7244376, 8215603, 9158188, 9840514, 10053792, 9731645, 8989566, 8052847, 7130564, 6328041, 5643844, 5027118, 4441651, 3897403, 3436700, 3089221, 2834567, 2610492, 2364166, 2097014, 1854419, 1666455, 1501984, 1293720, 1018020, 741894, 572875, 558228, 646724, 752425, 836677, 917185, 1018487, 1136039, 1235828, 1266951, 1190139]
38634A190139j62100j46870k7935R5957J27006P7612L7781N6554J08233J62228
38624A518605K18421K60386K36441J25025j8754j18480j54135j54215j34278q3029
38614A695987l297O7688Q9250N6360M694j9631r66L1437L7320J2918j0685j5816
38602A945259j8735l1957l4103r36N0020P0986L5035l9871j12847j55499j71577
38591A535775j85842k04161j90530j12578j1553J7820n7086j49615j49974m9232
38581D43024P5446J71575K48673L15457L44954L18048K55575J90474J46490J55155
38571B664871K43235L72994M37403L61636J92296M8543m861l675j4617o0241j20172
38560D117412j74689k25512k83157l46546l92797l83567k88457j12347R4741K55178
$$ y = [1190139, 1028039, 881169, 853234, 949191, 1076197, 1153809, 1191590, 1248144, 1356377, 1518605, 1737026, 1997412, 2233853, 2358878, 2340124, 2221644, 2067509, 1913294, 1779016, 1695987, 1692690, 1760378, 1849628, 1905988, 1910682, 1891051, 1890085, 1921522, 1958842, 1971760, 1961075, 1945259, 1926524, 1894567, 1860464, 1859528, 1909548, 1980534, 2015569, 1975698, 1862851, 1707352, 1535775, 1349933, 1145772, 955242, 842664, 831111, 848931, 791845, 642230, 492256, 443024, 518470, 690045, 938718, 1254175, 1599129, 1917177, 2172752, 2363226, 2509716, 2664871, 2908106, 3281100, 3718503, 4080139, 4272435, 4320978, 4316117, 4312442, 4297825, 4237584, 4117412, 3942723, 3717211, 3434054, 3087508, 2694711, 2311144, 2022687, 1910340, 2005081, 2260259]
38550B260259L00731K11132L1219j50125k49298k30807j17418K9048J40752J80445
38540B405938J66690J64557K37874L97698N92914P53436Q48506R07058R80299
38531G454970J081957J164339J149102R76150O31690J56810l51969p67760r95183
38522A0500106j024750r22209p65561o00227m44842l12703k16115j65307j74947
38513E873445k60873m16945n98559p39802p92373p52151o52977n32890m01525
38504G25350k44132o2541R8934J85363J86636J46535J18402J25106J55221J74181
38494A609055J38999L1059j12232k17504k40907k02795j54047j28361j35004j70967
38484D17296k16673k33528j88792q1903O0038K00698L01946L34650L02120K42138
$$ y = [2260259, 2560990, 2772122, 2803341, 2653216, 2403918, 2173111, 2055693, 2084741, 2225493, 2405938, 2572628, 2737185, 2975059, 3372757, 3965671, 4719107, 5567613, 6474671, 7454970, 8536927, 9701266, 10850368, 11826518, 12458208, 12615018, 12263049, 11495289, 10500106, 9475356, 8553147, 7787586, 7187359, 6742517, 6429814, 6213699, 6048392, 5873445, 5612572, 5195627, 4597068, 3857266, 3064893, 2312742, 1659765, 1126875, 725350, 481218, 418677, 517611, 702974, 889610, 1036145, 1154547, 1279653, 1434874, 1609055, 1748054, 1779113, 1666881, 1449377, 1208470, 1005675, 851628, 723267, 588263, 417296, 200623, -32905, -221697, -303600, -243562, -42864, 259082, 593732, 895852, 1137990]
38474A137990J91745J61781J53798J74380K08509K04478J24152k449j09744j76738
38464B067902k33504k89106l04506k58630j98048j82175k02430j97785j43434
38455E8284q3051o2557o2782k1589Q8846K27293L23620L37501K75945J72325O5294
38444A319129p992k0843K5630R6784J44393J36567P3060j9669j04670j53818j62027
38433A326544j46922j35303j49311j98411k72921l41773l65178l18618k09178
38424h11071p4470L2375P0645M3565j44j2746M787J6095M401j0820j1291l115
38412g51789N141J5704J9922k679m2931n4664k0572N291l7288j27185j84156j66750
38400a341956j04858m5339j6653m6189j52297k94046l73468l24895j84183m6332
$$ y = [1137990, 1329735, 1491516, 1645314, 1819694, 2028203, 2232681, 2356833, 2354384, 2244640, 2067902, 1834398, 1545292, 1240786, 982156, 784108, 601933, 399503, 201718, 58284, -24767, -87324, -150106, -171695, -82849, 144444, 468064, 805565, 1081510, 1253835, 1319129, 1311137, 1290294, 1315924, 1412708, 1557101, 1693668, 1766728, 1747059, 1642389, 1488571, 1326544, 1179622, 1044319, 895008, 696597, 423676, 81903, -283275, -601893, -811071, -885541, -853166, -782521, -738956, -739100, -751846, -747059, -730964, -726563, -737383, -748674, -751789, -746648, -730944, -711022, -713701, -756632, -811296, -831868, -826577, -863865, -991050, -1175206, -1341956, -1446814, -1492153, -1508806, -1554995, -1707292, -2001338, -2374806, -2699701, -2883884, -2930216]
38390b930216L1250O8334J21260K18375L26589L77227L37700K53552J95110J67382
38380h33437J12878J0647p7371q8091m4616j9795m0584p7697j15560j75671k59373
38369a608670l12157k74953j54379j8373P6036J35439K02250K78129K94453J83764
38359a198461k0016j84428k01406q8316N2092J48141K03161K41108K57598K37181
38349e53346J86495J30011Q7393O5462N7872M4557Q167l7566n1021r592N7336
38338a4232R9869J07192J17623J66969K42064K93673K84590K12173Q9901p1523
38328A528299k53512m14389n07043n15420m61281l73090k63542j43820m1032K0166
38318a424664M9926Q6691J48329J99692J84121R1205j8057o7111m1645N286K5963
$$ y = [-2930216, -2898966, -2830632, -2709372, -2490997, -2164408, -1787181, -1449481, -1195929, -1000819, -833437, -720559, -709912, -787283, -875374, -919990, -939785, -980369, -1058066, -1173626, -1349297, -1608670, -1920827, -2195780, -2350159, -2368532, -2292496, -2157057, -1954807, -1676678, -1382225, -1198461, -1218477, -1402905, -1604311, -1692627, -1640535, -1492394, -1289233, -1048125, -790527, -553346, -366851, -236840, -149447, -83985, -26113, 18444, 26611, -10955, -61976, -71568, -14232, 85637, 192829, 310452, 477421, 719485, 1013158, 1297748, 1509921, 1599822, 1528299, 1274787, 860398, 353355, -162065, -623346, -996436, -1259978, -1403798, -1444830, -1424664, -1374738, -1288047, -1139718, -940026, -755905, -664700, -682757, -749868, -791513, -786227, -760264]
38307g60264K7533L4163L4995J2420J866O1439J71731K23427J37750l9016j93997
38296b87953k65483k64677k17103j42251p8237o3869q3876p8312k6229J4041k8350
38285a522299j49375k67092k93590k01421l6845J16094J92578J85578J38142J02336
38275a735894J00262J05866N7825q4218k73817l88478l37346j46753Q6783L03607
38265b312163M94610O28673O41480N18139L30642J60086K2221r8804j85218k01918
38255b252j56409r7985o2839m8389l1864J1743R7267K05285K79961K80160K26276
38244G00954J70123J28609Q1344L0220K1131R0426K12371L14327L33953K59498
38234B342956J30490M652q7739j59865k31303k84628k82201k24349j61087j33636
$$ y = [-760264, -732731, -698568, -663573, -651153, -649287, -587848, -416117, -192690, -54940, -93956, -287953, -553436, -818113, -1035216, -1177467, -1255704, -1319573, -1403449, -1481761, -1507990, -1493949, -1522299, -1671674, -1938766, -2232356, -2433777, -2470622, -2354528, -2161950, -1976372, -1838230, -1735894, -1635632, -1529766, -1471941, -1556159, -1829976, -2218454, -2555800, -2702553, -2615770, -2312163, -1817553, -1188880, -547400, -29261, 301381, 461467, 483688, 384884, 199666, -2252, -158661, -256646, -319485, -367874, -399738, -387995, -290728, -85443, 194518, 474678, 700954, 871077, 999686, 1081030, 1111250, 1132381, 1222807, 1435178, 1749505, 2083458, 2342956, 2473446, 2478098, 2390359, 2230494, 1999191, 1714563, 1432362, 1208013, 1046926, 913290]
38224I13290j27401j01972n3412k5918o5508j75850l16126m29477m75369m48131
38214a305874l70745k67979j46713p935J24707K01425J81898P4517o3522j64136
38204a744357j85394j21327O403J59101K95887L93174M49680M68136M42096L73071
38194E36470K89852K26505J79995J13816J3657q1341j20026r9264o5097o0886
38184I33681q9857j24663j37605j20924r2087q5871j32559k33079l52217m38799
38174h73980m57031m01137k81283j03748J21008L51631N22570N95812N89706N36094
38164E99642M30258K59192O3663q1034j52425j98989k54489k84950k51220j77020
38154d7372j08672m2762M8631J38702J53928O8363n5239j32030j32145q2456k1671
$$ y = [913290, 785889, 683917, 630505, 604587, 539079, 363229, 47103, -382374, -857743, -1305874, -1676619, -1944598, -2091311, -2099246, -1974539, -1773114, -1591216, -1516699, -1580221, -1744357, -1929751, -2051078, -2044675, -1885574, -1589687, -1196513, -746833, -278697, 163399, 536470, 826322, 1052827, 1232822, 1346638, 1360295, 1278954, 1158928, 1059664, 994567, 933681, 843824, 719161, 581556, 460632, 368545, 282674, 150115, -82964, -435181, -873980, -1331011, -1732148, -2013431, -2117179, -1996171, -1644540, -1121970, -526158, 63548, 599642, 1029900, 1289092, 1352755, 1271721, 1119296, 920307, 665818, 380868, 129648, -47372, -156044, -198806, -150175, -11473, 142455, 210818, 155579, 23549, -108596, -191052, -212723]
38143b12723K8992O6203R0096R0527N5495n47l5942l0912k2511o2849j50740k31529
38131d16440k58052k26120j59161q8388m1978k1121J1266Q7493J82749K36521
38121f93231K25544J86372J67543J88006K36298K76599K62139J82305R2912N8083
38111A182570O6035M9780j2367p5075j09216j40053j81198j94754j52377q2018
38101C51327j6159N4955J34253J70234J13528j0562j35155k29475k97885l31664
38091a96603l14609k55986j68803l5517J53286L42190M45849M33239L34399J80545
38081I17990r163j92657l16950l69091l67141l01869j43270Q3935K81007L51615
38071f5594K68977O8965j77186l76011m50582l96466k76511j51409m3404L3526
$$ y = [-212723, -183731, -117528, -27432, 63095, 118590, 118043, 82101, 51189, 28678, -34171, -184911, -416440, -674492, -900612, -1059773, -1148161, -1190139, -1211260, -1199994, -1112501, -929752, -693231, -467687, -281315, -113772, 74234, 310532, 587131, 849270, 1031575, 1124487, 1182570, 1248605, 1298385, 1286018, 1210943, 1101727, 961674, 780476, 585722, 433345, 351327, 335168, 390123, 524376, 694610, 808138, 797576, 662421, 432946, 135061, -196603, -511212, -767198, -936001, -971518, -818232, -476042, -30193, 403046, 737445, 917990, 908827, 716170, 399220, 30129, -337012, -638881, -782151, -698216, -417209, -65594, 203383, 272348, 95162, -280849, -731431, -1127897, -1404408, -1555817, -1599221, -1565695]
38061a565695N7330L2237L300J4776P7032J80057L03302M01305M19053L41468
38051B64165K00180K6959j57133l00893l34825k59570j73930j70378k35001k85886
38041a426312k71123j85997l5991J52455L04742L47952K90138K03290J29317M9471
38031d42058n2076j44098j82762j55825q2449m32M0363J0602n4959p7674k0145
38020a161513P1038J24049J18050P8366K0246o5018j71071k56617k78930k33603
38010a755003j49762n3749N0368J65933K82273L75237M22158M08697L29922K01306
38000B77380O5590l4157r5956j53664k19356k53503k14789j24038m9465l2254
37990h34212n2927p3287q5787j08701j47243j74588j51417o2895O1245J67023
$$ y = [-1565695, -1508365, -1476128, -1472828, -1458052, -1381020, -1200963, -897661, -496356, -77303, 264165, 464345, 491304, 334171, 33278, -301547, -561117, -735047, -905425, -1140426, -1426312, -1697435, -1883432, -1919423, -1766968, -1462226, -1114274, -824136, -620846, -491529, -442058, -494134, -638232, -820994, -976819, -1059268, -1059700, -1019337, -1008735, -1063694, -1141368, -1161513, -1090475, -966426, -848376, -770010, -749764, -814782, -985853, -1242470, -1521400, -1755003, -1904765, -1958514, -1908146, -1742213, -1459940, -1084703, -662545, -253848, 76074, 277380, 342970, 308813, 212857, 59193, -160163, -413666, -628455, -752493, -801958, -834212, -887139, -960426, -1046213, -1154914, -1302157, -1476745, -1628162, -1691057, -1629812, -1462789]
37980a462789K22131K36032K28349J90779J00721l0435j44237j78369j14784J2896
37970i39706J44682K25761K31523J75347R1250Q885n2639p8255o3576k8280n252
37959b90260r976l0720n0681o7054q5744j10993j45308j87184k22998k32291k07243
37948a640452j57692r2899r185R9735K31345L77308N23477O38512O76718O08479
37938A255346M47044K41031M5212j03701k01291k75410l55811m29794m41903l54575
37928a73852j96805l3821R6915J91316K33106J90295P3701l8515o9624k4489K5248
37917B73475K5532j8134p5018j28460j70073j83162j53109q3560P790R5543J41598
37906b67578J09856J0797q4786j08828p0973m4884p9032j45285j78248j39641
$$ y = [-1462789, -1240658, -1004626, -776277, -585498, -484777, -515212, -659449, -837818, -952602, -939706, -795024, -569263, -337740, -162393, -71143, -62258, -114897, -193152, -256728, -285008, -290260, -300236, -330956, -381637, -448691, -534435, -645428, -790736, -977920, -1200918, -1433209, -1640452, -1798144, -1891043, -1900228, -1800493, -1569148, -1191840, -668363, -29851, 646867, 1255346, 1702390, 1943421, 1988633, 1884932, 1683641, 1408231, 1052420, 622626, 180723, -173852, -370657, -404478, -307563, -116247, 116859, 307154, 380855, 342340, 272716, 248227, 273475, 299007, 280873, 205855, 77395, -92678, -275840, -428949, -512509, -504719, -409176, -267578, -157722, -146925, -231711, -340539, -411512, -456396, -535428, -680713, -858961, -998602]
37896i98602l7286R1672J99848K52447K51071K26030J96111J50664P9776J009
37886D12740n9717r4706j04021p8520j7555N3176J09709J63296K34669L02644
37876I21715L12924K39696J10082l1820j51877k14151j85836q1612K0869M1212
37866I81202k9764j27395j76110j47834p3803j5039j3442n7669r8316j00881p5766
37855F5183n3274m6030n0796p5093j37920k37366l29243l50679k71978j26893
37845a614089J3122R9554J38026J57239J62640J39265R1096N0666M7027Q5697
37835f29757J60138K52654L15008K83329J42229l9137j57221j55539n2942Q1563
37825B00325J61678J21622l4003k18951l35837l63562l55937l59645l63482l31261
$$ y = [-998602, -1035888, -944216, -744368, -491921, -240850, -14820, 181291, 331955, 411731, 412740, 353023, 258317, 154296, 75776, 58221, 111397, 221106, 384402, 619071, 921715, 1234639, 1474335, 1584417, 1552597, 1400720, 1186569, 1000733, 919121, 939990, 981202, 951438, 824043, 647933, 500099, 426296, 411257, 397815, 340146, 241830, 140949, 65183, 11909, -34121, -84917, -160010, -297930, -535296, -864539, -1215218, -1487196, -1614089, -1600967, -1501413, -1363387, -1206148, -1043508, -904243, -813147, -762481, -715454, -629757, -469619, -216965, 98043, 381372, 523601, 484464, 327243, 171704, 118762, 200325, 362003, 483625, 449622, 230671, -105166, -468728, -824665, -1184310, -1547792, -1879053]
37815a879053k52566j45354l0454P8125J70387K42938K95810L16523K79965J81594
37805g42085O5635M40J5913O9339P8384q959j71102l30205m07772l68520k26185
37794b025117k6039J72665L12530L57182L02618J69733r165j92870l31795l84229
37784a654487l40219k29502j08077l2078k3621m6657l0869N6897J70298K34945
37774b003370K36492K26691K40464K48537K16737J78185J99694K80402L26196
37765A50028K45275N1794j42398k32425k06178j32578q1721o7392o4426o4124
37755e44145r0357j57238k32586k64622k39133j89924j50127j09022k3441J36249
37745a864346L49131N36541N94997M69642K17946j7455j27380j24578r8588r8915
$$ y = [-1879053, -2131619, -2276973, -2307427, -2229302, -2058915, -1815977, -1520167, -1203644, -923679, -742085, -676450, -676010, -660097, -590758, -512374, -521333, -692435, -1022640, -1430412, -1798932, -2025117, -2051156, -1878491, -1565961, -1208779, -906161, -736428, -745593, -938463, -1270258, -1654487, -1994706, -2224208, -2332285, -2364363, -2387984, -2434641, -2465510, -2408613, -2238315, -2003370, -1766878, -1540187, -1299723, -1051186, -834449, -656264, -456570, -176168, 150028, 395303, 447097, 304699, 72274, -133904, -266482, -348203, -415595, -480021, -544145, -634502, -791740, -1024326, -1288948, -1528081, -1718005, -1868132, -1977154, -2000595, -1864346, -1515215, -978674, -383677, 85965, 303911, 286456, 159076, 34498, -64090, -163005]
37735a63005r6445n3701J5460P7746J35679K15140L14456L98845M38865M28246
37725A711286L72077K87316K09888J66555J36462P4294k1084r6765j19120j20361
37715B600548j46062j87541k01697j76635j38816j07599q2530p0504q4708j12739
37705A291717j23000j11124j04961j12038j00313n4153j5983l7844j10577j75248
37695C46476j94962j84261j73495j76432j94424k20553k28472j84138r0729j0277
37685a311267j8623j32693k85713l76283l48229k34070j24087q5623j07139j20028
37675c143755o8083N0784J97076L18770L69933L33500K45078J74334J58269J61477
37665a202617J23053L5272m7120p0708k9202N4408J56223K44463K74383K26591
$$ y = [-163005, -259450, -313151, -297691, -219945, -84266, 130874, 445330, 844175, 1283040, 1711286, 2083363, 2370679, 2580567, 2747122, 2883584, 2957878, 2936794, 2840029, 2720909, 2600548, 2454486, 2266945, 2065248, 1888613, 1749797, 1642198, 1559668, 1489164, 1404456, 1291717, 1168717, 1057593, 952632, 840594, 740281, 686128, 670145, 632301, 521724, 346476, 151514, -32747, -206242, -382674, -577098, -797651, -1026123, -1210261, -1300990, -1311267, -1329890, -1462583, -1748296, -2124579, -2472808, -2706878, -2830965, -2916588, -3023727, -3143755, -3211838, -3161054, -2963978, -2645208, -2275275, -1941775, -1696697, -1522363, -1364094, -1202617, -1079564, -1044292, -1091412, -1162120, -1191322, -1136914, -980691, -736228, -461845, -235254]
37655b35254J44516J02635J29927J84323K09326J95193J69372J43214R5898J4752
37645A153902p0037j09533r2905o7917r9662k12881l75870n31836o35908o64821
37635a707468o07025m58866k35814J4857K19903L13616K82316J79442Q6105M8590
37625a864344N6795Q2333J23265K00411L17186M36766N01552M73839L64182K25108
37615I17093J09707L0014l7546j05640j55639j74969j87995k18194k34817j78416
37605b36402m1091J15301K26366K71753K46504J41436q085r8335n1207P3156J20468
37594G59864K0159j24766j56154l9351J12849J78899J48904J01292R7019J25900
37584A224615J44044J29156Q5489J5839q3013j95028k76358k86316k21768j15582
$$ y = [-235254, -90738, 11897, 141824, 326147, 535473, 730666, 900038, 1043252, 1139150, 1153902, 1083865, 974332, 881427, 813510, 713848, 500967, 125097, -406739, -1042647, -1707468, -2314493, -2773359, -3009173, -2994316, -2774413, -2460797, -2178481, -1999039, -1912934, -1864344, -1807549, -1725216, -1601951, -1401540, -1084354, -647588, -146036, 327803, 691985, 917093, 1026800, 1056814, 1019268, 913628, 757989, 583020, 395025, 176831, -57986, -236402, -277493, -162192, 64174, 335927, 582431, 723867, 715782, 617447, 566240, 639396, 759864, 780023, 655257, 499103, 459752, 572601, 751500, 900404, 1001696, 1098715, 1224615, 1368659, 1497815, 1583304, 1599143, 1516130, 1321102, 1044744, 758428, 536660, 421078]
37574D21078j0001O1673Q0164M6867j0779n0732m1891J5419Q6688J21857R2082
37563H12425J8772m3138o2845o8636j13938k13060l19724l62509k93511j18586
37553g64750R6436K56391L03832K66405K23242K21691K43377K49492K28208J83552
37543A507876J07293o735j31570k20074k50076k36833k03379j64728j46333j85264
37533G0177k84101l77376l78787k70859j26499l0582J213J0692K6314L7112L2670
37522a290026L1674N5188R7483J43797J95643K50685K71441K11109P6262o3910
37512b0654j44951j67762j80519k13198k44877k31289j54051m3942L7943M4434
37502a318866k2191j11149j59286j33517m7333O0193J62403K58615L45789L90059
$$ y = [421078, 411077, 472750, 552914, 599781, 589002, 538270, 496379, 511798, 598486, 720343, 812425, 831197, 788059, 725214, 656578, 542640, 329580, 9856, -352653, -646164, -764750, -668314, -411923, -108091, 158314, 381556, 603247, 846624, 1096116, 1324324, 1507876, 1615169, 1608434, 1476864, 1256790, 1006714, 769881, 566502, 401774, 255441, 70177, -213924, -591300, -970087, -1240946, -1367445, -1398027, -1396814, -1386122, -1359808, -1322696, -1290026, -1258352, -1203164, -1105681, -961884, -766241, -515556, -244115, -33006, 43256, -20654, -165605, -333367, -513886, -727084, -971961, -1203250, -1357301, -1401243, -1363300, -1318866, -1341057, -1452206, -1611492, -1745009, -1792342, -1732149, -1569746, -1311131, -965342, -575283]
37492e75283L52590K46082J35040O3528J1518n0214r0814n1837O0609J67094K07644
37481D75957K01530J99265K13870K23047K05911J48491M2178q6056j63581j39291
37471A321321n9183l4328j22901k71581l81332m00859l39789k22383o7411R1251
37461d87195K01182K28768J89767J30759Q5604N6467K5707k9259j24157k46040
37451C1603l42333l60676l12626k69219k69190k57968j56764K3035J84772K69988
37441a459378L26357M26803N57980O26864N62352L79525J53349m0043j55795j84772
37431A193242j47320q2538l3865k9341o0453q4123o5405k0902l43k2805n7797
37420E88350p7915r7762j39693j90048k20210k30367k38000k36855k04374j44733
$$ y = [-575283, -222693, 23389, 158429, 221957, 233475, 183261, 92447, 40610, 101219, 268313, 475957, 677487, 876752, 1090622, 1313669, 1519580, 1668071, 1710249, 1624193, 1460612, 1321321, 1262138, 1227810, 1104909, 833328, 451996, 51137, -288652, -511035, -578446, -487195, -286013, -57245, 132522, 263281, 348885, 405352, 431059, 401800, 277643, 31603, -310730, -671406, -984032, -1253251, -1522441, -1780409, -1937173, -1914138, -1729366, -1459378, -1133021, -706218, -148238, 478626, 1040978, 1420503, 1573852, 1533809, 1378014, 1193242, 1045922, 963384, 929519, 900178, 839725, 755602, 690197, 669295, 668952, 646147, 588350, 510435, 412673, 272980, 82932, -137278, -367645, -605645, -842500, -1046874, -1191607]
37410a191607q9015n0959j3133L9351J00746J65317K34720K91190K91205K09556
37400a2629P7313m2491j10775j32602j31694j23473j14718j15034j36296j80339
37390a022738k34908k87186l35044l73617l74484k97993j36157O7711K48547L57164
37380b388705L68109K78886J22967l3602j33734j62738j30845m4349Q3136K12026
37370a828849L03623L55759L82563L74480L18650K48631K22696K46257K62668
37361H86478K33851J83407J38605P8606j9240j16600j50370j22068j06332j64803
37351H41534k81608l91015m42748m25809l46656k11163l7896J23014K09213K00857
37341g62277J45520J07680R8240P8922L3936L31J1744M4741M9767J5448k9412
$$ y = [-1191607, -1280622, -1331581, -1344714, -1305363, -1204617, -1039300, -804580, -513390, -222185, -12629, 64684, 22193, -88582, -221184, -352878, -476351, -591069, -706103, -842399, -1022738, -1257646, -1544832, -1879876, -2253493, -2627977, -2925970, -3062127, -2994416, -2745869, -2388705, -2020596, -1741710, -1618743, -1652345, -1786079, -1948817, -2079662, -2124011, -2040875, -1828849, -1525226, -1169467, -786904, -412424, -93774, 154857, 377553, 623810, 886478, 1120329, 1303736, 1442341, 1520947, 1501707, 1385107, 1234737, 1112669, 1006337, 841534, 559926, 168911, -273837, -699646, -1046302, -1257465, -1295361, -1172347, -963134, -762277, -616757, -509077, -410837, -331915, -297979, -297648, -285904, -241163, -191396, -175948, -205360]
37330b05360o8255j20196k08563l25363m29170m66459m01824k48059o9232O2295
37320b480186J20324J34268J49356J86857K38549K84944L13688L26206L29005
37311c96989L17896K76162J94184Q7442r494o3066n3573J9705J33306K42228K98498
37300A046299K74126J73302L2462r3707j64031j78781j68168j50662j17916o6457
37290E86467k2521j6154m1231n8935l6723K5374R6592J32341J03704K8764l3352
37279G64326l6571Q227N2381N8929K0059n3885j35406j82651j73599j34849j09051
37268G7910r7813o8477j5860K3137K9749M1011R9448J87223K40608K22203J55128
37257H94267Q7253M0193j398n8876j23692j56601j30052o9127l4172n4459r0969
$$ y = [-205360, -273615, -393811, -602374, -927737, -1356907, -1823366, -2225190, -2473249, -2542481, -2480186, -2359862, -2225594, -2076238, -1889381, -1650832, -1365888, -1052200, -725994, -396989, -79093, 197069, 391253, 478695, 469201, 406135, 352562, 372267, 505573, 747801, 1046299, 1320425, 1493727, 1526189, 1432482, 1268451, 1089670, 921502, 770840, 652924, 586467, 563946, 547792, 506561, 447626, 410903, 436277, 532869, 665210, 768914, 797678, 764326, 727755, 735982, 788363, 847292, 867351, 813466, 678060, 495409, 321810, 186961, 77910, -19903, -88380, -104240, -81103, -51354, -10343, 89105, 276328, 516936, 739139, 894267, 981520, 1021713, 1020315, 961439, 837747, 681146, 551094, 481967, 447795, 393336, 302367]
37246C02367p5757J8292J52925K58404K82751K19844J06292j0289j09426k03167
37236I42236l00281l77613m02039l74056l29597k96226k64391k09502j28605m2638
37226a782712K9744Q5375J23561J34350J09489N9871J1414j8929l7202n9754r2277
37215a437070j27023j57817j90788k38625l05477l73710m01737l43762j89017
37206c765026J3214J80506K62104K76699K83634L24815L99604M79467N22739M79636
37196e42608L19192P6340j44264k42358k03851r3996K2406J24205J98318K08306
37186b78310J33520J4510q3724j46732k08192k72581k88256k19850j10095l3712
37176a493422r365N908M2625P6914P1738L3619R415L4481R7822J60901K03460
$$ y = [302367, 226610, 244902, 397827, 656231, 938982, 1158826, 1265118, 1254829, 1145403, 942236, 641955, 264342, -137697, -511753, -841350, -1137576, -1401967, -1611469, -1740074, -1782712, -1752968, -1667593, -1544032, -1409682, -1300193, -1240322, -1228908, -1247837, -1285039, -1344793, -1437070, -1564093, -1721910, -1912698, -2151323, -2456800, -2830510, -3232247, -3576009, -3765026, -3751812, -3571306, -3309202, -3032503, -2748869, -2424054, -2024450, -1544983, -1022244, -542608, -223416, -147076, -291340, -533698, -737549, -831545, -809139, -684934, -486616, -278310, -144790, -130280, -214004, -360736, -568928, -841509, -1129765, -1349615, -1459710, -1493422, -1502787, -1496879, -1454254, -1377340, -1305602, -1271983, -1262568, -1228087, -1130265, -969364, -765904]
37165g65904K38465K74615K78614K03839O2807n8155q0216j4423N6054O2384o92
37154B57388r3262j64306j74834j25957p4742r4599k02931l39709m23711m17281
37144a853944l36722k24625j26181p4484p5588j04206j19877r1043j1680R5683
37134b922667J96998K77122L47971M14466M42704L85760K41014O1286r1912j87915
37124h35173k24832k17785j95276j81124j70554j45152j14175j10087j32856j33067
37114b460081p3031K0267Q5615R0313M5228j4259l6174K9453J78200L30289M00526
37103a403654L85298L50373L41464L42791L19626K60965J72486O2517n1052j46049
37093F34765k19626k83220l26355l15006k41855j51196r1054n9426k0182M4113
$$ y = [-765904, -527439, -252824, 25790, 229629, 292436, 234281, 154065, 139642, 195696, 258080, 257388, 164126, -180, -175014, -300971, -375713, -470312, -673243, -1012952, -1436663, -1853944, -2190666, -2415291, -2541472, -2615956, -2691544, -2795750, -2915627, -3006670, -3018350, -2922667, -2725669, -2448547, -2100576, -1686110, -1243406, -857646, -616632, -555346, -647258, -835173, -1060005, -1277790, -1473066, -1654190, -1824744, -1969896, -2084071, -2194158, -2327014, -2460081, -2533112, -2512845, -2427230, -2336917, -2291689, -2305948, -2342122, -2312669, -2134469, -1804180, -1403654, -1018356, -667983, -326519, 16272, 335898, 596863, 769349, 831866, 780814, 634765, 415139, 131919, -194436, -509442, -751297, -902493, -993547, -1052973, -1073155, -1029042]
37083a029042J19533J87174K32591K33447J68030M4398r8279k25367l28707m06878
37073a103100m42530m15998l31355k10541o5635J01434K65382L65457L50462K34988
37063a251436R4231j698l8108m1550l6699l1666l0694l5720l3949m283N4940J18020
37051a238612J61774J91562K21145K31773J75045L1775j40275k36100j89281k5650
37041h16844J66029L05084L59314L36852K62650J62113N0075o6811j65747j95236
37031C97479j18732J9410J04200N7696p3672j65178j44281n5464Q52k9163j12521
37020a19374j67644j32561j2884J20937J88081J60418P6203n088n5260q5970j15165
37009a48307j34181j12915l9552N1629J07341J14304J13325J41335J77295J71198
$$ y = [-1029042, -909509, -722335, -489744, -256297, -88267, -43869, -142148, -367515, -696222, -1103100, -1545630, -1961628, -2292983, -2503524, -2569159, -2467725, -2202343, -1836886, -1486424, -1251436, -1157205, -1158903, -1197011, -1238561, -1275260, -1306926, -1337620, -1373340, -1407289, -1411572, -1356632, -1238612, -1076838, -885276, -664131, -432358, -257313, -225538, -365813, -601913, -791194, -816844, -650815, -345731, 13583, 350435, 613085, 775198, 825273, 758462, 592715, 397479, 278747, 298157, 402357, 460053, 386381, 221203, 76922, 21458, 22310, -6853, -119374, -287018, -419579, -432463, -311526, -123445, 36973, 113176, 108088, 52828, -33142, -148307, -282488, -395403, -434955, -383326, -275985, -161681, -48356, 92979, 270274, 441472]
36999D41472J18305P3016Q2632J31683J63604J40205O8060j8428q3885j09431
36989A007233r8648o8557l1581J0777N5273Q3745O7078j5223j51278k87993l60791
36978B10035l51553l10791l01574l25889l31708k90273k30709j85723j37495m5301
36968b300981R1736K25431L00656K87182J86892M0900p5150r5214j5660J06068
36958a248140K07323K66116K97527L22702L45079L46923L07849K32754J55226
36949A233359J02791O6898K3102k6296n2695m4831k8521l3503n8295q1006r3247
36938A007756j08235j38710j78508k08406k15941k06737j94721j81697j53498
36929e78697j03020n1911l6932p0330j18609j25398o0616M4057J08286O8353n6325
$$ y = [441472, 559777, 632793, 715425, 847108, 1010712, 1150917, 1218977, 1200549, 1116664, 1007233, 908585, 840028, 808447, 819224, 874497, 958242, 1025320, 1010097, 858819, 570826, 210035, -141518, -452309, -753883, -1079772, -1411480, -1701753, -1932462, -2118185, -2255680, -2300981, -2209245, -1983814, -1683158, -1395976, -1209084, -1168184, -1243334, -1338548, -1354208, -1248140, -1040817, -774701, -477174, -154472, 190607, 537530, 845379, 1078133, 1233359, 1336150, 1403048, 1426150, 1399854, 1347159, 1302328, 1273807, 1240304, 1182009, 1101003, 1007756, 899521, 760811, 582303, 373897, 157956, -48781, -243502, -425199, -578697, -681717, -733628, -770560, -840890, -959499, -1084897, -1145513, -1101456, -993170, -924817, -981142]
36918i81142j69866j85681r9056L2060J55796K51034L04286L07331K80074K54655
36908A49491K25677J55347M6955k6504p98R8162J83567J95228J24725j6432j95290
36897I40128l30790l33347j97942k2023R1058J18406R3832M0122l7468j15717
36887B46259j57809j52303j17621o9456j3109L0129K2244m6442j26638j42483
36877e27229n4659J08685K72729L64437L57157K85625K19404K13704K78501L87196
36867A905550N07747O26557P49760Q83421J009988J087977J080668R79306P88988
36858I619962N02678J13843l40465p71041j086244j243575j250233j134696r36516
36849C473713p11449n19735l98276l44431l20414k70501j52331K5190J94546K76560
$$ y = [-981142, -1151008, -1336689, -1435745, -1403685, -1247889, -996855, -692569, -385238, -105164, 149491, 375168, 530515, 577470, 550966, 550168, 648330, 831897, 1027125, 1151850, 1135418, 940128, 609338, 275991, 78049, 56026, 147084, 265490, 359322, 399444, 361976, 246259, 88450, -63853, -181474, -250930, -264039, -233910, -211666, -258108, -384746, -527229, -581888, -473203, -200474, 163963, 521120, 806745, 1026149, 1239853, 1518354, 1905550, 2413297, 3039854, 3789614, 4673035, 5683023, 6771000, 7851668, 8830974, 9619962, 10122640, 10236483, 9896018, 9124977, 8038733, 6795158, 5544925, 4410229, 3473713, 2762264, 2242529, 1844253, 1499822, 1179408, 908907, 756576, 781766, 976312, 1252872]
36839A252872K42838J32032J1666p0809j13453j54826k37726l60092m64702m93696
36829b55896m48632l77593l08712k24202j03192L9127J67369K56190K89436K53894
36819g12211J60475N9186N948J3360M7763P0479O8895N4197M6616O2158R9713
36808b3421J41288J75725K17933K89250L79071M42601M42269L79885K81830J63442
36798B889873K1393j37897k74014l33368l03885k38603k04372k08144k00436j59816
36788H50731j38610j92718k88949l28173k60102j34084k6338M4369J06252J69681
36778a97941K04566J71304N4253j20511k77348l18246j98965J3461J86874K41784
36768b40769K06681J49123Q1321l4050j96403l31232l64694l09699k42961k01381
$$ y = [1252872, 1495710, 1627742, 1639408, 1568599, 1455146, 1300320, 1062594, 702502, 237800, -255896, -704528, -1082121, -1390833, -1615035, -1718227, -1679100, -1511731, -1255541, -966105, -712211, -551736, -492550, -486602, -473242, -425479, -355000, -286105, -231908, -185292, -123134, -23421, 117867, 293592, 511525, 800775, 1179846, 1622447, 2064716, 2444601, 2726431, 2889873, 2911266, 2773369, 2499355, 2165987, 1862102, 1623499, 1419127, 1210983, 1010547, 850731, 712121, 519403, 230454, -97719, -357821, -491905, -518243, -473874, -367622, -197941, 6625, 177929, 232182, 111671, -165677, -483923, -682888, -669427, -482553, -240769, -34088, 115035, 196356, 162306, -34097, -365329, -730023, -1039722, -1282683, -1484064]
36758a484064j40178j1803J43333K20448J58227n643j83906l11107l58210l15262
36748b288165j94808m1610R0078J71462J99653J75552J08104L7968K2094P4003
36738a645669J36290J35853O3882j4108k6600L8307J33249J99669K09925J79279
36728e89923J51508J62288J97240J90773R0980o8289j83861j88632j24963r4219
36718d57098j45998k39277l00707k89188k07079q9441J470P029o8033j40052j20119
36707b048493k353J37913K26248K48961K37739K23675K17142K16059K17784K21156
36697a04169K18438J88510J11185r69r5897j25684r4277m5982j1198J4865M0881
36686I5703N7109N8896O8554J07604J55210J58753R0397j9981j11914j44653j18839
$$ y = [-1484064, -1624242, -1636045, -1492712, -1272264, -1114037, -1119680, -1303586, -1614693, -1972903, -2288165, -2482973, -2524583, -2434505, -2263043, -2063390, -1887838, -1779734, -1741766, -1719672, -1645669, -1509379, -1373526, -1309644, -1323752, -1350352, -1312045, -1178796, -979127, -769202, -589923, -438415, -276127, -78887, 111886, 202866, 134577, -49284, -237916, -362879, -457098, -603096, -842373, -1143080, -1432268, -1639347, -1728788, -1727318, -1720289, -1788322, -1928374, -2048493, -2050846, -1912933, -1686685, -1437724, -1199985, -976310, -759168, -543109, -325325, -104169, 114269, 302779, 413964, 412995, 317098, 191414, 97137, 51155, 39957, 54822, 95703, 152812, 211708, 280262, 387866, 543076, 701829, 792226, 772245, 660331, 515678, 396839]
36675C96839o1981n032L0722L8662K7916J4550K982k1795p3359j34876j63763
36664E0865j31838n2600L3893Q8585Q2795J0626q1208j00326N193J63689K27342
36653B97016J24933o0914j89148k04652j61295j29901j27788j31540j14116n6817
36643g54222M3158J55889K26410K19463J53608Q2494M5896M2079M0803J7985j9409
36632B54154m1188k7929Q426M3363O8447Q6931R1494P0627L3841J497l4693j08673
36620D46297k22304l20606l49818l18403k72774k31148j74935r3618j163Q7613
36610a450859J60381J88960J50736P7516L9308N8371P8293M7123n633j6514J4152
36599f58166K3720k1667q6312j19737j10726p6403l4233o50J1630J0243J3066
$$ y = [396839, 334858, 329826, 360548, 399210, 427126, 441676, 444658, 422863, 349504, 214628, 50865, -80973, -133573, -99680, -11095, 71700, 82326, 1118, -99208, -94015, 69674, 297016, 421949, 361035, 171887, -32765, -194060, -323961, -451749, -583289, -697405, -754222, -711064, -555175, -328765, -109302, 44306, 126800, 172696, 214775, 255578, 273563, 254154, 212966, 185037, 193463, 236826, 305273, 392204, 483698, 554325, 588166, 589663, 554970, 446297, 223993, -96613, -446431, -764834, -1037608, -1268756, -1443691, -1537309, -1538472, -1450859, -1290478, -1101518, -950782, -873266, -833958, -775587, -697294, -650171, -655804, -672318, -658166, -634446, -656113, -742425, -862162, -972888, -1049291, -1083524, -1084174, -1072544, -1062301, -1049235]
36588a049235J2943j5493o2266p6999m4126k1656n9454j06748n8185J12157L09878
36577a059184M15600L81612K36523M8298r8724j39610q2136l158L7156N9994J21143
36566h2486K17819K76885K35812J13181m868l9151J5447Q6808R6882M3244m955
36555I54618p01J7149k1312j18921k03598k11177j41998l7625O0787J21784J26368
36544E45374Q4202K9801j4079n7293j15587j75305j95496j38700r76J71012K92937
36533D25890L02029K17807J21656O3071J3763o5356j45762j60667r3801P651J02033
36522G88314J84796K44272K39441J53151L4111m8276p0405m8777M604P6598J16433
36511A674262O0851q6707k37142k96889k47487j34688j1023Q6862J33541J28850
$$ y = [-1049235, -1036292, -1051785, -1114051, -1191050, -1235176, -1256832, -1316286, -1423034, -1481219, -1369062, -1059184, -643584, -261972, -25449, 22849, -75875, -215485, -297621, -300779, -263623, -203629, -82486, 135333, 412218, 648030, 761211, 756343, 717192, 732639, 819447, 916329, 959573, 954618, 953917, 971066, 949754, 830833, 627235, 416058, 274060, 236435, 297222, 419006, 545374, 629576, 659377, 645298, 588005, 472418, 297113, 101617, -37083, -38059, 132953, 425890, 727919, 945726, 1067382, 1130453, 1144216, 1078860, 933098, 772431, 678630, 686281, 788314, 973110, 1217382, 1456823, 1609974, 1644085, 1595809, 1525404, 1476627, 1481231, 1557829, 1674262, 1735113, 1648406, 1411264, 1114375, 866888, 732200, 721177, 808039, 941580, 1070430]
36501A070430J09134J10586J22470J05224N1628o754o0278j47955k98900m73235
36491E82350n88580n90491m78639k89145q5212N2431P3712P350o7850j05338j17960
36480a607372j22397r8701k9168N3031R0318O6702K0630k647J2598N9395J20453
36469a437158J61989J37881K5497j40108k79612l25569k67585j44679j238J39146
36459b131436K57358L18298K92316J98351J03148O2926P3647Q6719O3003O00q0448
36448g55518j61839k30302k65696k37851j30259K3734J43023J65122J11998O1372
36438a276216M5336J2690q7933k24597l20017l46144l31562k89282j97342n9106
36428c074173P4116J67386K45639L38173M12488M05545L04767J60518K7978o6516
$$ y = [1070430, 1179564, 1290150, 1412620, 1517844, 1569472, 1562718, 1502440, 1354485, 1055585, 582350, -6230, -596721, -1075360, -1364505, -1449717, -1397286, -1323574, -1316224, -1384074, -1489412, -1607372, -1729769, -1828470, -1857638, -1804607, -1714289, -1647587, -1626957, -1629604, -1617006, -1557611, -1437158, -1275169, -1137288, -1111791, -1251899, -1531511, -1857080, -2124665, -2269344, -2270582, -2131436, -1874078, -1555780, -1263464, -1065113, -961965, -899039, -825392, -738673, -675670, -675070, -755518, -917357, -1147659, -1413355, -1651206, -1781465, -1757731, -1614708, -1449586, -1337588, -1276216, -1230880, -1218190, -1306123, -1530720, -1850737, -2196881, -2528443, -2817725, -3015067, -3074173, -3000057, -2832671, -2587032, -2248859, -1836371, -1430826, -1126059, -965541, -937563, -1004079]
36418a004079j05753p0822L3649J68100K89217L78706M28678M13497K99732R0933
36408I21858j45840l09519l32154k25734o6051O8606J42544J57845J28008O9323
36398D08886L568n2832j02150j53251j96932k08312j75184j10183l3421M0208
36388e79603R2023R8593N6334l366m0068m0926j9916R924M1291M9951m816j35984
36376d76563k93232l90486l73161k54684r6157L3714Q3841L7091p4302j76382
36366a980321j98888j25061J786J15433J66851J40822N4077n8018j64454k53582
36356b301355l20069l41325k85297j50524J3412J37599J83609J60425J05157N7954
36346b740414M4887O4975Q9902Q9310O5855O1997J23924K53736L96526M77667
$$ y = [-1004079, -1109832, -1180654, -1147005, -978905, -689688, -310982, 117696, 531193, 830925, 921858, 776018, 466499, 134345, -91389, -157440, -88834, 53710, 211555, 339563, 408886, 412454, 359622, 257472, 104221, -92711, -301023, -476207, -586390, -619811, -579603, -487580, -388987, -332653, -336019, -376087, -417013, -436929, -427005, -385714, -335763, -340579, -476563, -769795, -1160281, -1533442, -1788126, -1884283, -1850569, -1766728, -1729637, -1803939, -1980321, -2179209, -2304270, -2302484, -2187051, -2020200, -1879378, -1825301, -1883319, -2047773, -2301355, -2621424, -2962749, -3248046, -3398570, -3385158, -3247559, -3063950, -2903525, -2798368, -2740414, -2695527, -2630552, -2540650, -2451340, -2385485, -2323488, -2199564, -1945828, -1549302, -1071635]
36336a071635M57466L53840K19386J06252N0363O4817J25268J70517J45993N4935
36326F77202m8651j20635j63507k01543k43494k81282l07102l18735l20423l24325
36316a652495l33682l21245k51519j34189k4806M1093P6783Q7217L5537q3641
36306b560947j79398j45767N802J64061K62266L28407L82053L69229K48244P7398
36296a048652m3552q1635o7864k3373M6099J01585Q9080J6229m1887l0943K6072
36285a058841P5297J00999J26390J66849K03040J94183J14070j3520j15969j30719
36275c38221p1997k2088m7309j35824k23153k61025k52485k37664k58167l19101
36265b167034l68844l29456j70663M7369K21880K98558L00662K71197K15771J24110
$$ y = [-1071635, -614169, -260329, -40943, 65309, 115672, 180489, 305757, 476274, 622267, 677202, 628551, 507916, 344409, 142866, -100628, -381910, -689012, -1007747, -1328170, -1652495, -1986177, -2307422, -2558941, -2693130, -2717936, -2676843, -2600060, -2512843, -2477306, -2560947, -2740345, -2886112, -2880310, -2716249, -2453983, -2125576, -1743523, -1374294, -1126050, -1048652, -1092204, -1173839, -1241703, -1265076, -1218977, -1117392, -1028312, -1012083, -1053970, -1084913, -1058841, -983544, -882545, -756155, -589306, -386266, -192083, -78013, -91533, -207502, -338221, -410218, -432306, -479615, -615439, -838592, -1099617, -1352102, -1589766, -1847933, -2167034, -2535878, -2865334, -3035997, -2988628, -2766748, -2468190, -2167528, -1896331, -1680560, -1556450]
36255a556450K9697O080Q4748J98603K37397J59821L0443n5862o4449l1449j1587
36244i73008l4756r4159j49455j49048p6776J9594O3717J8963q5385j84799k16931
36233a862043j42169L1535K30923L57103L70479L21373K74458K19228Q9289j30201
36223b40025l49687m49470l90177k31582n6788R3154K10963K87410L12161K96949
36213e17092K69196K42185K12712J87038J80772J84254J57567Q2051l289m2805
36203I52589k9729n058J132n21J2426L9531N7440M0479j6957q3115j01541m7737
36191H18939K5625K8473o9394j98796k58502k07663q7062K9538R0987R1068N4468
36180C17681L298o0372j32544j80736j67968j07408o5115r2240j69832k30567
$$ y = [-1556450, -1526753, -1520673, -1435925, -1237322, -999925, -840104, -809661, -865523, -929972, -961421, -973008, -1007764, -1101923, -1251378, -1400426, -1477202, -1457608, -1393891, -1374928, -1460313, -1645112, -1862043, -2004212, -1972677, -1741754, -1384651, -1014172, -692799, -418341, -199113, -109824, -240025, -589712, -1039182, -1429359, -1660941, -1717729, -1624575, -1413612, -1126202, -814041, -517092, -247896, -5711, 207001, 394039, 574811, 759065, 916632, 998683, 995394, 952589, 922860, 917802, 918934, 918413, 930839, 970370, 1027810, 1068289, 1051332, 968217, 866676, 818939, 844564, 873037, 803643, 604847, 346345, 138682, 51620, 81158, 172145, 263213, 317681, 320979, 260607, 128063, -52673, -220641, -328049, -393164, -485404, -655236, -885803]
36170h85803k19766j30578l741R4667J19285Q8201O2985P3174Q3335N0707j3772
36159f81306o9231j03587j31561j51189j43993j13065q1642n1231M518R7749K07119
36148a217419L05559L77628M02983L57692K52653J46356R4730R7797J10172R3520
36138A021671M6692m479l4279m1857n6993j10213j89032k37448k10636j18161
36128F5265j330J16049K32892L36381L91179L72258K93880J95959J07471K8481
36118B138485n6650j53940k46906l06292l11460k61967j71842o2211L5010P6310
36108F78537L0459q3040j83814j77185k9433J96474L86230M63585M37710L66966
36098B086489K91319K13188J32151O6746K7644r475p5939j56015j86937j28617
$$ y = [-885803, -1105569, -1236147, -1239888, -1145221, -1025936, -937735, -874750, -801576, -718241, -667534, -681306, -750537, -854124, -985685, -1136874, -1280867, -1393932, -1475574, -1526805, -1522287, -1424538, -1217419, -911860, -534232, -131249, 226443, 479096, 625452, 720182, 817979, 928151, 1021671, 1068363, 1063884, 1029605, 987748, 930755, 820542, 631510, 394062, 183426, 65265, 63935, 179984, 412876, 749257, 1140436, 1512694, 1806574, 2002533, 2110004, 2138485, 2081835, 1927895, 1680989, 1374697, 1063237, 801270, 629428, 567217, 602227, 678537, 708996, 625956, 442142, 264957, 235524, 431998, 818228, 1281813, 1719523, 2086489, 2377808, 2590996, 2723147, 2789893, 2817537, 2808062, 2732123, 2576108, 2389171, 2260554]
36088B260554k0386N2742N0255J2375l453j774l7124j27422k15036k33498j87833
36077A549400j36626j05772n9648L3375J39628J86256J32166k658j59807k72904
36067A303410k93857k24259j22367n1739j7011K6541R4706J36233R4287j4031
36057I31913j07684j26154q4071m6382o7572j48349k28543k26944j19659J4940
36047b08505O1046r052j01789j13923m7043K0738M9560P4186J32353K07453K52812
36036C17836K30534J11998j12805l89745n95024o23077m81389k76846j16456m0552
36026a975526l3865o0396q1495p1426l3785P254L8009O8066J10232J59716J97695
36015a675521K06818J79064J14661K0861q1677j46965j10944N9673L12748N26856
$$ y = [2260554, 2240168, 2292910, 2343165, 2355540, 2352087, 2350313, 2313189, 2185767, 1970731, 1737233, 1549400, 1412774, 1307002, 1247354, 1280729, 1420357, 1606613, 1738779, 1736121, 1576314, 1303410, 1009553, 785294, 662927, 611188, 594177, 620718, 715424, 851657, 945944, 931913, 824229, 698075, 614004, 567622, 500050, 351701, 123158, -103786, -223445, -208505, -147459, -156511, -258300, -372223, -419266, -398528, -348968, -274782, -142429, 65024, 317836, 548370, 660368, 547563, 157818, -437206, -1060283, -1541672, -1818518, -1934974, -1975526, -2009391, -2069787, -2151282, -2222708, -2256493, -2249239, -2211230, -2143164, -2032932, -1873216, -1675521, -1468703, -1289639, -1174978, -1154117, -1235794, -1382759, -1493703, -1434030, -1121282, -594426]
36005e94426O05053N46176M16019K73309J48066O8171O2477J33786K53206L78438
35995B290275M58252M38192L05147J24244j2293q3528j53654k80064m42649n73956
35985B069966o22325n71169m35484k63608j11153J1018J35383K65316L40279L03896
35975A122119J75013J6369j36163k68806l42414l12164j96032p3714m465K0135
35965a22L3428L9568K1700j7037m1841j5876N6249J10366O6388q5066k49613l12825
35953c94681k54771j53111p6394j3167Q2504K10670L14773L34738K57356J31488
35943D39405M5689P0387J99432L51376M37347M26160L49007K59683J93369J44113
35933B915968P3059m9839k12499l83948n58240p35274q57283q23456o07442l24153
$$ y = [-594426, 10627, 556803, 972822, 1246131, 1394197, 1462368, 1524845, 1658631, 1911837, 2290275, 2748527, 3186719, 3491866, 3616110, 3603817, 3520289, 3366635, 3086571, 2643922, 2069966, 1447641, 876472, 440988, 177380, 66227, 77245, 212628, 477944, 818223, 1122119, 1297132, 1313501, 1177338, 908532, 566118, 253954, 57922, -15792, -20257, -122, 33306, 72874, 94574, 77537, 35696, 19820, 76069, 186435, 252823, 167757, -81856, -394681, -649452, -802563, -878957, -892124, -809620, -598950, -284177, 50561, 307917, 439405, 485094, 555481, 754913, 1106289, 1543636, 1969796, 2318803, 2578486, 2771855, 2915968, 2989027, 2939188, 2726689, 2342741, 1784501, 1049227, 191944, -631512, -1238954, -1563107]
35923a563107j31270p9799j00940j19382j22849j22090j05539o2095p996M3126
35913b371941J11412K17221L28206L70873K96814J25545o7350j88020j68563j2248
35903a358051J95791L45789L84916L35958K43747J33720L0952k0229L187N5135
35893C50915N7185o449o3563m4156K7935O2277R397q9346j58071j61036j10711
$$ y = [-1563107, -1694377, -1774176, -1875116, -1994498, -2117347, -2239437, -2344976, -2407071, -2415067, -2371941, -2260529, -2043308, -1715102, -1344229, -1047415, -921870, -989220, -1177240, -1345803, -1358051, -1162260, -816471, -431555, -95597, 148150, 281870, 312822, 292593, 295780, 350915, 408100, 401651, 338088, 293932, 321867, 384144, 393541, 304195, 146124, -14912, -125623]
$$ [...]
##END NTUPLES=NMR SPECTRUM
##END=
