##TITLE=31Pdec_SR-167-R2K-AK'
 D2O, 24 sc
 2.8.2023
##JCAMPDX= 6.0         $$ Bruker NMR JCAMP-DX V2.0
##DATA TYPE= NMR SPECTRUM
##DATA CLASS= NTUPLES
##ORIGIN= UXNMR, Bruker Analytische Messtechnik GmbH
##OWNER= root
$$ XWIN-NMR		Version 3.5
$$ Wed Aug  2 13:45:34 2023 Russian Standard Time (UT+4h)  she@DPX200
##.OBSERVE FREQUENCY= 81.013821
##.OBSERVE NUCLEUS= ^31P
##.ACQUISITION MODE= SIMULTANEOUS
##.ACQUISITION SCHEME= undefined
##.AVERAGES= 24
##.DIGITISER RES= 16
##SPECTROMETER/DATA SYSTEM= spect
##.PULSE SEQUENCE= zgpg30
##.SOLVENT NAME= CDCl3
##.SHIFT REFERENCE= (INTERNAL, CDCl3, 0, 248.564)
##AUDIT TRAIL= $$ (NUMBER, WHEN, WHO, WHERE, WHAT)
$$ ##TITLE= Audit trail, XWIN-NMR		Version 3.5
$$ ##JCAMPDX= 5.01
$$ ##ORIGIN= Bruker BioSpin GmbH
$$ ##OWNER= she
$$ F:/spectra/data/she/nmr/P31/1/pdata/1/auditp.txt
$$ ##AUDIT TRAIL=  $$ (NUMBER, WHEN, WHO, WHERE, WHAT)
(   1,<2023-08-02 13:44:08.53 +0400>,<she>,<DPX200>,
      <created by zg, POWCHK disabled, PULCHK disabled
       configuration hash MD5:
       00 E9 B6 7A A2 85 ED C7 34 08 36 98 17 FE 4E 26
       data hash MD5: 32K
       EB 06 9C 72 A3 A7 1E 9C 29 99 F6 5C 96 90 56 ED>)
(   2,<2023-08-02 13:44:28.10 +0400>,<she>,<DPX200>,
      <Start of raw data processing
       efp BC_mod = 2 LB = 5 FT_mod = 6 PKNL = 1 PHC0 = -10657.97 PHC1 = 40.28482 SI = 64K 
       data hash MD5: 64K
       34 F4 20 7D 8A F7 D5 F5 58 90 CB E6 C7 34 28 BA>)
(   3,<2023-08-02 13:44:49.39 +0400>,<she>,<DPX200>,
      <pk PHC0 = -0.3129376 PHC1 = 0 
       data hash MD5: 64K
       6F 21 F6 9F 7E 05 2A 27 CF 69 E6 61 B3 AA 1B 7E>)
(   4,<2023-08-02 13:44:56.90 +0400>,<she>,<DPX200>,
      <abs ABSG = 5 
       data hash MD5: 64K
       06 F7 96 AD 72 D6 4E 1E 2E 81 B5 C8 04 AB 30 5C>)
$$ ##END=
$$ 
$$ hash MD5
$$ 3D DD 73 F3 EC 3E EA 01 23 F0 77 8A 5D 73 4B 3D
##$RELAX= 
##$RELAX= 
##$RELAX= 
##$RELAX= 
##$RELAX= 
##$RELAX= 
##$RELAX= 
##$RELAX= 
##$RELAX= 
$$ Bruker specific parameters
$$ --------------------------
##$DU= <F:/spectra>
##$EXPNO= 1
##$NAME= <P31>
##$PROCNO= 1
##$TYPE= <nmr>
##$USER= <she>
##$AMP= (0..31)
100 100 100 100 100 100 100 100 100 100 100 100 100 100 100 100 100 100 
100 100 100 100 100 100 100 100 100 100 100 100 100 100 
##$AQSEQ= 0
##$AQ_mod= 1
##$AUNM= <au_zg>
##$AUTOPOS= <>
##$BF1= 81.014009
##$BF2= 200.13
##$BF3= 200.13
##$BF4= 200.13
##$BF5= 200.13
##$BF6= 200.13
##$BF7= 200.13
##$BF8= 200.13
##$BYTORDA= 1
##$CFDGTYP= 0
##$CFRGTYP= 5
##$CHEMSTR= <none>
##$CNST= (0..31)
1 1 145 1 1 1 1 1 1 1 1 1 1 1 1 1 1 1 1 1 1 1 1 1 1 1 1 1 1 1 1 1 
##$CPDPRG= <waltz16>
##$CPDPRG1= <>
##$CPDPRG2= <waltz16>
##$CPDPRG3= <>
##$CPDPRG4= <mlev>
##$CPDPRG5= <mlev>
##$CPDPRG6= <mlev>
##$CPDPRG7= <mlev>
##$CPDPRG8= <mlev>
##$CPDPRGB= <>
##$CPDPRGT= <>
##$D= (0..31)
0 1 0 0 0 0 0 0 0 0 0 0.03 2e-05 3e-06 0 0 0 0 0 0 0 0 0 0 0 0 0 0 0 0 
0 0 
##$DATE= 1690969448
##$DBL= (0..7)
120 120 120 11 120 120 24 19 
##$DBP= (0..7)
150 150 150 150 150 150 150 150 
##$DBP07= 0
##$DBPNAM0= <>
##$DBPNAM1= <>
$$ [...]
##$SUBNAM3= <"">
##$SUBNAM4= <"">
##$SUBNAM5= <"">
##$SUBNAM6= <"">
##$SUBNAM7= <"">
##$SUBNAM8= <"">
##$SUBNAM9= <"">
##$SW= 501.771253377433
##$SWIBOX= (0..15)
0 1 3 0 0 0 0 0 0 0 0 0 0 0 0 0 
##$SW_h= 40650.406504065
##$TD= 32768
##$TD0= 1
##$TE= 0
##$TE2= 300
##$TE3= 300
##$TEG= 300
##$TL= (0..7)
0 120 53 12 22 120 120 120 
##$TP= (0..7)
150 150 150 150 150 150 150 150 
##$TP07= 0
##$TPNAME0= <>
##$TPNAME1= <>
##$TPNAME2= <>
##$TPNAME3= <>
##$TPNAME4= <>
##$TPNAME5= <>
##$TPNAME6= <>
##$TPNAME7= <>
##$TPOAL= (0..7)
0.5 0.5 0.5 0.5 0.5 0.5 0.5 0.5 
##$TPOFFS= (0..7)
0 0 0 0 0 0 0 0 
##$TUNHIN= 0
##$TUNHOUT= 0
##$TUNXOUT= 0
##$USERA1= <user>
##$USERA2= <user>
##$USERA3= <user>
##$USERA4= <user>
##$USERA5= <user>
##$V9= 5
##$VALIST= <valist>
##$VCLIST= <CCCCCCCCCCCCCCC>
##$VD= 0
##$VDLIST= <DDDDDDDDDDDDDDD>
##$VPLIST= <PPPPPPPPPPPPPPP>
##$VTLIST= <TTTTTTTTTTTTTTT>
##$WBST= 1024
##$WBSW= 4
##$XGAIN= (0..3)
0 0 0 0 
##$XL= 0
##$YL= 0
##$YMAX_a= 2962
##$YMIN_a= -2963
##$ZGOPTNS= <>
##$ZL1= 120
##$ZL2= 120
##$ZL3= 120
##$ZL4= 120
##$ABSF1= 248.5645
##$ABSF2= -253.2056
##$ABSG= 5
##$ABSL= 3
##$ALPHA= 0
##$AQORDER= 0
##$ASSFAC= 0
##$ASSFACI= 0
##$ASSFACX= 0
##$ASSWID= 0
##$AUNMP= <proc_1d>
##$AZFE= 0.1
##$AZFW= 0.5
##$BCFW= 0
##$BC_mod= 2
##$BYTORDP= 0
##$COROFFS= 0
##$CY= -3
##$DATMOD= 1
##$DC= 0
##$DFILT= <>
##$DTYPP= 0
##$F1P= 0
##$F2P= 0
##$FCOR= 1
##$FTSIZE= 65536
##$FT_mod= 6
##$GAMMA= 0
##$GB= 0
##$INTBC= 1
##$INTSCL= 6.047779e-11
##$ISEN= 30
##$LB= 5
##$LEV0= 0
##$LPBIN= 0
##$MAXI= 10000
##$MC2= 0
##$MEAN= 0
##$ME_mod= 0
##$MI= 50
##$NCOEF= 0
##$NC_proc= -7
##$NLEV= 6
##$NOISF1= 182.463
##$NOISF2= 159.3651
##$NSP= 0
##$NTH_PI= 0
##$NZP= 0
##$OFFSET= 248.5645
##$PC= 4
##$PHC0= -10658.28
##$PHC1= 40.28482
##$PH_mod= 1
##$PKNL= yes
##$PPARMOD= 0
##$PSCAL= 0
##$PSIGN= 0
##$REVERSE= no
##$SF= 81.0140089999694
##$SI= 65536
##$SIGF1= 159.3651
##$SIGF2= -187.1042
##$SINO= 113.3802
##$SIOLD= 16384
##$SREGLST= <1H.CDCl3>
##$SSB= 0
##$STSI= 65536
##$STSR= 0
##$SW_p= 40650.406504065
##$SYMM= 0
##$S_DEV= 0
##$TDeff= 32768
##$TDoff= 0
##$TI= <>
##$TILT= no
##$TM1= 0
##$TM2= 0
##$TOPLEV= 0
##$USERP1= <user>
##$USERP2= <user>
##$USERP3= <user>
##$USERP4= <user>
##$USERP5= <user>
##$WDW= 1
##$XDIM= 65536
##$YMAX_p= 370719122
##$YMIN_p= -23218422
$$ End of Bruker specific parameters
$$ ---------------------------------
##NTUPLES= NMR SPECTRUM
##VAR_NAME=  FREQUENCY,     SPECTRUM/REAL,   SPECTRUM/IMAG
##SYMBOL=    X,             R,               I
##VAR_TYPE=  INDEPENDENT,   DEPENDENT,       DEPENDENT
##VAR_FORM=  AFFN,          ASDF,            ASDF
##VAR_DIM=   65536,         65536,           65536
##UNITS=     HZ,            ARBITRARY UNITS, ARBITRARY UNITS
##FACTOR=    0.620285442955139, 1,           1
##FIRST=     20137.2065510682, 0,            0
##LAST=      -20513.1999529968, 0,           0
##MIN=       -20513.1999529968, -23218422,   0
##MAX=       20137.2065510682, 370719122,    0
$$ Real data points
##PAGE= N=1
##DATA TABLE= (X++(R..R)), XYDATA
$$ [...]
41727b45946J78331K50169K95451K88935K49159K05944J51947N7346p6702k14177
41717A140457l29974m21849m72439m40103l10415j34929J677M3805r015j14505
41707a047290k10977k47127k11176j30576m0330L7565Q3600P5214J0645p2625
41697a753077j19423r5023k269J19659K03258J84370N6656j08160k16951k36015
41687a966975k04195j70859j42395r6025k7667L1809M6852J4049l5299o7666p8152
41676b696523q3765q6854n6426M2476K01687L60712M46639M21136K95655J17595
41666a037668n1133j55995j72663j18513l8548K4158M7055K8292j4325m1821j3699
41655a544860O8347J44481J52383J03848P9857J35423K32709K90563K79215K32137
$$ plain form
41727 -245946 -67615 182554 478005 766940 1016099 1222043 1373990 1431336 1354634 1140457
41717 1140457 810483 388634 -83805 -523908 -834323 -969252 -967575 -923770 -932785 -1047290
41707 -1047290 -1258267 -1505394 -1716570 -1847146 -1887476 -1849911 -1766311 -1691097 -1680452 -1753077
41697 -1753077 -1872500 -1967523 -1969792 -1850133 -1646875 -1462505 -1405849 -1514009 -1730960 -1966975
41687 -1966975 -2171170 -2342029 -2484424 -2580449 -2608116 -2576307 -2529455 -2515406 -2550705 -2618371 -2696523
41676 -2696523 -2780288 -2867142 -2923568 -2881092 -2679405 -2318693 -1872054 -1450918 -1155263 -1037668
41666 -1037668 -1088801 -1244796 -1417459 -1535972 -1574520 -1550362 -1503307 -1475015 -1489340 -1531161 -1544860
41655 -1544860 -1476513 -1332032 -1179649 -1075801 -995944 -860521 -627812 -337249 -58034 174103
41645A74103J76934J01219l405j07885j85811k57600l55761m58943n01571m53748
41635a872468l58889k79881k34161j98829j55877j04743m2118L7986J19783J66825
41625b922372J60581J23713R4085Q7508R6430J12267J32716J54022J70384J74870
41615a615796J49085O6867o4840j74920j73176l9816J50628L03014L78005L90404
41605f30545L66362L25407K77343K04750O6649j44504l56944m64831m22955k78324
41595a057592j18390j5221o263q2469j84490k45433k51573k36704k16314j70032
41585b584481j02287o7833r4854j16314l2260J65471L71855M72228M35412L08762
41575a244301J64455O3478L2461M2691K8387m3895j26577j35288m6916O3748R7435
$$ plain form
41645 174103 351037 452256 448851 340966 155155 -102445 -458206 -917149 -1418720 -1872468
41635 -1872468 -2231357 -2511238 -2745399 -2944228 -3100105 -3204848 -3246966 -3208980 -3089197 -2922372
41625 -2922372 -2761791 -2638078 -2543993 -2456485 -2360055 -2247788 -2115072 -1961050 -1790666 -1615796
41615 -1615796 -1466711 -1399844 -1464684 -1639604 -1812780 -1852596 -1701968 -1398954 -1020949 -630545
41605 -630545 -264183 61224 338567 543317 609966 465462 108518 -356313 -779268 -1057592
41595 -1057592 -1175982 -1191203 -1197466 -1279935 -1464425 -1709858 -1961431 -2198135 -2414449 -2584481
41585 -2584481 -2686768 -2754601 -2849455 -2965769 -2998029 -2832558 -2460703 -1988475 -1553063 -1244301
41575 -1244301 -1079846 -1016368 -983907 -941216 -912829 -956724 -1083301 -1218589 -1265505 -1201757 -1104322
41564a104322L3643n1086o7687o867N8201N3445k2295j02376j18482n7811L3685
41553a351952R2733Q6056K9445l1045n6615m1145q566R806q02k9335n0372m5931
41541a397723j6770K3061N3370N1384Q273m5682n2099J2937R4651J06677K6268
41530a135653p8915j21753p3002L0510J23444J48862R1160l714n8504l3271M9570
41519a061266J54002K71628L93809M79816M96027M68365M49236M36855L72180
41510B460652K23683L8259j05720j68547j61510j17896p1286m5467m7741p6424
41500A928003j34516k19741l02667l41706l28313k93798k64084k37074k16017
41491d09913k26376k69261k88991k28361j00034L4886J43044K27766K75063K54769
$$ plain form
41564 -1104322 -1070679 -1121765 -1189452 -1196319 -1138118 -1084673 -1106968 -1209344 -1327826 -1385637 -1351952
41553 -1351952 -1259219 -1173163 -1143718 -1174763 -1231378 -1272523 -1281089 -1271283 -1272085 -1301420 -1351792 -1397723
41541 -1397723 -1414493 -1391432 -1338062 -1286678 -1278405 -1324087 -1376186 -1363249 -1268598 -1161921 -1135653
41530 -1135653 -1214568 -1336321 -1409323 -1378813 -1255369 -1106507 -1015347 -1019061 -1077565 -1110836 -1061266
41519 -1061266 -907264 -635636 -241827 237989 734016 1202381 1651617 2088472 2460652
41510 2460652 2684335 2722594 2616874 2448327 2286817 2168921 2097635 2052168 2004427 1928003
41500 1928003 1793487 1573746 1271079 929373 601060 307262 43178 -193896 -409913
41491 -409913 -636289 -905550 -1194541 -1422902 -1522936 -1488050 -1345006 -1117240 -842177 -587408
41481e87408J89235J60296K10808K81895K90988K39948J96871J93715J99597J87624
41471A563569J66714J35972O4983n0826j56482j93635j63253j04693m3587L071
41461A221833j064q2642k09246l14440l72547m08314m31522m08980l19193j98163
41451a524278j07633q2194j23865k19041l33932m14388m21545l62516k69494j61204
41441d020090m4221O1545J27138J45610J41586J47918J81915K40284L06023L61259
41431b351033L98526M14746L94686L18543J96802Q0693K0193K0942N5404J01012
41421c49486J45409J64682J25803J9172j21615k34616k63839j95259p3841K7543
41411g56047P4338R6091J30059J57117J26519L8433l6954l6657K3115O8994N1650
$$ plain form
41481 -587408 -398173 -237877 -27069 254826 545814 785762 982633 1176348 1375945 1563569
41471 1563569 1730283 1866255 1931238 1880412 1723930 1530295 1367042 1262349 1218762 1221833
41461 1221833 1220769 1138127 928881 614441 241894 -166420 -597942 -1006922 -1326115 -1524278
41451 -1524278 -1631911 -1714105 -1837970 -2057011 -2390943 -2805331 -3226876 -3589392 -3858886 -4020090
41441 -4020090 -4064311 -4002766 -3875628 -3730018 -3588432 -3440514 -3258599 -3018315 -2712292 -2351033
41431 -2351033 -1952507 -1537761 -1143075 -824532 -627730 -547037 -526844 -505902 -450498 -349486
41421 -349486 -204077 -39395 86408 105580 -16035 -250651 -514490 -709749 -783590 -756047
41411 -756047 -681709 -585618 -455559 -298442 -171923 -133490 -170444 -207101 -183986 -114992 -63342
41400f3342p754m4517j3978O9355J51435J94347K04140K00149J74868J06492O002
41389I77197p2874p9440j2131Q2452J48325J61596J45773J45061J75022K06682
41379A877663K07406J81406J50290J07970K5304j02956k43129l56558m26115m49275
41369I72006m29899l80021l07373k00065m8186J18220K40895K89210K79844K38986
41359G73617J76240J01576L2213l1412j02767j65891j71363j01230o098N2834
41349E57719P0929P7512P6693N6936M0300O5712J18838J25710L4846j22349k66122
41338H36724l38475l26431k42652j11132L2624J47272K01697J89293J30439N9572
41328E78931M175k4617k3456Q492N9530J04973J31844J52426J74603J70803J06108
$$ plain form
41400 -63342 -71096 -115613 -129591 -60236 91199 285546 489686 689835 864703 971195 977197
41389 977197 904323 824883 812752 895204 1043529 1205125 1350898 1495959 1670981 1877663
41379 1877663 2085069 2266475 2416765 2524735 2550039 2447083 2203954 1847396 1421281 972006
41369 972006 542107 162086 -145287 -345352 -393538 -275318 -34423 254787 534631 773617
41359 773617 949857 1051433 1083646 1052234 949467 783576 612213 510983 504885 557719
41349 557719 628648 706160 782853 839789 880089 945801 1064639 1190349 1225195 1102846 836724
41338 836724 498249 171818 -70834 -181966 -149342 -2070 199627 388920 519359 578931
41328 578931 583106 558489 535033 543525 603055 708028 839872 992298 1166901 1337704 1443812
41317A443812k670q5632q9684l1294K9444M8473K0866l3935q7366j12478j02729
41306I96807q0160o7824n2551P085J25714K55712L22565K96812K21198J62604
41296B187962J45111J38094J04257M4759p883l0326l0341l1881m9881q3468j25744
41285B260659j69421j99212j86632j07628K5524J57826K31041K29236J73936P8363
41275B493692o9608k67821m64088n84895n97609n28697m23527l05952j79566n0272
41265i78343O4332J40914J57376J00462k0602j64352k70144k95123k45960j69696
41255a681136j06292n3965J0334Q4680J37979J53979J53087J54241J38150P7538
41245i31405p091n6812m3948k198K7592N8045J36282K70375L95213M18217K97117
$$ plain form
41317 1443812 1441142 1355510 1265826 1234532 1263976 1312449 1333315 1299380 1212014 1099536 996807
41306 996807 916647 848823 796272 803357 929071 1184783 1507348 1804160 2025358 2187962
41296 2187962 2333073 2471167 2575424 2620183 2612300 2581974 2551633 2519752 2469871 2386403 2260659
41285 2260659 2091238 1892026 1705394 1597766 1623290 1781116 2012157 2241393 2415329 2493692
41275 2493692 2424084 2156263 1692175 1107280 509671 -19026 -442553 -748505 -928071 -978343
41265 -978343 -914011 -773097 -615721 -515259 -535861 -700213 -970357 -1265480 -1511440 -1681136
41255 -1681136 -1787428 -1841393 -1831059 -1746379 -1608400 -1454421 -1301334 -1147093 -1008943 -931405
41245 -931405 -938496 -995308 -1039256 -1041454 -1013862 -955817 -819535 -549160 -153947 264270 561387
41234E61387P9905j22224k08524j56063k6971R3064J67915K22505K84207L26729
41224A221930K88565J48243l5275j71419k21518k20197k18190k26278k25145k09960
41214A30756k00017k05843k07105j71801q8927K2442J29574K07380K49485K64089
41204A30033K58235K26781J61883P4981L380j1812M1349J29903J91750J77267
41194A383750R1087n052m5427k6552j1394n4868j32502j63597j06980q765O1844
41183I81544J03026J73141K96659M16402M57249M07654L10508J97729P5702l4528
41173C385086r4167r9758j00053j33434j75292j76719j35506r6033r0409j13623
41163B170092j52826k04365k51913k56700j89959o5401O9915J68151K02259J74039
$$ plain form
41234 561387 641292 519068 310544 154481 127510 220574 388489 610994 895201 1221930
41224 1221930 1510495 1658738 1623463 1452044 1230526 1010329 792139 565861 340716 130756
41214 130756 -69261 -275104 -482209 -654010 -742937 -720495 -590921 -383541 -134056 130033
41204 130033 388268 615049 776932 851913 855293 843481 884830 1014733 1206483 1383750
41194 1383750 1474837 1469785 1424358 1397806 1386412 1331544 1199042 1035445 928465 919700 981544
41183 981544 1084570 1257711 1554370 1970772 2428021 2835675 3146183 3343912 3419614 3385086
41173 3385086 3290919 3191161 3091108 2957674 2782382 2605663 2470157 2374124 2283715 2170092
41163 2170092 2017266 1812901 1560988 1304288 1114329 1048928 1118843 1286994 1489253 1663292
41153A663292J15405P2172P0504R6264J10384Q3369J6823n9599j09774j19061
41143A939779j07169j06776j24769j32034r7470k4263N5449J12755J35037J12825
41133A763364L7111p9343j94383k71119l15280l54884l79424l29286j70940L3882
41123b60302J68914J76232J02771L2303L563P920K9764N2577M3605k4330j30187
41112B02830k10025k13844j46145n4650M503k574o5739j35785j69118j68596j64945
41101a124088j65370j47335j01328m8765j1701O734P134o237O67P6918K18636
41090a294735L48261L96698L83639L80398M10741M28025L80468K58816Q5373r8115
41080A679569k23759k23704r2048R5317K36812K70957J93705M8401q7168j40440
$$ plain form
41153 1663292 1778697 1850869 1921373 2017637 2128021 2211390 2228213 2168614 2058840 1939779
41143 1939779 1832610 1725834 1601065 1469031 1371561 1347298 1402747 1515502 1650539 1763364
41133 1763364 1800475 1721132 1526749 1255630 940350 585466 206042 -123244 -294184 -260302
41123 -260302 -91388 84844 187615 219918 223481 231401 261165 313742 357347 333017 202830
41112 202830 -7195 -221039 -367184 -421834 -417331 -419905 -485644 -621429 -790547 -959143 -1124088
41101 -1124088 -1289458 -1436793 -1538121 -1586886 -1598587 -1591853 -1584719 -1590956 -1590289 -1513371 -1294735
41090 -1294735 -946474 -549776 -166137 214261 625002 1053027 1433495 1692311 1777684 1679569
41080 1679569 1455810 1232106 1140058 1235375 1472187 1743144 1936849 1985250 1898082 1757642
41070A757642j03720m0305j1226j5967k8453o2485j52231k72558l31181k64136
41060D75380j10377L1886J02296J07199P0362l818j07224j96766k14823j42376
41050A1739j8744R3683J54044J50990Q7021k0705j27053j76433j52735r7566n9139
41039a54898l3497J9332J05218J71167J58581N9274q9678k40978l50239l80092
41029g35810l25824k32487j58658j18265p5799m76R4861J75267K26193K60079
41019h90919K87377K94322K55157J66630O6063N035J249K6371M5945N3445N1445
41008C62120K1429n5677j56085k21885k14797j37544r999J38326K54030K88772
40998B68690K60342K38380K41599J94815L1577j96888l68604m22181l83346k80160
$$ plain form
41070 1757642 1653922 1613617 1602391 1586424 1557971 1495486 1343255 1070697 739516 475380
41060 475380 365003 396889 499185 606384 676746 672928 565704 368938 154115 11739
41050 11739 -7005 86678 240722 391712 478733 458028 330975 154542 1807 -95759 -154898
41039 -154898 -188395 -169063 -63845 107322 265903 325177 235499 -5479 -355718 -735810
41029 -735810 -1061634 -1294121 -1452779 -1571044 -1646843 -1647319 -1552458 -1377191 -1150998 -890919
41019 -890919 -603542 -309220 -54063 112567 178630 183665 184914 211285 257230 310675 362120
41008 362120 383549 327872 171787 -50098 -264895 -402439 -412438 -274112 -20082 268690
40998 268690 529032 767412 1009011 1203826 1235403 1038515 669911 247730 -135616 -415776
40988d15776j10859Q8282K14839J89319M3328j13928j95408j81380r9339n39N8270
40977e23191N2509J6356R030M8409R0170P3746j7768j36219j97656j45365k231
40966g32210J43483K18120K24262K13449K13160K06224J76728J43152J31451J34514
40956A072333J16609N3402m0467j17550j27987n8935M1562Q8510K8389j11025
40946I44841k48343l25217l41463l15355k40535j09817L4565J17484J09949O1905
40936c11986L6969L8314K3321k9845j03414j72865k17377k01927r7032O7805K07267
40925g60770K59019K33530J72259R4621J4924k6403J381O7311J08093J04435Q8181
40914C56581Q0195P0434O4816R7770J71006K20621J82538O9226m9817j27285j69190
$$ plain form
40988 -415776 -526635 -438353 -223514 -34195 9133 -104795 -300203 -481583 -580922 -581461 -523191
40977 -523191 -470682 -454326 -445296 -396887 -306717 -232971 -250739 -386958 -584614 -729979 -732210
40966 -732210 -588727 -370607 -146345 67104 280264 486488 663216 806368 937819 1072333
40956 1072333 1188942 1242344 1201877 1084327 956340 897405 938967 1027477 1055866 944841
40946 944841 696498 371281 29818 -285537 -526072 -635889 -601324 -483840 -373891 -311986
40936 -311986 -275017 -236703 -213382 -243227 -346641 -519506 -736883 -938810 -1035842 -968037 -760770
40925 -760770 -501751 -268221 -95962 -1341 13583 -12820 -11439 55872 163965 268400 356581
40914 356581 436776 507210 572026 669796 840802 1061423 1243961 1313187 1263370 1136085 966895
40903I66895k03684k52638l24537l98672m16647l26719j49554K6141J26767J51582
40893h01066J38031J01135L7686k7905m5466K525P1376J00720P6234K8672j5844
40882c33902n8352r8002j07570o0372K6758J00245J24067J11218R4258Q2522O5743
40871e3387M8050N1116P8627R8982P7061J3184n9092j03784j00836m6520M3881
40860D7282J34557J87717J92555J72739J65144J91475K39193K59810J99778N7464
40850A847714r2184j54595j05190q201N1846L3897o1349k12829l73259m74627
40840D51223m78825m11880l20993k15948q7979L2472R0859Q4556P2960R3859J11966
40829e77730P5068j4755j14047j87807k10122j45890J4436K07919L33612L42794
$$ plain form
40903 966895 763211 510573 186036 -212636 -629283 -956002 -1105556 -1079415 -952648 -801066
40893 -801066 -663035 -561900 -524214 -552119 -597585 -595060 -523684 -422964 -346730 -318058 -333902
40882 -333902 -392254 -490256 -597826 -658198 -631440 -531195 -407128 -295910 -201652 -119130 -53387
40871 -53387 -5337 45779 124406 223388 300449 313633 254541 150757 49921 3401 47282
40860 47282 181839 369556 562111 734850 899994 1091469 1330662 1590472 1790250 1847714
40850 1847714 1755530 1600935 1495745 1487544 1539390 1573287 1511938 1299109 925850 451223
40840 451223 -27602 -439482 -760475 -976423 -1064402 -1031930 -941071 -856515 -783555 -689696 -577730
40829 -577730 -502662 -517417 -631464 -819271 -1029393 -1175283 -1160847 -952928 -619316 -276522
40819b76522K65762J50749J6500j23277k28138k52946j85101m3623J37304L03927
40809b35365L88323L58826K63853J93716J90336K15399K11640J68063J10359N4688
40799A919838K484l1554k5287J0000K7015m08m1731n6394n7680r5464j81276k68494
40787A201049l15230l32844l54169l82293l96892l90165l65216l10916k12719
40778a859395q8341J6413P3558R3454R5549Q1343M6360K421k2697j083P5986J76701
40766a309731K31694J90668Q6085R622O447K1405k2918j20341j91641j86683j31776
40755a417169p5245l0490J0923M6292O8846Q5151R8572R1027M9476J682l954M5047
40743a029842J13137J64387J98062K27463K46127K34192J86970J19565M9467q845
$$ plain form
40819 -276522 -10760 139989 156489 33212 -194926 -447872 -632973 -676596 -539292 -235365
40809 -235365 152958 511784 775637 969353 1159689 1375088 1586728 1754791 1865150 1919838
40799 1919838 1922322 1890768 1865481 1875481 1902496 1902088 1860357 1803963 1746283 1650819 1469543 1201049
40787 1201049 885819 552975 198806 -183487 -580379 -970544 -1335760 -1646676 -1859395
40778 -1859395 -1947736 -1931323 -1857765 -1764311 -1668762 -1587419 -1541059 -1538638 -1561335 -1562418 -1486432 -1309731
40766 -1309731 -1078037 -887369 -801284 -791662 -785215 -763810 -786728 -907069 -1098710 -1285393 -1417169
40755 -1417169 -1492414 -1522904 -1511981 -1465689 -1396843 -1311692 -1213120 -1122093 -1072617 -1070935 -1074889 -1029842
40743 -1029842 -916705 -752318 -554256 -326793 -80666 153526 340496 460061 509528 500683
40733E00683l5348r636O7124J61822K23951K09497J02444o5843k15435k60037
40723F79222j74139j9078J07569J49161J16321N1041j6347p5962j25709j65018
40713E27061j96828k25156k48133k56981k44662k15947j85961j62358j26372m0442
40703a375779J12872K98563M44851M95956M48535L41931K24218J27021N6054n980
40693A168242q0686j68126k41641k72908k56552k06344j38646p0627k3919j0772
40683c01979j8303k4017k7876m9964r1202j18912j08913q6278r7257j40784j53518
40672a219003p8974N9164J70617J87530J28649O8915N5943P3267Q5036R1106J14966
40661b62784J49642J51566R9696L2760M042J5906K7319J8053J3933M5428J09686
$$ plain form
40733 500683 465335 455699 522823 684645 908596 1118093 1220537 1154694 939259 679222
40723 679222 505083 486005 593574 742735 859056 910097 893750 817788 692079 527061
40713 527061 330233 105077 -143056 -400037 -644699 -860646 -1046607 -1208965 -1335337 -1375779
40703 -1375779 -1262907 -964344 -519493 -23537 424998 766929 991147 1118168 1174222 1168242
40693 1168242 1087556 919430 677789 404881 148329 -58015 -196661 -267288 -291207 -301979
40683 -301979 -320282 -344299 -372175 -422139 -513341 -632253 -741166 -827444 -924701 -1065485 -1219003
40672 -1219003 -1297977 -1238813 -1068196 -880666 -752017 -683102 -627159 -553892 -468856 -377750 -262784
40661 -262784 -113142 38424 138120 170880 174922 190828 218147 236200 250133 295561 405247
40650D05247J82627K42066K63361K18114J06571j7290p8235l9992P5385K15314
40640A573168L24262L57148L01623J96843J05287N0711j970r6116k29977l66643
40630B214336m79310n64435o17993o23452n68716m61889l26910j92940q6908j9619
40620a727836L0315J07506K36876L83280M60821L96190J96115m3888k05997k36332
40610d02950j69474p2645J9122J01957J56432J39279L6669r6941j79264j75389
40600f43204j15553m5111J5752N7061N5715k378q4809j27004r3451j0006O9156
40589i23832J08555R6416K6551r5437k30674l17527l14752k26829r0285M6657
40579a921157J32173J30546N6136k7959o8166p0304p3308q4037o5473J1249J30445
$$ plain form
40650 405247 587874 829940 1093301 1311415 1417986 1400696 1322461 1282469 1357854 1573168
40640 1573168 1897430 2254578 2556201 2753044 2858331 2909042 2907072 2810956 2580979 2214336
40630 2214336 1735026 1170591 552598 -70854 -639570 -1101459 -1428369 -1621309 -1708217 -1727836
40620 -1727836 -1697521 -1590015 -1353139 -969859 -509038 -112848 83267 39379 -166618 -402950
40610 -402950 -572424 -645069 -625947 -523990 -367558 -228279 -191610 -288551 -467815 -643204
40600 -643204 -758757 -803868 -788116 -731055 -675340 -677718 -762527 -889531 -982982 -992988 -923832
40589 -923832 -815277 -718861 -692310 -787747 -1018421 -1335948 -1650700 -1877529 -1967814 -1921157
40579 -1921157 -1788984 -1658438 -1602302 -1630261 -1698427 -1768731 -1842039 -1926076 -1991549 -1980300 -1849855
40568a849855K53658L53075M12509M19061L74324L02261K30793J74762J44485
40559H15073J48067J63637J31160J0246j55883k67762k67497j83745p7717J8604
40549C34183R4566J29792J10642O4235L8984M7695N2986J3978o6975j43816j60743
40538E15527r3701K1172J02340Q8956j915r8192j50515j66071j68360j59166j35971
40527b45896j15664j11497j03512o1622J0064P9561J34287J94876K77269L61530
40517D19396M04465L69423K44670N3957j44084k86315l47617l45758l04503k31702
40507a68068j38712n4266K232M5859J04107J80666K58121L19362L40208K79639
40497A169148J22887o4992j78138j84713j63732j95947k52101k35861j18944K0341
$$ plain form
40568 -1849855 -1596197 -1243122 -830613 -411552 -37228 265033 495826 670588 815073
40559 815073 963140 1126777 1257937 1268183 1112300 844538 577041 393296 315579 334183
40549 334183 428749 558541 669183 733418 772402 820097 873083 887061 820086 676270 515527
40538 515527 421826 442998 545338 634294 632379 534187 383672 217601 49241 -109925 -245896
40527 -245896 -361560 -473057 -576569 -638191 -628127 -548566 -414279 -219403 57866 419396
40517 419396 823861 1193284 1437954 1491911 1347827 1061512 713895 368137 63634 -168068
40507 -168068 -306780 -361046 -358814 -312955 -208848 -28182 229939 549301 889509 1169148
40497 1169148 1292035 1227043 1048905 864192 700460 504513 252412 16551 -102393 -82052
40487h2052R2671Q0486J4484p9792j80298k52334k76761k75139k70271k37814
40477a466820j38379P807J19588J36865P7469Q880j1391L2920J13051J73461J80075
40466g66474J58889J62152J92189J92375J26111K8866m1515p5404j01838j30477
40456b55126j35790q7946K4107J84300L37269M01204L29292J57693l0337j80568
40446G44098k85459l42608l38170k77480j99560j46122j30465j39206j46942j27847
40436a389761p1249J0667J02124K05424L27780M55302N61022O29967O51284N95809
40426B078369M37260J98966m9605k47569l72896m27145m27262m11768m11281m00597
40416c3528l19398j59326K141P4893L7403o6566j75552k34060k08258j16857k7169
$$ plain form
40487 -82052 10619 91105 105589 25797 -154501 -406835 -683596 -958735 -1229006 -1466820
40477 -1466820 -1605199 -1597392 -1477804 -1340939 -1263470 -1254590 -1265981 -1233061 -1120010 -946549 -766474
40466 -766474 -607585 -445433 -253244 -60869 65242 94108 52593 -22811 -124649 -255126
40456 -255126 -390916 -478862 -454755 -270455 66814 468018 797310 955003 924666 744098
40446 744098 458639 116031 -222139 -499619 -699179 -845301 -975766 -1114972 -1261914 -1389761
40436 -1389761 -1461010 -1450343 -1348219 -1142795 -815015 -359713 201309 831276 1482560 2078369
40426 2078369 2515629 2714595 2664990 2417421 2044525 1617380 1190118 778350 367069 -33528
40416 -33528 -352926 -512252 -510111 -435218 -397815 -464381 -639933 -873993 -1082251 -1199108 -1226277
40405a226277J1553J9414M9874J20233J99696K47470K38698J71861P8953J5015
40395g3510J0780M4501P8854J07828J42926J72351J66680J16662L8625m8598j27332
40384F29767j73757j75793j51342j24929r7178o2706m1463n5222q1001o8281n403
40373d07308O5934J09353J36904J82508K53500L18100L29809K67438J66180J00111
40363A522529J10662J57799J64085R9067j738q4413j09663n8045M4759J10127
40353A955169N1707j12593k65363l13021k66262j86140j02172j5085O4296J24310
40343I34846J73336K08588J84029N5088j49284l34264m19112l88685k79835j51984
40333a67277o6790n7136j00149j40147j48380j47674j75298k37115l03364l35420
$$ plain form
40405 -1226277 -1214724 -1195310 -1145436 -1025203 -825507 -578037 -339339 -167478 -88525 -73510
40395 -73510 -62730 -18229 60625 168453 311379 483730 650410 767072 805697 757099 629767
40384 629767 456010 280217 128875 3946 -93232 -155938 -197401 -252623 -333624 -401905 -407308
40373 -407308 -341374 -232021 -95117 87391 340891 658991 988800 1256238 1422418 1522529
40363 1522529 1633191 1790990 1955075 2054142 2052404 1967991 1858328 1800283 1845042 1955169
40353 1955169 2006876 1894283 1628920 1315899 1049637 863497 761325 746240 810536 934846
40343 934846 1108182 1316770 1500799 1555887 1406603 1072339 653227 264542 -15293 -167277
40333 -167277 -234067 -291203 -391352 -531499 -679879 -827553 -1002851 -1239966 -1543330 -1878750
40323a878750l10426k32402j30029l8930K2165N9915R2057J26244J50389J39244
40313b000523P1218n4276k07855l34631l76276l10082j79622p2267m1329n0892
40303c556535j8536Q6705K13547K99657L41706L73146L95398L64074K42794N2149
40293a205895j34494k34063k03637p0525Q2946J78022J92081J57673J21887J15462
40283a000543J48461K12468K79821L11840K79585J83427N6982n1420j13502j42253
40273A64866j68920j94014j73105o1671J30455L32274M52449M34075K97350J40217
40263A353976P0663J13257J94979K39929K53521K79331K93046J98130n3305l72986
40253B570541o00928o44382n35541l70432k21101j05547j2574O6419J26864J58312
$$ plain form
40323 -1878750 -2189176 -2421578 -2551607 -2590537 -2568372 -2508457 -2416400 -2290156 -2139767 -2000523
40313 -2000523 -1929305 -1983581 -2191436 -2526067 -2902343 -3212425 -3392047 -3464314 -3505643 -3556535
40303 -3556535 -3575071 -3488366 -3274819 -2975162 -2633456 -2260310 -1864912 -1500838 -1258044 -1205895
40293 -1205895 -1340389 -1574452 -1778089 -1848614 -1765668 -1587646 -1395565 -1237892 -1116005 -1000543
40283 -1000543 -852082 -639614 -359793 -47953 231632 415059 472041 420621 307119 164866
40273 164866 -4054 -198068 -371173 -432844 -302389 29885 482334 916409 1213759 1353976
40263 1353976 1424639 1537896 1732875 1972804 2226325 2505656 2798702 2996832 2943527 2570541
40253 2570541 1969613 1325231 789690 419258 198157 92610 80036 146455 273319 431631
40243D31631J55055J21207O9573J7406j8566k6377k496M2434P8814O8536l265
40232I33952j02879j67768j62142j07286n0067r592L3995J01918J79739K20546
40222H70416J83373P2625n7988j47183j75962j70600j59225j44915j28615j30817
40212A1109j61026j78159j17895L1364K02252L09221L22183K74061K12419J57690
40202A063219J01532L2577m1132r7093j25734j42177j58444j53619r5632O116
40192C89613R6102J32026J25526J05024N9867m4164j95428l15053l22853k14391
40182a83731o3683M0808N5383q313j07552j96708k45181k44065k02516j38015
40172a293573o7989n624M2726P7454R9096J02231Q4135O2978P5591J42434K36433
$$ plain form
40243 431631 586686 707893 777466 794872 776306 749929 747433 789867 868681 937217 933952
40232 933952 831073 663305 501163 393877 343810 334218 368213 470131 649870 870416
40222 870416 1053789 1126414 1068426 921243 745281 574681 415456 270541 141926 11109
40212 11109 -149917 -328076 -445971 -414607 -212355 96866 419049 693110 905529 1063219
40202 1063219 1164751 1197328 1156196 1059103 933369 791192 632748 479129 383497 389613
40192 389613 485715 617741 743267 848291 908158 863994 668566 353513 30660 -183731
40182 -183731 -247414 -206606 -151223 -159536 -267088 -463796 -708977 -953042 -1155558 -1293573
40172 -1293573 -1361562 -1367186 -1324460 -1247006 -1147910 -1045679 -961544 -898566 -822975 -680541 -444108
40161d44108K99737K94216K27820J35096M9292l845q853K4659O3493Q7619J17913
40150H43039J85059K72208L11731K48096R1835r2975k41599l26084l58983l72981
40140E59346l85525l71874k84068j12083Q1195K04924K22231J76100J35316J29979
40130C55541J42813J45789J30665J09348R5304Q4742N4126j6159j10365j79499
40120H12305j86177j41896r0158o2392o5778j01193j60511k04008j78939q4081
40110d62828R804L4899P667M277O3002J45434J95403K01784J91911J92245K12363
40099G95961K43851K54909K05423R2325k9997r6857r7804p9436r0180j37011j89078
40088H72106k05383j63635q3738k4588l5771j00391j37912p8270O6637K09879
$$ plain form
40161 -444108 -144371 149845 377665 512761 562053 558208 549355 574014 637507 725126 843039
40150 843039 1028098 1300306 1612037 1860133 1951968 1858993 1617394 1291310 932327 559346
40140 559346 173821 -198053 -482121 -594204 -513009 -308085 -85854 90246 225562 355541
40130 355541 498354 644143 774808 884156 979460 1064202 1118328 1102169 991804 812305
40120 812305 626128 484232 394074 331682 265904 164711 4200 -199808 -378747 -462828
40110 -462828 -453024 -418125 -410458 -406181 -343179 -197745 -2342 199442 391353 583598 795961
40099 795961 1039812 1294721 1500144 1592469 1562472 1465615 1367811 1288375 1198195 1061184 872106
40088 872106 666723 503088 419350 394762 358991 258600 120688 42418 109055 318934
40078C18934K67650K29917J57177J13801J11826J20923J17692J03641P7890K4635
40068A644086n2116j03109p6005J8810J10359J38924J04197L6864m9784j56641
40058A615585k61933l21173l15085k77929k57182k50291k04693q8125O1774J75396
40048a23656K21345K11562J50385K5812j34853k45259k36393j37402m7449l3362
40038c49270p9699j29397j41554j11158o4883m6647q4580j62135k34163k69792
40028a673278k62366k07276j05854M924O7616P1460P4402J30138K14696K56377
40018a429161K23375J47176O6726r862p9811j20807j20555j11333j38757j93546
40008a766555k04643j19694K3256J30139J54947J43540J64459K21428K58079K33649
$$ plain form
40078 318934 586584 816501 973678 1087479 1199305 1320228 1437920 1541561 1619451 1644086
40068 1644086 1591970 1488861 1412856 1431666 1542025 1680949 1785146 1822010 1772226 1615585
40058 1615585 1353652 1032479 717394 439465 182283 -68008 -272701 -360826 -299052 -123656
40048 -123656 97689 309251 459636 485448 350595 105336 -131057 -268459 -315908 -349270
40038 -349270 -428969 -558366 -699920 -811078 -875961 -922608 -1007188 -1169323 -1403486 -1673278
40028 -1673278 -1935644 -2142920 -2248774 -2243850 -2176234 -2104774 -2030372 -1900234 -1685538 -1429161
40018 -1429161 -1205786 -1058610 -991884 -1001746 -1081557 -1202364 -1322919 -1434252 -1573009 -1766555
40008 -1766555 -1971198 -2090892 -2067636 -1937497 -1782550 -1639010 -1474551 -1253123 -995044 -761395
39998g61395J62542Q2120J4791k8796l9339k3072p834j2530k1627j1423P001l225
39986f42787n1706j00301j05631o6839j9015J0607K5921M6890Q7844J53854K41900
39975d19263L30041L71392L20263J75899p429j63190k60907l06709l08056k57045
39965e25004j50495j2413J11858J82693J92286J72808J73637K14794K61406K58890
39955H80460J97324J25876R5496J00432Q9203K6791o6648j38896j60097j51002
39945I98939j56969j96061k40335k51750k23719j75954j25093q5842q7739j47214
39935f91737k15874k03485q3841N3150R3868K8580n1106p0237m0876j2259K249
39924a191568K3446N9791R3460J05942R9062R2640J08646J48533J76926J39224
$$ plain form
39998 -761395 -598853 -516733 -501942 -530738 -570077 -593149 -600983 -613513 -635140 -646563 -639562 -642787
39986 -642787 -694493 -794794 -900425 -967264 -986279 -975672 -949751 -902861 -815017 -661163 -419263
39975 -419263 -89222 282170 602433 778332 770903 607713 346806 40097 -267959 -525004
39965 -525004 -675499 -687912 -576054 -393361 -201075 -28267 145370 360164 621570 880460
39955 880460 1077784 1203660 1299156 1399588 1488791 1515582 1448934 1310038 1149941 998939
39945 998939 841970 645909 405574 153824 -69895 -245849 -370942 -456784 -544523 -691737
39935 -691737 -907611 -1111096 -1194937 -1141787 -1047919 -1019339 -1070445 -1140682 -1181558 -1193817 -1191568
39924 -1191568 -1168122 -1108331 -1014871 -908929 -809867 -717227 -608581 -460048 -283122 -143898
39914a43898J3289j54849k75031k75595j47669N4066K39988L27662K85666J52365
39904G5994O492q9901j24237j19865j05216r8875j08663j29744j46723j48179
39894i88917j36643j14758o8147J8177J24008J98222K14771K08087K30977K87172
39884b7051L31219L31436L02531K68814K25705J58294P6491L584o1286j40604
39874A469133k34330k98768k81825j74737k5788R4348J44072J35953J12291R4785
39864A035134O4400n930j10385k11678k71886k68367j93081o3146O8297J38381
39854A81739J24279N5098k9134j12943j93153k52228k64838k27785j71315j39394
39844a029674j58153k13625k56260k40093j68896r8367q5819j42551k36419l24459
$$ plain form
39914 -143898 -130609 -285458 -560489 -836084 -983753 -929687 -689699 -362037 -76371 75994
39904 75994 82486 -7415 -131652 -251517 -356733 -455608 -564271 -694015 -840738 -988917
39894 -988917 -1125560 -1240318 -1308465 -1290288 -1166280 -968058 -753287 -545200 -314223 -27051
39884 -27051 304168 635604 938135 1206949 1432654 1590948 1667439 1671023 1609737 1469133
39874 1469133 1234803 936035 654210 479473 453685 548033 692105 828058 940349 1035134
39864 1035134 1099534 1093604 983219 771541 499655 231288 38207 -24939 43358 181739
39854 181739 306018 361116 331982 219039 25886 -226342 -491180 -718965 -890280 -1029674
39844 -1029674 -1187827 -1401452 -1657712 -1897805 -2066701 -2165068 -2250887 -2393438 -2629857 -2954316
39834b954316l71046l49804k52964j03480N2726J69489K15700J82920R5267O561
39824c308947l2963j4057L5704R3511J66902K73113M00126M94515M92248L71909
39814a027939J83735J4440q9350j52964k16437k64948k49096j66400p7693k8740
39804b075392N000O8195J50970K02006K00528J77335J68336J79831J99767K11779
39794e11645J93815J33904N7715J2680J1034J5287j334q045L7394J10136J25141
39783A76082L0880j26898k45948k59425j82024p9850q137K5072M4767O7338Q1106
39772d77037P1938N7290P5873J38779K04160K10933J33454j903j46374k65054
39762B059l47140l92065l92588l34057k15667p5160J8338J4994o4317j36733j29523
$$ plain form
39834 -2954316 -3325362 -3675166 -3928130 -4031610 -3978884 -3809395 -3593695 -3410775 -3315508 -3308947
39824 -3308947 -3341910 -3355967 -3320263 -3226752 -3059850 -2786737 -2386611 -1892096 -1399848 -1027939
39814 -1027939 -844204 -829764 -919114 -1072078 -1288515 -1553463 -1802559 -1968959 -2046652 -2075392
39804 -2075392 -2070392 -2002197 -1851227 -1649221 -1448693 -1271358 -1103022 -923191 -723424 -511645
39794 -511645 -317830 -183926 -126211 -113531 -102497 -87210 -88544 -96589 -59195 50941 176082
39783 176082 206962 80064 -165884 -425309 -607333 -687183 -695320 -670248 -625481 -558143 -477037
39772 -477037 -405099 -347809 -271936 -133157 71003 281936 415390 413487 267113 2059
39762 2059 -345081 -737146 -1129734 -1463791 -1679458 -1754618 -1736280 -1721286 -1785603 -1922336 -2051859
39751b051859m4507N2472J00359R1497N5333J2404m1606j11614j78577k07332
39741b323430j77608j04972k9818J7665M2524P0200J04913J14617P1715L388k0926
39730b231732L6249J30560J74576J24251J9370n6633m6791M3980J64843K60965
39720a380362L07412L11937K88659K34408J40181K5761n3189m9374K4467R8694
39710e1406J06184L6283o6978j49924j90333k05107k25710k60115k72137k06957
39700a486200n1066J34340K52710K50031J50825K4295o9823j04301q0134j9583
39690i98906M3230Q0717Q4162N6747L478o3597j17566j27200p8464J5261J19703
39679i82435J96385K25094K17709K01567J82831J36137L8490r5209k15360k65032
$$ plain form
39751 -2051859 -2096366 -2043894 -1943535 -1852038 -1796705 -1784301 -1825907 -1937521 -2116098 -2323430
39741 -2323430 -2501038 -2606010 -2635828 -2618163 -2575639 -2505439 -2400526 -2285909 -2214194 -2210806 -2231732
39730 -2231732 -2195483 -2064923 -1890347 -1766096 -1746726 -1803359 -1850150 -1806170 -1641327 -1380362
39720 -1380362 -1072950 -761013 -472354 -237946 -97765 -72004 -125193 -174567 -150100 -51406
39710 -51406 54778 91061 24083 -125841 -316174 -521281 -746991 -1007106 -1279243 -1486200
39700 -1486200 -1537266 -1402926 -1150216 -900185 -749360 -725065 -794888 -899189 -979323 -998906
39690 -998906 -955676 -874959 -790797 -734050 -730572 -794169 -911735 -1038935 -1117399 -1102138 -982435
39679 -982435 -786050 -560956 -343247 -141680 41151 177288 215778 120569 -94791 -359823
39669c59823k05246m2117J53812K80806K86771K04183Q7725n1936k14263l38542
39659a98630l35330j97563k5950Q1381J28616J88411K99084M23913M96046M80607
39649A340585L98254K97205J99593Q6607m4246j29806j02049L55M2742n4389k21466
39638A813385l30784l39465l00934k71320k58844k48179k22499j61867n8564O0740
39628c18331J50452J83802J65376J21587Q9394Q7910Q5837L3888m7214o0559M0411
39617E32553J66043J94879J28946P0503O9480Q2811P9526Q8098J14443R9334L951
39606A630567j23594k12132k47977k51972k28207j85856j68688k03226k43290
39597b34375k22394j47419q9377q7486j09222j08174q2046o2273p1721j02480
$$ plain form
39669 -359823 -565069 -607186 -453374 -172568 114203 318386 406111 354175 139912 -198630
39659 -198630 -533960 -731523 -757473 -676092 -547476 -359065 -59981 363932 859978 1340585
39649 1340585 1738839 2036044 2235637 2322244 2277998 2148192 2046143 2046498 2089240 2034851 1813385
39638 1813385 1482601 1143136 842202 570882 312038 63859 -158640 -320507 -379071 -318331
39628 -318331 -167879 15923 181299 302886 392280 480190 566027 599915 552701 492142 532553
39617 532553 698596 893475 1022421 1092924 1162404 1245215 1324741 1412839 1527282 1626616 1630567
39606 1630567 1506973 1294841 1046864 794892 566685 380829 212141 8915 -234375
39597 -234375 -456769 -604188 -693565 -781051 -890273 -998447 -1080493 -1142766 -1214487 -1316967
39587a316967j20429q8782j054J04917J71216J59255P2729l8580r5665m2270R6554
39576a099076K24345K63492K25113J75171J51723J41780J25333J07183J00835
39567D15899J03613R7583O7585J5865l8901q0988j14867j51216j76536j57643
39557a9606q4118J2215Q6264J05870M6676r8013k76413l82455l43955j95930l7319
39546a186784O9821J28826J59030J66489J61282J58171J47537R8272M838r0755
39536a83273j36468j14385m2009N1591J40436K04309K26824J91816R1305n1802
39526C78344j80827k46414k46272k06546j34143j5806J38700K84807L81836M18436
39516E72115L93930L04306J63764J9307p6394j00684o6381q596K8941J8385k5730
$$ plain form
39587 -1316967 -1437396 -1526178 -1527232 -1422315 -1251099 -1091844 -1019115 -1057695 -1153360 -1195630 -1099076
39576 -1099076 -874731 -611239 -386126 -210955 -59232 82548 207881 315064 415899
39567 415899 519512 617095 684680 700545 661644 580656 465789 314573 138037 -19606
39557 -19606 -103724 -91509 -5245 100625 147301 49288 -227125 -609580 -953535 -1149465 -1186784
39546 -1186784 -1116963 -988137 -829107 -662618 -501336 -343165 -195628 -97356 -92518 -183273
39536 -183273 -319741 -434126 -476135 -424544 -284108 -79799 147025 338841 430146 378344
39526 378344 197517 -48897 -295169 -501715 -635858 -651664 -512964 -228157 153679 572115
39516 572115 966045 1270351 1434115 1453422 1377028 1276344 1209963 1201367 1230308 1248693 1222963
39505A222963o1098p1722q7612j33155j79471j81805j54446j67870k57572l61560
39495d33348l70447k32340L236K33916L77724M03790L22275J70602N701j16326
39485C64783j71706j77402j61025j30124q2793l8427k9996n5956o3212k773J05034
39474d43597J85585J92464J52734J21675J15043J05510P0091J4029m5792r0640
39464C77102r0437j9104J00944J93787J96650J22184L6300j2182j8428L514L5017
39453I25347M4254J019q6820j75450k33011k62623k69725k36223j50049m3771
39443d87052K1083P010p0486j59202k08557k01680j57645r7778j5687J00435K19658
39432a049901K76284K41891J64822J18659J30444J76918K27450K61218K55508
$$ plain form
39505 1222963 1161865 1090143 1002531 869376 689905 508100 353654 185784 -71788 -433348
39495 -433348 -803795 -1036135 -1032899 -798983 -421259 -17469 304806 475408 481109 364783
39485 364783 193077 15675 -145350 -275474 -358267 -396694 -426690 -482646 -545858 -548631 -443597
39474 -443597 -258012 -65548 87186 208861 323904 429414 499505 513534 467742 377102
39464 377102 286665 267561 368505 562292 758942 881126 917426 905244 886816 890330 925347
39453 925347 969601 970620 883800 708350 475339 212716 -57009 -293232 -443281 -487052
39443 -487052 -465969 -458959 -529445 -688647 -897204 -1098884 -1256529 -1354307 -1369994 -1269559 -1049901
39432 -1049901 -773617 -531726 -366904 -248245 -117801 59117 286567 547785 803293
39423H03293J90374O9610p7420k13038l01868l15977k46257j05621Q3536K90703
39413A77335M61412N30265M76596L50838K20179J01255k9332j74811l02806l83770
39403A427161m14419m06463l79771l61856l62108l45702k65157j25215R555Q0458
39393a143517Q8100P6875Q8272J32852J84255J94605J38408M7822j6983l5669
39383b44980l7996m1589j9789M2192R1762N3663p6174k16743k86132k74078k26460
39372a236324j87090j74240j94679k46904l03074l10335k31228q1652Q1120K04710
39362b679696K66624K64467K10252J43325J21770J72648K55001K91268K36997
39353g17344J12912k0370j01605r2437P476J54478K81789L40658L26893K75311
$$ plain form
39423 803293 993667 1063277 985857 772819 470951 154974 -91283 -196904 -113368 177335
39413 177335 638747 1169012 1645608 1996446 2216625 2317880 2288548 2113737 1810931 1427161
39403 1427161 1012742 606279 226508 -135348 -497456 -843158 -1108315 -1233530 -1223975 -1143517
39393 -1143517 -1055417 -978542 -890270 -757418 -573163 -378558 -240150 -192328 -209311 -244980
39383 -244980 -282976 -324565 -344354 -302162 -210400 -156737 -232911 -449654 -735786 -1009864 -1236324
39372 -1236324 -1423414 -1597654 -1792333 -2039237 -2342311 -2652646 -2883874 -2965526 -2884406 -2679696
39362 -2679696 -2413072 -2148605 -1938353 -1795028 -1673258 -1500610 -1245609 -954341 -717344
39353 -717344 -604432 -624802 -726407 -818844 -811368 -656890 -375101 -34443 292450 567761
39343E67761K35297K41231K84631L09478K51206R5617j00972k55598l24181l25505
39333I78965l07407k97855k91662k74498k40575j82232q6510L2568J11741Q5168
39323d72297m0624j86687k83706l25109l30247k94607k05582q0716M4341J52739
39313b022495K44947L13288L41517L15449K14000J7128k38623m32518m43584k74316
39303a965207n8312O5953O8924K2313J2944P4293J76181K63500L11904L46342
39293f81165L95623M38681M18593L09076J49182J4118l5891P021Q5558J12334
39283A213130M8947n3833j20424j42065j66206k04832k07081j35226k1545P3428
39273B84293J24846J43306J41762J30084J22114J24085J27998J27872J21933Q7004
$$ plain form
39343 567761 803058 1044289 1328920 1638398 1889604 1985221 1884249 1628651 1304470 978965
39333 978965 671558 373703 82041 -192457 -433032 -615264 -701774 -669206 -557465 -472297
39323 -472297 -512921 -699608 -983314 -1308423 -1638670 -1933277 -2138859 -2219575 -2175234 -2022495
39313 -2022495 -1777548 -1464260 -1122743 -807294 -593294 -576166 -814789 -1247307 -1690891 -1965207
39303 -1965207 -2023519 -1957566 -1888642 -1866329 -1853385 -1779092 -1602911 -1339411 -1027507 -681165
39293 -681165 -285542 153139 571732 880808 1029990 1044108 1008217 1015238 1100796 1213130
39283 1213130 1262077 1208244 1087820 945755 779549 574717 367636 232410 210865 284293
39273 284293 409139 552445 694207 824291 946405 1070490 1198488 1326360 1448293 1535297
39263A535297j9827k07835m19055n72976o32406o06662n11034l58888j89047o4074
39253b046507k2674m3743o5582l6539N1501J66133K61265L06907L06633K95062
39243h27544L13370L73233M38814M53676L93198K85321J77675R7881N0118K6896
39233A782638N069m9493j42996k27399k42265j83618j08890p3507q2052j00024
39223E77463r2113m7339J5895O6888R3260J06640J11100Q9762M3742J5633L6659
39212A017590P2394O7260K7008L542P747O06k6566l1751o62K1153Q145O298N7615
39199A230379J21875J31025Q9283N9226O5304O8760L5087k5313r0368j54473k04490
39188A326295k01941j20717M855R2052P9503j6004j16676j60225j53952j46281
$$ plain form
39263 1535297 1515470 1307635 888580 315604 -316802 -923464 -1434498 -1793386 -1982433 -2046507
39253 -2046507 -2069181 -2112924 -2178506 -2215045 -2163544 -1997411 -1736146 -1429239 -1122606 -827544
39243 -827544 -514174 -140941 297873 751549 1144747 1430068 1607743 1705624 1755742 1782638
39233 1782638 1787707 1738214 1595218 1367819 1125554 941936 833046 759539 677487 577463
39223 577463 485350 438011 453906 520794 614054 720694 831794 921556 965298 980931 1017590
39212 1017590 1089984 1157244 1184252 1187794 1195541 1196147 1169581 1137830 1137168 1158321 1166466 1172764 1230379
39199 1230379 1352254 1483279 1572562 1631788 1697092 1765852 1800939 1775626 1685258 1530785 1326295
39188 1326295 1124354 1003637 1008492 1100544 1180047 1164043 1047367 887142 733190 586909
39178E86909j56757j57023j18951n2293J5869P3471J17601J36064J15884N9293
39168F20067k4187j27258k26554k67702k00851m1977J16418J72311R7236m6162
39158G1341j65916k13589j94469j24436j0058J20237K00864J80348P8598l1356
39148h8436q8651p2008J3008J31285K13121K01047J11774J9790k2732j7859J9888
39137D20227Q8133J69501K26367K43973K43844K36117J94513J02593m531p1207
39127A849530p6623m4352j5710k2333n9975p9671l1414P1916J57030J60377O9745
39116A978520r5610k95487m51672m80995l80954k44837j61832j33558j08940n5490
39106d30855L6641J75007L39311M63490M90679M30720L28992K01732M3896j16839
$$ plain form
39178 586909 430152 273129 154178 101885 117754 191225 308826 444890 560774 620067
39168 620067 595880 468622 242068 -25634 -226485 -268462 -152044 20267 117503 71341
39158 71341 -94575 -308164 -502633 -627069 -637127 -516890 -316026 -135678 -57080 -88436
39148 -88436 -177087 -249095 -236087 -104802 108319 309366 421140 440930 418198 400339 420227
39137 420227 508360 677861 904228 1148201 1392045 1628162 1822675 1925268 1920737 1849530
39127 1849530 1772907 1728555 1712845 1690512 1630537 1550866 1519452 1591368 1748398 1908775 1978520
39116 1978520 1882910 1587423 1135751 654756 273802 28965 -132867 -266425 -375365 -430855
39106 -430855 -394214 -219207 120104 583594 1074273 1504993 1833985 2035717 2079613 1962774
39096A962774k21863k38513j85607j05228l2601J3205L3566M4407N2690M6723
39086A369553J9284j5029l7953m7313m9958n6426r0945j75968k87688l54383l22786
39075d9612k08169o5323O3662J58408K11249K34787K52139K56666K08000R0962
39065A152769m8740j51542k00775k11255j92670j52748j10278p6420m4298j7985
39055e3942k4113p2112j30942j65666j64929j14930O342J74732L04222L32731
39045I1393K95038K69723K81346K93805K70324J95949O6651r6157k36106l07403
39035A124563l18346l01659k64571k00093j22085n1643J3010Q2831J54222K21063
39025C37292K80082L03057K48366J34821N8975R4328K10518L30594M19090M64651
$$ plain form
39096 1962774 1740911 1502398 1316791 1211563 1178962 1192167 1225733 1270140 1322830 1369553
39086 1369553 1388837 1373808 1335855 1288542 1238584 1182158 1091213 915245 627557 273174 -49612
39075 -49612 -257781 -323104 -259442 -101034 110215 345002 597141 853807 1061807 1152769
39065 1152769 1104029 952487 751712 540457 347787 195039 84761 8341 -35957 -53942
39055 -53942 -78055 -150167 -281109 -446775 -611704 -726634 -720292 -545560 -241338 91393
39045 91393 386431 656154 937500 1231305 1501629 1697578 1764229 1668072 1431966 1124563
39035 1124563 806217 504558 239987 39894 -82191 -133834 -120824 -37993 116229 337292
39025 337292 617374 920431 1168797 1303618 1362593 1456921 1667439 1998033 2417123 2881774
39015B881774M33268L15209J82277J18367J10181P5570j4376j06661j46970j26775
39005C721864o1666J5827M9871O215q0692j52715k03264k53873k78359k21368
38995B541840q7535N3186J50423K05888K23999J94153J30877P4473L6400j0925
38985C512779p8886j39513j70173j85335k07973k32051k25261j62673o2604J0830
38975B059140O164m8852p6166n1795k7968l1344p575Q7448K02068K51331K16983
38964B579434J36521M8692K628N5955J95266L15044L43500L32479L59362M11746
38954D780627M42951M59123M61820L94013K54617J79299K75411M53006N62021
38945H262888O24549P74215J032775J323237J651233K082904K576474L029224
$$ plain form
39015 2881774 3315042 3630251 3812528 3930895 4041076 4116646 4102270 3995609 3848639 3721864
39005 3721864 3660198 3676025 3725896 3732111 3651419 3498704 3295440 3041567 2763208 2541840
38995 2541840 2454305 2507491 2657914 2863802 3087801 3281954 3412831 3487304 3523704 3512779
38985 3512779 3433893 3294380 3124207 2938872 2730899 2498848 2273587 2110914 2048310 2059140
38975 2059140 2065304 2016452 1940286 1888491 1860523 1829179 1821604 1909052 2111120 2362451 2579434
38964 2579434 2715955 2764647 2767275 2823230 3018496 3333540 3677040 4009519 4368881 4780627
38954 4780627 5223578 5682701 6144521 6538534 6793151 6972450 7247861 7700867 8262888
38945 8262888 8887437 9661652 10694427 12017664 13668897 15751801 18328275 21357499
38937B1357499L474171M049863M806652N730281O901135Q405493J0151844J2011771
38929G6888709J3952159J5513884J5214650J1299714L686082n169098j1925215
38922A19460885j4900782j4792161j3252425j1379433r525225p821466o389624
38915D1399769n238652m298811l546307k973724k518141k129061j834769j649823
38907A7210481j488137j256682r77745p38342n68164m44710l78623m09337n23721
38898A0425020o38841o69008n78305l81006j33136P6518J69147J35675M5543j6887
38888H434720k1660O950M6255J00210J59165J70180Q6451o7471k19047l28517
38878H367236m06237m59029m73224m55516m35349m10457l38590k03983n1597O0098
$$ plain form
38937 21357499 24831670 28881533 33688185 39418466 46319601 54725094 64876938 76888709
38929 76888709 90840868 106354752 121569402 132869116 136555198 131386100 119460885
38922 119460885 104560103 89767942 76515517 65136084 55610859 47789393 41399769
38915 41399769 36161117 31862306 28315999 25342275 22824134 20695073 18860304 17210481
38907 17210481 15722344 14465662 13487917 12749575 12181411 11736701 11358078 10948741 10425020
38898 10425020 9786179 9117171 8538866 8157860 8024724 8101242 8270389 8406064 8451607 8434720
38888 8434720 8413060 8420010 8466265 8566475 8725640 8895820 8982271 8914800 8695753 8367236
38878 8367236 7960999 7501970 7028746 6573230 6137881 5727424 5388834 5184851 5133254 5193352
38868E193352J02229O6901k9402j16538j01557L5478K08246L07445K91086J90696
38858F147936P1756j917m220M1441J07099J94300K83743K94626J74594O808o3177
38847G252989J763J19171K30404L49513M69437N29785M98846M01992K66914J31311
38837A0252125R2197K34952N12168P95441J031784J239874J393332J456490J505047
38828A8513410J648061J860903K069937K352197K832001L423348L933930M401724
38820D1035511N051458N948904P023070Q397776J0300148J2640222J5148291J7969653
38812A23515033K1596875K6149997L1294232L6705275M1342491M1852305L3497467
38805C55953675J4765447r136326k9117302l9187746m0061106l6245867l1278774
$$ plain form
38868 5193352 5295581 5362482 5333080 5216542 5114985 5150463 5358709 5666154 5957240 6147936
38858 6147936 6219692 6217775 6213555 6254996 6362095 6556395 6840138 7134764 7309358 7316166 7252989
38847 7252989 7254752 7373923 7604327 7953840 8423277 8953062 9451908 9853900 10120814 10252125
38837 10252125 10344322 10579274 11091442 11886883 12918667 14158541 15551873 17008363 18513410
38828 18513410 20161471 22022374 24092311 26444508 29276509 32699857 36633787 41035511
38820 41035511 46086969 52035873 59058943 67456719 77756867 90397089 105545380 123515033
38812 123515033 145111908 171261905 202556137 239261412 280603903 322456208 355953675
38805 355953675 370719122 361582796 332465494 293277748 253216642 216970775 185692001
38798A85692001k6350592k1808589j8076952j5231318j2899115j0869473r252724
38791G1203238q021942o921122n867415n014578m385889l810876l243251k806188
38783C1131977k502320k184759j839942j619133j559243j522812j438205j361295
38775A7104268j275436j065408p36625m56421l28996l01835l21554m04482n18433
38766A1695078n64652n23701m77785m58725m13306l42237l26848l80541m06646
38757G800637l45033k44736j57980p3587J2551O6028Q4754J07212J26282Q5186
38747G461314k1077j25948j85035k05469j79325q2967M7112J30419J48160J49221
38737G136405J46681R9079K118r2987j64233k34494k95181l07334k92635l29913
$$ plain form
38798 185692001 159341409 137532820 119455868 104224550 91325435 80455962 71203238
38791 71203238 63181296 56260174 50392759 45378181 40992292 37181416 33938165 31131977
38783 31131977 28629657 26444898 24604956 22985823 21426580 19903768 18465563 17104268
38775 17104268 15828832 14763424 14026799 13570378 13241382 12939547 12617993 12213511 11695078
38766 11695078 11130426 10606725 10128940 9670215 9256909 8914672 8587824 8207283 7800637
38757 7800637 7455604 7210868 7052888 6979301 6991852 7057880 7142634 7249846 7376128 7461314
38747 7461314 7440237 7314289 7129254 6923785 6744460 6661493 6708605 6839024 6987184 7136405
38737 7136405 7283086 7382165 7384283 7291296 7127063 6892569 6597388 6290054 5997419 5667506
38727E667506m36911n36731n62505n21255m44266l57239l11233l51963m32812
38718A712591m41400l41369k12620j26751o2893J8415R2933J11543P2142K0037
38708H42628J4807J04786K79857M40834M77741L93658K93256K40834J99500J27839
38698C415740O0960N5786J06887J50202J16754k5563k35220l94994m04076k88861
38688B557615j73916j36618j45613j44227j20551p4657J0696J28287K28747K80007
38678B409770L02999L23463L32347L21635L21810L75630M95928O57730Q09704
38669F351016R02331R35796R54297R41907P63642L07848l14990q17530j008102
38660I016215r41968p89063o53299n62686n31169n42581n29538m44180l18833
$$ plain form
38727 5667506 5230595 4693864 4131359 3610104 3165838 2808599 2497366 2145403 1712591
38718 1712591 1271191 929822 717202 590451 527558 545973 638906 750449 822591 842628
38708 842628 857435 962221 1242078 1682912 2160653 2554311 2847567 3088401 3287901 3415740
38698 3415740 3476700 3532486 3639373 3789575 3906329 3880766 3645546 3250552 2846476 2557615
38688 2557615 2383699 2247081 2101468 1957241 1836690 1762033 1772729 1901016 2129763 2409770
38678 2409770 2712769 3036232 3368579 3690214 4012024 4387654 4883582 5541312 6351016
38669 6351016 7253347 8189143 9143440 10085347 10848989 11156837 10841847 10024317 9016215
38660 9016215 8074247 7285184 6631885 6069199 5538030 4995449 4465911 4021731 3702898
38651C702898k09270j22602n2190l5632j10502k38494l32108l43026k83603j83803
38641A791668p0286L0547J09410J78904K29916K08340P8109j06761k34128k35304
38631A980415j32074Q63Q8643Q5406o651j35240k33478k68543k55432k27549j96251
38620G00109j35822j4426J52015K93310L53858L49644L23419K63708J22821q8081
38610B320555k81248l82242l86666l17129j86930l6792M9712J8106r4879j99962
38600E02525k28035j47849L7112K64956M24022M38485L38451K18860J46794J30362
38590B125683J46573J61181J39746P5818q0o1329j16888j79284k25758k25078
38580A840584j86819j49058j24540q8084j4312R2799K02615K75091K86722K55428
$$ plain form
38651 3702898 3493628 3371026 3318836 3283204 3172702 2934208 2602100 2259074 1975471 1791668
38641 1791668 1721382 1751929 1861339 2040243 2270159 2478499 2556608 2449847 2215719 1980415
38631 1980415 1848341 1849204 1937847 2023253 2016602 1881362 1647884 1379341 1123909 896360 700109
38620 700109 564287 549861 701876 995186 1349044 1698688 2022107 2285815 2408636 2320555
38610 2320555 2039307 1657065 1270399 953270 766340 729548 779260 797366 702487 502525
38600 502525 274490 126641 163753 428709 852731 1291216 1629667 1848527 1995321 2125683
38590 2125683 2272256 2433437 2573183 2649001 2648921 2587592 2470704 2291420 2065662 1840584
38580 1840584 1653765 1504707 1380167 1292083 1277771 1370570 1573185 1848276 2134998 2390426
38570B390426K27075K21823K08516J48395M6751n9353j48411k23455k80884k93869
38560B237014k31285q8965R0538K29090K64607K03572J08186K5262n0843j35717
38550B651459k04532k10337j40415l2639O1423J19585J59596K09963K66208K86257
38540C166568K46266J85950J64018J76627J66560J19124R8358J65911L06858M66175
38530E262415O25930Q13386J049063J299020J450279J333385Q39758P0494o70649
38521A2073081j096354j148650r78331p59834n80090m67959m34317m56770m84550
38512E666226m95209n15878n64225n98333n58286m44032l20681k44899k08455
38503A716228j64242r2000j7945K8529N4300Q5444J26025J51492J33720N8188
$$ plain form
38570 2390426 2617501 2839324 3047840 3196235 3242986 3183633 3035222 2811767 2530883 2237014
38560 2237014 2005729 1916764 2007302 2236392 2500999 2704571 2812757 2838019 2787176 2651459
38550 2651459 2446927 2236590 2096175 2063536 2124959 2244544 2404140 2614103 2880311 3166568
38540 3166568 3412834 3598784 3762802 3939429 4105989 4225113 4323471 4489382 4796240 5262415
38530 5262415 5888345 6701731 7750794 9049814 10500093 11833478 12673236 12743730 12073081
38521 12073081 10976727 9828077 8849746 8089912 7509822 7041863 6607546 6150776 5666226
38512 5666226 5171017 4655139 4090914 3492581 2934295 2490263 2169582 1924683 1716228
38503 1716228 1551986 1459986 1442041 1470570 1524870 1610314 1736339 1887831 2021551 2079739
38493B079739o8032k03643k86888k95368k79657k99316l35925l15259k08888n8913
38483b72150R7806K62083M10659M72760M12690K86856J75150R7905M3149K9381
38473B016289Q0254J62090K04049J72135Q6704j3684q8208j00322n7022k3840
38463B438445n3343j13091j29704q7853l5103k098K5721O1697R8474J35454J71221
38452B509820J63965N8458j26882k88062l38308k91098k23537j92758k09856k59667
38442H02075l10296l19887k65452j65242o2991J746N694n2328j39784j96930j74188
38431h77583o7390Q1497K10032K66426K37097J55163P2949J8792j5617m7349p2574
38420c8557o7085j0734Q6201J76013K02318J48973N7291j2407k7638J1571Q9761
$$ plain form
38493 2079739 2011707 1808064 1521176 1225808 946151 646835 310910 -4349 -213237 -272150
38483 -272150 -174344 87739 498398 971158 1383848 1670704 1845854 1943759 1986908 2016289
38473 2016289 2096543 2258633 2462682 2634817 2721521 2707837 2619629 2519307 2462285 2438445
38463 2438445 2385102 2272011 2142307 2054454 2019351 2017253 2042974 2104671 2203145 2338599 2509820
38452 2509820 2673785 2732243 2605361 2317299 1978991 1687893 1464356 1271598 1061742 802075
38442 802075 491779 171892 -93560 -258802 -321793 -320047 -314353 -366681 -506465 -703395 -877583
38431 -877583 -944973 -863476 -653444 -387018 -149921 5242 78191 96983 81366 34017 -38557
38420 -38557 -105642 -116376 -30175 145838 348156 497129 554420 542013 514375 525946 615707
38409F15707J75971K28081K30930K19271K28859K34738J82115P9716J2224L7815
38399B245427J12559J49758J30163J16778J67744K63885L25077K81531J30231
38390C923153o1318k03369k51239k37419k36224k90946l72749m10136l57142k30068
38380A272543p9252O2670J89431K82536K90788J69816o2990l27913n37339o44906
38370F15384o49722n70769m26090k35009l4807J18430J83855J72891J36001J08803
38360e81033R0177P6767Q6792J28422J72191J87381J88309K08863K41935K44309
38350A044113K02521J55882J42362J49990J36555P8544j0254r2527j30966j12337
38340A563883n5969J0477Q0443J55379K05979J78673N7584r9051k04103k18820
$$ plain form
38409 615707 791678 1019759 1250689 1469960 1698819 1933557 2115672 2195388 2207612 2245427
38399 2245427 2357986 2507744 2637907 2754685 2922429 3186314 3511391 3792922 3923153
38390 3923153 3861835 3658466 3407227 3169808 2933584 2642638 2269889 1859753 1502611 1272543
38380 1272543 1193291 1255961 1445392 1727928 2018716 2188532 2125542 1797629 1260290 615384
38370 615384 -34338 -605107 -1031197 -1266206 -1301013 -1182583 -998728 -825837 -689836 -581033
38360 -581033 -490856 -414089 -327297 -198875 -26684 160697 349006 557869 799804 1044113
38350 1044113 1246634 1402516 1544878 1694868 1831423 1909967 1899713 1807186 1676220 1563883
38340 1563883 1507914 1518391 1598834 1754213 1960192 2138865 2196449 2097398 1893295 1674475
38330A674475j79767j60102k08613l10615l96726m00336l17809k07029j23091
38321f29613o6593r13R4467K01396K85275L25981L28766L13734K94593K63802
38311A410895K01138R9146k3583j34849k07594k26105j86802j03406o797O9120
38301H91163J02296Q4400J8152p8116j69127k19821k18675j79406j20243n2047
38291E8576Q451K8768j3358r2375j45851j38064r7688p2653o1406k0330O2613
38280d83317J38833J58708J30333R4710O3900J4046o9414j67395k46349k80831
38270f46776k59454j90445j04601l6250L238K4806M0148N5178P8934J18220J62741
38259g54261J94314K13635K40261K82388L24601L51258L63295L61810L32891K65453
$$ plain form
38330 1674475 1494708 1334606 1125993 815378 418652 18316 -299493 -506522 -629613
38321 -629613 -696206 -697119 -602652 -401256 -115981 210000 538766 852500 1147093 1410895
38311 1410895 1612033 1711179 1687596 1552747 1345153 1119048 932246 828840 822043 891163
38301 891163 993459 1077859 1096011 1017895 848768 628947 410272 230866 110623 58576
38291 58576 67027 95795 82437 -9938 -155789 -293853 -391541 -464194 -525600 -545930 -483317
38280 -483317 -344484 -185776 -55443 39267 103167 117213 47799 -119596 -365945 -646776
38270 -646776 -906230 -1096675 -1201276 -1237526 -1234288 -1209482 -1169334 -1114156 -1035222 -917002 -754261
38259 -754261 -559947 -346312 -106051 176337 500938 852196 1215491 1577301 1910192 2175645
38249B175645J73139Q0454p306j01071j94897k57796k72383k67843k91601l47258
38239F89083l81723l44949k46698j39155n9344j3678r376o3209j65417k58886
38229i93352k72885j72347K1926K37435L74449L68002K52668J41000J09505J23489
38219A89890R8790J4801o9788r9464p8741m6880l1174l2081k6946K0747J33617
38208G2771K88706M21940M67301L89030J92714o8952l05709m35738m38512l59785
38198B23766k70053k23659k35636k68599k51247j42684J8997J53329K16531K20210
38188e59045J86775J30041P8609O7474Q7534Q2542J9031p2517j47311k02073k50293
38177e79233k71359k26269j13235K5947J47077K19917K12728J05715o2362j89833
$$ plain form
38249 2175645 2348784 2429238 2421932 2320861 2125964 1868168 1595785 1327942 1036341 689083
38239 689083 307360 -37589 -284287 -423442 -482786 -496464 -505840 -569049 -734466 -993352
38229 -993352 -1266237 -1438584 -1416658 -1179223 -804774 -436772 -184104 -43104 66401 189890
38219 189890 288680 303481 233693 134229 55488 8608 -22566 -54647 -81593 -60846 72771
38208 72771 361477 783417 1250718 1639748 1832462 1763510 1457801 1022063 583551 223766
38198 223766 -46287 -269946 -505582 -774181 -1025428 -1168112 -1149115 -995786 -779255 -559045
38188 -559045 -372270 -242229 -163620 -96146 -8612 73930 92961 20444 -126867 -328940 -579233
38177 -579233 -850592 -1076861 -1190096 -1164149 -1017072 -797155 -584427 -478712 -541074 -730907
38167g30907j85287m7805J33261K55447K75208K12939J09672k271r0454j13329
38157a83526m6468Q3567K08912K67436K33683J15957m9691k01890k84251k95450
38147a51721k92037l19970l53381l22465j99099l7036P5850R7220O5591O5505
38137a371543J51825K94028L95261L79391K63678J38213P3418N9305L8473j9012
38127D03037r1892j50163j92834k30124k47185k11129j12830J7633J39050K24277
38117d52160K55116K17735J21035O245p9143j12846r8686n3172l755J6948m656
38106a87339n3093j08684j63622j97496j66310n3585Q3502J63196J71961J67719
38096c43751J89300K07751J81089J15236M6397k724j8603K3973J37109K78920
$$ plain form
38167 -730907 -916194 -963999 -830738 -575291 -300083 -87144 22528 20257 -70197 -183526
38157 -183526 -229994 -146427 62485 329921 563604 679561 629870 427980 143729 -151721
38147 -151721 -443758 -763728 -1117109 -1439574 -1638673 -1675709 -1599859 -1502639 -1437048 -1371543
38137 -1371543 -1219718 -925690 -530429 -151038 112640 250853 324271 383576 422049 403037
38127 403037 311145 160982 -31852 -261976 -509161 -720290 -833120 -815487 -676437 -452160
38117 -452160 -197044 20691 141726 147971 68828 -44018 -142704 -195876 -199631 -182683 -187339
38106 -187339 -240432 -349116 -512738 -710234 -876544 -930129 -846627 -683431 -511470 -343751
38096 -343751 -154451 53300 234389 349625 396022 393298 374695 398668 535777 814697
38086H14697L68757L52085K40739R1705m3141j49218k42176l31824l95113l92148
38076C14363l07196j61728J1271J86240L34733M21141M26766L67081K73169J67292
38066B033132O6358o902l5506k5196L127L3395N8753P4827P8706O6247K1887p5582
38054B293246k21020l66026m54995m79626m83520n09616n52706n65106m98979
38045a838348l40057j13264J28111L17098L95655L48443K23829J07048N5311N9970
38035f56204P8474R1660J13135J51765J90820K06858J87036J21693K578j55501
38025C32314l02922l81122l62510k67444j51558p4233o1116q6347r6214n3402
38015a504554M1989J61590K62852L06228K85498K38496K02245J61744P7164l8673
$$ plain form
38086 814697 1183454 1535539 1776278 1867983 1824842 1675624 1433448 1101624 706511 314363
38076 314363 7167 -154561 -143290 42950 377683 798824 1225590 1592671 1865840 2033132
38066 2033132 2099490 2092588 2057082 2031886 2035013 2068408 2127161 2201988 2280694 2346941 2368828 2293246
38054 2293246 2072226 1706200 1251205 771579 288059 -221557 -774263 -1339369 -1838348
38045 -1838348 -2178405 -2291669 -2163558 -1846460 -1450805 -1102362 -878533 -771485 -716174 -656204
38035 -656204 -577730 -486070 -372935 -221170 -30350 176508 363544 485237 487815 332314
38025 332314 29392 -351730 -714240 -981684 -1133242 -1207475 -1268591 -1354938 -1451152 -1504554
38015 -1504554 -1462565 -1300975 -1038123 -731895 -446397 -207901 -5656 156088 233252 194579
38005A94579j15580j16185q8195r5718j31300j34407p5087K0825J15825J89048
37995b36195K26595K24996K09132K11004K18816J76089M9678j17951k38826k52715
37985D70623j66776m1949M5053M0869n6409j96441l09307l50593l26898k84638
37975a176466k67870k74318k51278j46492L0671K05937L03849L08757K59477K00469
37965h07264J59205J61153K24441L16080L45812K52572R4908P762N2646J50570
37955I57885J87971J47681R2168N1202q802j09204k17382k97601l52090l84483
37945F7345l65334k73291j45807m9659j0031J496J4230K2639Q923j7836j9961
37934g67286K7636R6761J19557N9762l2630n7422M0366K20753L84942M39552L40208
$$ plain form
38005 194579 78999 -37186 -125381 -221099 -352399 -486806 -561893 -541068 -425243 -236195
37995 -236195 -9600 215396 424528 635532 854348 1030437 1080115 962164 723338 470623
37985 470623 303847 261898 306951 347820 291411 94970 -214337 -564930 -891828 -1176466
37975 -1176466 -1444336 -1718654 -1969932 -2116424 -2085753 -1879816 -1575967 -1267210 -1007733 -807264
37965 -807264 -648059 -486906 -262465 53615 399427 651999 746907 754669 807315 957885
37955 957885 1145856 1293537 1385705 1436907 1428105 1318901 1101519 803918 451828 67345
37945 67345 -297989 -571280 -717087 -766746 -776777 -775281 -761051 -738412 -729489 -747325 -767286
37934 -767286 -739650 -642889 -523332 -463570 -496200 -553622 -513256 -292503 92439 531991 872199
37923H72199J20250j08428k22336j85540p0261K8911P7299R2334R6024J01990
37913H02442J18121J29362R6919l09j42555l03885m75303o23564o67689n53386
37903a619847l37429j45985m7816n686N2044J53324K75455L72370L98718L42664
37893e62188K49152J85153J72629J78782J74095J66214J66027J56998J24101Q8531
37883A099494Q2361R8819R5357M5456l3621j07225j57219j79391j65641j14744
37873F63646n9277m9906r0571j09395k9174J34775K78231L13106K38901J06307
37863A396643m6656j96901l08997l45681k98880j92279o6723K6367M7225R598
37853B3716k3868j6527o077m9492j42848k27744k53803k01214p1474R5842K19613
$$ plain form
37923 872199 992449 884021 661685 476145 405884 434795 512094 604428 700452 802442
37913 802442 920563 1049925 1146844 1146535 1003980 700095 224792 -398772 -1066461 -1619847
37903 -1619847 -1957276 -2103261 -2151077 -2156763 -2104719 -1951395 -1675940 -1303570 -904852 -562188
37893 -562188 -313036 -127883 44746 223528 397623 563837 729864 886862 1010963 1099494
37883 1099494 1181855 1280674 1376031 1421487 1387866 1280641 1123422 944031 778390 663646
37873 663646 604369 554463 463892 354497 325323 460098 738329 1051435 1290336 1396643
37863 1396643 1349987 1153086 844089 498408 199528 7249 -59474 -33107 14118 23716
37853 23716 -152 -16679 -22756 -72248 -215096 -442840 -696643 -897857 -969331 -873489 -653876
37842f53876K46624K14184J92158J77084J08324j3833j00799q9058k2914M341
37832F2235n2273j71545k95740l49790k80557j21276J4063M3148N700J1057J11526
37821a023452K52891L33419K88214J33233m7185j65186j98738j88339j65523j18738
37811h99404m3393J9812L5614L1649N6373R5257P9281k2006j56589k46133k53786
37800a303325j89419q1152L8719J39131K03194K34020K42656K35526K12734J66202
37790a01714P7146o7594k42970l77844m00274l01517j48904k4746M5576R4214
37780a448627J45287J76632J61493J21074J01562J11886J24239J32338J59322
37771b14794J93508J69520N6822o3978o8432O8855K39752L20596K93220K32421
$$ plain form
37842 -653876 -407252 -193068 -910 176174 284498 270665 169866 80808 57894 62235
37832 62235 9962 -161583 -457323 -807113 -1087670 -1208946 -1194883 -1151735 -1146035 -1134978 -1023452
37821 -1023452 -770561 -437142 -148928 -15695 -62880 -228066 -426804 -615143 -780666 -899404
37811 -899404 -942797 -922985 -887371 -855722 -799349 -704092 -624811 -646817 -803406 -1049539 -1303325
37800 -1303325 -1492744 -1573896 -1535177 -1396046 -1192852 -958832 -716176 -480650 -267916 -101714
37790 -101714 -24568 -92162 -335132 -712976 -1113250 -1414767 -1563671 -1588417 -1542841 -1448627
37780 -1448627 -1303340 -1126708 -965215 -844141 -742579 -630693 -506454 -374116 -214794
37771 -214794 -21286 148234 205056 141078 72646 141501 381253 701849 995069 1227490
37761A227490J99019J77385J18934K0111o6110r2538o7877l4832k0996l5664r6727
37750A328195k15921l49755m06103l29386j63753j2343N4076L7528j3728m7317
37740a18507l7861n882n021p0853j80833k75152l11747k88809k21327j15890K4622
37729a607260J78107K92508L11341K28124J13336O0024Q8955J26847R2566j4375
37719a29827j26099j82778j70756j03099K045J23119K37657L23978L49278K71582
37709E95100Q1842j59217l53207m38898m22904l46102k47713j61865j14726j03049
37699a670739q9091l5884N2265J32089J65916J62817J71357K23720K88551K94583
37689c04416K06833O2967p3637j73930k39238k63794k36165j67774q6124l069
$$ plain form
37761 1227490 1426509 1603894 1722828 1742939 1676829 1584291 1516414 1481582 1460586 1424922 1328195
37750 1328195 1112274 762519 356416 27030 -136723 -149066 -94990 -57462 -71190 -118507
37740 -118507 -156368 -162250 -167271 -238124 -418957 -694109 -1005856 -1294665 -1515992 -1631882 -1607260
37729 -1607260 -1429153 -1136645 -825304 -597180 -483844 -423820 -334865 -208018 -115452 -129827
37719 -129827 -255926 -438704 -609460 -712559 -710514 -587395 -349738 -25760 323518 595100
37709 595100 676942 517725 164518 -274380 -697284 -1043386 -1291099 -1452964 -1567690 -1670739
37699 -1670739 -1759830 -1795714 -1743449 -1611360 -1445444 -1282627 -1111270 -887550 -598999 -304416
37689 -304416 -97583 -34616 -108253 -282183 -521421 -785215 -1021380 -1189154 -1275278 -1278347
37679a278347P7990J25295Q9292l3216j71158k35158j92278q3039J5655M0400
37669a644564j6880r5447j07114j0177J57994L22354M31383M75894M68782M21426
37659D03651L31969J91147J0044j59741k58822k83214k89612l18780l35952k74374
37649i83684j22764O0880K12196K99841L02618J94889j2662k38692l75795l77578
37639a040751k87191j78963q9033j0225O2806J06438R0749J9737n8066q0574j9209
37628a484282R5944J97121K32806K04525J48412Q7939K0535n0734r9057j04919
37618g51710q8070q4638j00738j14120j18258j33889j66579j78517j23892k342
37608a862753J37687K40981K78990K53257J88618J26025J03982J32919J87961
$$ plain form
37679 -1278347 -1200357 -1075062 -985770 -1018986 -1190144 -1425302 -1617580 -1700619 -1684964 -1644564
37669 -1644564 -1661444 -1756891 -1864005 -1874182 -1716188 -1393834 -962451 -486557 -17775 403651
37659 403651 735620 926767 936811 777070 518248 235034 -54578 -373358 -709310 -983684
37649 -983684 -1106448 -1045568 -833372 -533531 -230913 -36024 -48686 -287378 -663173 -1040751
37639 -1040751 -1327942 -1506905 -1595938 -1606163 -1543357 -1436919 -1346170 -1326433 -1384499 -1465073 -1484282
37628 -1484282 -1388338 -1191217 -958411 -753886 -605474 -517535 -497000 -547734 -646791 -751710
37618 -751710 -839780 -924418 -1025156 -1139276 -1257534 -1391423 -1558002 -1736519 -1860411 -1862753
37608 -1862753 -1725066 -1484085 -1205095 -951838 -763220 -637195 -533213 -400294 -212333
37599b12333K30156K34648K00246J39334O5630p765o3623q1711n1069J6177Q4462
37588E54152J11812P2832k6917j51555k48336k68802j92265m1979J21061K32682
37578A62685K65596K35925J71607Q8775Q551k5442J7022R8119J30110O7721m2321
37567A178348j24655j62789j91591k21163k14019j45055m9902N257j2862q1262
37557a9693j47706j72374j51004j03050l7686N6072J71786K53960K37049J21269
37547B08623j4153q1203n1666L8321J20730J29307M1536q6650j51757r6197L7720
37536I4611J59105K13449J99349J28923J1726j24779k31386k66000k18054j09234
37526a42290J5804J05437J28725R2990K6882n1468j42208k46227l49373m19910
$$ plain form
37599 -212333 17823 252471 452717 592051 657681 649916 586293 504582 453513 469690 554152
37588 554152 665964 738796 711879 560324 311988 43186 -149079 -191058 -69997 162685
37578 162685 428281 664206 835813 924588 933139 907697 924719 1022838 1152948 1220669 1178348
37567 1178348 1053693 890904 699313 478150 264131 119076 69174 74431 61569 -19693
37557 -19693 -167399 -339773 -490777 -593827 -631513 -575441 -403655 -149695 87354 208623
37547 208623 194470 113267 61601 99922 220652 349959 391495 304845 153088 56891 94611
37536 94611 253716 467165 666514 795437 807163 682384 450998 184998 -33056 -142290
37526 -142290 -126486 -21049 107676 200666 227548 176080 33872 -212355 -561728 -981638
37516i81638m19115l30171j87228n8537J6027N6347R5451J23070J05260M7030
37506a533504N61J1110Q0130J78167K66641L09748K95777K49544J97095J20443
37496A75712j7071j94699l21858l20937j99277k8979J16028J91948J92400J54008
37486b52725J35495J66494K26463K80159L08293K94391K20683J02560q215q6772
37476A386826j66063k63214l11237k28255m3089J11470J37242N3817n8114j38145
37466D81238j56095j02465j0357M9994M0442k39r564K2124N8617P9806R7456J17111
37454F68068J22493J04156P7424O0956N1398K6705l1169j16068j92306k12073
37444E59584j48579j7569J29996K30972K34223J27237m7749k16991l26998l67395
$$ plain form
37516 -981638 -1400753 -1730924 -1918152 -1976689 -1960662 -1904315 -1808864 -1685794 -1580534 -1533504
37506 -1533504 -1532943 -1521833 -1441703 -1263536 -996895 -687147 -391370 -141826 55269 175712
37496 175712 158641 -36058 -357916 -678853 -878130 -907109 -791081 -599133 -406733 -252725
37486 -252725 -117230 49264 275727 555886 864179 1158570 1379253 1481813 1473598 1386826
37476 1386826 1220763 957549 646312 418057 374968 486438 623680 677497 619383 481238
37466 481238 325143 222678 212321 262315 302757 302518 292954 315078 373695 453501 550957 668068
37454 668068 790561 894717 972141 1033097 1084495 1111200 1080031 963963 771657 559584
37444 559584 411005 393436 523432 754404 988627 1115864 1068115 851124 524126 156731
37434A56731l44596k59556j26455J0939J09064J60796J81555J69939J04495k4601
37424A38311j94630l51566m23989l63340j98806l1486O1769J05562J72213K68288
37414h17674L24365K92595J99319R2923m961p7166r6016o6981m3772n7127o2508
37403c17003n661Q6338J32716J03484M1778j3579o7634j14090r4537M1929K54222
37392D7963M19162M32215K92839R8816l4208n6987r449K9857J4714m3372j04326
37381A087224j37963j37512j14106q6712p0907p2359r1285j26386j66538j87629
37371a04173j75346j49994j49689j82744k11059j90371j19175m0853j914j0964
37361a336282l2457j7307N6287J68745K81701L64362L95169L59759K72175J87111
$$ plain form
37434 156731 -187865 -447421 -573876 -562937 -453873 -293077 -111522 58417 162912 138311
37424 138311 -56319 -407885 -831874 -1195214 -1394020 -1425506 -1363737 -1258175 -1085962 -817674
37414 -817674 -493309 -200714 -1395 91528 86567 9401 -86615 -153596 -197368 -254495 -317003
37403 -317003 -322664 -236326 -103610 -126 41652 28073 -39561 -153651 -248188 -206259 47963
37392 47963 467125 899340 1192179 1290995 1256787 1199800 1190351 1220208 1234922 1191550 1087224
37381 1087224 949261 811749 697643 610931 540024 467665 376380 249994 83456 -104173
37371 -104173 -279519 -429513 -579202 -761946 -973005 -1163376 -1282551 -1323404 -1325318 -1336282
37361 -1336282 -1368739 -1386046 -1329759 -1161014 -879313 -514951 -119782 239977 512152 699263
37351F99263J57281J73381J75001J30462P6661O2915Q2948R0151O1605J4419l3650
37340A690437q6589j48270k03896k35122k40469k32040k20013k04975j79987j39666
37330b00590r2813o2317o2338p7712p7019m6109k10L3800L6968P050l4824m8592
37318f24706o360P8053J67268K47256L31323M12694M46294M01083L07014K18352
37308A978271J42334L9031j07087k48130l19035l02890k36699j68136j23988j11403
37298E42268j26079j49155j46345q7710J9905J22060J53145R5387l038p8158j12926
37287B29354j38181j79190k24206k49394k50219k32123j87278j05018l681O7052
37277a272884O3826j3329j18468j88229j79698r5119K5427J39497K29580K93120
$$ plain form
37351 699263 856544 1029925 1204926 1335388 1412049 1474964 1557912 1648063 1709668 1724087 1690437
37340 1690437 1603848 1455578 1251682 1016560 776091 544051 324038 119063 -60924 -200590
37330 -200590 -293403 -355720 -418058 -495770 -572789 -618898 -619108 -585308 -548340 -541290 -576114 -624706
37318 -624706 -631066 -553013 -385745 -138489 192834 605528 1051822 1452905 1759919 1978271
37308 1978271 2120605 2159636 2052549 1804419 1485384 1182494 945795 777659 653671 542268
37298 542268 416189 267034 120689 32979 52884 174944 328089 423476 420438 342280 229354
37287 229354 91173 -88017 -312223 -561617 -811836 -1043959 -1231237 -1336255 -1339936 -1272884
37277 -1272884 -1209058 -1222387 -1340855 -1529084 -1708782 -1803901 -1778474 -1638977 -1409397 -1116277
37267a116277L16647K77947J76240M6265o4766j27699j39706j19406j03978j34635
37257i89368k19629l08272l20917k20781n5572P8393J15493O7612J694k2115N237
37246a868225M7285O5850O2040P7011J50579K74997L86371M02383K78561M5680
37236g7468j97366l39784l32987k21380r4507o333N1810J04990J47380J54569
37226h11076J24786Q6676P2551R7224J51132J97398J92245J36965R7551J33711
37216D79163K10141K24464J38398L7282K8464J13703K00845K18259J71453R6839
37206A919011J2704o8853j20720j22694r3151p7333j01888j46164j58368j02434
37196I40110N092J04773J42739J05197Q413j22201k47248l10461k76513j72022
$$ plain form
37267 -1116277 -799630 -521683 -345443 -299178 -363944 -491643 -631349 -750755 -854733 -989368
37257 -989368 -1208997 -1517269 -1838186 -2058967 -2114539 -2036146 -1920653 -1853041 -1851347 -1873462 -1868225
37246 -1868225 -1820940 -1755090 -1693050 -1616039 -1465460 -1190463 -804092 -401709 -123148 -77468
37236 -77468 -274834 -614618 -947605 -1168985 -1263492 -1269825 -1218015 -1113025 -965645 -811076
37226 -811076 -686290 -599614 -527063 -429839 -278707 -81309 110936 247901 345452 479163
37216 479163 689304 913768 1052166 1089448 1117912 1231615 1432460 1650719 1822172 1919011
37206 1919011 1931715 1862862 1742142 1619448 1526297 1448964 1347076 1200912 1042544 940110
37196 940110 945202 1049975 1192714 1297911 1306324 1184123 936875 626414 349901 177879
37186A77879o1259K5241J15608K41632L77805M49849L99114K35509L3697j23748
37176A871327k08854k55107k99798l32778l16181k40137j35151l9057K1274K5377
37166I0915k5388q5348r4195l9611L9575J17725K09271L15309L87125L78249L05497
37155A599124K22577J52646Q3387J5261k6942l4234l5636o9501j43954k25143
37145A537585k55185j91160m4931J16142K19043K35252J83453J03383L8653K1701
37135A963936M9133Q1632Q7632P5554O5095M5816p310r0850j77170k52335l16272
37124A524861l52639l38832k89504k51184k40413k18562j44622k8054Q7643J73228
37114g8078K27961K61884K82039K89255K79603K55644K35401K32795K27363J77124
$$ plain form
37186 177879 116620 141861 257469 499101 876906 1326755 1725869 1961378 1995075 1871327
37176 1871327 1662473 1407366 1107568 774790 458609 218472 83321 44264 65538 90915
37166 90915 65527 -19821 -114016 -153627 -114052 3673 212944 528253 915378 1293627 1599124
37155 1599124 1821701 1974347 2057734 2072995 2046053 2011819 1976183 1906682 1762728 1537585
37145 1537585 1282400 1091240 1046309 1162451 1381494 1616746 1800199 1903582 1942235 1963936
37135 1963936 2013069 2094701 2182333 2257887 2322982 2368798 2361488 2270638 2093468 1841133 1524861
37124 1524861 1172222 833390 543886 292702 52289 -166273 -310895 -338949 -251306 -78078
37114 -78078 149883 411767 693806 983061 1262664 1518308 1753709 1986504 2213867 2390991
37104B390991P2122m3916j14826j14888m3779Q7889K40209L33595K97130J34378
37094C238905p3452k28164k72325k08609r2865n281j23p2531j80812k91777l85975
37083A426991m32391l98774k99163k00104j57074j61574j68259j54345j26862
37074f71555q7517k8473L4008N6014J4810n6980j04115j05779q5720p4654p9295
37063a189256q5787p9252n8594m0720m8213q2888j13009r8290l0826N4105J07032
37052a665698J00900M9189L206K6879J51502L42419N15818N95186N54248M15708
37042A089357K22834J2002j97383l86602n10937n10238l70194j61952R353R3697
37032g10063J09066P8924N386q8577j43386j21210m8864K2713P0722Q7416N3593
$$ plain form
37104 2390991 2463113 2419197 2304371 2189483 2145704 2233593 2473802 2807397 3104527 3238905
37094 3238905 3165453 2937289 2664964 2456355 2363490 2358209 2358086 2285555 2104743 1812966 1426991
37083 1426991 994600 595826 296663 96559 -60515 -222089 -390348 -544693 -671555
37074 -671555 -759072 -787545 -753537 -697523 -682713 -739693 -843808 -949587 -1035307 -1109961 -1189256
37063 -1189256 -1275043 -1354295 -1412889 -1453609 -1501822 -1584710 -1697719 -1796009 -1826835 -1772730 -1665698
37052 -1665698 -1564798 -1515609 -1512403 -1485524 -1334022 -991603 -475785 119401 673649 1089357
37042 1089357 1312191 1324193 1126810 740208 229271 -280967 -651161 -813113 -803760 -710063
37032 -710063 -600997 -522073 -516687 -605264 -748650 -869860 -918724 -896011 -825289 -737873 -684280
37021f84280l1691j18135j44349j00951k4608M9810R6613Q5169R094q1878j26453
37010a071659j20680r8009n3355N5046K27887M06429N40350O20072O34219N60157
37000A700457M22674L01156K38747J91884J09889J7733l0600m1833o5772j10656
36990B733679j37171j29506j17527j25307j43464j58385j67608j58111j09979
36981A486621l7061J1264J0424m792Q985L8093K6544m9456j46581j98419j79384
36970I66238j18636o1748k9665j1748J4581O3342J28543J81658J88172J44009
36960A464746R3885R3010J43849J86527J58934N1976r6946k38572l24663l15655
36950A217091k14206q8872l3001q5237j97806k85351k98335k51462j90276j33081
$$ plain form
37021 -684280 -715971 -834106 -978455 -1079406 -1104014 -1054204 -957591 -872422 -863328 -945206 -1071659
37010 -1071659 -1192339 -1290348 -1343703 -1288657 -1060770 -654341 -113991 506081 1140300 1700457
37000 1700457 2123131 2424287 2663034 2854918 2964807 2982540 2951940 2910107 2844335 2733679
36990 2733679 2596508 2467002 2349475 2224168 2080704 1922319 1754711 1596600 1486621
36981 1486621 1449560 1460824 1471248 1466456 1475441 1513534 1540078 1490622 1344041 1145622 966238
36970 966238 847602 785854 756189 744441 759022 822364 950907 1132565 1320737 1464746
36960 1464746 1558631 1651641 1795490 1982017 2140951 2192927 2095981 1857409 1532746 1217091
36950 1217091 1002885 914013 881012 795775 597969 312618 14283 -237179 -427455 -560536
36940e60536m7965J01230K83380L97186L63088K10737N3871j8573o891L7632Q1883
36929H95042J23720J54644J40686N3892q4449k07010k56547k35494j91147j56736
36919B36601j24980q2501m7361n4111j11150j88639k44627k54280k21743j74149
36909a266940j36755j04704m7513N1342J73167K92067M05444N17666O08669O42638
36899A135081N99897M82222L01190Q7206j03943k29188l00184l55140l91541l64748
36889H60852k57437j07708M8078K18581M11519N73766O19711N15758L14068J11988
36879C309176j694J9197J52609L09012L91902L78764L29342L07106L15223L26261
36869E836898L51213M44404O42598R27766J247749J528827J645264J429323P95738
$$ plain form
36940 -560536 -608501 -507271 -223891 173295 536383 747120 800991 782418 775527 813159 895042
36929 895042 1018762 1173406 1314092 1367984 1283535 1076525 819978 584484 393337 236601
36919 236601 111621 29120 -18241 -72352 -183502 -372141 -616768 -871048 -1092791 -1266940
36909 -1266940 -1403695 -1508399 -1555912 -1504570 -1331403 -1039336 -633892 -116226 492443 1135081
36899 1135081 1734978 2217200 2518390 2605596 2501653 2272465 1972281 1617141 1225600 860852
36889 860852 603415 495707 543785 762366 1173885 1747651 2367362 2883120 3197188 3309176
36879 3309176 3307482 3326679 3479288 3788300 4180202 4558966 4888308 5195414 5510637 5836898
36869 5836898 6188111 6632515 7275113 8202879 9450628 10979455 12624719 14054042 14849780
36860A4849780j19731r95983j548831j717237j626502j411708j124983p91760
36852E513045m79507k69959j90733k06134k65324l39839m23254n14593o03820
36843B219882o67043o80566o43826n79884n09890m39395l71649l09768k30384
36834b212523q1139J60136M28857O08270O27693N08237L16507J09281o4785j51486
36824B49048j23658j8668R1885J71129K28213K62823K40474J46099L2416k1442
36814A258319P984P3709J18048J19131Q3567K9967j0502r995J9409K8719n660
36803A712696m1175j6307P3963J75552K37680K47816K09237J22095K282j06258
36793B617581j61927j62560j42081j38846j75497k55136l53777m14237l69767
$$ plain form
36860 14849780 14730049 13734066 12185235 10467998 8841496 7429788 6304805 5513045
36852 5513045 5033538 4763579 4572846 4366712 4101388 3761549 3338295 2823702 2219882
36843 2219882 1552839 872273 228447 -351437 -861327 -1300722 -1672371 -1982139 -2212523
36834 -2212523 -2293662 -2133526 -1704669 -1096399 -468706 39531 356038 465319 400534 249048
36824 249048 125390 106722 198607 369736 597949 860772 1101246 1247345 1279761 1258319
36814 1258319 1266303 1340012 1458060 1577191 1660758 1690725 1680223 1670228 1689637 1718356 1712696
36803 1712696 1671521 1655214 1729177 1904729 2142409 2390225 2599462 2721557 2723839 2617581
36793 2617581 2455654 2293094 2151013 2012167 1836670 1581534 1227757 813520 443753
36784D43753j98026M1915K38743L11023K65107J68827P6041o225q0709j24528
36774A135921j14382o8431l2885l0984m9663p4224j08880j56818k02451k23965
36764G3238k09769j59316q6560k8016k4646q0782j54013j96097j90809j45636
36754a202406p0170J7843Q3845J02133Q5586O8201O0821M5024J1442j6820p737
36743h22238M2641J00551J15820N9067m4456j16883q3961N7797K37127L73454
36733h1081M32548M15552L23120J60959k9453j81291k54554k57892k12037j19855
36723A96016M655J00234R4324j5143j40557j85013j30395l5244L9143Q0259J08856
36712A17135J37259J55389J47909J09718M0921o2898k01461l49660m60674m98791
$$ plain form
36784 443753 245727 287642 526385 837408 1102515 1271342 1347383 1341158 1260449 1135921
36774 1135921 1021539 953108 920223 889239 839576 765352 656472 499654 297203 73238
36764 73238 -136531 -295847 -382407 -410423 -435069 -515851 -669864 -865961 -1056770 -1202406
36754 -1202406 -1272576 -1254733 -1170888 -1068755 -983169 -914968 -854147 -809123 -797681 -814501 -822238
36743 -822238 -779597 -679046 -563226 -504159 -548615 -665498 -749459 -691662 -454535 -81081
36733 -81081 351467 767019 1090139 1251098 1221645 1040354 785800 527908 315871 196016
36723 196016 200671 300905 395229 380086 239529 54516 -75879 -111123 -71980 8279 117135
36712 117135 254394 409783 557692 667410 708331 645433 443972 94312 -366362 -865153
36702h65153m59162l47013j59501Q2391K96919L81823L05277J28527o6273k29647
36692i31812l17083k75260j13820M9494R2699L4987J3443J06449K41855L01969
36682g97079K61822J84112J21434P7048M3545K8161L2890M0805L5265K1374K2332
36671G1709N6356J14290J59823J58479J03475N370j26157k60250l19725k36287
36661b72917n0600R2450Q7024k4587j17054j21646o2174R277M8850J1430j20964
36650e20911k86530l74690l35660k25865j31222q4098p3200r0039j25442j43710
36640b391367j03159l331J11131J95800K44282K82514L32108L79074L84871L40355
36630b27722K96772L11197L60129L48556K25396N4046o4213j08838j39429j92518
$$ plain form
36702 -865153 -1324315 -1671328 -1830829 -1748438 -1451519 -1069696 -764419 -635892 -702165 -931812
36692 -931812 -1248895 -1524155 -1637975 -1588481 -1495782 -1460795 -1447352 -1340903 -1099048 -797079
36682 -797079 -535257 -351145 -229711 -152663 -109118 -80957 -48067 -7262 28003 49377 71709
36671 71709 128065 242355 402178 560657 664132 669502 543345 283095 -36630 -272917
36661 -272917 -323517 -231067 -144043 -168630 -285684 -407330 -469504 -460227 -411377 -399947 -520911
36650 -520911 -807441 -1182131 -1517791 -1743656 -1874878 -1958976 -2032176 -2122215 -2247657 -2391367
36640 -2391367 -2494526 -2497857 -2386726 -2190926 -1946644 -1664130 -1332022 -952948 -568077 -227722
36630 -227722 69050 380247 740376 1088932 1314328 1368374 1304161 1195323 1055894 863376
36620H63376k30170k00108j08006r121N1342P2235Q2682J07020J37189J34193
36610I00632O3477o7961k13405l19309l46313k72223j08446P7164J84616J57213
36600E5445K7050j27219k54189l43352l81997l37425j95662L654J89562L09520
36590a054613L47156L04169J89080K8496j30087k45231l10476l46614l66177l57224
36580a941521l05701k20266j22374j9674R1942J98499K61206K55227K06046J70107
36570a426509J79891K20131K56084K68249K55041K20774J78168J53093J65247
36561D70169K00501K17342J88766J29345P3521L4583m392o1734j31373j90546
36551I26182k25312k37976k28838j84257r9519j2301J2290m5992j16091r7086
$$ plain form
36620 863376 633206 433098 325092 315971 367313 439548 522230 629250 766439 900632
36610 900632 964109 896148 682743 363434 17121 -255102 -363548 -286384 -101768 55445
36600 55445 82495 -44724 -298913 -642265 -1024262 -1361687 -1557349 -1553695 -1364133 -1054613
36590 -1054613 -707457 -403288 -214208 -185712 -315799 -561030 -871506 -1218120 -1584297 -1941521
36580 -1941521 -2247222 -2467488 -2589862 -2609536 -2517594 -2319095 -2057889 -1802662 -1596616 -1426509
36570 -1426509 -1246618 -1026487 -770403 -502154 -247113 -26339 151829 304922 470169
36561 470169 670670 888012 1076778 1206123 1279644 1314227 1309835 1248101 1116728 926182
36551 926182 700870 462894 234056 49799 -49720 -62021 -49731 -95723 -211814 -308900
36541c08900K2602J38018J44895O0659r476j5060j6986q7654k03257k75663k65331
36530h16153k15749j83458j81003j98377k37626k96683l41321l24525k30588q4170
36520c109653P7365K25800L44563M27449M72494M65674L80937K17218L0101j00485
36510e68537j41867j29978j14197j02907p6322l2270M251J0047j6303n8503q8021
36499a314607o7655K8567J87941L58533M80494N15193M52374L09953J33535k3172
36489A061156j35774k22312l07881l82662m08968l66075k73023j68983q9166o0105
36479a353793q9591j40343j33068j0367J97989L96198N14946N62421N76998N60140
36469A081530M85055L56101K21971J24996O5423K5676L493J774N394m087j6581
$$ plain form
36541 -308900 -286298 -148280 -3385 57274 47798 32738 15752 -71902 -275159 -550822 -816153
36530 -816153 -1031902 -1215360 -1396363 -1594740 -1832366 -2129049 -2470370 -2794895 -3025483 -3109653
36520 -3109653 -3032288 -2806488 -2461925 -2034476 -1561982 -1096308 -715371 -498153 -468052 -568537
36510 -568537 -710404 -840382 -954579 -1057486 -1133808 -1166078 -1161827 -1151780 -1168083 -1226586 -1314607
36499 -1314607 -1382262 -1353695 -1165754 -807221 -326727 188466 640840 950793 1084328 1061156
36489 1061156 925382 703070 395189 12527 -396441 -762516 -1035539 -1204522 -1293688 -1353793
36479 -1353793 -1443384 -1583727 -1716795 -1727162 -1529173 -1132975 -618029 -55608 521390 1081530
36469 1081530 1566585 1922686 2144657 2269653 2335076 2360752 2364245 2366019 2371413 2367326 2350745
36458B350745j883M6861R7348J11497P8861J1650p3398j54022k01443k05890j96867
36447A863459k10616k35338k19323j46011o7179k9840K109R9108K43344L21249
36437A620962K69807J76046J72031K58920L04459K13736L4937j23460k16507k61755
36427B449176k66482k23909j67059j61860k30164l15673l40599k72094j27455
36418C43881N3800K23647L33343L53254K84840J49701k0839j80814k77009k85239
36408I78565k36939j93268j87096j94501j64129p2649M8521J41458J75927J68465
36398D64354J44119R5882N350j01702j54253j08385k585P8250Q4210L2363k7024
36387E10579n1679k1575N6308J42153J75996J14520l6966k24009l71188m20652
$$ plain form
36458 2350745 2348862 2395723 2493071 2604568 2683429 2695079 2621681 2467659 2266216 2060326 1863459
36447 1863459 1652843 1417505 1198182 1052171 984992 955152 957261 1056369 1299713 1620962
36437 1620962 1890769 2066815 2238846 2497766 2802225 3015961 3050898 2927438 2710931 2449176
36427 2449176 2182694 1958785 1791726 1629866 1399702 1084029 743430 471336 343881
36418 343881 397681 621328 954671 1307925 1592765 1742466 1721627 1540813 1263804 978565
36408 978565 741626 548358 361262 166761 2632 -70017 -21496 119962 295889 464354
36398 464354 608473 704355 709705 608003 453750 345365 342780 421030 505240 537603 510579
36387 510579 458900 437325 493633 635786 811782 926302 889336 665327 294139 -126513
36377a26513l61781k31497q1211N8786J80598K74467L21866L15946K71145K01760
36367H23566J05872j2325j14226j47027r9337j9350L4674N2143O5600R5789J20246
36356I05625J03005M4258j1372j5471M1092J24022J85144J91721J36528L7045
36346A741597o7869j33691j42312j22106j23249j64991k12674k10269j28578J8978
36336D54836J90467L32084L95393L63625K65038J46761L2559q3978k06494l12132
36326A578159l66732l54844k90559k05190j26344o4569j9821J794o241k0713J1281
36315A36221J13664K36466L03562K97280K55612J90198O3036j36389l42154m74698
36305F42798n14410m77321l59429j62040M8725J70726J62258P3190j9853p4897
$$ plain form
36377 -126513 -488294 -719791 -801002 -742216 -561618 -287151 34715 350661 621806 823566
36367 823566 929438 917113 802887 655860 556523 537173 571847 623990 689590 785379 905625
36356 905625 1008630 1052888 1041516 1026045 1067137 1191159 1376303 1568024 1704552 1741597
36346 1741597 1673728 1540037 1397725 1275619 1152370 987379 774705 564436 435858 454836
36336 454836 645303 977387 1372780 1736405 2001443 2148204 2180763 2096785 1890291 1578159
36326 1578159 1211427 856583 566024 360834 234490 169921 150100 151894 145653 124940 136221
36315 136221 249885 486351 789913 1087193 1342805 1533003 1596039 1459650 1117496 642798
36305 642798 128388 -348933 -708362 -870402 -821677 -650951 -488693 -415503 -435356 -510253
36295e10253q6335o9525n3414n4968n0447K079J07313K26314L25018L95233M24294
36284F55309L85901K80439J52439M5286l8694j13456j65733j59985p8294N6864
36274A020076J91313K68123K66360K18348J73161J42027J01560M9531K1991M2107
36264B494597Q3868J05783R3393M6994m6748k00790l94521n71262o60102o01034
36254C50178l85125r3148J36341K14287J69199R2994M4086K9387N0367J13086
36244G21652J91051K19504J46325k1331k20614l72191m26056l90705l19998k63406
36234g35769k34296k26690k37401k54625k49519k06616j46566r4549m6273M888
36224b427416L0321Q42n0847n1394K2217J10656J42100J05827M9368K9549P1980
$$ plain form
36295 -510253 -596588 -666113 -719527 -774495 -824942 -822863 -715550 -489236 -164218 231015 655309
36284 655309 1041210 1321649 1474088 1519374 1480680 1367224 1201491 1041506 963212 1020076
36274 1020076 1211389 1479512 1745872 1964220 2137381 2279408 2380968 2430499 2452490 2494597
36264 2494597 2578465 2684248 2777641 2824635 2777887 2577097 2182576 1611314 951212 350178
36254 350178 -34947 -128095 8246 222533 391732 484726 528812 558199 608566 721652
36244 721652 912703 1132207 1278532 1257201 1036587 664396 238340 -152365 -472363 -735769
36234 -735769 -970065 -1196755 -1434156 -1688781 -1938300 -2144916 -2291482 -2386031 -2432304 -2427416
36224 -2427416 -2397095 -2396253 -2447100 -2498494 -2476277 -2365621 -2223521 -2117694 -2068326 -2038777 -1966797
36213a966797J51890K08711K05208J75801J87973K52436L05102K85280J94233
36204a63O3689q8252k38215l32520l30350k59865j88917j40500p4139M0437J63436
36193a385359K21937J94878J40452J35009J93281K56156K55817J83415Q5784N897
36183B87267n3616j07242j51618j71279j65900j48809j19711o1224K5714R6210
36173e70208R1268j009j23823k01347k09541j91442k02799k49827k82125k39621
36163b180474j04395Q3852K54586L51625L60140K97803J93333Q2895J0448K73
36153f49914K7204M5007N4364J10095K39588L82410M40178L67937J93375k5395
36143A184849k22940l33095l27793k48591j58521o7504N0988J79207K54474K59570
$$ plain form
36213 -1966797 -1814907 -1606196 -1400988 -1225187 -1037214 -784778 -479676 -194396 -163
36204 -163 63526 -24726 -262941 -595461 -925811 -1185676 -1374593 -1515093 -1589232 -1548795 -1385359
36193 -1385359 -1163422 -968544 -828092 -693083 -499802 -243646 12171 195586 281370 287267
36183 287267 233651 126409 -25209 -196488 -362388 -511197 -630908 -692132 -666418 -570208
36173 -570208 -478940 -479949 -603772 -805119 -1014660 -1206102 -1408901 -1658728 -1940853 -2180474
36163 -2180474 -2284869 -2201017 -1946431 -1594806 -1234666 -936863 -743530 -660635 -650187 -649914
36153 -649914 -622710 -577703 -523339 -413244 -173656 208754 648932 1016869 1210244 1184849
36143 1184849 961909 628814 301021 52430 -106091 -173595 -122607 56600 311074 570644
36133E70644K48173K50068K10613P4276j13485k46114k76685k45556j99603j39682
36123A32649n5458L2854Q8757R3707N5903K121l3325k9214M039L5995M8263M5646
36111D21937M0135M0923N9724J06244J70533K21503K28891J81208Q6004l2851
36101A524251j38650k01194k20475k19652k10681j81716j25454o2179j8170Q702
36091A54782M2678R1935J34705J47881J34730J15113R7863P4523L6108j6020p5504
36080I38794j34285j74436j67284r6090J5096J01287R7265q124j51024k32943
36070A88256j97044p1717O2352J42468J54369J08359J8661q5715j62555j94873
36060c7439k08872k26819k18760j36448R917J45015K03211J80728J10598K3135
$$ plain form
36133 570644 818817 1068885 1279498 1353774 1240289 994175 717490 471934 272331 132649
36123 132649 77191 110045 198802 292509 348412 350533 317208 287994 292033 328028 376291 421937
36111 421937 462072 502995 562719 668963 839496 1060999 1289890 1471098 1557102 1524251
36101 1524251 1385601 1184407 963932 744280 533599 351883 226429 164250 146080 154782
36091 154782 197460 289395 424100 571981 706711 821824 919687 994210 1030318 1014298 938794
36080 938794 804509 630073 462789 366699 381795 483082 580347 572223 421199 188256
36070 188256 -8788 -80505 -18153 124315 278684 387043 405704 319989 157434 -37439
36060 -37439 -246311 -473130 -691890 -828338 -818421 -673406 -470195 -289467 -178869 -155734
36050a55734n2296q0992n0623R004N8599R1649J23042J46269J29474N6719m4665
36039B30446j21491j29078n2809Q3042K18935K88219K62925J77662R9215O2841
36029A119907L9527k4941j38260k43079k78467k45155j91821j47667r6053j7503
36019b23512O5889J01214M9313q1170k25726k89927k14189l2962J44592K28789
36009d77689K18361J74284J46876J41058J32667R8567M1513l73J7219Q9703J50979
35998G33165J34543L7877q6825j87849k38464k26525j57868p0724j5820j0831
35988h9321k9317l8299l3918m1179r1961j98133l28484m18105m25019l76744l34659
35977b405139l09613k44045r2228J08428K69816L41918L46730L33481L25237L11091
$$ plain form
36050 -155734 -208030 -289022 -339645 -330641 -272042 -180393 -57351 88918 218392 275111 230446
36039 230446 108955 -20123 -72932 10110 229045 517264 780189 957851 1057066 1119907
36029 1119907 1159434 1134493 996233 753154 474687 229532 37711 -109956 -206009 -223512
36019 -223512 -157623 -56409 -7096 -88266 -313992 -603919 -818108 -851070 -706478 -477689
36009 -477689 -259328 -85044 61832 202890 335557 434124 475637 475264 492483 582186 733165
35998 733165 867708 905585 818760 630911 392447 165922 8054 -62670 -78490 -89321
35988 -89321 -118638 -156937 -190855 -232034 -323995 -522128 -850612 -1268717 -1693736 -2070480 -2405139
35977 -2405139 -2714752 -2958797 -3051025 -2942597 -2672781 -2330863 -1984133 -1650652 -1325415 -1014324
35967a014324K71108J99973J16302N6905N5550J15499J97866K41105K01801Q4458
35957E26243o7104k08347l20062l94179m06951l28894j68680R287J29489J66957
35947a062241J54563J31803J01493M3160m3979j27668j72744j73426j50895j26262
35937a426196j04085q1129o3762p0019j10071j64241j88132j50006o2058L5891
35927b383808J22411K07195K93846L53508L54248L01249K25818J46857O9570J2200
35917b96906k052J7332L2820L1548M2458Q5620J34794J52954J39022J10801O3790
35906E12181j4793r9240j32257q7456J185Q2293J38179J79311K03651J83210R4770
35895A061034m4661j79582k54079k47407j76675p9426k946Q836m7029j05446q1999
$$ plain form
35967 -1014324 -743216 -543243 -426941 -370036 -314486 -198987 -1121 239984 441785 526243
35957 526243 459139 250792 -69270 -463449 -870400 -1199294 -1367974 -1358687 -1229198 -1062241
35947 -1062241 -907678 -775875 -674382 -631222 -675201 -802869 -975613 -1149039 -1299934 -1426196
35937 -1426196 -1530281 -1611410 -1675172 -1745191 -1855262 -2019503 -2207635 -2357641 -2419699 -2383808
35927 -2383808 -2261397 -2054202 -1760356 -1406848 -1052600 -751351 -525533 -378676 -309106 -296906
35917 -296906 -298958 -281626 -248806 -217258 -174800 -89180 45614 198568 337590 448391 512181
35906 512181 497388 398148 265891 178435 179620 261913 400092 579403 783054 966264 1061034
35895 1061034 1016373 836791 582712 335305 158630 79204 76258 85094 38065 -67381 -149380
$$ [...]
##END NTUPLES=NMR SPECTRUM
##END=
