##TITLE=31Pdec_SR-167-R22_TFA
 CDCl3
  24 sc
 22.12.2023
##JCAMPDX= 6.0         $$ Bruker NMR JCAMP-DX V2.0
##DATA TYPE= NMR SPECTRUM
##DATA CLASS= NTUPLES
##ORIGIN= UXNMR, Bruker Analytische Messtechnik GmbH
##OWNER= root
$$ XWIN-NMR		Version 3.5
$$ Fri Dec 22 14:14:10 2023 Russian Standard Time (UT+4h)  she@DPX200
##.OBSERVE FREQUENCY= 81.013821
##.OBSERVE NUCLEUS= ^31P
##.ACQUISITION MODE= SIMULTANEOUS
##.ACQUISITION SCHEME= undefined
##.AVERAGES= 24
##.DIGITISER RES= 16
##SPECTROMETER/DATA SYSTEM= spect
##.PULSE SEQUENCE= zgpg30
##.SOLVENT NAME= DMSO
##.SHIFT REFERENCE= (INTERNAL, DMSO, 0, 248.564)
##AUDIT TRAIL= $$ (NUMBER, WHEN, WHO, WHERE, WHAT)
$$ ##TITLE= Audit trail, XWIN-NMR		Version 3.5
$$ ##JCAMPDX= 5.01
$$ ##ORIGIN= Bruker BioSpin GmbH
$$ ##OWNER= she
$$ F:/spectra/data/she/nmr/P31/1/pdata/1/auditp.txt
$$ ##AUDIT TRAIL=  $$ (NUMBER, WHEN, WHO, WHERE, WHAT)
(   1,<2023-12-22 14:12:46.06 +0400>,<she>,<DPX200>,
      <created by zg, POWCHK disabled, PULCHK disabled
       configuration hash MD5:
       00 E9 B6 7A A2 85 ED C7 34 08 36 98 17 FE 4E 26
       data hash MD5: 32K
       A1 3F 40 53 88 5F BD D3 10 0D 8C F6 88 B4 03 1E>)
(   2,<2023-12-22 14:12:50.17 +0400>,<she>,<DPX200>,
      <Start of raw data processing
       efp BC_mod = 2 LB = 10 FT_mod = 6 PKNL = 1 PHC0 = -12624.53 PHC1 = 1353.294 SI = 64K 
       data hash MD5: 64K
       DE FB 85 35 A3 AF 7B B4 A8 50 74 D5 53 BD 1B 1E>)
(   3,<2023-12-22 14:13:25.56 +0400>,<she>,<DPX200>,
      <pk PHC0 = -88.9301 PHC1 = 226.6001 
       data hash MD5: 64K
       4E DA 38 3A 05 36 14 65 85 26 C9 00 04 E0 01 D0>)
(   4,<2023-12-22 14:13:29.51 +0400>,<she>,<DPX200>,
      <abs ABSG = 5 
       data hash MD5: 64K
       73 7D 98 0E 09 CE 2F 1C 54 C3 43 59 20 D1 21 D9>)
$$ ##END=
$$ 
$$ hash MD5
$$ C5 9A 5E AD FE 75 C9 EB 4D 28 B3 CD FB 8E E9 54
##$RELAX= 
##$RELAX= 
##$RELAX= 
##$RELAX= 
##$RELAX= 
##$RELAX= 
##$RELAX= 
##$RELAX= 
##$RELAX= 
$$ Bruker specific parameters
$$ --------------------------
##$DU= <F:/spectra>
##$EXPNO= 1
##$NAME= <P31>
##$PROCNO= 1
##$TYPE= <nmr>
##$USER= <she>
##$AMP= (0..31)
100 100 100 100 100 100 100 100 100 100 100 100 100 100 100 100 100 100 
100 100 100 100 100 100 100 100 100 100 100 100 100 100 
##$AQSEQ= 0
##$AQ_mod= 1
##$AUNM= <au_zg>
##$AUTOPOS= <>
##$BF1= 81.014009
##$BF2= 200.13
##$BF3= 200.13
##$BF4= 200.13
##$BF5= 200.13
##$BF6= 200.13
##$BF7= 200.13
##$BF8= 200.13
##$BYTORDA= 1
##$CFDGTYP= 0
##$CFRGTYP= 5
##$CHEMSTR= <none>
##$CNST= (0..31)
1 1 145 1 1 1 1 1 1 1 1 1 1 1 1 1 1 1 1 1 1 1 1 1 1 1 1 1 1 1 1 1 
##$CPDPRG= <waltz16>
##$CPDPRG1= <>
##$CPDPRG2= <waltz16>
##$CPDPRG3= <>
##$CPDPRG4= <mlev>
##$CPDPRG5= <mlev>
##$CPDPRG6= <mlev>
##$CPDPRG7= <mlev>
##$CPDPRG8= <mlev>
##$CPDPRGB= <>
##$CPDPRGT= <>
##$D= (0..31)
0 1 0 0 0 0 0 0 0 0 0 0.03 2e-05 3e-06 0 0 0 0 0 0 0 0 0 0 0 0 0 0 0 0 
0 0 
##$DATE= 1703239965
##$DBL= (0..7)
120 120 120 11 120 120 24 19 
##$DBP= (0..7)
150 150 150 150 150 150 150 150 
##$DBP07= 0
##$DBPNAM0= <>
$$ [...]
##$SUBNAM3= <"">
##$SUBNAM4= <"">
##$SUBNAM5= <"">
##$SUBNAM6= <"">
##$SUBNAM7= <"">
##$SUBNAM8= <"">
##$SUBNAM9= <"">
##$SW= 501.771253377433
##$SWIBOX= (0..15)
0 1 3 0 0 0 0 0 0 0 0 0 0 0 0 0 
##$SW_h= 40650.406504065
##$TD= 32768
##$TD0= 1
##$TE= 0
##$TE2= 300
##$TE3= 300
##$TEG= 300
##$TL= (0..7)
0 120 53 12 22 120 120 120 
##$TP= (0..7)
150 150 150 150 150 150 150 150 
##$TP07= 0
##$TPNAME0= <>
##$TPNAME1= <>
##$TPNAME2= <>
##$TPNAME3= <>
##$TPNAME4= <>
##$TPNAME5= <>
##$TPNAME6= <>
##$TPNAME7= <>
##$TPOAL= (0..7)
0.5 0.5 0.5 0.5 0.5 0.5 0.5 0.5 
##$TPOFFS= (0..7)
0 0 0 0 0 0 0 0 
##$TUNHIN= 0
##$TUNHOUT= 0
##$TUNXOUT= 0
##$USERA1= <user>
##$USERA2= <user>
##$USERA3= <user>
##$USERA4= <user>
##$USERA5= <user>
##$V9= 5
##$VALIST= <valist>
##$VCLIST= <CCCCCCCCCCCCCCC>
##$VD= 0
##$VDLIST= <DDDDDDDDDDDDDDD>
##$VPLIST= <PPPPPPPPPPPPPPP>
##$VTLIST= <TTTTTTTTTTTTTTT>
##$WBST= 1024
##$WBSW= 4
##$XGAIN= (0..3)
0 0 0 0 
##$XL= 0
##$YL= 0
##$YMAX_a= 1852
##$YMIN_a= -3140
##$ZGOPTNS= <>
##$ZL1= 120
##$ZL2= 120
##$ZL3= 120
##$ZL4= 120
##$ABSF1= 248.5645
##$ABSF2= -253.2056
##$ABSG= 5
##$ABSL= 3
##$ALPHA= 0
##$AQORDER= 0
##$ASSFAC= 0
##$ASSFACI= 0
##$ASSFACX= 0
##$ASSWID= 0
##$AUNMP= <proc_1d>
##$AZFE= 0.1
##$AZFW= 0.5
##$BCFW= 0
##$BC_mod= 2
##$BYTORDP= 0
##$COROFFS= 0
##$CY= -3
##$DATMOD= 1
##$DC= 0
##$DFILT= <>
##$DTYPP= 0
##$F1P= 0
##$F2P= 0
##$FCOR= 1
##$FTSIZE= 65536
##$FT_mod= 6
##$GAMMA= 0
##$GB= 0
##$INTBC= 1
##$INTSCL= 6.047779e-11
##$ISEN= 30
##$LB= 10
##$LEV0= 0
##$LPBIN= 0
##$MAXI= 10000
##$MC2= 0
##$MEAN= 0
##$ME_mod= 0
##$MI= 50
##$NCOEF= 0
##$NC_proc= -10
##$NLEV= 6
##$NOISF1= 182.463
##$NOISF2= 159.3651
##$NSP= 0
##$NTH_PI= 0
##$NZP= 0
##$OFFSET= 248.5645
##$PC= 4
##$PHC0= -12713.46
##$PHC1= 1579.894
##$PH_mod= 1
##$PKNL= yes
##$PPARMOD= 0
##$PSCAL= 0
##$PSIGN= 0
##$REVERSE= no
##$SF= 81.0140089999694
##$SI= 65536
##$SIGF1= 159.3651
##$SIGF2= -187.1042
##$SINO= 113.3802
##$SIOLD= 16384
##$SREGLST= <1H.CDCl3>
##$SSB= 0
##$STSI= 65536
##$STSR= 0
##$SW_p= 40650.406504065
##$SYMM= 0
##$S_DEV= 0
##$TDeff= 32768
##$TDoff= 0
##$TI= <>
##$TILT= no
##$TM1= 0
##$TM2= 0
##$TOPLEV= 0
##$USERP1= <user>
##$USERP2= <user>
##$USERP3= <user>
##$USERP4= <user>
##$USERP5= <user>
##$WDW= 1
##$XDIM= 65536
##$YMAX_p= 283391938
##$YMIN_p= -24092710
$$ End of Bruker specific parameters
$$ ---------------------------------
##NTUPLES= NMR SPECTRUM
##VAR_NAME=  FREQUENCY,     SPECTRUM/REAL,   SPECTRUM/IMAG
##SYMBOL=    X,             R,               I
##VAR_TYPE=  INDEPENDENT,   DEPENDENT,       DEPENDENT
##VAR_FORM=  AFFN,          ASDF,            ASDF
##VAR_DIM=   65536,         65536,           65536
##UNITS=     HZ,            ARBITRARY UNITS, ARBITRARY UNITS
##FACTOR=    0.620285442955139, 1,           1
##FIRST=     20137.2065510682, 0,            0
##LAST=      -20513.1999529968, 0,           0
##MIN=       -20513.1999529968, -24092710,   0
##MAX=       20137.2065510682, 283391938,    0
$$ Real data points
##PAGE= N=1
##DATA TABLE= (X++(R..R)), XYDATA
$$ [...]
43566a850621K16894K47033K42526J94518J08172J813r7977j64342j79646j42458
$$ -1850621 -1633727 -1386694 -1144168 -949650 -841478 -839665 -937642 -1101984 -1281630 -1424088
43556a424088o7598K1431J02987J64644K04139K25042K30450K18197J79838J04227
$$ -1424088 -1491686 -1470255 -1367268 -1202624 -998485 -773443 -542993 -324796 -144958 -40731
43546d0731j5654j75677l57185n29856o60545p24492p13698o38443n21661l89869
$$ -40731 -56385 -232062 -589247 -1119103 -1779648 -2504140 -3217838 -3856281 -4377942 -4767811
43536d767811k65910j66669j04613q9099j24415k05592l16324m32548n29953n89585
$$ -4767811 -5033721 -5200390 -5305003 -5394102 -5518517 -5724109 -6040433 -6472981 -7002934 -7592519
43526g592519n97721n43552m21360k37423j3461K20033M36146O18794P60764Q58731
$$ -7592519 -8190240 -8733792 -9155152 -9392575 -9406036 -9186003 -8749857 -8131063 -7370299 -6511568
43516f511568R11905R23295Q98850Q44135P62310O55038N23838L70001J94066
$$ -6511568 -5599663 -4676368 -3777518 -2933383 -2171073 -1516035 -992197 -622196 -428130
43507d28130l130k17733m39956o52781q33713r59930j014761r92382q98834p50076
$$ -428130 -431260 -648993 -1088949 -1741730 -2575443 -3535373 -4550134 -5542516 -6441350 -7191426
43497g191426n68224l76779j95969m0080Q2389J67167K13687K25955K12746J85106
$$ -7191426 -7759650 -8136429 -8332398 -8372478 -8290089 -8122922 -7909235 -7683280 -7470534 -7285428
43487g285428J51796J16196P7482L5093p852m5184p0750q0038o9140l3989K7789
$$ -7285428 -7133632 -7017436 -6939954 -6904861 -6912713 -6957897 -7028647 -7108685 -7177825 -7211814 -7184025
43476g184025J14128K18666L34485M57700N87079P20134Q49343R61478J040138
$$ -7184025 -7069897 -6851231 -6516746 -6059046 -5471967 -4751833 -3902490 -2941012 -1900874
43467a900874J070166J042786R59634Q32992O80880N20233L63427K20357J02621
$$ -1900874 -830708 212078 1171712 2004704 2685584 3205817 3569244 3789601 3892222
43458C892222K4179l898J8002P2199J26281J45261J06793R013j34336l05761m91573
$$ 3892222 3916401 3912503 3930505 4002704 4128985 4274246 4381039 4390052 4255716 3949955 3458382
43447C458382o80146q56005r97831j082633j092131j017387q61279o39632l79874
$$ 3458382 2778236 1922231 924400 -158233 -1250364 -2267751 -3129030 -3768662 -4148536
43438d148536j15246J24594L21403M69230N68281O17781O14300N56001M47601
$$ -4148536 -4263782 -4139188 -3817785 -3348555 -2780274 -2162493 -1548193 -992192 -544591
43429e44591L01233J33761l5476j84491k88933l26879k88055j81700l5985J12527
$$ -544591 -243358 -109597 -145073 -329564 -618497 -945376 -1233431 -1415131 -1451116 -1338589
43419a338589K33695L14065L56937L73084L68672L39077K73608J67750L2619j06739
$$ -1338589 -1104894 -790829 -433892 -60808 307864 646941 920549 1088299 1120918 1014179
43409A014179k22300k94081l14575k88065k29143j60570j07564q8762j09367j61423
$$ 1014179 791879 497798 183223 -104842 -333985 -494555 -602119 -690881 -800248 -961671
43399i61671k30364l01919l64835m09789m28230m13716l65077k89127k00965j20751
$$ -961671 -1192035 -1493954 -1858789 -2268578 -2696808 -3110524 -3475601 -3764728 -3965693 -4086444
43389d086444o6795m7162n4926p1509p7185o2123l1288o61J3222N449j0606q430
$$ -4086444 -4153239 -4200401 -4255327 -4326836 -4404021 -4466144 -4497432 -4498093 -4484871 -4479422 -4490028 -4498458
43377d498458L5406J24483K37946L41514M05014M14065L70895K88128J81900O7231
$$ -4498458 -4463052 -4338569 -4100623 -3759109 -3354095 -2940030 -2569135 -2281007 -2099107 -2031876
43367b031876m4777j48814k45596l39464m33688n26063o07726o66382o92627o86403
$$ -2031876 -2076653 -2225467 -2471063 -2810527 -3244215 -3770278 -4378004 -5044386 -5737013 -6423416
43357f423416o60122o35853o36062o71189p30123p79907p77150o87459n03177
$$ -6423416 -7083538 -7719391 -8355453 -9026642 -9756765 -10536672 -11313822 -12001281 -12504458
43348a2504458k49119K7606K77346M65407N79154O25062O20954N87720N42297
$$ -12504458 -12753577 -12725971 -12448625 -11983218 -11404064 -10779002 -10158048 -9570328 -9028031
43339i028031M93640M43448L91071L38870K94336K68519K72900L16392M02583
$$ -9028031 -8534391 -8090943 -7699872 -7361002 -7066666 -6798147 -6525247 -6208855 -5806272
43330e806272N27206O76785Q30019R62050J050031J077862J039226R39593P97322
$$ -5806272 -5279066 -4602281 -3772262 -2810212 -1760181 -682319 356907 1296500 2093822
43321B093822O41883N06584M16686L78813L78782L89689L85186L49977K82589
$$ 2093822 2735705 3242289 3658975 4037788 4416570 4806259 5191445 5541422 5824011
43312E824011J91012Q5772k5160j37764k51018l65638m82785o01798p17277q18101
$$ 5824011 6015023 6100795 6075635 5937871 5686853 5321215 4838430 4236632 3519355 2701254
43302B701254q90486r24005r16671q75569q12339p36151o48939n46677m25997
$$ 2701254 1810768 886763 -29908 -905477 -1717816 -2453967 -3102906 -3649583 -4075580
43293d075580k90580j51995k5141P6817J44456J71858J56727J01322J3111r5415
$$ -4075580 -4366160 -4518155 -4543296 -4466479 -4322023 -4150165 -3993438 -3892116 -3879005 -3974420
43283c974420k07780l05873l73855m02464l91758l51267k97234k46588k08971
$$ -3974420 -4182200 -4488073 -4861928 -5264392 -5656150 -6007417 -6304651 -6551239 -6760210
43274f760210j81261j49434r7342j6356R0135K08163L17506L96897M29789M09444
$$ -6760210 -6941471 -7090905 -7188247 -7204603 -7114468 -6906305 -6588799 -6191902 -5762113 -5352669
43264e352669L40418K34698J04754m2034k04630l85643n86733q03824j022808
$$ -5352669 -5012251 -4777553 -4672799 -4714833 -4919463 -5305106 -5891839 -6695663 -7718471
43255g718471j217183j350526j386244j302588j105399q29697n27252k46569j6762
$$ -7718471 -8935654 -10286180 -11672424 -12975012 -14080411 -14910108 -15437360 -15683929 -15700691
43246a5700691J56551K83925L80478M57161N17699N60341N82632N87161N84969
$$ -15700691 -15544140 -15260215 -14879737 -14422576 -13904877 -13344536 -12761904 -12174743 -11589774
43237a1589774N93207O27494O93742P84772Q82979R66708J017659J026995R96997
$$ -11589774 -10996567 -10369073 -9675331 -8890559 -8007580 -7040872 -6023213 -4996218 -3999221
43228c999221R36083Q50335P39098N99352M34906K61309J01737k2872j02313j39898
$$ -3999221 -3063138 -2212803 -1473705 -874353 -439447 -178138 -76401 -99273 -201586 -341484
43218c41484j49362j48472j52032j66353j86256j95693j72997j00127K8462K02916
$$ -341484 -490846 -639318 -791350 -957703 -1143959 -1339652 -1512649 -1612776 -1584314 -1381398
43208a381398M02686O04320P86743R33161J032708J083226J092610J075848J049347
$$ -1381398 -978712 -374392 412351 1345512 2378220 3461446 4554056 5629904 6679251
43199F679251J026469J016038J021734J040534J061615J068420J043780R74727
$$ 6679251 7705720 8721758 9743492 10784026 11845641 12914061 13957841 14932568
43191A4932568Q54544O83217M68241K24627k8680k74992n03012p03112q60792
$$ 14932568 15787112 16470329 16938570 17163197 17134517 16859525 16356513 15653401 14792609
43182A4792609r55663r69469q97693p56134n78173m04821k72603k04029k03938
$$ 14792609 13836946 12867477 11969784 11213650 10635477 10230656 9958053 9754024 9550086
43173I550086k62394l61781m84075o15346p47203q76249j002492j126692j246947
$$ 9550086 9287692 8925911 8441836 7826490 7079287 6203038 5200546 4073854 2826907
43164B826907j355415j436811j470366j435650j320794j129435q82498o13298
$$ 2826907 1471492 34681 -1435685 -2871335 -4192129 -5321564 -6204062 -6817360
43156f817360l58284j48121k266P2781Q3246M6124j5303p8548j28928j63334j88953
$$ -6817360 -7175644 -7323765 -7326031 -7253250 -7170004 -7123880 -7139183 -7217731 -7346659 -7509993 -7698946
43145g698946k17676k58731l12879l71052m17983m38944m26553l85149l30531
$$ -7698946 -7916622 -8175353 -8488232 -8859284 -9277267 -9716211 -10142764 -10527913 -10858444
43136a0858444k83940k62179k69484k96310l25101l37964l21307k66479j68807
$$ -10858444 -11142384 -11404563 -11674047 -11970357 -12295458 -12633422 -12954729 -13221208 -13390015
43127a3390015k7712J51212L53831N58176P39929Q79652R66466R96743R71657
$$ -13390015 -13417727 -13266515 -12912684 -12354508 -11614579 -10734927 -9768461 -8771718 -7800061
43118g800061Q97243P85375O52426N16028L92891K97591K39243K16655K17117
$$ -7800061 -6902818 -6117443 -5465017 -4948989 -4556098 -4258507 -4019264 -3802609 -3585492
43109c585492K22373K17985J99514J72665J49325J42061J58775J99472K56484
$$ -3585492 -3363119 -3145134 -2945620 -2772955 -2623630 -2481569 -2322794 -2123322 -1866838
43100a866838L17149L66663L90482L76842L18848K14811O7833j12933l09620m96065
$$ -1866838 -1549689 -1183026 -792544 -415702 -96854 117957 185790 72857 -236763 -732828
43090g32828o44142p33621p59353p31956o71994o00812n32670m72506m19985l75393
$$ -732828 -1376970 -2110591 -2869944 -3601900 -4273894 -4874706 -5407376 -5879882 -6299867 -6675260
43080f675260l41889l23278l21036l33784l58469l90806m24709m52826m69602
$$ -6675260 -7017149 -7340427 -7661463 -7995247 -8353716 -8744522 -9169231 -9622057 -10091659
43071a0091659m74803m73534m71208m67428m54942m25082l73947l02412k10279
$$ -10091659 -10566462 -11039996 -11511204 -11978632 -12433574 -12858656 -13232603 -13535015 -13745294
43062a3745294r1809O1470K52375M71296O96462R01126J062813J168931J216106
$$ -13745294 -13837103 -13775633 -13523258 -13051962 -12355500 -11454374 -10391561 -9222630 -8006524
43053h006524J205719J140916J028284Q81928P24802N84368M84219M36311M37974
$$ -8006524 -6800805 -5659889 -4631605 -3749677 -3024875 -2440507 -1956288 -1519977 -1082003
43044a082003M75508N32526N98371O71661P57076Q57948R69690J078080J163202
$$ -1082003 -606495 -73969 524402 1196063 1953139 2811087 3780777 4858857 6022059
43035F022059J206155J194378J122934R92879Q09870N84827L34896Q1831j52933
$$ 6022059 7228214 8422592 9545526 10538405 11348275 11933102 12267998 12349829 12196896
43026A2196896l54135n16916o48054p63354q79930j004523j124094j207037j217122
$$ 12196896 11842761 11325845 10677791 9914437 9034507 8029984 6905890 5698853 4481731
43017D481731j132384r56817p18650m58730k17564k7095R1999J30461R0966j0899
$$ 4481731 3349347 2392530 1673880 1215150 997586 970491 1062490 1192951 1283917 1273018
43007A273018j47883k86870l97851m61411m71361m32900l59087k67146j74537
$$ 1273018 1125135 838265 440414 -20997 -492358 -925258 -1284345 -1551491 -1726028
42998a726028r5204l7417m053N848m097k8370o0908r6800j32400j63137j81504
$$ -1726028 -1821232 -1858649 -1862702 -1856854 -1860951 -1889321 -1950229 -2047029 -2179429 -2342566 -2524070
42987b524070j78753j50077r8731l5305K6901P6384J05659J11753R5682O0757
$$ -2524070 -2702823 -2852900 -2951631 -2986936 -2960035 -2883651 -2777992 -2666239 -2570557 -2509800
42977b509800J0562n1359j19555j84988k36155k62339k56396k15766j42594m3802
$$ -2509800 -2499238 -2550597 -2670152 -2855140 -3091295 -3353634 -3610030 -3825796 -3968390 -4012192
42967d012192O9309J82386K80196L49254L80610L71765L26219K50328J49974L0574
$$ -4012192 -3942883 -3760497 -3480301 -3131047 -2750437 -2378672 -2052453 -1802125 -1652151 -1621577
42957a621577r9182k24676l29429m05079m57949n03370n49547n84051n74989m86860
$$ -1621577 -1720759 -1945435 -2274864 -2679943 -3137892 -3641262 -4190809 -4774860 -5349849 -5836709
42947e836709l00151k3099L08508O40490R13225J074971J094097R68317P26522
$$ -5836709 -6136860 -6159959 -5851451 -5210961 -4297736 -3222765 -2128668 -1160351 -433829
42938d33829M19071R8859j96199m48404o52316q03944q97650r31458r12663q56494
$$ -433829 -14758 84101 -112098 -560502 -1212818 -2016762 -2914412 -3845870 -4758533 -5615027
42928e615027p78761o89653n94309m98624m13566l52650l23674l21157l25775
$$ -5615027 -6393788 -7083441 -7677750 -8176374 -8589940 -8942590 -9266264 -9587421 -9913196
42919i913196l12874k65962j86990r5614j7080L2303N0606M3460J3040m6524j43926
$$ -9913196 -10226070 -10492032 -10679022 -10774636 -10791716 -10759413 -10708807 -10665347 -10652307 -10698831 -10842757
42908a0842757k80719m43606o03211p20237p57897o96183n40843l21223p7245
$$ -10842757 -11123476 -11567082 -12170293 -12890530 -13648427 -14344610 -14885453 -15206676 -15283921
42899a5283921J57385L66519N52230P25755Q94569J052700J179322J246606J232809
$$ -15283921 -15126536 -14760017 -14207787 -13482032 -12587463 -11534763 -10355441 -9108835 -7876026
42890g876026J133721R66143P61379N51961L58723J85719K5985j26671k69479
$$ -7876026 -6742305 -5776162 -5014783 -4462822 -4104099 -3918380 -3892395 -4019066 -4288545
42881d288545l92164m85036n45406n77677n89135n85646n69108n36779m83179
$$ -4288545 -4680709 -5165745 -5711151 -6288828 -6877963 -7463609 -8032717 -8569496 -9052675
42872i052675m04538l02990j86919o6994M8487J55199K50482L29535L83239L99637
$$ -9052675 -9457213 -9760203 -9947122 -10014116 -9965629 -9810430 -9559948 -9230413 -8847174 -8447537
42862h447537L68555K87110J62965J3158j41896k86575m15020n28537o27030p02032
$$ -8447537 -8078982 -7791872 -7628907 -7615749 -7757645 -8044220 -8459240 -8987777 -9614807 -10316839
42852a0316839p37536p17330o32034m81783k76279l5054K13038M34489O00590
$$ -10316839 -11054375 -11771705 -12403739 -12885522 -13161801 -13196855 -12983817 -12549328 -11948738
42843a1948738O97586P31965P27624P16070P24280P65415Q35754R18137R90142
$$ -11948738 -11251152 -10519187 -9791563 -9075493 -8351213 -7585798 -6750044 -5831907 -4841765
42834d841765J033623J041106J015635R64745Q93843Q04205O96092N73231M44655
$$ -4841765 -3808142 -2767036 -1751401 -786656 107187 911392 1607484 2180715 2625370
42825B625370L22874K19405J40080Q3075M1625R617j4697k9586l2744k1964O354
$$ 2625370 2948244 3167649 3307729 3390804 3432429 3442046 3427349 3397763 3365019 3343055 3349409
42814C349409N6454J28124K11380K86702L31223L25840K59358J30483n0339k60689
$$ 3349409 3405863 3533987 3745367 4032069 4363292 4689132 4948490 5078973 5028634 4767945
42804D767945m70908o53400p91034q79344r22822r29975r10850q76106q34882
$$ 4767945 4297037 3643637 2852603 1973259 1050437 120462 -790388 -1666494 -2501376
42795b501376p91391p43383o84919o11441n22481m19945l04767j76180l3920J19786
$$ -2501376 -3292767 -4036150 -4721069 -5332510 -5854991 -6274936 -6579703 -6755883 -6789803 -6670017
42785f670017K80577M42591N96887P29195Q21858Q61498Q47477P94312P26144
$$ -6670017 -6389440 -5946849 -5349962 -4620767 -3798909 -2937411 -2089934 -1295622 -569478
42776e69478O68084O39985O54246P15524Q19988R53894J092901J204436J254806
$$ -569478 98606 738591 1392837 2108361 2928349 3882243 4975144 6179580 7434386
42767G434386J219955J095112Q97786O62487M30173K36608J02174K5638j4075
$$ 7434386 8654341 9749453 10647239 11309726 11739899 11976507 12078681 12104319 12090244
42758A2090244m6185r1932j55253k27236k99143l71204m49585n36437o24035o98437
$$ 12090244 12044059 11952127 11796874 11569638 11270495 10899291 10449706 9913269 9289234 8590797
42748H590797p47977p68738p63934p39974p02938o57022o05310n52766n09335
$$ 8590797 7842820 7074082 6310148 5570174 4867236 4210214 3604904 3052138 2542803
42739B542803m89328n05497n61806o51086p59097q69891r67011j031511j042749
$$ 2542803 2053475 1547978 986172 335086 -424011 -1293902 -2260913 -3292424 -4335173
42730d335173r85005q55394o65518m35174j84443O8588L04776N02574O43592P21405
$$ -4335173 -5320178 -6175572 -6841090 -7276264 -7460707 -7392119 -7087343 -6584769 -5941177 -5219772
42720e219772P45126P33495P04085O65791O18599N58743M84622M00327L15478
$$ -5219772 -4474646 -3741151 -3037066 -2371275 -1752676 -1193933 -709311 -308984 6494
42711F494K41376J85120J45193J12106P4410K5889l1483r0779j46036j95745k42011
$$ 6494 247870 432990 578183 690289 764699 790588 759105 668326 522290 326545 84534
42700H4534k87591l33505l77749m14484m34279m26713l84921l09910k12727j14128
$$ 84534 -203057 -536562 -914311 -1328795 -1763074 -2189787 -2574708 -2884618 -3097345 -3211473
42690c211473m1158j9389o1578j57996k75848l70545m03491l56443k35386o4204
$$ -3211473 -3252631 -3272020 -3333598 -3491594 -3767442 -4137987 -4541478 -4897921 -5133307 -5197511
42680e197511J26052L06232M54441N59049O20698O51799O71207O94867P27498
$$ -5197511 -5071459 -4765227 -4310786 -3751737 -3131039 -2479240 -1808033 -1113166 -385668
42671c85668P60712P78140P63564P07111O07514M71383L11324J44091j1316j36882
$$ -385668 375044 1153184 1916748 2623859 3231373 3702756 4014080 4158171 4146855 4009973
42661D009973k20870k63358k77325k82442k94605l18781l50134l80929m06666
$$ 4009973 3789103 3525745 3248420 2965978 2671373 2352592 2002458 1621529 1214863
42652A214863m27541m46401m65565m83374m91489m75788m22288l24913j89531
$$ 1214863 787322 340921 -124644 -608018 -1099507 -1575295 -1997583 -2322496 -2512027
42643b512027l2224J24974K57614L41965L59739L04034J83582K2847j42841k76491
$$ -2512027 -2544251 -2419277 -2161663 -1819698 -1459959 -1155925 -972343 -949496 -1092337 -1368828
42633a368828l50792l56876l05894k22865j36841p2689m6675o5344j26043k17997
$$ -1368828 -1719620 -2076496 -2382390 -2605255 -2742096 -2814785 -2861460 -2926804 -3052847 -3270844
42623c270844l23852m22337m92804n21182n05450m58303m04986l75590l93572
$$ -3270844 -3594696 -4017033 -4509837 -5031019 -5536469 -5994772 -6399758 -6775348 -7168920
42614g168920m65437n77041o98361p93411q30748p92129o78495n11337l26657
$$ -7168920 -7634357 -8211398 -8909759 -9703170 -10533918 -11326047 -12004542 -12515879 -12842536
42605a2842536j61529l8776M1920J00994J65753K54885L69333M93268O02530O75033
$$ -12842536 -13004065 -13042841 -13000921 -12899927 -12734174 -12479289 -12109956 -11616688 -11014158 -10339125
42595a0339125O98427O72859O08893N22564M29948L42683K64873J92502J17254
$$ -10339125 -9640698 -8967839 -8358946 -7836382 -7406434 -7063751 -6798878 -6606376 -6489122
42586f489122L4460m9376j15739j41950j12918k8606R7812K48997M11993N79976
$$ -6489122 -6454662 -6504038 -6619777 -6761727 -6874645 -6903251 -6805439 -6556442 -6144449 -5564473
42576e564473P47578R05749J040364J133580J165155J114412R65720P16686L84308
$$ -5564473 -4816895 -3911146 -2870782 -1737202 -572047 542365 1508085 2224771 2609079
42567B609079M763l73288o99512r33891j055915j067206r87452q48114o86754
$$ 2609079 2613842 2240554 1541042 607151 -448764 -1515970 -2503422 -3351536 -4038290
42558d038290n40249m34496l74683l44077l13931k57941j62438k8989J28480K88970
$$ -4038290 -4578539 -5013035 -5387718 -5731795 -6045726 -6303667 -6466105 -6495094 -6366614 -6077644
42548f077644M30567N35768N94299O03252N65905M90322L87813K70986J51470
$$ -6077644 -5647077 -5111309 -4517010 -3913758 -3347853 -2857531 -2469718 -2198732 -2047262
42539b047262L7954o4331j51500k17272k51346k43402j90908j04366n002Q3738
$$ -2047262 -2009308 -2073639 -2225139 -2442411 -2693757 -2937159 -3128067 -3232433 -3237435 -3153697
42529c153697J45241J73984J72955J46140R1567J086j32106l04908n02624p04950
$$ -3153697 -3008456 -2834472 -2661517 -2515377 -2423810 -2422724 -2554830 -2859738 -3362362 -4067312
42519d067312q92986j051768j169337j236499j248309j204951j110428r69891
$$ -4067312 -4960298 -6012066 -7181403 -8417902 -9666211 -10871162 -11981590 -12951481
42511a2951481p87712n67989l17922n2233K05311M26449N88090O82227P20638
$$ -12951481 -13739193 -14307182 -14625104 -14677337 -14472026 -14045577 -13457487 -12775260 -12054622
42502a2054622P31471P48385P96814Q84063R98257J115907J213283J275946J302531
$$ -12054622 -11323151 -10574766 -9777952 -8893889 -7895632 -6779725 -5566442 -4290496 -2987965
42493b987965J301653J283807J252982J203074J120793R92582Q11630N82016L19122
$$ -2987965 -1686312 -402505 850477 2053551 3174344 4166926 4978556 5560572 5879694
42484E879694M7014k05402m08545n37593n79698n39808m39898l09978j76305n4736
$$ 5879694 5926708 5721306 5312761 4775168 4195470 3655662 3215764 2905786 2729481 2674745
42474B674745M6963J21264J54910J31211M0601j07684k82748m41802n46778n77575
$$ 2674745 2721708 2842972 2997882 3129093 3169694 3062010 2779262 2337460 1790682 1213107
42464A213107n35984m40948l19116j94487q1032J8289J05669J80105K32536K47670
$$ 1213107 677123 236175 -82941 -277428 -358460 -340171 -234502 -54397 178139 425809
42454D25809K10836J15788l0305k06718l84066n32244o27993o59259o26527n43493
$$ 425809 636645 752433 722128 515410 131344 -400900 -1028893 -1688152 -2314679 -2858172
42444b858172m37671l47532l12447l57951m84903o69509q72711j051247j165173
$$ -2858172 -3295843 -3643375 -3955822 -4313773 -4798676 -5468185 -6340896 -7392143 -8557316
42435h557316j182805j086379q78203n83293k44500Q9716L80330O08819P78943
$$ -8557316 -9740121 -10826500 -11704703 -12287996 -12532496 -12442780 -12062450 -11453631 -10674688
42426a0674688R08663J016980J112918J192038J241037J246456J202191J112266
$$ -10674688 -9766025 -8749045 -7636127 -6444089 -5203052 -3956596 -2754405 -1642139
42418a642139R88866Q48034P05965N77487M76118M13626L97646M28652M98834
$$ -1642139 -653273 194761 900726 1478213 1954331 2367957 2765603 3194255 3693089
42409C693089N93830O95752P86161Q49370Q75901Q63014Q09977P11195N54858
$$ 3693089 4286919 4982671 5768832 6618202 7494103 8357117 9167094 9878289 10433147
42400A0433147L30837M2430k87983o24505r30663j180505j361137j467534j496851
$$ 10433147 10763984 10806414 10518431 9893926 8963263 7782758 6421621 4954087 3457236
42391C457236j449015j332850j170124r91359q25899o94388o08478n74963n97975
$$ 3457236 2008221 675371 -494753 -1486112 -2312011 -3006399 -3614877 -4189840 -4787815
42382d787815o75922p95614r29024j037204j080989j033026q84782o46480l42971
$$ -4787815 -5463737 -6259351 -7188375 -8225579 -9306568 -10339594 -11224376 -11870856 -12213827
42373a2213827q739L17788O01328Q16668R52630J012434J011314R71795R16479
$$ -12213827 -12222566 -11904778 -11303450 -10486782 -9534152 -8521718 -7510404 -6538609 -5622130
42364e622130Q60920Q10509P62479P09693O43224N54652M39956L03330J56818
$$ -5622130 -4761210 -3950701 -3188222 -2478529 -1835305 -1280653 -840697 -537367 -380549
42355c80549J5010j11412k18945l10693l93525m74384n56319o35175o98487p28187
$$ -380549 -365539 -476951 -695896 -1006589 -1400114 -1874498 -2430817 -3065992 -3764479 -4492666
42345d492666p07840o32333n14137l79597k55107j52390o4566K3924J22298K25522
$$ -4492666 -5200506 -5832839 -6346976 -6726573 -6981680 -7134070 -7198636 -7174712 -7052414 -6826892
42335f826892L17793L82111M07883L93288L44062K71414J89964J15797O4618M9711
$$ -6826892 -6509099 -6126988 -5719105 -5325817 -4981755 -4710341 -4520377 -4404580 -4339962 -4290251
42325d290251P9121J52825K62145L92392N26491O46927P37049P84870P88961P60626
$$ -4290251 -4211130 -4058305 -3796160 -3403768 -2877277 -2230350 -1493301 -708431 80530 841156
42315H41156P17841O74211O31654N82089N15057M23828L05980J61255p952j92262
$$ 841156 1558997 2233208 2864862 3446951 3962008 4385836 4691816 4853071 4845119 4652857
42305D652857l72511n24518o30366o87104p05039o97292o70299o23169n55181
$$ 4652857 4280346 3755828 3125462 2438358 1733319 1036027 365728 -257441 -812622
42296h12622m74087l97620l45497l26183l27411l18439k64503j45460L2253K36737
$$ -812622 -1286709 -1684329 -2029826 -2356009 -2683420 -3001859 -3266362 -3411822 -3379569 -3142832
42286c142832M23778N54980O11519N97154N31169M38094L41205K61160K16276
$$ -3142832 -2719054 -2164074 -1552555 -955401 -424232 13862 355067 616227 832503
42277H32503K20497K78507L80303M98844N94166O25010N64329M11194J91974n0492
$$ 832503 1053000 1331507 1711810 2210654 2804820 3429830 3994159 4405353 4597327 4546835
42267D546835k73802m50207n72231o49489p00032p39856p74266p95139p86341
$$ 4546835 4273033 3822826 3250595 2601106 1901074 1161218 386952 -408187 -1194528
42258a194528p34228o35915n00077l41663j75297j0226J53035L23227N13371P30537
$$ -1194528 -1928756 -2564671 -3064748 -3406411 -3581708 -3591934 -3438899 -3115672 -2602301 -1871764
42248a871764R65991J193053J375034J478599J485217J395741J227924J009818
$$ -1871764 -905773 287280 1662314 3140913 4626130 6021871 7249795 8259613
42240H259613P72101N41355L35860J65055L2154o2714j21453j48676j51832j39937
$$ 8259613 9031714 9573069 9908929 10073984 10106138 10043424 9921971 9773295 9621463 9481526
42230I481526j22625j10690j16605j52566k26396l38153m79771o37418p94624
$$ 9481526 9358901 9248211 9131606 8979040 8752644 8414491 7934720 7297302 6502678
42221F502678r34793j042874j107150j121624j088157j015763r15905p96344o58812
$$ 6502678 5567885 4525011 3417861 2296237 1208080 192317 -723588 -1519932 -2178744
42212b178744n03084l34153j65814j6828R7380J70724K05786K08605J84887J40759
$$ -2178744 -2681828 -3015981 -3181795 -3198623 -3101243 -2930519 -2724733 -2516128 -2331241 -2190482
42202b190482Q5165K9163j8033n1733p0372p3127o1302m2419l0801m0653p5751
$$ -2190482 -2105317 -2076154 -2094187 -2145920 -2216292 -2289419 -2350721 -2393140 -2423941 -2464594 -2540345
42191b540345j24338j64098j74325j47318r1872k7195K8208O5304Q5945R7486
$$ -2540345 -2664683 -2828781 -3003106 -3150424 -3242296 -3269491 -3241283 -3175979 -3090034 -2992548
42181b992548J05322J08552J01560Q0529M9955K3348J6486L8728Q9667J62304
$$ -2992548 -2887226 -2778674 -2677114 -2596585 -2546630 -2523282 -2506796 -2468068 -2378401 -2216097
42171b216097K46832L29936L92275M11112L70448K72769J43261K1988n2975o2499
$$ -2216097 -1969265 -1639329 -1247054 -835942 -465494 -192725 -49464 -27476 -80451 -142950
42161a42950j3618O7099J49204K12469K51712K72983K86997L04404L33249L77372
$$ -142950 -156568 -89469 59735 272204 523916 796899 1083896 1388300 1721549 2098921
42151B098921M35269M99210N54331N78530N46166M37762K52623J6199k24928m19621
$$ 2098921 2534190 3033400 3587731 4166261 4712427 5150189 5402812 5419011 5194083 4774462
42141D774462n31234n48780m85982l71662k37864j10084j645Q6485J59955K22092
$$ 4774462 4243228 3694448 3208466 2836804 2598940 2488856 2487211 2573696 2733651 2955743
42131B955743K67717K83997K56659J75858L8627j49850l73380o02480p98444r25513
$$ 2955743 3223460 3507457 3764116 3939974 3978601 3828751 3455371 2852891 2054447 1128934
42121A128934r65498r25844q36181p35480o56740o16071o09829o18570o14393
$$ 1128934 163436 -762408 -1598589 -2334069 -2990809 -3606880 -4216709 -4835279 -5449672
42112e449672n69349m64242k95798p7804J65461M08589O29667Q09561R32858R94514
$$ -5449672 -6019021 -6483263 -6779061 -6856865 -6691404 -6282815 -5653148 -4843587 -3910729 -2916215
42102b916215J005903R90455R68924R45966R08496Q34665P04499N06708K43042
$$ -2916215 -1910312 -919857 49067 995033 1903529 2738194 3442693 3949401 4192443
42093D192443o8120l91459o81234q93406r98086r87828q80484p15858n45204m15351
$$ 4192443 4124323 3732864 3051630 2158224 1160138 172310 -708174 -1424032 -1969236 -2384587
42083b384587l53867l62574m21369m98113n58938n75947n31345m17811k36439
$$ -2384587 -2738454 -3101028 -3522397 -4020510 -4579448 -5155395 -5686740 -6104551 -6340990
42074f340990M705K89689N93682Q85579J134538J316881J419734J440904J386411
$$ -6340990 -6336285 -6046596 -5452914 -4567335 -3432797 -2115916 -696182 744722 2131133
42065B131133J266878J094240Q80231O36899L77125J13318j45197l93541o29703
$$ 2131133 3398011 4492251 5372482 6009381 6386506 6499824 6354627 5961086 5331383
42056E331383q50907j050656j219218j347539j431190j470798j469377j430995
$$ 5331383 4480476 3429820 2210602 863063 -568127 -2038925 -3508302 -4939297
42048d939297j362639j275849j183619j093906j005596r10055p95520o50038m62374
$$ -4939297 -6301936 -7577785 -8761404 -9855310 -10860906 -11770961 -12566481 -13216519 -13678893
42039a3678893k23571O8550M02539P48314J059630J286526J393341J372405J245987
$$ -13678893 -13902464 -13833914 -13431375 -12683061 -11623431 -10336905 -8943564 -7571159 -6325172
42030f325172J056237Q49158O60123N06959L92663L14341K71263K67022L06143
$$ -6325172 -5268935 -4419777 -3759654 -3252695 -2860032 -2545691 -2274428 -2007406 -1701263
42021a701263L88531N04758O34826P52613Q34604Q66458Q42234P58930O14189
$$ -1701263 -1312732 -807974 -173148 579465 1414069 2280527 3122761 3881691 4495880
42012D495880M10410J60627j09922l68322n82376p29736q03774q12966p74394
$$ 4495880 4906290 5066917 4956995 4588673 4006297 3276561 2472787 1659821 885427
42003H85427p06600o25638n43562m66970l96357l27877k56126j75115p8329L8710
$$ 885427 178827 -446811 -990373 -1457343 -1853700 -2181577 -2437703 -2612818 -2691147 -2652437
41993b652437J73643L15455M49130N63576O55822P28023P80096Q04416P87659
$$ -2652437 -2478794 -2163339 -1714209 -1150633 -494811 233212 1013308 1817724 2605383
41984B605383P19465O01996M53057L00460J72119Q8303N8404Q0075J38560K07348
$$ 2605383 3324848 3926844 4379901 4680361 4852480 4940783 4999187 5079262 5217822 5425170
41974E425170K53554K49271J84325P1834n8854j77401k64569l13729l25533l04724
$$ 5425170 5678724 5927995 6112320 6184154 6125300 5947899 5683330 5369601 5044068 4739344
41964D739344k62304k17502j93609k08531k66058l52583m40767m99436n06838
$$ 4739344 4477040 4259538 4065929 3857398 3591340 3238757 2797990 2298554 1791716
41955A791716m60547l76702k78216j80861q8108L285R4982J85052K72212L58775
$$ 1791716 1331169 954467 676251 495390 407282 410567 505549 690601 962813 1321588
41945A321588M46335N27252N80890N80737N09414L71245J92644Q888j54094k90478
$$ 1321588 1767923 2295175 2876065 3456802 3966216 4337461 4530105 4538993 4384899 4094421
41935D094421m11056n29767o51344p68433q67642r37641r73087r73892r43696
$$ 4094421 3683365 3153598 2502254 1733821 866179 -71462 -1044549 -2018441 -2962137
41926b962137q90640q29036p77345p49993p47077p50567p32508o71615n67257
$$ -2962137 -3852777 -4681813 -5459158 -6209151 -6956228 -7706795 -8439303 -9110918 -9678175
41917i678175m40839l23327k36948j82623j40048p8916K6542J87079L94881O26048
$$ -9678175 -10119014 -10442341 -10679289 -10861912 -11001960 -11080876 -11054334 -10867255 -10472374 -9846326
41907i846326Q47505J026405J138450J171267J122566R97290Q07549N74684L29434
$$ -9846326 -8998821 -7972416 -6833966 -5662699 -4540133 -3542843 -2735294 -2160610 -1831176
41898a831176J07913n5721j37518j31088n1814O4821J72188K27131K04879J07784
$$ -1831176 -1723263 -1778984 -1916502 -2047590 -2099404 -2034583 -1862395 -1635264 -1430385 -1322601
41888a322601l6697j87978l08041l73462l80088l41264k81591k27406j95810j86445
$$ -1322601 -1359298 -1547276 -1855317 -2228779 -2608867 -2950131 -3231722 -3459128 -3654938 -3841383
41878c841383j80803j51105p5326M9275K02412L49922M60193N17062N22163M88708
$$ -3841383 -4022186 -4173291 -4248617 -4199342 -3996930 -3647008 -3186815 -2669753 -2147590 -1658882
41868a658882M34022L75369L27909L01996L00061L16021L39005L59479L73223
$$ -1658882 -1224860 -849491 -521582 -219586 80475 396496 735501 1094980 1468203
41859A468203L79922L77276L55628K98293J88956K2312j88829m15247o21772p80590
$$ 1468203 1848125 2225401 2581029 2879322 3068278 3090590 2901761 2486514 1864742 1084152
41849A084152q79958r24621r29669r11690q80617q35142p64150o53653m94814
$$ 1084152 204194 -720427 -1650096 -2561786 -3442403 -4277545 -5041695 -5695348 -6190162
41840f190162k88714m7619K05493M39945O25529P43844P95352P96147P66850P22219
$$ -6190162 -6478876 -6526495 -6321002 -5881057 -5255528 -4511684 -3716332 -2920185 -2153335 -1431116
41830a431116O68453O08217N47503M96992M65271M49080M30263L84277K94709
$$ -1431116 -762663 -154446 393057 890049 1355320 1804400 2234663 2618940 2913649
41821B913649J62841O690j47219k73043l52585l79704l61524l15400k62759k22856
$$ 2913649 3076490 3083180 2935961 2662918 2310333 1930629 1569105 1253705 990946 768090
41811G68090k08746k25067k66662l18555l58972l65736l23980k31870j01970M1936
$$ 768090 559344 334277 67615 -250940 -609912 -975648 -1299628 -1531498 -1633468 -1591532
41801a591532J70965K57769K82048K35135J24279k4952j72275k74745l03335k54738
$$ -1591532 -1420567 -1162798 -880750 -645615 -521336 -546288 -718563 -993308 -1296643 -1551381
41791a551381j51149k8657P8100J46850J70756J55436J13869O1737J3426k1520
$$ -1551381 -1702530 -1731187 -1653087 -1506237 -1335481 -1180045 -1066176 -1004439 -991013 -1012533
41781a012533m0178m4257l5137j0008L7134J09986K03674L01815L79280M11163
$$ -1012533 -1052711 -1096968 -1132105 -1142113 -1104979 -994993 -791319 -489504 -110224 300939
41771C00939L84490L05651J97498Q7483m682p2065j17730j48810j71536j87974
$$ 300939 685429 991080 1188578 1276061 1271379 1199314 1081584 932774 761238 573264
41761E73264j94326j81692j39862o2490M9439J87492L37806M83161O05232O89039
$$ 573264 378938 197246 57384 -5106 44333 231825 569631 1052792 1658024 2347063
41751B347063P29569P36048P28756P28923P48314P84975Q25682Q51290Q41746
$$ 2347063 3076632 3812680 4541436 5270359 6018673 6803648 7629330 8480620 9322366
41742I322366P80028O55136M64201K13906p8689l86981o78566r21486j090956
$$ 9322366 10102394 10757530 11221731 11435637 11356948 10969967 10291401 9369915 8278959
41733H278959j174603j174989j108279r98456q68980p36051o06850m82974l67028
$$ 8278959 7104356 5929367 4821088 3822632 2953652 2217601 1610751 1127777 760749
41724G60749k69000k08420k08801k85588m34769o30476q33714j006329j121915
$$ 760749 491749 283329 74528 -211060 -645829 -1276305 -2110019 -3116348 -4238263
41715d238263j169185j148928j068392r37260p67601n76907l89776k33151j25130
$$ -4238263 -5407448 -6556376 -7624768 -8562028 -9329629 -9906536 -10296312 -10529463 -10654593
41706a0654593o4950l4088j0546J3706K6887Q445n2370j45619k44506l18508l45378
$$ -10654593 -10719543 -10753631 -10764177 -10750471 -10723584 -10715139 -10767509 -10913128 -11157634 -11476142 -11821520
41695a1821520l15698k30963r9547O5160K43110M05007N14091N36020M54246K82004
$$ -11821520 -12137218 -12368181 -12467728 -12402568 -12159458 -11754451 -11240360 -10704340 -10250094 -9968090
41685i968090O1994j47693k93942l44470k93242j56782L4042K43759M42152O11448
$$ -9968090 -9906096 -10053789 -10347731 -10692201 -10985443 -11142225 -11108183 -10864424 -10422272 -9810824
41675i810824P47315Q53669R35854R96761J035922J049162J028999R68029Q64488
$$ -9810824 -9063509 -8209840 -7273986 -6277225 -5241303 -4192141 -3163142 -2195113 -1330625
41666a330625P24822N59773L77766J82944j9302k14888l79455m85192n11241m50914
$$ -1330625 -605803 -46030 331736 514680 495378 280490 -98965 -584157 -1095398 -1546312
41656a546312l12370j14740J16032L49135N49604O81081P12874O29998M41380
$$ -1546312 -1858682 -1973422 -1857390 -1508255 -958651 -277570 435304 1065302 1506682
41647A506682J80902j00770l50773n28859o16137o14886n41318m16809k62773
$$ 1506682 1687584 1586814 1236041 707182 91045 -523841 -1065159 -1481968 -1744741
41638a744741j00062N0532J70104K45292K70049K43728J67824M5455j15220k96877
$$ -1744741 -1844803 -1794271 -1624167 -1378875 -1108826 -865098 -697274 -651819 -767039 -1063916
41628a063916m72922o13245o92910o98656o30720n01599l33966j56981Q45J20363
$$ -1063916 -1536838 -2150083 -2842993 -3541649 -4172369 -4673968 -5007934 -5164915 -5164070 -5043707
41618e043707J96651K36785K52983K56277K53488K47877K42787K45752K68433
$$ -5043707 -4847056 -4610271 -4357288 -4101011 -3847523 -3599646 -3356859 -3111107 -2842674
41609b842674L20395M01229M98097N90185O55229O74181O35015N36658L90514
$$ -2842674 -2522279 -2121050 -1622953 -1032768 -377539 296642 931657 1468315 1858829
41600A858829K17087L9871j19777k46466l34681l90945m30899m71909n26288n98552
$$ 1858829 2075916 2115787 1996010 1749544 1414863 1023918 593019 121110 -405178 -1003730
41590a003730o85921p80795q75162r64808j048814j122888j172564j173977j103819
$$ -1003730 -1689651 -2470446 -3345608 -4310416 -5359230 -6482118 -7654682 -8828659 -9932478
41581i932478r52906p36054m92563k74199j23381n2561l8183l3674P262J10380
$$ -9932478 -10885384 -11621438 -12114001 -12388200 -12511581 -12564142 -12602325 -12635999 -12628737 -12518357
41571a2518357K71748M60556O31931P45627P82823P52050O81411O03375N42080
$$ -12518357 -12246609 -11786053 -11154122 -10408495 -9625672 -8873622 -8192211 -7588836 -7046756
41562g046756N08324N00323N06215N07180M82600M17163L06417J57025j8339k06850
$$ -7046756 -6538432 -6038109 -5531894 -5024714 -4542114 -4124951 -3818534 -3661509 -3679848 -3886698
41552c886698l97590n78901p34593q43341q83268q39880p13020n19132k87691
$$ -3886698 -4284288 -4863189 -5597782 -6441123 -7324391 -8164271 -8877291 -9396423 -9684114
41543i684114n3561J52078L09343M12560M66256M76275M42896L62159K34456P2750
$$ -9684114 -9737675 -9585597 -9276254 -8863694 -8397438 -7921163 -7478267 -7116108 -6881652 -6808902
41533f808902r6562k40420l28726l42093k75722j38711N0460K69678M96389P07002
$$ -6808902 -6905464 -7145884 -7474610 -7816703 -8092425 -8231136 -8180676 -7910998 -7414609 -6707607
41523f707607Q75425R74906R84021Q93826P12466M65403J90827o9761k84093m39731
$$ -6707607 -5832182 -4857276 -3873255 -2979429 -2266963 -1801560 -1610733 -1680494 -1964587 -2404318
41513b404318n46252o26395p00739p75290q39235q73313q62256q03219p05955
$$ -2404318 -2950570 -3576965 -4277704 -5052994 -5892229 -6765542 -7627798 -8431017 -9136972
41504i136972n86675m60571l36724k16233r3505L9414J87057L46980N10757O67194
$$ -9136972 -9723647 -10184218 -10520942 -10737175 -10830680 -10791266 -10604209 -10257229 -9746472 -9079278
41494i079278Q03576R04582R52788R33057Q37998O70697M44952J85421p3328k92698
$$ -9079278 -8275702 -7371120 -6418332 -5485275 -4647277 -3976580 -3531628 -3346207 -3419535 -3712233
41484c712233m40886n02286m79396l88301k53793j07031J7493Q9324R1625K6315
$$ -3712233 -4153119 -4655405 -5134801 -5523102 -5776895 -5883926 -5866433 -5777109 -5685484 -5659169
41474e659169q9062k29831l71203m90055n64017n73501n08746l77261k04198k3191
$$ -5659169 -5748231 -5978062 -6349265 -6839320 -7403337 -7976838 -8485584 -8862845 -9067043 -9090234
41464i090234J36128K54566L21124L28662K75353J70905L8747r1367j95500k62576
$$ -9090234 -8954106 -8699540 -8378416 -8049754 -7774401 -7603496 -7564749 -7656116 -7851616 -8114192
41454h114192k92428k89504k58124k00256j13884P513J71411L78076O13078Q47474
$$ -8114192 -8406620 -8696124 -8954248 -9154504 -9268388 -9260875 -9089464 -8711388 -8098310 -7250836
41444g250836J047599J188648J262865J278076J249793J193275J118563J028214
$$ -7250836 -6203237 -5014589 -3751724 -2473648 -1223855 -30580 1087983 2116197
41436B116197R17939P81838O20614M46332K78321J32851J5131q0675j65428k48843
$$ 2116197 3034136 3815974 4436588 4882920 5161241 5294092 5309223 5228548 5063120 4814277
41426D814277l36289m27854n18368n98754o59785o97144p14240p19380p18403
$$ 4814277 4477988 4050134 3531766 2933012 2273227 1576083 861843 142463 -575940
41417e75940p08729o80116o21451n27615m02104k56287j07936K1020J09562J44959
$$ -575940 -1284669 -1964785 -2586236 -3113851 -3515955 -3772242 -3880178 -3859158 -3749596 -3604637
41407c604637J28648P6408J1933m2928p5548q2692o4259j7383O2241J72603K99484
$$ -3604637 -3475989 -3399581 -3387648 -3430576 -3506124 -3588816 -3653075 -3670458 -3608217 -3435614 -3136130
41396c136130M19483N10221N59749N69120N48722N12815M75268M46637M31459
$$ -3136130 -2716647 -2206426 -1646677 -1077557 -528835 -16020 459248 905885 1337344
41387A337344M26328M20321L98896L49555K66009J48795L297j62241l37183n08437
$$ 1337344 1763672 2183993 2582889 2932444 3198453 3347248 3350545 3188304 2851121 2342684
41377B342684o61694p84718q70830r19948r36259r24870q90308q36783p67448
$$ 2342684 1680990 896272 25442 -894506 -1830765 -2755635 -3645943 -4482726 -5250174
41368e250174o81860n74771m39429k73603q2672J22775L31679N34705P22871Q85415
$$ -5250174 -5932034 -6506805 -6946234 -7219837 -7302509 -7179734 -6848055 -6313350 -5590479 -4705064
41358d705064J010029J086276J110783J091159J044727R90774R40346Q91405Q33686
$$ -4705064 -3695035 -2608759 -1497976 -406817 637910 1628684 2569030 3460435 4294121
41349D294121P59252O69559N73317M77663L80452K69477J28808n1254k65344m89923
$$ 4294121 5053373 5722932 6296249 6773912 7154364 7423841 7552649 7501395 7236051 6746128
41339F746128o89298q29392q91619q77850q04559o93326n66100m45877l56315
$$ 6746128 6056830 5227438 4335819 3457969 2653410 1960084 1393984 948107 591792
41330E91792l15968l30579l90465m75355n62735o34004o76426o82447o48698n75942
$$ 591792 275824 -54755 -445220 -920575 -1483310 -2117314 -2793740 -3476187 -4124885 -4700827
41320d700827m69751l40942k04588p7288K6007R3840J18584R6700L0254p0915
$$ -4700827 -5170578 -5511520 -5716108 -5793396 -5767389 -5673549 -5554965 -5458265 -5428011 -5498926
41310e498926j88151k95195l62016l61241k76370j08720J20825L77194O21491
$$ -5498926 -5687077 -5982272 -6344288 -6705529 -6981899 -7090619 -6969794 -6592600 -5971109
41301e971109Q22002R62272J044044J084121J105811J128224J158105J187374
$$ -5971109 -5149107 -4186835 -3142791 -2058670 -952859 175365 1333470 2520844
41293B520844J197120J166484J082951R48909P80481N99339M23039K59478J07379
$$ 2520844 3717964 4884448 5967399 6916308 7696789 8296128 8719167 8978645 9086024
41284I086024l9137j84893l29571m66919n86867o78155p29432p29778o71215n53787
$$ 9086024 9046887 8861994 8532423 8065504 7478637 6800482 6071050 5341272 4670057 4116270
41274D116270l90592k09066m6377O0556Q7570L3250p8660k06850l07958l53589
$$ 4116270 3725678 3516612 3470235 3530791 3618361 3651611 3572951 3366101 3058143 2704554
41264B704554l40485k88081k24814j72444j38561j19966j10680j07142j08645
$$ 2704554 2364069 2075988 1851174 1678730 1540169 1420203 1309523 1202381 1093736
41255A093736j15989j30278j51283j75185j94413k02050j98770j96025k10738
$$ 1093736 977747 847469 696186 521001 326588 124538 -74232 -270257 -480995
41246d80995k54211l23177l99060m54251m60772l99339k68779r2028Q9142K32591
$$ -480995 -735206 -1058383 -1457443 -1911694 -2372466 -2771805 -3040584 -3132612 -3043470 -2810879
41236b810879L16956L49863L57381L63950L77598L88647L79794L39145K67717
$$ -2810879 -2493923 -2144060 -1786679 -1422729 -1045131 -656484 -276690 62455 330172
41227C30172J77453Q2820o616q7133j56375k08907k36280k31695j95909j39989
$$ 330172 507625 590445 583829 496696 340321 131414 -104866 -336561 -532470 -672459
41217f72459q2549m2643l2251n2001r1550j33969j62128j63833j32893o6960L3678
$$ -672459 -755008 -797651 -829902 -881903 -973453 -1107422 -1269550 -1433383 -1566276 -1633236 -1599558
41206a599558J64147L13717M70074O27190P88333R59211J136480J301757J425615
$$ -1599558 -1435411 -1121694 -651620 -24430 763903 1723114 2859594 4161351 5586966
41197E586966J477740J436907J297526J072030P88248M81850J87032o9653k70489
$$ 5586966 7064706 8501613 9799139 10871169 11659417 12141267 12328299 12258646 11988157
41188A1988157m05718m74169m84848m55653m07536l57520l15099k82428k55304
$$ 11988157 11582439 11108270 10623422 10167769 9760233 9402713 9087614 8805186 8549882
41179H549882k23885j75798j03613j2985P5521J34112J41147R2389M104r3588
$$ 8549882 8325997 8150199 8046586 8033601 8109122 8243234 8384381 8476770 8480874 8387286
41169H387286j70297k09221k13727k03027k01050k26705k90291l93738n30106
$$ 8387286 8216989 8007768 7794041 7591014 7389964 7163259 6872968 6479230 5949124
41160E949124o82200q24334r29547r79132r68784r07862q12628o97263n67337
$$ 5949124 5266924 4442590 3513043 2533911 1565127 657265 -155363 -852626 -1419963
41151a419963m19119k44848m1156J83362M05110N89873P05120P34962O87865N90365
$$ -1419963 -1839082 -2083930 -2125086 -1941724 -1536614 -946741 -241621 493341 1181206 1771571
41141A771571M71248L49056K31670J24628L7487j7789l3138q313N0741J36607
$$ 1771571 2242819 2591875 2823545 2948173 2985660 2967871 2934733 2926420 2977161 3113768
41131C113768K43832L68743N06451O47765P78550Q81980R41950R45715Q85930
$$ 3113768 3357600 3726343 4232794 4880559 5659109 6541089 7483039 8428754 9314684
41122I314684P63443N90311L89550J88537Q256j44656k77316m02238n27632o52397
$$ 9314684 10078127 10668438 11057988 11246525 11254781 11110125 10832809 10430571 9902939 9250542
41112I250542p67091q58044r11395r15697q63299p50693n77785l46979o3686K61001
$$ 9250542 8483451 7625407 6714012 5798315 4935016 4184323 3606538 3259559 3195873 3456874
41102C456874O07707R49509J256991J504807J676317J765152J774475J714555
$$ 3456874 4064581 5014090 6271081 7775888 9452205 11217357 12991832 14706387
41094A4706387J598840J439664J245620J021810P72410N04258K29939l0989k53638
$$ 14706387 16305227 17744891 18990511 20012321 20784731 21288989 21518928 21487939 21234301
41085B1234301m12284m87071m71833l79964k43780j05045q00M7139L3986l2633
$$ 21234301 20822017 20334946 19863113 19483149 19239369 19134324 19133524 19180663 19214649 19182016
41075A9182016j37765k61187l77469m57640m75324m16449k86437j07860R1521
$$ 19182016 19044251 18783064 18405595 17947955 17472631 17056182 16769745 16661885 16753406
41066A6753406K91469M83112O63332Q27492R67472J075032J146335J184322J197801
$$ 16753406 17044875 17527987 18191319 19018811 19986283 21061315 22207650 23391972 24589773
41057B4589773J197782J193300J189895J191529J202500J225213J254368J273378
$$ 24589773 25787555 26980855 28170750 29362279 30564779 31789992 33044360 34317738
41049C4317738J258564J190501J065797R01787P31867N95011N24296N37021O27562
$$ 34317738 35576302 36766803 37832600 38734387 39466254 40061265 40585561 41122582 41750144
41040D1750144P66349R08754J012686J055939J043117R98962R53909R30802R38953
$$ 41750144 42516493 43425247 44437933 45493872 46536989 47535951 48489860 49420662 50359615
41031E0359615R76668J038897J123483J230682J357008J490794J615571J719137
$$ 50359615 51336283 52375180 53498663 54729345 56086353 57577147 59192718 60911855
41023F0911855J800053J866429J929760J999881K083593K185122K306006K444184
$$ 60911855 62711908 64578337 66508097 68507978 70591571 72776693 75082699 77526883
41015G7526883K593228K742136K876054K978466L035332L040634L001401K939240
$$ 77526883 80120111 82862247 85738301 88716767 91752099 94792733 97794134 100733374
41007A00733374K886109K875014K929602L056837L244108L460007L658709L788349
$$ 100733374 103619483 106494497 109424099 112480936 115725044 119185051 122843760 126632109
40999A26632109L802035L667472L371844K921149K335184J640168Q62659K8515
$$ 126632109 130434144 134101616 137473460 140394609 142729793 144369961 145232620 145261135
40991A45261135q32809j683676k479109l173933l732212m134503m380749m488363
$$ 145261135 144428326 142744650 140265541 137091608 133359396 129224893 124844144 120355781
40983A20355781m485985m404858m271016m100956l901919l676185l426788l160952
$$ 120355781 115869796 111464938 107193922 103092966 99191047 95514862 92088074 88927122
40975H8927122k889191k621587k364988k123233j899769j700100j531421j398307
$$ 88927122 86037931 83416344 81051356 78928123 77028354 75328254 73796833 72398526
40967G2398526j297507j218220j150717j096734j070159j084586j137698j206552
$$ 72398526 71101019 69882799 68732082 67635348 66565189 65480603 64342905 63136353
40959F3136353j257823j264292j215500j117394r84486q31551o69218n03583l37903
$$ 63136353 61878530 60614238 59398738 58281344 57296858 56465307 55796089 55292506 54954603
40950E4954603j75085k0261J17759K27460K97568L20094K92666K20702J19058
$$ 54954603 54779518 54759257 54877016 55104476 55402044 55722138 56014804 56235506 56354564
40941E6354564J1323p3807j07353o4850O8062K90017N82864R18983J273111J629724
$$ 56354564 56365887 56292080 56184727 56119877 56187939 56477956 57060820 57979803 59252914 60882638
40931F0882638J981715K324994K655590K969720L263063L528662L757509L944044
$$ 60882638 62864353 65189347 67844937 70814657 74077720 77606382 81363891 85307935
40923H5307935M092632M219057M345740M494394M679677M904996N161494N432463
$$ 85307935 89400567 93619624 97965364 102459758 107139435 112044431 117205925 122638388
40915A22638388N702865N968243O236001O518063O821247P142562P471392P795139
$$ 122638388 128341253 134309496 140545497 147063560 153884807 161027369 168498761 176293900
40907A76293900Q103326Q387574Q638193Q840609Q973782R010132Q916130Q655246
$$ 176293900 184397226 192784800 201422993 210263602 219237384 228247516 237163646 245818892
40899B45818892Q195627P520602O635813N568953M364001L074118J755003M58929
$$ 245818892 254014519 261535121 268170934 273739887 278103888 281178006 282933009 283391938
40891B83391938p69015j891121k875177l693423m323595m751513m974582n004147
$$ 283391938 282622923 280731802 277856625 274163202 269839607 265088094 260113512 255109365
40883B55109365m863215m578756m174386l670259l089139k460631j818700j196189
$$ 255109365 250246150 245667394 241493008 237822749 234733610 232272979 230454279 229258090
40875B29258090o21616j17461L04234O48450R39121J210068J486258J765260K011206
$$ 229258090 228636474 228519013 228823247 229471697 230410818 231620886 233107144 234872404 236883610
40866B36883610K166797K177038K011037J671276J188646O07654l2280p11773
$$ 236883610 239050407 241227445 243238482 244909758 246098404 246706058 246673778 245962005
40858B45962005j434325k213967l055526l941271m831894n678355o435183p068643
$$ 245962005 244527680 242313713 239258187 235316916 230485022 224806667 218371484 211302841
40850B11302841p558743p897296q084689q127143q035078p822743p509357p121594
$$ 211302841 203744098 195846802 187762113 179634970 171599892 163777149 156267792 149146198
40842A49146198o695433o274064n899873n602745n390335n246203n137947n031597
$$ 149146198 142450765 136176701 130276828 124674083 119283748 114037545 108899598 103868001
40834A03868001m904721m751183m576201m386721m184515l966389l729994l479982
$$ 103868001 98963280 94212097 89635896 85249175 81064660 77098271 73368277 69888295
40826F9888295l229713k997292k798313k639177k514698k411826k317643k226431
$$ 69888295 66658582 63661290 60862977 58223800 55709102 53297276 50979633 48753202
40818D8753202k140717k065806k002439j942284j867797j755841j585039j346062
$$ 48753202 46612485 44546679 42544240 40601956 38734159 36978318 35393279 34047217
40810C4047217j050678p33143m41135k20102r9301q6028j68927l26121n32338
$$ 34047217 32996539 32263396 31822261 31602159 31502858 31416830 31247903 30921782 30389444
40801C0389444p62213r91169j197131j363843j483436j555408j582395j566180
$$ 30389444 29627231 28636062 27438931 26075088 24591652 23036244 21453849 19887669
40793A9887669j507673j411374j290871j170060j076940j031752j035823j068485
$$ 19887669 18379996 16968622 15677751 14507691 13430751 12398999 11363176 10294691
40785A0294691j095560j085750j025344r22119p96916o69750n49981m35526l19958
$$ 10294691 9199131 8113381 7088037 6165918 5369002 4699252 4149271 3713745 3393787
40776C393787k02168r1994p524L4536K8317j8689q9999j66334k29905k66896k68812
$$ 3393787 3191619 3099625 3092101 3126637 3154954 3136265 3046266 2879932 2650027 2383131 2114319
40765B114319k32241j57849n1345P3624J95325K90238L42349L48126L14026K50033
$$ 2114319 1882078 1724229 1672884 1746508 1941833 2232071 2574420 2922546 3236572 3486605
40755C486605J64089N9627o3224k02437l47415m76510n62805n85858n41772m45195
$$ 3486605 3650694 3710321 3647097 3444660 3097245 2620735 2057930 1472072 930300 485105
40745D85105l22130j97789q6203J2567J06495K02156K99398L92993M76937N45436
$$ 485105 162975 -34814 -121017 -108450 -1955 200201 499599 892592 1369529 1914965
40735A914965N90277O00183N66125M89472L85763K80451J99336J59173J62371
$$ 1914965 2505242 3105425 3671550 4161022 4546785 4827236 5026572 5185745 5348116
40726E348116J97550K46083K91805L28067L57451L85140M11710M30259M28723
$$ 5348116 5545666 5791749 6083554 6411621 6769072 7154212 7565922 7996181 8424904
40717H424904L95375L24802K20949R4917m0662j75350k99923m04331m80164n27072
$$ 8424904 8820279 9145081 9366030 9460947 9420285 9244935 8945012 8540681 8060517 7533445
40707G533445n56100n84553o25215o78055p30291p63923p64797p27638o55755
$$ 7533445 6977345 6392792 5767577 5089522 4359231 3595308 2830511 2102873 1447118
40698A447118n58671m51106l53007k87133k72284l15272m07188n26961o50078
$$ 1447118 888447 437341 84334 -202799 -475083 -790355 -1197543 -1724504 -2374582
40689b374582p57122q37291q86030q99741q72413p96624o68133m90932k79534
$$ -2374582 -3131704 -3968995 -4855025 -5754766 -6627179 -7423803 -8091936 -8582868 -8862402
40680h862402n6494J54127L33692M71714N63484O06173N97835N40341M43510L26776
$$ -8862402 -8918896 -8764769 -8431077 -7959363 -7395879 -6789706 -6191871 -5651530 -5208020 -4881244
40670d881244K15442J31242Q1540N4893K7745k1752j02657k09665l29236m47029
$$ -4881244 -4665802 -4534560 -4453020 -4398127 -4370382 -4392134 -4494791 -4704456 -5033692 -5480721
40660e480721n52027o37146o98329p33485p40946p16864o53171n39777l72196
$$ -5480721 -6032748 -6669894 -7368223 -8101708 -8842654 -9559518 -10212689 -10752466 -11124662
40651a1124662j59925P1892K89640M62352N70714O11930O00671N64907N35825
$$ -11124662 -11284587 -11212695 -10923055 -10460703 -9889989 -9278059 -8677388 -8112481 -7576656
40642g576656N35548N69294O25639O83204P19480P18503O75039N94079M87079
$$ -7576656 -7041108 -6471814 -5846175 -5162971 -4443491 -3724988 -3049949 -2455870 -1968791
40633a968791L68208K52714J56221R2716P1295R3966J56091K48545L59766M77002
$$ -1968791 -1600583 -1347869 -1191648 -1098932 -1027637 -933671 -777580 -529035 -169269 307733
40623C07733N87670O80889P48054P81615P74087P20335O22587M93150L50738K12636
$$ 307733 895403 1576292 2324346 3105961 3880048 4600383 5222970 5716120 6066858 6279494
40613F279494Q9120j6451j04369j75934k31893k70394k84791k64013j97093q0119
$$ 6279494 6368614 6352163 6247794 6071860 5839967 5569573 5284782 5020769 4823676 4743557
40603D743557P8097K55254M20917N45709O08975O00341N16352L58845J40144j08838
$$ 4743557 4821654 5076908 5497825 6043534 6652509 7252850 7769202 8128047 8268191 8159353
40593H159353l38670m96466n49238m99148l79536k36117j08535k2983O056k6094
$$ 8159353 7820683 7324217 6774979 6275831 5896295 5660178 5551643 5528660 5534716 5508622
40583E508622j12629k34661l66975m87820n85468o58205p11832p58957q18104
$$ 5508622 5395993 5161332 4794357 4306537 3721069 3062864 2351032 1592075 773971
40574G73971r07216j032039j177491j310170j391507j393664j308984j148703
$$ 773971 -133245 -1165284 -2342775 -3652945 -5044452 -6438116 -7747100 -8895803
40566h895803r33312o82596m12894j41485J10075L20650M79272N90560O70687
$$ -8895803 -9829115 -10511711 -10924605 -11066090 -10956015 -10635365 -10156093 -9565533 -8894846
40557h894846P37824Q03888Q71332R35290R89357J031047J062511J086237J101025
$$ -8894846 -8157022 -7353134 -6481802 -5546512 -4557155 -3526108 -2463597 -1377360 -276335
40548b76335J102871J089334J062568J028816R95206R65010R33054Q85451Q07112
$$ -276335 826536 1915870 2978438 4007254 5002460 5967470 6900524 7785975 8593087
40539H593087O93376N55838M16327K93901J95892J18504N3183q422p3006j44475
$$ 8593087 9286463 9842301 10258628 10552529 10748421 10866925 10920108 10911686 10838680 10694205
40529A0694205k20638k90857l40091l59598l56525l53226l74773m33157n19296
$$ 10694205 10473567 10182710 9842619 9483021 9126496 8773270 8398497 7965340 7446044
40520G446044o08005o71826o94282o74492o22006n47666m57660l53056k31967
$$ 7446044 6838039 6166213 5471931 4797439 4175433 3627767 3170107 2817051 2585084
40511B585084r1293P1439K54108M44758O18974P43382P85014P22813N56433L08536
$$ 2585084 2493791 2565230 2819338 3264096 3883070 4626452 5411466 6134279 6690712 6999248
40501F999248J9468k63899n00880o66500p54662p75213p47799o95780o41371o01626
$$ 6999248 7018716 6754817 6253937 5587437 4832775 4057562 3309763 2613983 1972612 1370986
40491A370986n85214n90820o07652o17658n99934n38430m31985l00866j82931
$$ 1370986 785772 194952 -412700 -1030358 -1630292 -2168722 -2600707 -2901573 -3084504
40482c084504j18092j29119k10587l32779m56656n49106n89674n68364m81049
$$ -3084504 -3202596 -3331715 -3542302 -3875081 -4331737 -4880843 -5470517 -6038881 -6519930
40473f519930l28739j21134J20020L62106N68416P08160P65594P43841O60980
$$ -6519930 -6848669 -6969803 -6849783 -6487677 -5919261 -5211101 -4445507 -3701666 -3040686
40464c040686N40252L99922K48837Q9791p2715k26888l55255m42065m79681m68312
$$ -3040686 -2500434 -2100512 -1851675 -1761884 -1834599 -2061487 -2416742 -2858807 -3338488 -3806800
40454c806800m10816l09717j70124m394J68242L28220M63205N71224O58034P30900
$$ -3806800 -4217616 -4527333 -4697457 -4701851 -4533609 -4205389 -3742184 -3170960 -2512926 -1782026
40444a782026P92440Q38653Q63057Q63600Q45570Q17346P83067P38777O74155
$$ -1782026 -989586 -150933 712124 1575724 2421294 3238640 4021707 4760484 5434639
40435E434639N77256M39731K61655N4279j62428l67538n47427o98630q24106r26652
$$ 5434639 6011895 6451626 6713281 6767560 6605132 6237594 5690167 4991537 4167431 3240779
40425C240779j004277j049622j052888j006779r11908p80393o34907n01431l98425
$$ 3240779 2236502 1186880 133992 -872787 -1784695 -2565088 -3199995 -3701426 -4099851
40416d099851l28956k81356k37363j81461j06212j2929R0434J92984K84500L56260
$$ -4099851 -4428807 -4710163 -4947526 -5128987 -5235199 -5248128 -5157694 -4964710 -4680210 -4323950
40406d323950L98233L96451L35809K08781K4373j88877l87933n26497n69092n03968
$$ -4323950 -3925717 -3529266 -3193457 -2984676 -2960303 -3149180 -3537113 -4063610 -4632702 -5136670
40396e136670l49641j50409L9504J76690K43112K46500K08379J50110Q5998K3799
$$ -5136670 -5486311 -5636720 -5597216 -5420526 -5177414 -4930914 -4722535 -4572425 -4486427 -4462628
40386d462628l3068q4870j34718j85847k38356k87195l21273l23852k76824j69940
$$ -4462628 -4495696 -4580566 -4715284 -4901131 -5139487 -5426682 -5747955 -6071807 -6348631 -6518571
40376f518571j0384J74739L46003M64954N05760M60740L39531J64507l4678k25930
$$ -6518571 -6528955 -6354216 -6008213 -5543259 -5037499 -4576759 -4237228 -4072721 -4107399 -4333329
40366d333329l79360m72196m92792m42025l32213j85369l1055R8476J77503J97248
$$ -4333329 -4712689 -5184885 -5677677 -6119702 -6451915 -6637284 -6668339 -6569863 -6392360 -6195112
40356f195112J70616J26269R4376R3099J24398J79850K49003L22624L90672M40859
$$ -6195112 -6024496 -5898227 -5803851 -5710752 -5586354 -5406504 -5157501 -4834877 -4444205 -4003346
40346d003346M61558M46627L97755L23548K37496J56089R5940O9692Q2058J27540
$$ -4003346 -3541788 -3095161 -2697406 -2373858 -2136362 -1980273 -1884333 -1814641 -1732583 -1605043
40336a605043J90194K45635K66055K28305J22388m3745k46134m53225o37055p81761
$$ -1605043 -1414849 -1169214 -903159 -674854 -552466 -596211 -842345 -1295570 -1932625 -2714386
40326b714386q85341r54554r96821j013665r97861r34558q06406o02370l27559
$$ -2714386 -3599727 -4554281 -5551102 -6564767 -7562628 -8497186 -9303592 -9905962 -10233521
40317a0233521q330L12134N87260P82738Q86024R05759Q64074P88065P04223O34892
$$ -10233521 -10241851 -9929717 -9342457 -8559719 -7673695 -6767936 -5903862 -5115797 -4411574 -3776682
40307c776682N94451N86003O01764O28191O52276O64705O59188O31050N77484
$$ -3776682 -3182231 -2596228 -1994464 -1366273 -713997 -49292 609896 1240946 1818430
40298A818430M99021M00029K87218J66738M1996q5238k09814l17966l88076l99971
$$ 1818430 2317451 2717480 3004698 3171436 3213432 3128194 2918380 2600414 2212338 1812367
40288A812367l47350k43602j15913Q060J11193J89068K45093K85014L14637L38935
$$ 1812367 1465017 1221415 1105502 1113562 1224755 1413823 1658916 1943930 2258567 2597502
40278B597502L59488L71862L67303L39066K87643K19967J44731O9455N95n6624
$$ 2597502 2956990 3328852 3696155 4035221 4322864 4542831 4687562 4757017 4757612 4700988
40268D700988r9606j27900j39530j28725q9869k5050N2370J21908J64181J67252
$$ 4700988 4601382 4473482 4333952 4205227 4115358 4090308 4142678 4264586 4428767 4596019
40258D596019J28722N4447m5035j59546k83660m16951n58587o99694q20824q99739
$$ 4596019 4724741 4779188 4734153 4574607 4290947 3873996 3315409 2615715 1794891 895152
40248H95152r25949r10477q81216q65627q73147q89189q83300q24549o94576m92146
$$ 895152 -30797 -941274 -1822490 -2688117 -3561264 -4450453 -5333753 -6158302 -6852878 -7345024
40238g345024k29259P5455L99731P16362R93419J201229J323366J363086J339580
$$ -7345024 -7574283 -7498828 -7099097 -6382735 -5389316 -4188087 -2864721 -1501635 -162055
40229a62055J276292J188575J077114R30479P35705M90870K11314p4539l35332
$$ -162055 1114237 2302812 3379926 4310405 5046110 5536980 5748294 5673755 5338423
40220E338423n44810o84390p43722p23058o36038n08106l69174k44477j48788
$$ 5338423 4793613 4109223 3365501 2642443 2006405 1498299 1129125 884648 735860
40211G35860q5568m9049k7177n526K7739P7658J42237K16599K97934L86679M83089
$$ 735860 650292 601243 574066 568540 596279 673937 816174 1032773 1330707 1717386 2200475
40200B200475N82823O75553P47509P85558P80207P26628O24654M79241L01702
$$ 2200475 2783298 3458851 4206360 4991918 5772125 6498753 7123407 7602648 7904350
40191G904350J09912p4925k34767l60463m52447n16439n58682n84459n98744o05116
$$ 7904350 8014262 7939337 7704570 7344107 6891660 6375221 5816539 5232080 4633336 4028220
40181D028220o01800n78699n20578m16929k72536j10493L5347J33372J63832J20791
$$ 4028220 3426420 2847721 2327143 1910214 1637678 1527185 1562532 1695904 1859736 1980527
40171A980527R136j58009l59705n67757p50271q78652r35841r21687q51656p48762
$$ 1980527 1989663 1831654 1471949 904192 153921 -724731 -1660572 -2582259 -3433915 -4182677
40161d182677o33824n20360m15423l22648k43675j77847j21801o9568j3598N2039
$$ -4182677 -4816501 -5336861 -5752284 -6074932 -6318607 -6496454 -6618255 -6687823 -6701421 -6649382
40151f649382J26540J98871K49855K59652K16586J23482k48j21822k03650k14356
$$ -6649382 -6522842 -6323971 -6074116 -5814464 -5597878 -5474396 -5474644 -5596466 -5800116 -6014472
40141f014472j37044K7858K63312N37241Q05799J021607J146918J166349J091722
$$ -6014472 -6151516 -6123658 -5860346 -5323105 -4517306 -3495699 -2348781 -1182432 -90710
40132i0710R55678P97709O51160N37895M69967M51724M77730N29336N76870N89761
$$ -90710 864968 1662677 2313837 2851732 3321699 3773423 4251153 4780489 5357359 5947120
40122E947120N48730M51797L11152J45218k8145j94567l43807m69986n71599o50010
$$ 5947120 6495850 6947647 7258799 7404017 7375872 7181305 6837498 6367512 5795913 5145903
40112E145903p06495p39731p45533p18902o56816n60635m37937l03415j77525
$$ 5145903 4439408 3699677 2954144 2235242 1578426 1017791 579854 276439 98914
40103I8914q2053l3689l8750r1352j75000k65979l37640l65785l34967k43827
$$ 98914 16861 -16828 -55578 -146930 -321930 -587909 -925549 -1291334 -1626301 -1870128
40093a870128j07101M7626J88457K90404L43771L54462L36421L02701K61568K18088
$$ -1870128 -1977229 -1929603 -1741146 -1450742 -1106971 -752509 -416088 -113387 148181 366269
40083C66269J77081J45101J31558J47685K00715K85221L79540M52820M78447M43948
$$ 366269 543350 688451 820009 967694 1168409 1453630 1833170 2285990 2764437 3208385
40073C208385L52420K18579O4172q6338k10879k95420l37844l47907l42458l37699
$$ 3208385 3560805 3779384 3843556 3757218 3546339 3250919 2913075 2565168 2222710 1885011
40063A885011l42985l60034l86896m21866m63712n09051n49789n72598n61318
$$ 1885011 1542026 1181992 795096 373230 -90482 -599533 -1149322 -1721920 -2283238
40054b283238n02923l95031k49681q9069O4533J97334L05521L90232M50309M77029
$$ -2283238 -2786161 -3181192 -3430873 -3519942 -3455409 -3258075 -2952554 -2562322 -2112013 -1634984
40044a634984M53948L63751K00141k2407k69122m96961o70342p70636p96237p57889
$$ -1634984 -1181036 -817285 -617144 -639551 -908673 -1405634 -2075976 -2846612 -3642849 -4400738
40034d400738o74843n71819m73798l98591l51730l27784l17094l12715l12708
$$ -4400738 -5075581 -5647400 -6121198 -6519789 -6871519 -7199303 -7516397 -7829112 -8141820
40025h141820l16973l22051l18893k95933k44873j64145n7789O7941K06973L54067
$$ -8141820 -8458793 -8780844 -9099737 -9395670 -9640543 -9804688 -9862477 -9794536 -9587563 -9233496
40015i233496N04799O54934P98618R26107J022863J071020J053198R59168P94765
$$ -9233496 -8728697 -8073763 -7275145 -6349038 -5326175 -4255155 -3201957 -2242789 -1448024
40006a448024N87961L84359K30345J53527J54994K18374L25757M65389O26366
$$ -1448024 -860063 -475704 -245359 -91832 63162 281536 607293 1072682 1699048
39997A699048P89556R26971J011911J031006R88331Q99566P81965O46917M98225
$$ 1699048 2488604 3415575 4427486 5458492 6446823 7346389 8128354 8775271 9273496
39988I273496L35111J56828l4557k34559m38128o39898q31981j002092j135009
$$ 9273496 9608607 9765435 9730878 9496319 9058191 8418293 7586312 6584220 5449211
39979E449211j217507j243705j217689j152162j063671r66363q67491p67824o66553
$$ 5449211 4231704 2987999 1770310 618148 -445523 -1411886 -2279377 -3047201 -3713754
39970c713754n65966m70998l84452l04053k25571j49140q1753l3001p720j603
$$ -3713754 -4279720 -4750718 -5135170 -5439223 -5664794 -5813934 -5895687 -5928688 -5936408 -5938011
39960e938011k559L302K4214N7611R0447J05534R0390M3546k4798r7122j55094
$$ -5938011 -5940570 -5937268 -5913054 -5855443 -5764996 -5659462 -5569072 -5525526 -5550324 -5647446 -5802540
39949e802540j85558j84574j59345j27479j12174j32884j95167k86525l82197
$$ -5802540 -5988098 -6172672 -6332017 -6459496 -6571670 -6704554 -6899721 -7186246 -7568443
39940g568443m57362m97439n00337m70847m12143l20806j89680j7572J81555L78567
$$ -7568443 -8025805 -8523244 -9023581 -9494428 -9906571 -10227377 -10417057 -10434629 -10253074 -9874507
39930i874507N40391O45075O90182O89491O61844O20574N70193N10408M42094
$$ -9874507 -9334116 -8689041 -7998859 -7309368 -6647524 -6026950 -5456757 -4946349 -4504255
39921d504255L69539K98546K34308J81757J46670J34569J47433J81134K25648
$$ -4504255 -4134716 -3836170 -3601862 -3420105 -3273435 -3138866 -2991433 -2810299 -2584651
39912b584651K67929K95802L01026K79610K29288J46886K9287j21302k91319m54249
$$ -2584651 -2316722 -2020920 -1719894 -1440284 -1210996 -1064110 -1034823 -1156125 -1447444 -1901693
39902a901693n76552o29864o03463n09182l74392k27231q4250N1627J83856L13309
$$ -1901693 -2478245 -3108109 -3711572 -4220754 -4595146 -4822377 -4906627 -4855000 -4671144 -4357835
39892d357835M34122N35278O04771O33234O16100N54661M56357L33818K02506
$$ -4357835 -3923713 -3388435 -2783664 -2150430 -1534330 -979669 -523312 -189494 13012
39883A3012P7904k6575j00946j40525j48206j35086j17295j10115j23034j58405
$$ 13012 90916 64341 -36605 -177130 -325336 -460422 -577717 -687832 -810866 -969271
39873i69271k13242k81413l54343m20608m66887m82008m62495m14595l49623k75988
$$ -969271 -1182513 -1463926 -1818269 -2238877 -2705764 -3187772 -3650267 -4064862 -4414485 -4690473
39863d690473j95487j07249j4048P6655J57793K27206K85982L32585L59341L54642
$$ -4690473 -4885960 -4993209 -5007257 -4930602 -4772809 -4545603 -4259621 -3927036 -3567695 -3213053
39853c213053L08384K16384Q2037q3705k63085m33708n72871o62910o94770o67934
$$ -3213053 -2904669 -2688285 -2606248 -2689953 -2953038 -3386746 -3959617 -4622527 -5317297 -5985231
39843e985231n87372m60208k94601j01698J00924K88250M32876N15247N32398
$$ -5985231 -6572603 -7032811 -7327412 -7429110 -7328186 -7039936 -6607060 -6091813 -5559415
39834e559415M97746M31028L45524K41995J13621m1616k09945l60756m57414m73244
$$ -5559415 -5061669 -4630641 -4285117 -4043122 -3929501 -3971117 -4181062 -4541818 -4999232 -5472476
39824e472476m02147k57923o4783J53873L82298O11990Q35229J037633J196195
$$ -5472476 -5874623 -6132546 -6197329 -6043456 -5661158 -5049168 -4213939 -3176306 -1980111
39815a980111J285150J285793J194310J023965Q01141N56807L17731J02892p4249
$$ -1980111 -694961 590832 1785142 2809107 3610248 4167055 4484786 4587678 4513429
39806D513429k03378k79394l05435k90804k45284j77570j00075l2794O82j6921
$$ 4513429 4310051 4030657 3725222 3434418 3189134 3011564 2911489 2878695 2879377 2862456
39796B862456q8190j98795l21914m27699m94102n13591m92794m47714l98400l63808
$$ 2862456 2774266 2575471 2253557 1825858 1331756 818165 325371 -122343 -520743 -884551
39786h84551l56643l80573m31960n03135n83076o56771p08384p28008p15684o78825
$$ -884551 -1241194 -1621767 -2053727 -2556862 -3139938 -3796709 -4505093 -5233101 -5948785 -6627610
39776f627610o26873n68323n09863m54680m00674l41478k70343j82921p6935M9014
$$ -6627610 -7254483 -7822806 -8332669 -8787349 -9188023 -9529501 -9799844 -9982765 -10059700 -10010686
39766a0010686J93766L48643M93226N97237O30566N76788M41411K49167L3174
$$ -10010686 -9816920 -9468277 -8975051 -8377814 -7747248 -7170460 -6729049 -6479882 -6446708
39757f446708j75915l55155m89530n70858n97495n74342n11480m20610l10617
$$ -6446708 -6622623 -6977778 -7467308 -8038166 -8635661 -9210003 -9721483 -10142093 -10452710
39748a0452710j85867n0129Q6178K02428K72936K77846K11778Q5521p7274k44633
$$ -10452710 -10638577 -10688706 -10602528 -10400100 -10127164 -9849318 -9637540 -9552019 -9629293 -9873926
39738i873926l81989m60822m68615m14259l24069k29391j52576r9200o0134k0177
$$ -9873926 -10255915 -10716737 -11185352 -11599611 -11923680 -12153071 -12305647 -12404847 -12464981 -12485158
39728a2485158L3819J09545K08788L26422M49252N57974O32816O59635O33948
$$ -12485158 -12451339 -12341794 -12133006 -11806584 -11357332 -10799358 -10166542 -9506907 -8872959
39719h872959N63312M67333L72335L00553K60562K46563K46415K50671K55546
$$ -8872959 -8309647 -7842314 -7469979 -7169426 -6908864 -6662301 -6415886 -6165215 -5909669
39710e909669K59382K57129K37903J88075R8014l2685j94844l71686n38812o63284
$$ -5909669 -5650287 -5393158 -5155255 -4967180 -4869166 -4901851 -5096695 -5468381 -6007193 -6670477
39700f670477p08487o47228m75568k16272R1258M06986P01536R57947J166789
$$ -6670477 -7378964 -8026192 -8501760 -8718032 -8626774 -8219788 -7518252 -6560305 -5393516
39691e393516J320762J412289J433557J377439J240274J027895P61971M79687
$$ -5393516 -4072754 -2660465 -1226908 150531 1390805 2418700 3180671 3660358
39683C660358K23362K5548j00082j57512j61390j31423r0049n9413n5090p9973
$$ 3660358 3883720 3909268 3809186 3651674 3490284 3358861 3268812 3209399 3154309 3074336
39673C074336j24428j73623k15940k45952k61883k62358k45278k07829j46771
$$ 3074336 2949908 2776285 2560345 2314393 2052510 1790152 1544874 1337045 1190274
39664A190274o0612M6357J62041K70200L57727M19531M57664M76452M77713M58793
$$ 1190274 1129662 1176019 1338060 1608260 1965987 2385518 2843182 3319634 3797347 4256140
39654D256140M14219L39957K37799J16837q854j24381k17105k77223k97192k72728
$$ 4256140 4670359 5010316 5248115 5364952 5356098 5231717 5014612 4737389 4440197 4167469
39644D167469k06242j09911l679R2738J68173K21099K52128K55449K18689J32942
$$ 4167469 3961227 3851316 3847637 3940375 4108548 4329647 4581775 4837224 5055913 5188855
39634E188855M364j43421k78914l76560m24863m25662l88832l27218k52972j74799
$$ 5188855 5193219 5049798 4770884 4394324 3969461 3543799 3154967 2827749 2574777 2399978
39624B399978r6415j6733O8739J65139K73577L86120M85172N49705N64668N27443
$$ 2399978 2303563 2286830 2355569 2520708 2794285 3180405 3665577 4215282 4779950 5307393
39614E307393M48881L50067K55378J82354J33340R5956N3165n825q3311j79446
$$ 5307393 5756274 6106341 6361719 6544073 6677413 6773369 6826534 6820709 6737398 6557952
39604F557952k98551m47796o28835q29346j021388j168498j238031j212945j098463
$$ 6557952 6259401 5811605 5182770 4353424 3332036 2163538 925507 -287438 -1385901
39595a385901r21253p21005n36885l95009l03454k56281k41197k44102k49126
$$ -1385901 -2307154 -3028159 -3565044 -3960053 -4263507 -4519788 -4760985 -5005087 -5254213
39586e254213k38709j97891j21133j5683J02423K16524L14540L88291M31569M42764
$$ -5254213 -5492922 -5690813 -5811946 -5827629 -5725206 -5508682 -5194142 -4805851 -4374282 -3931518
39576c931518M30449M14023M15459M47820N09701N88679O68975P37421P85655
$$ -3931518 -3501069 -3087046 -2671587 -2223767 -1714066 -1125387 -456412 281009 1066664
39567A066664Q10118Q11906P96948P75395P58415P52527P54411P49919P18488
$$ 1066664 1876782 2688688 3485636 4261031 5019446 5771973 6526384 7276303 7994791
39558G994791O40969N07263L20685R7579j37033l54982n29427o38289o68264o19207
$$ 7994791 8635760 9143023 9463708 9561287 9424254 9069272 8539845 7901556 7233292 6614085
39548F614085n06056l54971j93853m1914R5266K22231L45043M64220N73275O61593
$$ 6614085 6108029 5753058 5559205 5517291 5612557 5834788 6179831 6644051 7217326 7878919
39538G878919P18187P34649P07089O36549N27855L88478K28640O1083j01898k52622
$$ 7878919 8597106 9331755 10038844 10675393 11203248 11591726 11820366 11881449 11779551 11526929
39528A1526929l89334n13634o28188p37725q50414r74848j112991j254795j378696
$$ 11526929 11137595 10623961 9995773 9258048 8407634 7432786 6319795 5065000 3686304
39519C686304j457320j465645j389533j232281j015006p68795n22455k93850q9583
$$ 3686304 2228984 763339 -626194 -1858475 -2873481 -3642276 -4164731 -4458581 -4548164
39510d548164Q9241K41415L64129M54919N13744N42469N41415N05746M26127K96098
$$ -4548164 -4458923 -4217508 -3853379 -3398460 -2884716 -2342247 -1800832 -1295086 -868959 -572861
39500e72861J22568o8723k38411l47178l69730l02488j63962J0249J77183L00525
$$ -572861 -450293 -519016 -757427 -1104605 -1474335 -1776823 -1940785 -1930536 -1753353 -1452828
39490a452828L64649L80387L76707L81840M05807M35922M47262M19715L49934
$$ -1452828 -1088179 -707792 -331085 50755 456562 892484 1339746 1759461 2109395
39481B109395K51645J46256N1146k6882r0063j43072j87709k23405k52384k83294
$$ 2109395 2361040 2507296 2558442 2531560 2441497 2298425 2110716 1887311 1634927 1351633
39471A351633l28223l94528m78741n68830o52891p25659p86392q30813q46348
$$ 1351633 1023410 628882 150141 -418689 -1071580 -1797239 -2583631 -3414444 -4260792
39462d260792q16230p29084n86284m03143k05444k4198J10628J77560J70677J03314
$$ -4260792 -5077022 -5806106 -6392390 -6795533 -7000977 -7025175 -6914547 -6736987 -6566310 -6462996
39452f462996N894q2609j26962j06265j7657J27030L06726M94043O57237P66298
$$ -6462996 -6457102 -6539711 -6666673 -6772938 -6790595 -6663565 -6356839 -5862796 -5205559 -4439261
39442d439261Q03981P74865P04147O25201N63763N28499N12005M98935M74524
$$ -4439261 -3635280 -2860415 -2156268 -1531067 -967304 -438805 73200 572135 1046659
39433A046659M28815L56132K52643J15265n6667k57702m73061o78675q46032r50484
$$ 1046659 1475474 1831606 2084249 2199514 2142847 1885145 1412084 733409 -112623 -1063107
39423a063107r79512r37760q47080p41137o54950o12597o19139o61775p18987
$$ -1063107 -2042619 -2980379 -3827459 -4568596 -5223546 -5836143 -6455282 -7117057 -7836044
39414g836044p70534q01701q01355p58966o66069n23115l46514j68568k7031N0415
$$ -7836044 -8606578 -9408279 -10209634 -10968600 -11634669 -12157784 -12504298 -12672866 -12699897 -12649482
39404a2649482N7215Q788o5000j30880j63565j54818j15453o7114k7788q95K4903
$$ -12649482 -12592267 -12583479 -12648479 -12779359 -12942924 -13097742 -13213195 -13280309 -13308097 -13308992 -13284089
39393a3284089O6663J35936K31888L40996M41877N11546N30056M83525L67611
$$ -13284089 -13217426 -13081490 -12849602 -12508606 -12066729 -11555183 -11025127 -10541602 -10173991
39384a0173991J91771j8950k27661l94161m84322m77206l69178j75097P4162L38861
$$ -10173991 -9982220 -10001170 -10228831 -10622992 -11107314 -11584520 -11953698 -12128795 -12054633 -11715772
39374a1715772N81249P76260R16570J009159J066190J096883J104737J088751
$$ -11715772 -11134523 -10358263 -9441693 -8432534 -7366344 -6269461 -5164724 -4075973
39366d075973J044484R63850Q36699O57098M32557J89619l0178j83915k43285
$$ -4075973 -3031489 -2067639 -1230940 -573842 -141285 48334 18156 -165759 -409044
39357d09044k03926q3974Q5306K70816M46076N94865P10197P90741Q37636Q53484
$$ -409044 -612970 -696944 -611638 -340822 105254 700119 1410316 2201057 3038693 3892177
39347C892177Q42942Q13354P74360P35935P04563O79047O49225O00043N19364
$$ 3892177 4735119 5548473 6322833 7058768 7763331 8442378 9091603 9691646 10211010
39338A0211010M04631K64176J12547l6819j76637l05773m25962n39440o48836
$$ 10211010 10615641 10879817 10992364 10955545 10778908 10473135 10047173 9507733 8858897
39329H858897p56707q62630r60216j037355j079627j073998j012130q94417p34231
$$ 8858897 8102190 7239560 6279344 5241989 4162362 3088364 2076234 1181817 447586
39320D47586n58577m02345k97056k58243k76904l20277l43763l09324k00890k9437
$$ 447586 -110991 -513336 -810392 -1068635 -1345539 -1665816 -2009579 -2318903 -2519793 -2549230
39310b549230J73142L67295N20544O18065O64613O77137O72430O56711O22611
$$ -2549230 -2376088 -2008793 -1488249 -870184 -205571 471566 1143996 1800707 2423318
39301B423318N54608M39591K76261P8293j29344l17874m62846n50650n80860n62752
$$ 2423318 2977926 3417517 3693778 3772071 3642727 3324853 2862007 2311357 1730497 1167745
39291A167745n08879m31632l45207k68434k22799k25758k84092l90884n26434
$$ 1167745 658866 227234 -117973 -386407 -609206 -834964 -1119056 -1509940 -2036374
39282b036374o62650p70215q26236q19167p50113o31964m87288l44009k28729
$$ -2036374 -2699024 -3469239 -4295475 -5114642 -5864755 -6496719 -6984007 -7328016 -7556745
39273g556745j59818j43264j72709k33437l08640l85169m56038n19343n75537
$$ -7556745 -7716563 -7859827 -8032536 -8265973 -8574613 -8959782 -9415820 -9935163 -10510700
39264a0510700o24498o62084o76679o49033n58369l92679j56499J29164M33674
$$ -10510700 -11135198 -11797282 -12473961 -13122994 -13681363 -14074042 -14230541 -14101377 -13667703
39255a3667703P25056R75565J164413J279243J317219J285222J198960J080778
$$ -13667703 -12942647 -11967082 -10802669 -9523426 -8206207 -6920985 -5722025 -4641247
39247d641247R55541Q44317P57745O92811O36076N72821M97092M15983L44435
$$ -4641247 -3685706 -2841389 -2083644 -1390833 -754757 -181936 315156 731139 1075574
39238A075574K93817K62778K37292J99160J36167M7567n7052j64073k63723l54539
$$ 1075574 1369391 1632169 1869461 2068621 2204788 2252355 2195303 2031230 1767507 1412968
39228A412968m40655n23907n97772o48583o62783o34912n72199m94008m25490
$$ 1412968 972313 448406 -149366 -797949 -1460732 -2095644 -2667843 -3161851 -3587341
39219c587341l87417l88025m22394m78485n43441o05458o52841o74319o61976
$$ -3587341 -3974758 -4362783 -4785177 -5263662 -5807103 -6412561 -7065402 -7739721 -8401697
39210h401697o14534n38096m42993l37883k24869r9885M0745J91619L33714M38197
$$ -8401697 -9016231 -9554327 -9997320 -10335203 -10560072 -10659957 -10619212 -10427593 -10093879 -9655682
39200i655682M78483M45946L60814K69598K26955K70965M06689O07250Q28682
$$ -9655682 -9177199 -8731253 -8370439 -8100841 -7873886 -7602921 -7196232 -6588982 -5760300
39191e760300J026845J167473J229003J202232J089265R01210O54616L68192O1469
$$ -5760300 -4733455 -3565982 -2336979 -1134747 -45482 855728 1510344 1878536 1940005
39182A940005k44918n28263p63520r25397r94384r65132q52113o87381n10447
$$ 1940005 1695087 1166824 403304 -522093 -1516477 -2481609 -3333722 -4021103 -4531550
39173d531550l55559k43320j80040j62636j82891k26688k70613k83243k35130
$$ -4531550 -4887109 -5130429 -5310469 -5473105 -5655996 -5882684 -6153297 -6436540 -6671670
39164f671670j12543P4565K95508N10316O83574P94655Q40487Q30289P76857O91136
$$ -6671670 -6784213 -6709648 -6414140 -5903824 -5220250 -4425595 -3585108 -2754819 -1977962 -1286826
39154a286826N82604M61872L40668K28861J31672M9310k1394q4472j42133j92957
$$ -1286826 -704222 -242350 98318 327179 458851 508161 486767 402295 260162 67205
39144F7205k32556k56662k64060k56627k36751k05699j65595j23545r3700r4576
$$ 67205 -165351 -422013 -686073 -942700 -1179451 -1385150 -1550745 -1674290 -1767990 -1862566
39134a862566j42559k44494l92308n62864p25065q51484r27299r50751r26975
$$ -1862566 -2005125 -2249619 -2641927 -3204791 -3929856 -4781340 -5708639 -6659390 -7586365
39125g586365q62000p61527o33695m92275l57272k50865j89517j77106k04415
$$ -7586365 -8448365 -9209892 -9843587 -10335862 -10693134 -10943999 -11133516 -11310622 -11515037
39116a1515037k54817l10477l54996l74183l58426l06090k24516j27164k8762
$$ -11515037 -11769854 -12080331 -12435327 -12809510 -13167936 -13474026 -13698542 -13825706 -13854468
39107a3854468N8603J27031J72895J97543K09481K25024K63471L37834M47964
$$ -13854468 -13795865 -13668834 -13495939 -13298396 -13088915 -12863891 -12600420 -12262586 -11814622
39098a1814622N81398P20254Q48783R58881J052978J142190J238050J341899J440247
$$ -11814622 -11233224 -10512970 -9664187 -8705306 -7652328 -6510138 -5272088 -3930189 -2489942
39089b489942J509767J527201J476946J353596J161139R10688O17924L01311j8429
$$ -2489942 -980175 547026 2023972 3377568 4538707 5449395 6067319 6368630 6350201
39080F350201l19151n80353p87811r36431j028634j068983j059253r98528q89325
$$ 6350201 6031050 5450697 4662886 3726455 2697821 1628838 569585 -428943 -1318268
39071a318268p44694n88474m45369l27036k25084j16827K0689J97866M06937O23649
$$ -1318268 -2062962 -2651436 -3096805 -3423841 -3648925 -3765752 -3745063 -3547197 -3140260 -2516611
39061b516611Q14478R48093J007847R98780R43933Q72415Q07446P60874P33922
$$ -2516611 -1702133 -754040 253807 1252587 2196520 3068935 3876381 4637255 5371177
39052E371177P20182P08597O87159O48088N92908N33489M86045M60189M51120
$$ 5371177 6091359 6799956 7487115 8135203 8728111 9261600 9747645 10207834 10658954
39043A0658954M42530M18552L74105L14867K49202J81563J12863M4882j7178o6303
$$ 10658954 11101484 11520036 11894141 12209008 12458210 12639773 12752636 12797518 12780340 12714037
39033A2714037r7446j10307j09486j02959j01237j17188j63073k42902l45391
$$ 12714037 12616591 12506284 12396798 12293839 12192602 12075414 11912341 11669439 11324048
39024A1324048m46614n23690n68783n90915o05363o22507o46297o79762p27046
$$ 11324048 10877434 10353744 9784961 9194046 8588683 7966176 7319879 6640117 5913071
39015E913071p87184q46296q78480q57405p70423o25504m47912k70122j20460
$$ 5913071 5125887 4279591 3401111 2543706 1773283 1147779 699867 429745 309285
39006C09285j4663M6654P4144Q2551Q4750Q9036R8579J11745J23704J29344J25441
$$ 309285 294622 341276 415420 497971 582721 671757 770336 882081 1005785 1135129 1260570
38995A260570J10009P9467K7159n3853j64117k91406m09661m85460m89700m09440
$$ 1260570 1370579 1450046 1477205 1423352 1259235 967829 558168 72708 -416992 -826432
38985h26432k54993n8984J33623K81164L58762L62389L03458K00954P7322m2403
$$ -826432 -1081425 -1140409 -1006786 -725622 -366860 -4471 298987 499941 577263 534860
38975E34860j32817j73557j55234q2302K7890J48857K50954L09584L13889K71245
$$ 534860 402043 228486 73252 -9050 18840 167697 418651 728235 1042124 1313369
38965A313369K03243J34477Q1722N0720L9978M4604N5714N8262L3148l4895j47857
$$ 1313369 1516612 1651089 1732811 1783531 1823509 1868113 1923827 1982089 2015237 1980342 1832485
38954A832485k89449m28322n29168n66244n31446m33067k89118j22263M1985J78375
$$ 1832485 1543036 1114714 585546 19302 -512144 -945211 -1234329 -1356592 -1314607 -1136232
38944a136232K69212L10953L12885K87783K43130J80595J02122J4288p3574j53794
$$ -1136232 -867020 -556067 -243182 44601 287731 468326 570448 584736 511162 357368
38934C57368k21330k71126k96645k92108k55890j91761j08152j7381O5355J24506
$$ 357368 136038 -135088 -431733 -723841 -979731 -1171492 -1279644 -1297025 -1231670 -1107164
38924a107164J47771J28423O5693l5274j63125l01599m34360n51440o51764p38096
$$ -1107164 -959393 -830970 -765277 -800551 -963676 -1265275 -1699635 -2251075 -2902839 -3640935
38914c640935q07893q48782q44173p84995o77538n41362m00214k72997j68961
$$ -3640935 -4448828 -5297610 -6141783 -6926778 -7604316 -8145678 -8545892 -8818889 -8987850
38905h987850q6995j7869N1493J32696K30981L41853M50986N39244N91785O05749
$$ -8987850 -9074845 -9092714 -9041221 -8908525 -8677544 -8335691 -7884705 -7345461 -6753676 -6147927
38895f147927N90438N60190N26155M93073M61637M32649M09000L93735L85266
$$ -6147927 -5557489 -4997299 -4471144 -3978071 -3516434 -3083785 -2674785 -2281050 -1895784
38886a895784L73150L38163K58213J18322p9328l10088n30980o95019p69216p44998
$$ -1895784 -1522634 -1184471 -926258 -807936 -887264 -1197352 -1728332 -2423351 -3192567 -3937565
38876c937565o34502m57295k29604L5772L20834N94349Q12906R32627R26026P95079
$$ -3937565 -4572067 -5029362 -5258966 -5223194 -4902360 -4308011 -3495105 -2562478 -1636452 -841373
38866h41373N73688L18319R1079n8210j05404n7769M9640J67067K49570K75082
$$ -841373 -267685 50634 141713 83503 -21901 -79670 -30030 137037 386607 661689
38856F61689K51663K09683J84077J97420K51917L31425M09434M58227M55695L88534
$$ 661689 913352 1123035 1307112 1504532 1756449 2087874 2497308 2955535 3411230 3799764
38846C799764K52809N4300j90419m53851p01096q97414j017375j052162j012794
$$ 3799764 4052573 4106873 3916454 3462603 2761507 1864093 846718 -205444 -1218238
38837a218238r28036q36531p74105p60390p91276q41748q77086q65203p84314
$$ -1218238 -2146274 -2982805 -3756910 -4517300 -5308576 -6150324 -7027410 -7892613 -8676927
38828h676927o25945l95960j13465J94412N00303P81233J016930J185829J265857
$$ -8676927 -9302872 -9698832 -9812297 -9617885 -9117582 -8336349 -7319419 -6133590 -4867733
38819d867733J242152J117125R15619O80402M58311K83327J65939R4744M7419
$$ -4867733 -3625581 -2508456 -1592837 -912435 -454124 -170797 -4858 89886 137305
38810A37305K131n6876j38292k43021l63010m83153n88296o71409p36036p90018
$$ 137305 139436 82560 -55732 -298753 -661763 -1144916 -1733212 -2404621 -3140657 -3930675
38800c930675q35615q64777q63667q22172p40392o27965m98168l61405k21933
$$ -3930675 -4766290 -5631067 -6494734 -7316906 -8057298 -8685263 -9183431 -9544836 -9766769
38791i766769p9624O4203K01449L17395L96985M31913M23227L79068L10680K28437
$$ -9766769 -9846393 -9782190 -9580741 -9263346 -8866361 -8434448 -8011221 -7632153 -7321473 -7093036
38781g093036J37808L7151p9767k17075l71286n30792o78321p92867q52356q40637
$$ -7093036 -6955228 -6918077 -6997844 -7214919 -7586205 -8116997 -8795318 -9588185 -10440541 -11281178
38771a1281178p56677o17557m50392k78930j15909L4133J66914K74002L45918
$$ -11281178 -12037855 -12655412 -13105804 -13384734 -13500643 -13466510 -13299596 -13025594 -12679676
38762a2679676L79659L83853L76447L75742L91253M20922M55277M83482M96656
$$ -12679676 -12300017 -11916164 -11539717 -11163975 -10772722 -10351800 -9896523 -9413041 -8916385
38753h916385M88529M56357M03446L41410K88861K64743K78127L20226L64739
$$ -8916385 -8427856 -7971499 -7568053 -7226643 -6937782 -6673039 -6394912 -6074686 -5709947
38744e709947L78093L34633K29020Q0021p6097k00306k67364k75192k41505j90821
$$ -5709947 -5331854 -4997221 -4768201 -4688180 -4764277 -4964583 -5231947 -5507139 -5748644 -5939465
38734e939465j41689j02330p4851o2045p0651j08786j79499k75234l78092m66502
$$ -5939465 -6081154 -6183484 -6258335 -6320380 -6391031 -6499817 -6679316 -6954550 -7332642 -7799144
38724g799144n22867n34978m90662l73554j68383J26007M87863Q77719J254487
$$ -7799144 -8322011 -8856989 -9347651 -9721205 -9889588 -9763581 -9275718 -8397999 -7143512
38715g143512J589283J867453K081218K222454K281720K252173K133686J934408
$$ -7143512 -5554229 -3686776 -1605558 616896 2898616 5150789 7284475 9218883
38707I218883J669569J358636J022086O79235L47495M2266k23417m39776o01536
$$ 9218883 10888452 12247088 13269174 13948409 14295904 14338170 14114753 13674977 13073441
38698A3073441p09343p70524p97647q04373q00670p90492p72781p43937o99784
$$ 13073441 12364098 11593574 10795927 9991554 9190884 8400392 7627611 6883674 6183890
38689F183890o37193n56088m60651l57900k54405j54746o3476J2561O6110R5270
$$ 6183890 5546697 4990609 4529958 4172058 3917653 3762907 3699431 3711992 3778102 3873372
38679C873372J07090J14379J27838J50165J75763J94248J94483J68772J17584
$$ 3873372 3980462 4094841 4222679 4372844 4548607 4742855 4937338 5106110 5223694
38670E223694N2450p015m2223m5456k4280P67K439m5020j55995l24195n19744
$$ 5223694 5276144 5269129 5226906 5181450 5157170 5157937 5160376 5115356 4959361 4635166 4115422
38659D115422o97204q12374q39537p80631o62528n24325m00955l11233k55589
$$ 4115422 3418218 2605844 1766307 985676 323148 -201177 -602132 -913365 -1168954
38650a168954k22363j97027j69249j36155j02009p4656o0317n9758o7748p4548
$$ -1168954 -1391317 -1588344 -1757593 -1893748 -1995757 -2070413 -2130730 -2190488 -2258236 -2332784
38640b332784o7185l0326N1028J85700L69080N79035P79821R34887J022312J042918
$$ -2332784 -2399969 -2430295 -2379267 -2193567 -1824487 -1245452 -465631 469256 1491568 2534486
38630B534486J015744R65704R12818Q67519Q29389P86262P15531N91255L96363
$$ 2534486 3550230 4515934 5428752 6296271 7125660 7911922 8627453 9218708 9615071
38621I615071J33941j69245m69684p21725q92878r72554r70996r10942q18153
$$ 9615071 9749012 9579767 9110083 8388358 7495480 6522926 5551930 4640988 3822835
38612C822835p15719o22654n53529n15792n05178n03539m83483m19780l02259
$$ 3822835 3107116 2484462 1930933 1415141 909963 406424 -77059 -496839 -799098
38603g99098j42959K7195J71227K61482K88156K56600J78064O3404p5646k22445
$$ -799098 -942057 -914862 -743635 -482153 -193997 62603 240667 304071 228425 5980
38593E980l56476m61166n32290n79417o18386o59509o98725p16922o88017n91783
$$ 5980 -350496 -811662 -1343952 -1923369 -2541755 -3201264 -3899989 -4616911 -5304928 -5896711
38583e896711m24753k02997M5086K91528N18688P20461Q96243J044023J157577
$$ -5896711 -6321464 -6524461 -6479375 -6187847 -5669159 -4948698 -4052455 -3008432 -1850855
38574a850855J228284J249644J222305J156308J067162R66960Q57848P34674N94588
$$ -1850855 -622571 627073 1849378 3005686 4072848 5039808 5897656 6632330 7226918
38565G226918M43914K95615J60828M3581n6439j36564j87060j94620j50906n9197
$$ 7226918 7670832 7966447 8127275 8170856 8114417 7977853 7790793 7596173 7445267 7386070
38555G386070O5836K03662L33242M34958M91358M90231M29831L21914J88529N2759
$$ 7386070 7451906 7655568 7988810 8423768 8915126 9405357 9835188 10157102 10345631 10398390
38545A0398390p2115j88215l08402m42613n84601p10572p93063q20068q04433
$$ 10398390 10326275 10138060 9829658 9387045 8802444 8091872 7298809 6478741 5674308
38536E674308p76687p68177p96880q62685r49880j032050j077998j060282r65760
$$ 5674308 4897621 4129444 3332564 2469879 1519999 487949 -590049 -1650331 -2616091
38527b616091q03183o01912m00795k33122j16240n0024k1911j3728p976O499L0993
$$ -2616091 -3419274 -4021186 -4421981 -4655103 -4771343 -4821367 -4843278 -4857006 -4864982 -4858483 -4827490
38516d827490N8636Q1328R6640J08704J22524J37485J46295J40598J18788Q9575
$$ -4827490 -4768854 -4687526 -4590886 -4482182 -4359658 -4222173 -4075878 -3935280 -3816492 -3726917
38506c726917O8106O7239R0322J29713J70132J93115J81110J22615J8478j14242
$$ -3726917 -3658811 -3591572 -3501250 -3371537 -3201405 -3008290 -2827180 -2704565 -2686087 -2800329
38496b800329k45434l42758l85188l71531l18720k50981j87030j33385q6576m0267
$$ -2800329 -3045763 -3388521 -3773709 -4145240 -4463960 -4714941 -4901971 -5035356 -5121932 -5162199
38486e162199Q698N8245J02127J32231J41712J28701R8993O5375M3007M3940P4736
$$ -5162199 -5153501 -5095256 -4993129 -4860898 -4719186 -4590485 -4491492 -4426117 -4383110 -4339170 -4264434
38475d264434J37760K32028L49945M72362N69294O09554N73675M60507K84318
$$ -4264434 -4126674 -3894646 -3544701 -3072339 -2503045 -1893491 -1319816 -859309 -574991
38466e74991O7683j63402l81503n60362o79351p26985p01020o06797m56897k72336
$$ -574991 -507308 -670710 -1052213 -1612575 -2291926 -3018911 -3719931 -4326728 -4783625 -5055961
38456e055961q1613Q5570K08271K82009L18830L39773L65214M09051M78194N74370
$$ -5055961 -5137574 -5052004 -4843733 -4561724 -4242894 -3903121 -3537907 -3128856 -2650662 -2076292
38446b076292O95125Q33797R79769J119318J236674J315690J342393J307200J205052
$$ -2076292 -1381167 -547370 432399 1551717 2788391 4104081 5446474 6753674 7958726
38437G958726J034511P98862N09943J91126j24544m01351o10031p35686p82008
$$ 7958726 8993237 9792099 10302042 10493168 10368624 9967273 9357242 8621556 7839548
38428G839548p69591p27704o82551o47730o21724n93135n49879m85901m01017
$$ 7839548 7069957 6342253 5659702 5011972 4390248 3797113 3247234 2761333 2360316
38419B360316k96131j70953k8383J18923K47882L32372L53377L05747J99492N5533
$$ 2360316 2064185 1893232 1864849 1983772 2231654 2564026 2917403 3223150 3422642 3478175
38409C478175j03487k63540m23449n88709p59052r19326j040794j093172j061474
$$ 3478175 3374688 3111148 2687699 2098990 1339938 420612 -620182 -1713354 -2774828
38400b774828r58102q21153o97634o21005n96963o04888o11231n85390n10155
$$ -2774828 -3732930 -4554083 -5251717 -5872722 -6469685 -7074573 -7685804 -8271194 -8781349
38391h781349l83974k17501k9348J55384L05637L89195L84179K92305J44421q044
$$ -8781349 -9165323 -9382824 -9412172 -9256788 -8951151 -8561956 -8177777 -7885472 -7741051 -7749095
38381g749095j13149j39072q3368L3155J81295L36162M81713O08765P11006P81869
$$ -7749095 -7862244 -8001316 -8084684 -8051529 -7870234 -7534072 -7052359 -6443594 -5732588 -4950719
38371d950719Q13029P95507P24090O03491M51986K98303J71632R0215N5976N8234
$$ -4950719 -4137690 -3342183 -2618093 -2014602 -1562616 -1264313 -1092681 -1002466 -946490 -888256
38361h88256Q2438J17131J56042J96652K37484K75237L03367L13966L02169K68998
$$ -888256 -805818 -688687 -532645 -335993 -98509 176728 480095 794061 1096230 1365228
38351A365228K19777J60047R3268K2254m7676j07141j44441j49856j19750n7836
$$ 1365228 1585005 1745052 1838320 1860574 1812898 1705757 1561316 1411460 1291710 1233874
38341A233874K6613J21651K15445K99253L70048M29918M81268N21888N45576N47917
$$ 1233874 1260487 1382138 1597583 1896836 2266884 2696802 3178070 3699958 4245534 4793451
38331D793451N30333M97180M49471L83310K95837J92256Q5904r099q4822j39272
$$ 4793451 5323784 5820964 6270435 6653745 6949582 7141838 7227742 7218643 7133821 6994549
38321F994549j70456j72403j38180o7692K6039J16637J70799J58793O4883j06753
$$ 6994549 6824093 6651690 6513510 6445818 6471857 6588494 6759293 6918086 6982969 6876216
38311F876216l33080n79501q10105r96854j124437j189571j196515j152181j063202
$$ 6876216 6543136 5963635 5153530 4156676 3032239 1842668 646153 -506028 -1569230
38302a569230r35503p76388n98252m20260k63897j43713o1226q262K3553L6172
$$ -1569230 -2504733 -3281121 -3879373 -4299633 -4563530 -4707243 -4768469 -4776731 -4753178 -4717006
38292d717006K5711j2730p9982j68304k58732l23781l36593k81411j58911J4973
$$ -4717006 -4691295 -4704025 -4784007 -4952311 -5211043 -5534824 -5871417 -6152828 -6311739 -6296766
38282f296766K13634M05635N61794O62104O99320O77862O10421N14908M11462
$$ -6296766 -6083132 -5677497 -5115703 -4453599 -3754279 -3076417 -2465996 -1951088 -1539626
38273a539626L17646K42719J85070J35962Q7167L5899j7206p3812j39625k19043
$$ -1539626 -1221980 -979261 -794191 -658229 -571062 -535163 -552369 -626181 -765806 -984849
38263i84849l08303l94937m64550n08321n25201n19446m97977m69292m41591m18946
$$ -984849 -1293152 -1688089 -2152639 -2660960 -3186161 -3705607 -4203584 -4672876 -5114467 -5533413
38253e533413l98508l72659l34739k82380k14889j28958j9886J10742K48630L69388
$$ -5533413 -5931921 -6304580 -6639319 -6921699 -7136588 -7265546 -7285432 -7174690 -6926060 -6556672
38243f556672M49354M76207M52357L90955L09317K24246J50442J00453Q3512J02521
$$ -6556672 -6107318 -5631111 -5178754 -4787799 -4478482 -4254236 -4103794 -4003341 -3919829 -3817308
38233c817308J51361K15899K79305L28376L56651L62914L47345L09293K49161
$$ -3817308 -3665947 -3450048 -3170743 -2842367 -2485716 -2122802 -1775457 -1466164 -1217003
38224a217003J73383R7681M3622K8397N4078J04332J51428J69058J43278P6390
$$ -1217003 -1043620 -945939 -902317 -873920 -819842 -715510 -564082 -395024 -251746 -175356
38214a75356j5882j09904j78721j96003j41957j1717J78548L93986N92729P40225
$$ -175356 -191238 -301142 -479863 -675866 -817823 -829540 -650992 -257006 335723 1075948
38204A075948Q17820Q23156P65915O62997N33479L92359K44928Q6176r2972k96211
$$ 1075948 1893768 2716924 3482839 4145836 4679315 5071674 5316602 5402778 5309806 5013595
38194E013595n15799p33605r27199j075507j160641j167746j087626r23308o94953
$$ 5013595 4497796 3764191 2836992 1761485 600844 -566902 -1654528 -2577836 -3272789
$$ [...]
##END NTUPLES=NMR SPECTRUM
##END=
