##TITLE=31Pdec_SR-167-R2-K
 CDCl3, 24 sc
 12.7.2023
##JCAMPDX= 6.0         $$ Bruker NMR JCAMP-DX V2.0
##DATA TYPE= NMR SPECTRUM
##DATA CLASS= NTUPLES
##ORIGIN= UXNMR, Bruker Analytische Messtechnik GmbH
##OWNER= root
$$ XWIN-NMR		Version 3.5
$$ Wed Jul 12 15:39:52 2023 Russian Standard Time (UT+4h)  she@DPX200
##.OBSERVE FREQUENCY= 81.013821
##.OBSERVE NUCLEUS= ^31P
##.ACQUISITION MODE= SIMULTANEOUS
##.ACQUISITION SCHEME= undefined
##.AVERAGES= 24
##.DIGITISER RES= 16
##SPECTROMETER/DATA SYSTEM= spect
##.PULSE SEQUENCE= zgpg30
##.SOLVENT NAME= CDCl3
##.SHIFT REFERENCE= (INTERNAL, CDCl3, 0, 248.564)
##AUDIT TRAIL= $$ (NUMBER, WHEN, WHO, WHERE, WHAT)
$$ ##TITLE= Audit trail, XWIN-NMR		Version 3.5
$$ ##JCAMPDX= 5.01
$$ ##ORIGIN= Bruker BioSpin GmbH
$$ ##OWNER= she
$$ F:/spectra/data/she/nmr/P31/1/pdata/1/auditp.txt
$$ ##AUDIT TRAIL=  $$ (NUMBER, WHEN, WHO, WHERE, WHAT)
(   1,<2023-07-12 15:38:48.15 +0400>,<she>,<DPX200>,
      <created by zg, POWCHK disabled, PULCHK disabled
       configuration hash MD5:
       00 E9 B6 7A A2 85 ED C7 34 08 36 98 17 FE 4E 26
       data hash MD5: 32K
       A4 71 FD 36 BD F8 DB 7D A6 AB 70 B3 EB C4 38 A0>)
(   2,<2023-07-12 15:38:50.64 +0400>,<she>,<DPX200>,
      <Start of raw data processing
       efp BC_mod = 2 LB = 1 FT_mod = 6 PKNL = 1 PHC0 = -10644.02 PHC1 = -4.515289 SI = 64K 
       data hash MD5: 64K
       B1 7F CC 91 12 C7 FD 28 0E 46 73 3D F3 BD B8 20>)
(   3,<2023-07-12 15:39:20.60 +0400>,<she>,<DPX200>,
      <pk PHC0 = -71.37195 PHC1 = 134.8 
       data hash MD5: 64K
       4E BD 70 84 4E C0 EB 53 B6 75 7F 81 8C 5E EE 65>)
(   4,<2023-07-12 15:39:24.28 +0400>,<she>,<DPX200>,
      <abs ABSG = 5 
       data hash MD5: 64K
       81 1E 00 D2 27 D9 7D A8 5A 1D 63 7A 1F 61 9E 9E>)
$$ ##END=
$$ 
$$ hash MD5
$$ BA 35 6D E4 F0 E3 CA 91 75 E3 6C 6A 92 07 C1 5E
##$RELAX= 
##$RELAX= 
##$RELAX= 
##$RELAX= 
##$RELAX= 
##$RELAX= 
##$RELAX= 
##$RELAX= 
##$RELAX= 
$$ Bruker specific parameters
$$ --------------------------
##$DU= <F:/spectra>
##$EXPNO= 1
##$NAME= <P31>
##$PROCNO= 1
##$TYPE= <nmr>
##$USER= <she>
##$AMP= (0..31)
100 100 100 100 100 100 100 100 100 100 100 100 100 100 100 100 100 100 
100 100 100 100 100 100 100 100 100 100 100 100 100 100 
##$AQSEQ= 0
##$AQ_mod= 1
##$AUNM= <au_zg>
##$AUTOPOS= <>
##$BF1= 81.014009
##$BF2= 200.13
##$BF3= 200.13
##$BF4= 200.13
##$BF5= 200.13
##$BF6= 200.13
##$BF7= 200.13
##$BF8= 200.13
##$BYTORDA= 1
##$CFDGTYP= 0
##$CFRGTYP= 5
##$CHEMSTR= <none>
##$CNST= (0..31)
1 1 145 1 1 1 1 1 1 1 1 1 1 1 1 1 1 1 1 1 1 1 1 1 1 1 1 1 1 1 1 1 
##$CPDPRG= <waltz16>
##$CPDPRG1= <>
##$CPDPRG2= <waltz16>
##$CPDPRG3= <>
##$CPDPRG4= <mlev>
##$CPDPRG5= <mlev>
##$CPDPRG6= <mlev>
##$CPDPRG7= <mlev>
##$CPDPRG8= <mlev>
##$CPDPRGB= <>
##$CPDPRGT= <>
##$D= (0..31)
0 1 0 0 0 0 0 0 0 0 0 0.03 2e-05 3e-06 0 0 0 0 0 0 0 0 0 0 0 0 0 0 0 0 
0 0 
##$DATE= 1689161927
##$DBL= (0..7)
120 120 120 11 120 120 24 19 
##$DBP= (0..7)
150 150 150 150 150 150 150 150 
##$DBP07= 0
##$DBPNAM0= <>
##$DBPNAM1= <>
$$ [...]
##$SUBNAM3= <"">
##$SUBNAM4= <"">
##$SUBNAM5= <"">
##$SUBNAM6= <"">
##$SUBNAM7= <"">
##$SUBNAM8= <"">
##$SUBNAM9= <"">
##$SW= 501.771253377433
##$SWIBOX= (0..15)
0 1 3 0 0 0 0 0 0 0 0 0 0 0 0 0 
##$SW_h= 40650.406504065
##$TD= 32768
##$TD0= 1
##$TE= 0
##$TE2= 300
##$TE3= 300
##$TEG= 300
##$TL= (0..7)
0 120 53 12 22 120 120 120 
##$TP= (0..7)
150 150 150 150 150 150 150 150 
##$TP07= 0
##$TPNAME0= <>
##$TPNAME1= <>
##$TPNAME2= <>
##$TPNAME3= <>
##$TPNAME4= <>
##$TPNAME5= <>
##$TPNAME6= <>
##$TPNAME7= <>
##$TPOAL= (0..7)
0.5 0.5 0.5 0.5 0.5 0.5 0.5 0.5 
##$TPOFFS= (0..7)
0 0 0 0 0 0 0 0 
##$TUNHIN= 0
##$TUNHOUT= 0
##$TUNXOUT= 0
##$USERA1= <user>
##$USERA2= <user>
##$USERA3= <user>
##$USERA4= <user>
##$USERA5= <user>
##$V9= 5
##$VALIST= <valist>
##$VCLIST= <CCCCCCCCCCCCCCC>
##$VD= 0
##$VDLIST= <DDDDDDDDDDDDDDD>
##$VPLIST= <PPPPPPPPPPPPPPP>
##$VTLIST= <TTTTTTTTTTTTTTT>
##$WBST= 1024
##$WBSW= 4
##$XGAIN= (0..3)
0 0 0 0 
##$XL= 0
##$YL= 0
##$YMAX_a= 5255
##$YMIN_a= -1692
##$ZGOPTNS= <>
##$ZL1= 120
##$ZL2= 120
##$ZL3= 120
##$ZL4= 120
##$ABSF1= 248.5645
##$ABSF2= -253.2056
##$ABSG= 5
##$ABSL= 3
##$ALPHA= 0
##$AQORDER= 0
##$ASSFAC= 0
##$ASSFACI= 0
##$ASSFACX= 0
##$ASSWID= 0
##$AUNMP= <proc_1d>
##$AZFE= 0.1
##$AZFW= 0.5
##$BCFW= 0
##$BC_mod= 2
##$BYTORDP= 0
##$COROFFS= 0
##$CY= -3
##$DATMOD= 1
##$DC= 0
##$DFILT= <>
##$DTYPP= 0
##$F1P= 0
##$F2P= 0
##$FCOR= 1
##$FTSIZE= 65536
##$FT_mod= 6
##$GAMMA= 0
##$GB= 0
##$INTBC= 1
##$INTSCL= 6.047779e-11
##$ISEN= 30
##$LB= 1
##$LEV0= 0
##$LPBIN= 0
##$MAXI= 10000
##$MC2= 0
##$MEAN= 0
##$ME_mod= 0
##$MI= 50
##$NCOEF= 0
##$NC_proc= -9
##$NLEV= 6
##$NOISF1= 182.463
##$NOISF2= 159.3651
##$NSP= 0
##$NTH_PI= 0
##$NZP= 0
##$OFFSET= 248.5645
##$PC= 4
##$PHC0= -10715.39
##$PHC1= 130.2847
##$PH_mod= 1
##$PKNL= yes
##$PPARMOD= 0
##$PSCAL= 0
##$PSIGN= 0
##$REVERSE= no
##$SF= 81.0140089999694
##$SI= 65536
##$SIGF1= 159.3651
##$SIGF2= -187.1042
##$SINO= 113.3802
##$SIOLD= 16384
##$SREGLST= <1H.CDCl3>
##$SSB= 0
##$STSI= 65536
##$STSR= 0
##$SW_p= 40650.406504065
##$SYMM= 0
##$S_DEV= 0
##$TDeff= 32768
##$TDoff= 0
##$TI= <>
##$TILT= no
##$TM1= 0
##$TM2= 0
##$TOPLEV= 0
##$USERP1= <user>
##$USERP2= <user>
##$USERP3= <user>
##$USERP4= <user>
##$USERP5= <user>
##$WDW= 1
##$XDIM= 65536
##$YMAX_p= 357456002
##$YMIN_p= -387163484
$$ End of Bruker specific parameters
$$ ---------------------------------
##NTUPLES= NMR SPECTRUM
##VAR_NAME=  FREQUENCY,     SPECTRUM/REAL,   SPECTRUM/IMAG
##SYMBOL=    X,             R,               I
##VAR_TYPE=  INDEPENDENT,   DEPENDENT,       DEPENDENT
##VAR_FORM=  AFFN,          ASDF,            ASDF
##VAR_DIM=   65536,         65536,           65536
##UNITS=     HZ,            ARBITRARY UNITS, ARBITRARY UNITS
##FACTOR=    0.620285442955139, 1,           1
##FIRST=     20137.2065510682, 0,            0
##LAST=      -20513.1999529968, 0,           0
##MIN=       -20513.1999529968, -387163484,  0
##MAX=       20137.2065510682, 357456002,    0
$$ Real data points
##PAGE= N=1
##DATA TABLE= (X++(R..R)), XYDATA
$$ [...]
$$ plain form
12950 -8013733 1128323 4430883 -3365043 -11981794 -11045284 -4150541 -1432365 -5134877
12942 -5134877 -9040073 -8489006 -5737966 -6440472 -13092351 -21387665 -23560713 -17039519
12934 -17039519 -7762233 -2043062 1222938 5048461 5466726 -2798081 -13713998 -13982072
12926 -13982072 -1400499 10975116 12600832 7796713 5108190 3670327 -1463851 -7137236
12918 -7137236 -5533532 2736345 8248574 5627542 -559168 -4050438 -4835581 -6253610
12910 -6253610 -8808474 -10515920 -10809722 -10301886 -7592244 -285198 9614243 14634800
12902 14634800 9531588 -1280542 -7977465 -7061077 -4377163 -5257586 -7223461 -6177632
12894 -6177632 -4561677 -7037829 -11379323 -11102315 -5936509 -2299876 -3267087 -5277789
$$ packed form
12950h013733R142056L302560p795926q616751R36510O894743K718176l702512
12942e134877l905196N51067K751040p02506o651879q295314k173048O521194
12934a7039519R277286N719171L266000L825523M18265q264807j0915917k68074
12926a3982072J2581573J2375615J625716m804119k688523j437863n134178n673385
12918g137236J603704Q269877N512229k621032o186710l491270p85143j418029
12910f253610k554864j707446k93802N07836K709642P307046R899441N020557
12902A4634800n103212j0812130o696923R16388K683914q80423j965875J045829
12894f177632J615955k476152m341494K77008N165806L636633r67211k010702
$$ plain form
12886 -5277789 -5862814 -7332082 -10392602 -11037054 -7523323 -4538483 -5957927 -8388556
12878 -8388556 -6765079 -2175435 1304597 4297274 10449385 18527932 22290033 18900059
12870 18900059 12746881 9102337 7378569 3489287 -2661580 -5621233 -1677691 4807811
12862 4807811 6063103 1463508 -1601644 775603 2712130 -1376244 -6303615 -4145351
12854 -4145351 1419605 131340 -6656732 -6116350 4891536 12568098 7257732 -818236
12846 -818236 1988586 10689581 10506882 1543998 -1992871 3917829 6188181 -3938636
12838 -3938636 -16394102 -16651798 -4674095 8390716 14858641 13843248 6296207 -4090029
12830 -4090029 -8920938 -3278675 5695820 6426785 -1846804 -9330016 -10653482 -10510169
$$ packed form
12886e277789n85025j469268l060520o44452L513731K984840j419444k430629
12878h388556J623477M589644L480032K992677O152111Q078547L762101l389974
12870A8900059o153178l644544j723768l889282o150867k959653L943542O485502
12862D807811J255292m599595l065152K377247J936527m088374m927371K158264
12854d145351N564956j288265o788072N40382J1007886P676562n310366q075968
12846h18236K806822Q700995j82699q962884l536869N910700K270352j0126817
12838c938636j2455466k57696J1977703J3064811O467925j015393p547041j0386236
12830d090029m830909N642263Q974495P30965q273589p483212j323466J43313
$$ plain form
12822 -10510169 -12589722 -12229431 -5117355 3934249 7548166 6289938 5878739 7257678
12814 7257678 6295559 1433443 -4732950 -10112878 -13418944 -11615489 -3933879 3071327
12806 3071327 2460940 -1948748 -628696 5568791 5907950 -1132577 -2609134 7953279
12798 7953279 16976894 9733765 -6556377 -12498214 -3716947 6313437 8007715 5544579
12790 5544579 4586832 3919677 2426340 2751204 3983957 675797 -6719185 -9477143 -2807067
12781 -2807067 7873120 16239648 21535899 22102378 13239905 -1882858 -9046539 379232
12773 379232 16729928 24596386 21942352 17864952 16785913 15112446 10896229 7244156
12765 7244156 6390321 7245289 8412448 8501842 5128261 -1382435 -5634949 -3840571 -371855
$$ packed form
12822a0510169k079553L60291P112076R051604L613917j258228m11199J378939
12814G257678r62119m862116o166393n379928l306066J803455P681610P005206
12806C071327o10387m409688J320052O197487L39159p040527j476557J0562413
12798G953279R023615p243129j6290142n941837Q781267J0030384J694278k463136
12790E544579r57747o67155j493337L24864J232753l308160p394982k757958O670076
12781b807067J0680187Q366528N296251N66479q862473j5122763p163681R425771
12773C79232J6350696P866458k654034m077400j079039j673467m216217l652073
12765G244156q53835Q54968J167159Q9394l373581o510696m252514J794378L468716
$$ plain form
12756 -371855 -2050369 -8294877 -12805272 -12864651 -10855858 -8223460 -4080034 1070459 5501924
12747 5501924 9163635 11948536 11163035 5809159 1080115 2760517 8922610 13022171
12739 13022171 13526613 14248808 16482712 17534231 16807225 16969405 18316823 17330380 12216054
12730 12216054 6263579 4672384 9643855 17660331 20788542 14079982 3028613 -1697698
12722 -1697698 973398 888176 -6098582 -9584080 -1711598 7467415 4460562 -5744234
12714 -5744234 -7647449 -165673 3310119 -2044884 -6629913 -4669583 -1811756 -1495344
12706 -1495344 585788 4222930 2300327 -3873908 -2191964 9940047 17533155 9411406
12698 9411406 -5513777 -13274642 -13534192 -12027553 -6422135 6497922 18827526 21161975
$$ packed form
12756c71855j678514o244508m510395n9379K008793K632398M143426N150493M431465
12747E501924L661711K784901p85501n353876m729044J680402O162093M099561
12739A3022171N04442P22195K233904J051519p27006J62180J347418r86443n114326
12730A2216054n952475j591195M971471Q016476L128211o708560j1051369m726311
12722a697698K671096q5222o986758l485498P872482R179013l006853j0204796
12714e744234j903215P481776L475792n355003m585029J960330K857827L16412
12706a495344K081132L637142j922603o174235J681944J2132011P593108q121749
12698I411406j4925183p760865k59550J506639N605418J2920057J2329604K334449
$$ plain form
12690 21161975 17606341 17614803 18701559 11535417 -1733313 -8800448 -5546324 24086
12682 24086 2126019 3477328 6096733 6707206 3960774 1661985 1992119 1993409 -1159688
12673 -1159688 -6311866 -10492210 -10996663 -6452143 -28741 905778 -6502560 -15226683
12665 -15226683 -17408499 -14954740 -14178755 -14236997 -10063140 -3702623 -2197666 -5155932
12657 -5155932 -4725792 1439412 6452277 4622250 -2419331 -10632126 -16734492 -16510186
12649 -16510186 -8658032 -566486 -922938 -5916996 -2984031 10128724 21083876 21042198
12641 21042198 15865113 13956175 13634215 10345811 7531650 10628897 15873482 14566154
12633 14566154 5705283 -3316128 -6742646 -4750959 574961 7198462 11415140 9538319
$$ packed form
12690B1161975l555634Q462J086756p166142j3268730p067135L254124N570410
12682B4086K101933J351309K619405O10473k746432k298789L30134J290l153097
12673a159688n152178m180344n04453M544520O423402R34519p408338q724123
12665a5226683k181816K453759P75985n8242M173857O360517J504957k958266
12657e155932M30140O165204N012865j830027p041581q212795o102366K24306
12649a6510186P852154Q091546l56452m994058K932965J3112755J0955152m1678
12641B1042198n177085j908938l21960l288404k814161L097247N244585j307328
12633A4566154q860871r021411l426518J991687N325920O623501M216678j876821
$$ plain form
12625 9538319 2278624 -5477179 -9406439 -8500333 -4313578 100352 1394744 -1487503
12617 -1487503 -5903283 -7831110 -5403054 2721 4997176 6232400 2732114 -3016413
12609 -3016413 -6890415 -6300167 -1879854 2614053 2464677 -2860764 -6628580 -1877062
12601 -1877062 7331749 8971981 933462 -3219265 6080357 17911973 15817178 2505291
12593 2505291 -5097068 -1757287 1717561 -250197 -13990 6173366 9740075 5720852
12585 5720852 2589664 7112610 11812162 7778073 -333528 -2737639 378236 2241391
12577 2241391 665295 -3560733 -12215032 -23959523 -29880348 -24486466 -15075489 -10919400
12569 -10919400 -9804258 -5136403 748700 1877346 987474 4148091 8034543 5351256
$$ packed form
12625I538319p259695p755803l929260R06106M186755M413930J294392k882247
12617a487503m415780j927827K428056N405775M994455J235224l500286n748527
12609c016413l874002N90248M420313M493907j49376n325441l767816M751518
12601a877062R208811J640232q038519m152727R299622J1831616k094795j3311887
12593B505291p602359L339781L474848j967758K36207O187356L566709m019223
12585E720852l131188M522946M699552m034089q111601k404111L115875J863155
12577B241391j576096m226028q654299j1744491n920825N393882R410977M156089
12569a0919400J115142M667855N885103J128646q89872L160617L886452k683287
$$ plain form
12561 5351256 -1084442 -2646566 106141 8276 -2196737 -272896 2623745 -2833772
12553 -2833772 -13958447 -17268543 -10356405 -6570679 -13014469 -19148100 -14742209 -5581396
12545 -5581396 -1799118 -1831773 1188283 5531367 4555821 -1229702 -5841856 -7718857 -9121670
12536 -9121670 -8895355 -4517214 562965 -154156 -6346282 -10803128 -9490095 -5794035
12528 -5794035 -3988216 -3704402 -2624985 -764058 224633 -117970 -795599 -1121146 -1689222
12519 -1689222 -3587328 -6632614 -8547124 -6903016 -2436276 741232 -481041 -4268699
12511 -4268699 -6015284 -4669523 -4610538 -8904968 -12277966 -5921766 8911670 18064516
12503 18064516 11201268 -2874527 -6675144 1863906 7171466 92840 -8285172 -3906248
$$ packed form
12561E351256o435698j562124K752707r7865k205013J923841K896641n457517
12553b833772j1124675l310096O912138L785726o443790o133631M405891R160813
12545e581396L782278l2655L020056M343084r75546n785523m612154j877001j402813
12536i121670K26315M378141N080179p17121o192126m456846J313033L696060
12528e794035J805819K83814J079417J860927R88691l42603o77629l25547n68076
12519a689222j898106l045286j914510J644108M466740L177508j222273l787658
12511d268699j746585J345761N8985m294430l372998O356200J4833436R152846
12503A8064516o863248j4075795l800617Q539050N307560p078626q378012M378924
$$ plain form
12495 -3906248 9542608 17303563 13790142 5438429 -1612108 -5732564 -5043325 699931
12487 699931 5080931 1511969 -6627631 -10997084 -10875554 -11118412 -10557737 -4165060 4699864
12478 4699864 6873700 2601153 1675220 6889295 9900277 6381674 2867743 4194344
12470 4194344 5755095 3601385 1580771 2452872 1643562 -3791969 -8739244 -8834865 -7640827
12461 -7640827 -9017267 -10145746 -8139207 -6028995 -6106413 -4475579 1842873 9060635
12453 9060635 12892708 13623201 10941162 2753239 -6133708 -4943212 6500183 13104403
12445 13104403 5309545 -6127642 -6896176 -404991 1076457 -1876273 1233579 10862858
12437 10862858 16291777 13423656 9747004 10732030 13305586 14384924 15151249 14609982
$$ packed form
12495c906248J3448856P760955l513421q351713p050537m120456O89239N743256
12487F99931M381000l568962q139600m369453J21530k42858N60675O392677Q864924
12478D699864K173836m272547r25933N214075L010982l518603l513931J326601
12470D194344J560751k153710k020614Q72101q09310n435531m947275r5621J194038
12461g640827j376440j128479K006539K110212p7418J630834O318452P217762
12453I060635L832073P30493k682039q187923q886947J190496J1443395O604220
12445A3104403p794858j1437187p68534O491185J481448k952730L109852R629279
12437A0862858N428919k868121l676652R85026K573556J079338P66325n41267
$$ plain form
12429 14609982 8401637 -2939043 -11980605 -13251587 -8345735 -1161265 5874110 9853004
12421 9853004 7844130 1385758 -3611080 -2687601 3941758 12861564 19104857 18717710
12413 18717710 13588311 10947227 13966648 16662350 13089021 6865555 4912760 6278814
12405 6278814 5217834 1612113 -316690 -376531 -368997 2898774 11986127 18868680 12985403
12396 12985403 -1105151 -6773335 2145485 13866625 16767257 12967835 8735009 2910968
12388 2910968 -6769595 -14269052 -11802346 -1579126 6762345 8044342 5015447 2016988
12380 2016988 524697 288097 1105349 3258843 7381994 12801133 15844404 12558253
12372 12558253 4108711 -3049054 -3377220 3220795 12634463 19380347 18913214 11205203
$$ packed form
12429A4609982o208345j1340680r041562j270982M905852P184470P035375L978894
12421I853004k008874o458372m996838R23479O629359Q919806O243293l87147
12413A8717710n129399k641084L019421K695702l573329o223466j952795J366054
12405F278814j060980l605721j928803n9841P534L267771R087353O882553n883277
12396A2985403j4090554n668184Q918820J1721140K900632l799422m232826n824041
12388B910968r680563p499457K466706J0223220Q341471J281997l028895k998459
12380B016988j492291k36600Q17252K153494M123151N419139L043271l286151
12372A2558253q449542p157765l28166O598015R413668O745884m67133p708011
$$ plain form
12364 11205203 2342173 -1037676 903055 2559548 733187 -2887726 -5906743 -6770257
12356 -6770257 -2970925 6296535 15620800 17758662 13363920 10241962 11859663 13216260
12348 13216260 10124081 5722945 4132925 3436853 -349688 -6259114 -9689324 -8346836
12340 -8346836 -3835802 642077 2168935 -165161 -4138317 -7127956 -9877318 -14054209
12332 -14054209 -16550324 -11724418 -436242 8988353 11271641 10238667 11119016 12090169
12324 12090169 8323310 700062 -5064737 -6455922 -6585655 -8770857 -12263956 -14121897
12316 -14121897 -13101060 -10480302 -7823807 -5349138 -3293014 -3543276 -7059339 -9967590
12308 -9967590 -7040266 -918983 -1811317 -12961167 -22084359 -15561116 2077450 12650677
$$ packed form
12364A1205203q863030l379849J940731J656493j826361l620913l019017q63514
12356f770257L799332R267460R324265K137862m394742l121958J617701J356597
12348A3216260l092179m401136j590020o96072l786541n909426l430210J342488
12340h346836M511034M477879J526858k334096l973156k989639k749362m176891
12332a4054209k496115M825906J1288176R424595K283288j032974Q80349R71153
12324A2090169l766859p623248n764799j391185j29733k185202l493099j857941
12316a4121897J020837K620758K656495K474669K056124k50262l516063k908251
12308i967590K927324O121283q92334j1149850r123192O523243J7638566J0573227
$$ plain form
12300 12650677 7855665 -1649049 -2666578 4440007 10540266 11064039 8357283 5146638
12292 5146638 1443602 -3567845 -9723492 -14897305 -15208575 -8936894 -477536 3412324
12284 3412324 1896605 567709 3225874 7697866 10535391 11042277 9599969 6679496
12276 6679496 4414665 4520273 4402873 671616 -3815223 -3422782 -481070 -3705657 -13510252
12267 -13510252 -18317716 -10628461 1499216 5948599 3008238 2234046 7111956 11497294
12259 11497294 10171069 5586214 2931851 3359756 4232314 3782647 3307699 4354114 5046179
12250 5046179 2180681 -2176711 -828073 8067378 15627708 13887325 8174750 8608671
12242 8608671 12855023 9762259 -599246 -4924060 2071687 8544204 4459316 -2847087
$$ packed form
12300A2650677m795012r504714j017529P106585O100259N23773k706756l210645
12292E146638l703036n011447o155647n173813l11270O271681Q459358L889860
12284C412324j515719j328896K658165M471992K837525N06886j442308k920473
12276F679496k264831J05608j17400l731257m486839L92441K941712l224587r804595
12267a3510252m807464P689255J2127677M449383k940361p74192M877910M385338
12259A1497294j326225m584855k654363M27905Q72558m49667m74948J046415O92065
12250E046179k865498m357392J348638Q895451P560330j740383n712575M33921
12242H608671M246352l092764j0361505m324814O995747O472517m084888p306403
$$ plain form
12234 -2847087 -1394319 6988166 11356835 7774646 834356 -5640693 -10382359 -11246986
12226 -11246986 -7645998 -2729387 2453808 11329545 22660899 26768085 18781296 8000444
12218 8000444 4654131 4893147 100717 -6052234 -3610631 5481512 10151367 8887340
12210 8887340 10543130 16525127 17331976 9406414 1268889 -1522200 -4180369 -9217320
12202 -9217320 -7807598 5864123 21044894 22408222 10508079 -9036 -251945 4046586
12194 4046586 3585874 -2201499 -6495394 -4446220 1736494 5861106 4558157 819794
12186 819794 210628 3548482 5222844 327719 -7881296 -10353056 -2792307 8107187
12178 8107187 11287268 3957171 -5251789 -7159171 -2815185 209395 -489293 -425499 2314630
$$ packed form
12234b847087J452768Q382485M368669l582189o940290o475049m741666q64627
12226a1246986L600988M916611N183195Q875737J1331354M107186p986789j0780852
12218H000444l346313K39016m792430o152951K441603R092143M669855j264027
12210H887340J655790N981997Q06849p925562q137525k791089k658169n036951
12202i217320J409722J3671721J5180771J363328j1900143j0517115k42909M298531
12194D046586m60712n787373m293895K049174O182714M124612j302949l738363
12186H19794o09166L337854J674362m895125q209015k471760P560749J0899494
12178H107187L180081p330097r208960j907382M343986L024580o98688O3794K740129
$$ plain form
12169 2314630 3275625 -486661 -5450952 -8039720 -9533969 -10075121 -4677338 7607157
12161 7607157 16016140 8959356 -9466778 -22559379 -20568008 -9789184 -1589792 412415
12153 412415 20867 1322014 5562105 11899250 18064218 21282391 19989345 14606679
12145 14606679 7279494 1331191 -952599 -1371543 -4363937 -10786660 -15886986 -15592082
12137 -15592082 -11526360 -7001347 -1746716 5463487 12251876 15326899 15414714 15331521 15265206
12128 15265206 13751984 11073164 8222215 5048918 2311674 1971181 2679011 169330
12120 169330 -4339281 -3100778 5240876 9680255 2449976 -6772744 -3855936 7938733
12112 7938733 12804950 6601845 1382136 4723913 9190339 7174777 3572932 5814152
$$ packed form
12169B314630R60995l762286m964291k588768j494249n41152N397783J2284495
12161G607157Q408983p056784j8426134j3092601J991371J0778824Q199392K002207
12153D12415l91548J301147M240091O337145O164968L218173j293046n382666
12145A4606679p327185n948303k283790m18944k992394o422723n100326K94904
12137a5592082M065722M525013N254631P210203O788389L075023Q7815q3193o6315
12128A5265206j513222k678820k850949l173297k737244l40493P07830k509681
12120A69330m508611J238503Q341654M439379p230279r222720K916808J1794669
12112G938733M866217o203105n219709L341777M466426k015562l601845K241220
$$ plain form
12104 5814152 10197904 7084274 -4785263 -16287713 -18518582 -11277555 -2096173 1401776
12096 1401776 -693494 -913875 5370992 12733028 13174659 7699241 3568450 2472631
12088 2472631 39716 -3944689 -4332074 -19267 4814393 9591083 17266799 23953139
12080 23953139 20278507 6972426 -2479282 -697074 2951057 -1710861 -9182040 -7909875
12072 -7909875 1166597 7020918 5085254 781511 -1168111 -1420258 -834081 1131917
12064 1131917 2661412 944586 -2221264 -1671848 3793915 9542706 10390434 4303314
12056 4303314 -7556683 -19811159 -23208487 -11946047 8095145 22514759 21680725 9207409
12048 9207409 -2935543 -6018645 -1564276 1587128 -2600009 -9986416 -11192510 -4405082
$$ packed form
12104E814152M383752l113630j1869537j1502450k230869P241027R181382L497949
12096A401776k095270k20381O284867P362036M41631n475418m130791j095819
12088B472631k432915l984405l87385M312807M833660M776690P675716O686340
12080B3953139l674632j3306081r451708J782208L648131m661918p471179J272165
12072g909875R076472N854321j935664m303743j949622k52147N86177J965998
12064A131917J529495j716826l165850N49416N465763N748791Q47728o087120
12056D303314j1859997j2254476l397328J1262440K0041192J4419614q34034j2473316
12048I207409j2142952l083102M454369L151404m187137p386407j206094O787428
$$ plain form
12040 -4405082 1148931 -2288015 -9351148 -8471528 1383243 8081848 2174285 -10317437
12032 -10317437 -15001311 -6020026 8739780 18489370 20552920 18669652 15016058 9461835
12024 9461835 5003014 6565312 12372857 13324170 5349801 -3653997 -5216645 -2752699
12016 -2752699 -4318222 -7991876 -5751431 623329 713990 -6661878 -10261672 -4877943
12008 -4877943 235682 -2098276 -4571149 1040504 8758312 8825780 4970028 7643495
12000 7643495 15313382 16908255 10905058 7766289 12145772 15534229 10534701 1962289
11992 1962289 -1714879 -207120 1017143 -418446 -2397873 -2174028 1861140 8995285
11984 8995285 14321832 11909481 2676371 -4505058 -2753462 4649526 9057218 6863604
$$ packed form
12040d405082N554013l436946p063133Q79620R854771O698605n907563j2491722
12032a0317437m683874Q981285J4759806R749590K063550j883268l653594n554223
12024I461835m458821J562298N807545R51313p974369r003798j562648K463946
12016b752699j565523l673654K240445O374760R0661p375868l599794N383729
12008d877943N113625k333958k472873N611653P717808O7468l855752K673467
12000G643495P669887J594873o003197l138769M379483L388457m999528q572412
11992A962289l677168J507759J224263j435589j979427K23845M035168P134145
11984H995285N326547k412351r233110p181429J751596P402988M407692k193614
$$ plain form
11976 6863604 1711397 -2128733 -4958707 -9612997 -15907936 -18735846 -13207124 -1874513
11968 -1874513 6166279 5882626 2774309 4058492 6455010 675375 -12325479 -19374875
11960 -19374875 -13087294 -2915263 -1350844 -6264814 -6477059 -406488 2403584 -2020494
11952 -2020494 -5428297 -1051192 5627599 6158879 2171084 1239094 4070153 4547019 1168511
11943 1168511 -1503 4843701 11352276 13664565 11634653 8143759 3699191 -2028981
11935 -2028981 -6250849 -5262089 417854 6500010 9763302 9656600 6114539 -753495
11927 -753495 -8529613 -12855731 -11299395 -6089753 -2612294 -5018078 -12196174 -17855576
11919 -17855576 -16330326 -8669614 -669246 4991854 10074164 13081574 7290015 -7993156
$$ packed form
11976F863604n152207l840130k829974m654290o294939k827910N528722J1332611
11968a874513Q040792k83653l108317J284183K396518n779635j3000854p049396
11960a9374875O287581J0172031J564419m913970k12245O070571K810072m424078
11952b020494l407803M377105O678791N31280l987795r31990K831059M76866l378508
11943A168511j170014M845204O508575K312289k029912l490894m444568n728172
11935b028981m221868R88760N679943O082156L263292j06702l542061o868034
11927g53495p776118m326118J556336N209642L477459k405784p178096n659402
11919a7855576J525250P660712Q000368N661100N082310L007410n791559j5283171
$$ plain form
11911 -7993156 -20166551 -16439659 -1620953 7231840 3907289 -183111 4312736 9305707
11903 9305707 1926846 -14860137 -25298231 -22172738 -14827334 -14503525 -20116141 -22659258
11895 -22659258 -18075904 -10443826 -5011024 -3009646 -3023572 -3793647 -4752439 -5841264 -7537828
11886 -7537828 -9729760 -10440132 -7548619 -2360479 571292 -1584343 -6816685 -11192207
11878 -11192207 -12498472 -9277699 143174 13271154 20761916 14860480 858707 -6390091
11870 -6390091 313267 12230652 16427522 10454900 1503222 -3885288 -3717601 2050008
11862 2050008 11348682 18366043 17632459 10220656 2752569 555602 3776278 8559107
11854 8559107 9962628 6180750 2097622 5265845 15566147 22953978 19159783 7383535
$$ packed form
11911g993156j2173395L726892J4818706Q852793l324551m090400M495847M992971
11903I305707p378861j6786983j0438094L125493P345404L23809n612616k543117
11895b2659258M583354P632078N432802K001378j3926p70075r58792j088825j696564
11886g537828k191932p10372K891513N188140K931771k155635n232342m375522
11878a1192207j306265L220773R420873J3127980P490762n901436j4001773p248798
11870f390091O703358J1917385M196870n972622q951678n388510J67687N767609
11862B050008R298674P017361p33584p411803p468087k196967L220676M782829
11854H559107J403521l781878m083128L168223J0300302P387831l794195j1776248
$$ plain form
11846 7383535 -3656988 -10122849 -12162725 -8422907 738726 8600296 8940875 4926480
11838 4926480 3778750 5957748 7634798 9787575 14783305 17242261 10101848 -1695459
11830 -1695459 -5933707 -1619383 -171220 -6681018 -12943776 -12637334 -10921139 -13418089
11822 -13418089 -16625175 -15798653 -13166371 -11903727 -10060916 -6373402 -4343317 -4958201
11814 -4958201 -3175097 2672038 5834733 1513835 -5339670 -8523664 -9065072 -9087775 -5775353
11805 -5775353 1001458 3288190 -3728049 -11962641 -11179493 -3557864 1845665 3635490
11797 3635490 6676751 10113475 7683946 -1100146 -8974798 -10193319 -5657468 206665
11789 206665 2816812 -62569 -4730399 -3727872 4274834 11399378 11689690 9100892
$$ packed form
11846G383535j1040523o465861k039876L739818R161633P861570L40579m014395
11838D926480j147730K178998J677050K152777M995730K458956p140413j1797307
11830a695459m238248M314324J448163o509798o262758L06442J716195k496950
11822a3418089l207086Q26522K632282J262644J842811L687514K030085o14884
11814d958201J783104N847135L162695m320898o853505l183994n41408k2703L312422
11805e775353O776811K286732p016239q234592P83148P621629N403529J789825
11797C635490L041261L436724k429529q784092p874652j218521M535851N864133
11789B06665K610147k879381m667830J002527Q002706P124544K90312k588798
$$ plain form
11781 9100892 8891796 8479490 4393475 778347 1382632 -115349 -10516277 -23268787
11773 -23268787 -26449162 -20577054 -15789980 -14287443 -9473691 -1624643 147446 -6172140
11765 -6172140 -10556890 -6154123 1134394 2964547 -372190 -4038549 -6716291 -9749793
11757 -9749793 -12968721 -14616852 -12383373 -4402107 6721679 12687753 8317031 -484130
11749 -484130 -4665638 -5045295 -8169096 -12164408 -9238828 -1821792 -1861104 -10769306 -14066412
11740 -14066412 -2539245 13364288 18716480 13724375 8676995 7281809 5697337 3307028
11732 3307028 4143860 9205290 15022781 19094456 21254715 20863327 17254952 11959700
11724 11959700 7252136 3999923 2828206 4342574 6296887 4755792 520174 -493329
$$ packed form
11781I100892k09096m12306m086015l615128O04285j497981j0400928j2752510
11773b3268787l180375N872108M787074J502537M813752P849048J772089o319586
11765f172140m384750M402767P288517J830153l336737l666359k677742l033502
11757i749793l218928j648131K233479P981266J1123786N966074m370722q801161
11749d84130m181508l79657l123801l995312K925580P417036l9312q908202l297106
11740a4066412J1527167J5903533N352192m992105n047380j395186j584472k390309
11732C307028Q36832N061430N817491M071675K160259l91388l608375n295252
11724A1959700m707564l252213j171717J514368J954313j541095m235618j013503
$$ plain form
11716 -493329 3608213 6582831 3254803 -2526849 -4437273 -3538242 -5482939 -11154175
11708 -11154175 -15885681 -15642619 -9387725 1476673 11229970 11469039 985068 -9141056
11700 -9141056 -7249055 4188855 12255174 10004335 1976688 -5076030 -8548222 -6977709
11692 -6977709 507696 9223014 10764594 3444110 -4794349 -7241676 -6700825 -8827057
11684 -8827057 -12343864 -11641669 -6221135 -1739571 -2313174 -6116693 -8747637 -7921141 -4707803
11675 -4707803 -2355252 -3838489 -8917153 -13956456 -15756558 -14347535 -10818204 -4825112
11667 -4825112 2965202 8197362 6940920 1819406 -442277 2011105 3997956 1211660
11659 1211660 -4208230 -8256232 -10865993 -13422059 -13764400 -8473568 1220769 10080082
$$ packed form
11716d93329M101542K974618l328028n781652j910424Q99031j944697n671236
11708a1154175m731506K43062O254894J0864398R753297K39069j0483971j0126124
11700i141056J892001J1437910Q066319k250839q027647p052718l472192J570513
11692f977709P485405Q715318J541580p320484q238459k447327N40851k126232
11684h827057l516807P02195N420534M481564n73603l803519k630944Q26496L213338
11675d707803K352551j483237n078664n039303j800102J409023L529331N993092
11667d825112P790314N232160j256442n121514k261683K453382J986851k786296
11659A211660n419890m048002k609761k556066l42341N290832R694337Q859313
$$ plain form
11651 10080082 14911732 16381725 15255178 10742318 3133633 -5037612 -11142601 -13447672
11643 -13447672 -10331638 -2036518 6222021 6646544 -3293204 -16894854 -23479944 -17313633
11635 -17313633 -2263325 10673625 11954430 2693188 -5738181 -4621735 1440397 1885181
11627 1885181 -3607415 -4552050 3343669 9986878 5503563 -4146823 -4762754 6359586
11619 6359586 17310790 18075766 11985316 7894347 7261305 4480110 -2484312 -7726626
11611 -7726626 -5179450 2852513 8191413 6543548 1356119 -1760172 -354265 5726029
11603 5726029 15058639 21798353 18133822 4979857 -4872859 -1187508 10468853 17694713
11595 17694713 18559945 19224327 18283299 8097472 -8023939 -15363828 -8654905 583685
$$ packed form
11651A0080082M831650J469993j126547m512860p608685q171245o104989k305071
11643a3447672L116034Q295120Q258539M24523r939748j3601650o585090O166311
11635a7313633J5050308J2936950J280805r261242q431369J116446O062132M44784
11627A885181n492596r44635P895719O643209m483315r650386o15931J1122340
11619F359586J0951204P64976o090450m090969o33042k781195o964422n242314
11611g726626K547176Q031963N338900j647865n187429l116291J405907O080294
11603E726029R332610O739714l664531j3153965r852716L685351J1656361P225860
11595A7694713Q65232O64382r41028j0185827j6121411p339889O708923R238590
$$ plain form
11587 583685 3076937 3994945 8601910 10520613 5670724 4467137 15231500 26018984
11579 26018984 20299985 3781182 -3007321 4212359 8679369 -4628 -11441740 -12701422
11571 -12701422 -6243672 -1429083 1048798 6620490 14823797 18738806 14883017 8103052
11563 8103052 6069372 10767598 16043926 14598332 7535052 3395373 5854407 7889992
11555 7889992 2929764 -3992040 -4000250 801365 -190605 -10127987 -20378284 -22707518 -18034301
11546 -18034301 -11639626 -5937095 194542 8772391 19504455 26705980 22696594 8644877
11538 8644877 -2519513 -515716 9212907 14128949 11455750 7239205 3186813 -3973442
11530 -3973442 -12325771 -15911220 -15555777 -17506255 -21535679 -21493592 -17630122 -16738881 -19427863
$$ packed form
11587E83685K493252R18008M606965J918703m849889j203587J0764363J0787484
11579B6018984n718999j6518803o788503P219680M467010q683997j1437112j259682
11571a2701422O457750M814589K477881N571692Q203307L915009l855789o779965
11563H103052k033680M698226N276328j445594p063280m139679K459034K035585
11555G889992m960228o921804q210M801615r91970r937382j0250297k329234M673217
11546a8034301O394675N702531O131637Q577849J0732064P201525m009386j4051717
11538H644877j1164390K003797R728623M916042k673199m216545m052392p160255
11530c973442q352329l585449L55443j950478m029424M2087L863470Q91241k688982
$$ plain form
11521 -19427863 -19239436 -15660543 -15324757 -17853814 -13830465 -1508139 7036781 3016857
11513 3016857 -6327010 -9071803 -3863686 2925276 7685711 10687083 12569458 14637345
11505 14637345 17628543 17965508 11906649 4443542 4892584 11978431 14287419 8560540
11497 8560540 5162847 10179102 14898049 10949745 4137199 3453430 6300282 5274169
11489 5274169 1521105 622890 1874528 1922513 3105664 8091314 11626647 7689944 -2533
11480 -2533 -4529006 -7860153 -15560797 -23438158 -21613330 -10575258 -1859651 -2160745 -6447772
11471 -6447772 -8060271 -6722917 -4197907 305862 6719423 11414188 11516910 8804097
11463 8804097 6709601 5502841 2585562 -3103606 -8516653 -9456339 -6299032 -4474591
$$ packed form
11521a9427863J88427L578893L35786k529057M023349J2322326Q544920m019924
11513C016857r343867k744793N208117O788962M760435L001372J882375K067887
11505A4637345K991198L36965o058859p463107M49042P085847K308988n726879
11497H560540l397693N016255M718947l948304o812546o83769K846852j026113
11489E274169l753064q98215J251638M7985J183151M985650L535333l936703p692477
11480b533m526473l331147p700644p877361J824828J1038072Q715607l01094m287027
11471f447772j612499J337354K525010M503769O413561M694765J02722k712813
11463H804097k094496j206760k917279n689168n413047r39686L157307J824441
$$ plain form
11455 -4474591 -6718369 -7259774 1278281 16203839 26034472 23996910 14704023 6940356
11447 6940356 5619843 10916926 18434493 19968983 11843551 2597156 3240550 9807800
11439 9807800 7419095 -6429957 -16575181 -13224469 -5958379 -6501869 -11160709 -11471782
11431 -11471782 -10212449 -13326805 -15513597 -8494805 3245376 9263656 10162675 13513337
11423 13513337 17243027 12196586 -586995 -9220658 -7370243 683015 10303818 19384393
11415 19384393 21780571 11575082 -4396146 -10845081 -3786368 5172124 7096670 6645624
11407 6645624 10134661 13768036 11009745 3621105 -2345822 -6104093 -10382792 -13514986
11399 -13514986 -10299479 -441161 8605354 8685618 -638664 -11604289 -16185437 -13703070
$$ packed form
11455d474591k243778n41405Q538055J4925558R830633k037562r292887p763667
11447F940356j320513N297083P517567J534490q125432r246395O43394O567250
11439I807800k388705j3849052j0145224L350712P266090n43490m658840l11073
11431a1471782J259333l114356k186792P018792J1740181O018280Q99019L350662
11423A3513337L729690n046441j2783581q633663J850415Q053258R620803R080575
11415A9384393K396178j0205489j5971228o448935P058713Q958492J924546m51046
11407F645624L489037L633375k758291p388640n966927l758271m278699l132194
11399a3514986L215507R858318R046515Q0264r324282j0965625m581148K482367
$$ plain form
11391 -13703070 -9108839 -4966178 490680 6772145 8681638 3785556 -3019251 -6644064
11383 -6644064 -8363814 -10594329 -10979824 -7798910 -5484714 -7278033 -7707137 -1059984
11375 -1059984 7375572 8510265 4352621 4763597 11085965 14133905 8632899 -545612
11367 -545612 -7568507 -11674495 -12564240 -8570609 -1687911 2823374 3506245 3178102 2470435
11358 2470435 8427 -1916053 -490068 -289092 -7624916 -16941093 -15210593 -2454555
11350 -2454555 5320488 -633268 -8426614 -4500899 5089950 5032684 -4659533 -9008474
11342 -9008474 -1449924 6730929 3575070 -7248667 -13279339 -9907667 -3308007 62979
11334 62979 -78997 -1639171 -3982029 -5606994 -3097160 3418817 7446076 4092665 -1839179
$$ packed form
11391a3703070M594231M142661N456858O281465J909493m896082o804807l624813
11383f644064j719750k230515l85495L180914K314196j793319m29104O647153
11375a059984Q435556J134693m157644M10976O322368L047940n501006r178511
11367e45612p022895m105988q89745L993631O882698M511285O82871l28143p07667
11358B470435k462008j924480J425985K00976p335824r316177J730500J2756038
11350b454555P775043n953756p793346L925715R590849n7266r692217m348941
11342i008474P558550Q180853l155859j0823737o030672L371672O599660L370986
11334F2979j41976j560174k342858j624965K509834O515977M027259l353411n931844
$$ plain form
11325 -1839179 -2214750 1988597 2994089 453559 2698788 11029972 14213486 5407960
11317 5407960 -5386126 -5151839 3680251 9254268 8648530 8134656 8829847 5032478 -3364535
11308 -3364535 -8199200 -4717199 2584913 7366079 7853419 5425948 3123483 4937270
11300 4937270 10255972 11057775 2350613 -7124948 -4505245 8107047 15275148 9760419
11292 9760419 1120853 -240447 2850483 1451353 -6218060 -14286034 -16948356 -12714423
11284 -12714423 -4997972 -744372 -4413408 -12264368 -16880503 -16889625 -16356194 -15376496 -9322967
11275 -9322967 1398666 8770521 7088282 -657273 -8338096 -12736697 -12389378 -6602570
11267 -6602570 1770371 7168860 6781617 2056926 -4479449 -9924239 -10805690 -7556449
$$ packed form
11325a839179l75571M203347J005492k540530K245229Q331184L183514q805526
11317E407960j0794086K34287Q832090N574017o05738n13874O95191l797369q397013
11308c364535m834665L482001P302112M781166M87340k427471k302465J813787
11300D937270N318702Q01803q707162r475561K619703J2612292P168101n514729
11292I760419q639566j361300L090930j399130p669413q067974k662322M233933
11284a2714423P716451M253600l669036p850960m616135r122N33431R79698O053529
11275i322967J0721633P371855j682239p745555p680823m398601L47319N786808
11267f602570Q372941N398489l87243m724691o536375n444790q81451L249241
$$ plain form
11259 -7556449 -6231649 -9615993 -11055533 -5293756 166782 -3885869 -10890333 -7016325
11251 -7016325 5334663 9630431 1533453 -4799838 -781533 3860636 -379180 -7421974
11243 -7421974 -8138251 -4818693 -3319058 -2201179 1121836 3882341 5435853 9963118
11235 9963118 14561292 8423167 -7019399 -12580936 1405039 17296674 15459754 3634931
11227 3634931 1971998 10172337 11720459 3478614 -2473475 -3244025 -7725620 -14490542
11219 -14490542 -10568432 3419777 9220797 -72488 -7565940 -387130 8489333 1542644
11211 1542644 -14610473 -20167434 -12875107 -8519741 -13834406 -17422344 -10298328 -10615
11203 -10615 2497206 -1077636 -2302494 -627162 -2018439 -6266358 -6036688 486080 5131241
$$ packed form
11259g556449J324800l384344j439540N761777N460538m052651p004464L874008
11251g016325J2350988M295768q096978o333291M018305M642169m239816p042794
11243g421974p16277L319558J499635J117879L323015K760505J553512M527265
11235I963118M598174o138125j5442566n561537J3985975J5891635j836920j1824823
11227C634931j662933Q200339J548122q241845n952089p70550m481595o764922
11219a4490542L922110J3988209N801020r293285p493452P178810Q876463o946689
11211A542644j6153117n556961P292327M355366n314665l587938P124016J0287713
11203a0615K507821l574842j224858J675332j391277m247919K29670O522768M645161
$$ plain form
11194 5131241 1974104 -3278188 -2430255 2400849 3878911 3890203 11511181 25625469
11186 25625469 31379118 19751932 1419820 -7078249 -4298519 -1516921 -3975099 -5791444
11178 -5791444 -3022300 -799236 -3683448 -6756812 -2300026 8224285 14311103 8427403
11170 8427403 -5099837 -14441473 -12725136 -4429289 1706420 3706443 5948768 8886221
11162 8886221 6864786 -712504 -4063812 3685325 13504754 10810800 -3317183 -12120954
11154 -12120954 -5761738 6249795 9702847 4228501 -49763 1106183 1939836 -2115397
11146 -2115397 -6916637 -5640638 2206517 10704641 14119466 11167573 4071569 -4091667
11138 -4091667 -10939405 -15147947 -15880509 -11866006 -2235488 10316742 18530550 16268291
$$ packed form
11194E131241l157137n252292Q47933M831104J478062J1292P620978J4114288
11186B5625469N753649j1627186j8332112q498069K779730K781598k458178j816345
11178e791444K769144K223064k884212l073364M456786J0524311O086818n883700
11170H427403j3527240r341636J716337Q295847O135709K000023K242325K937453
11162H886221k021435p577290l351308P749137R819429k693954j4127983q803771
11154a2120954O359216J2011533L453052n474346m278264J155946Q33653m055233
11146b115397m801240J275999P847155Q498124L414825k951893p096004q163236
11138d091667o847738m208542p32562M014503R630518J2552230Q213808k262259
$$ plain form
11130 16268291 6246811 -1120141 889332 7375931 8344894 1225225 -7279114 -11003952
11122 -11003952 -10956108 -10799035 -10012077 -4827637 5665445 17044021 23274377 22066780
11114 22066780 16482108 11222350 7738046 4552588 2226385 4026185 9269635 10443256
11106 10443256 2267383 -9187714 -13057198 -8164845 -3753287 -5416061 -7883717 -4219220
11098 -4219220 4490174 12252136 15655619 14491620 9496325 3418120 586348 1834771
11090 1834771 3247636 2824809 3960399 8481524 11068616 6410589 -1415608 -3396704
11082 -3396704 1986353 7382518 7922624 7575406 11528821 17059340 16687024 8720707 -133587
11073 -133587 -3722832 -4087647 -6856939 -11475636 -11440563 -4519330 3260341 6578361 8180237
$$ packed form
11130A6268291j0021480p366952K009473O486599R68963p119669q504339l724838
11122a1003952M7844J57073P86958N184440J0493082J1378576O230356j207597
11114B2066780n584672n259758l484304l185458k326203J799800N243450J173621
11106A0443256q175873j1455097l869484M892353M411558j662774k467656L664497
11098d219220Q709394P761962L403483j163999m995295o078205k831772J248423
11090A834771J412865m22827J135590M521125K587092m658027p826197j981096
11082c396704N383057N396165N40106l47218L953415N530519l72316p966317q854294
11073a33587l589245l64815k769292m618697L5073O921233P779671L318020J601876
$$ plain form
11064 8180237 12594747 17401990 17237020 13008769 9759881 7625051 2924931 -2858341
11056 -2858341 -3802601 188041 1974860 -2208568 -7801933 -9346830 -6299824 23763
11048 23763 8446862 15144250 15711010 11920099 9842055 10045776 7330257 1588800 -157368
11039 -157368 4479363 8716451 8110537 7645914 11857511 16167532 14608409 9329219 6012431
11030 6012431 5794728 7461347 11524468 16318025 16163681 9488051 3126379 2944062 5981935
11021 5981935 7089339 6617382 5923132 2793993 -2034566 -1732585 5474793 9986529 4698130
11012 4698130 -2681973 -1970963 1970870 -2980020 -15665296 -22856857 -19466905 -14472991
11004 -14472991 -15720623 -19852846 -19660892 -13143041 -3546731 3153176 930854 -9572058
$$ packed form
11064H180237M414510M807243j64970m228251l248888k134830m700120n783272
11056b858341r44260L990642J786819m183428n593365j544897L047006O323587
11048B3763Q423099O697388N66760l790911k078044K03721k715519n741457j746168
11039a57368M636731M237088o05914m64623M211597M310021j559123n279190l316788
11030F012431k17703J666619M063121M793557j54344o675630o361672j82317L037873
11021E981935J107404m71957o94250l129139m828559L01981P207378M511736n288399
11012D698130p380103P11010L941833m950890j2685276p191561L389952M993914
11004a4472991j247632m132223J91954O517851R596310O699907k222322j0502912
$$ plain form
10996 -9572058 -18055018 -15375959 -5961087 -1794289 -5767925 -9960059 -9577973 -8647312
10988 -8647312 -10821237 -14103424 -17238302 -22779131 -30105369 -32368980 -24625447 -10243024
10980 -10243024 3673785 12845291 15646454 11334479 1997639 -6626371 -9387226 -6071963
10972 -6071963 -963796 930489 -2063190 -6477186 -7159820 -3780352 -1375965 -2783970
10964 -2783970 -4339661 -1929227 2906986 6661415 9268356 11417061 11019544 7540100
10956 7540100 5420891 7617596 10217163 9306103 8085547 10427471 12811609 10696236
10948 10696236 7716605 9400452 12291869 9188326 1299843 -4862504 -8668863 -12564425
10940 -12564425 -12426778 -3572631 6786449 7277685 818745 290095 6450389 7113548
$$ packed form
10996i572058q482960K679059R414872M166798l973636m192134L82086R30661
10988h647312k173925l282187l134878n540829p326238k263611P743533J4382423
10980a0243024J3916809R171506K801163m311975r336840q624010k760855L315263
10972f071963N108167J894285k993679m413996o82634L379468K404387j408005
10964b783970j555691K410434M836213L754429K606941K148705l97517l479444
10956G540100k119209K196705K599567r11060j220556K341924K384138k115373
10948A0696236k979631J683847K891417l103543p888483o162347l806359l895562
10940a2564425J37647Q854147J0359080M91236o458940n28650O160294O63159
$$ plain form
10932 7113548 353529 200082 12662033 23004601 17263972 2912087 -3773729 -494122
10924 -494122 3258552 3383828 3604796 5239732 5686540 4893809 4618007 3165491 -1657155
10915 -1657155 -6190408 -4409557 3398900 11139387 14915018 15680507 15302208 14569975 14102336
10906 14102336 13450298 10456949 4675891 -87931 267944 4898271 9129055 9486473
10898 9486473 5966152 1243149 -871087 1654236 6514915 9726087 11066928 13324217
10890 13324217 15901555 14194448 6784568 -1771314 -7171548 -9164301 -7363291 -40688
10882 -40688 9283361 11165473 2321546 -7114737 -5703756 3898086 9681267 7880314
10874 7880314 6473640 10545199 13497505 7689712 -2331776 -4431963 4714634 14286579
$$ packed form
10932G113548o760019j53447J2461951J0342568n740629j4351885o685816L279607
10924d94122L752674J25276K20968J634936M46808p92731k75802j452516m822646
10915a657155m533253J780851P808457P740487L775631P65489l78299p32233m67639
10906A4102336o52038k993349n781058m763822L55875M630327M230784L57418
10898I486473l520321m723003k114236K525323M860679L211172J340841K257289
10890A3324217K577338j707107p409880q555882n400234j992753J801010P322603
10882d0688R324049J882112q843927r436283J410981R601842N783181j800953
10874G880314j406674M071559K952306n807793j0021488k100187R146597R571945
$$ plain form
10866 14286579 12576161 1366615 -7201632 -6354577 -1733183 -1549233 -5311869 -6708524
10858 -6708524 -3895557 -788446 546439 2479274 6126917 8554634 7589992 5273640
10850 5273640 4350172 4487512 3929511 2318855 201871 -2102965 -3846026 -4116164 -3954016
10841 -3954016 -6362958 -12908047 -21212439 -26413341 -24878274 -17347686 -9035217 -4929859
10833 -4929859 -4047930 -955374 5543240 9119775 4519611 -4266320 -8907411 -7153453
10825 -7153453 -4066587 -5381791 -13501190 -26604526 -37278148 -36271516 -23181464 -9064669
10817 -9064669 -2538429 935614 8132688 13492673 7474028 -5261626 -10362137 -5023663
10809 -5023663 -300264 -1784584 -2842192 260428 1295819 -2874090 -5824486 -4317250
$$ packed form
10866A4286579j710418j1209546q568247Q47055M621394J83950l762636j396655
10858f708524K812967L107111J334885J932835L647643K427717r64642k316352
10850E273640r23468J37340n58001j610656k116984k304836j743061k70138J62148
10841c954016k408942o545089q304392n200902J535067P530588Q312469M105358
10833d929859Q81929L092556O498614L576535m600164q785931m641091J753958
10825g153453L086866j315204q119399j3103336j0673622J006632J3090052J4116795
10817i064669O526240L474043P197074N359985o018645j2735654n100511N338474
10809e023663M723399j484320j057608L102620J035391m169909k950396J507236
$$ plain form
10801 -4317250 -4636477 -9085258 -8943369 164921 7777027 4112817 -4333961 -6600364
10793 -6600364 -5625715 -11247004 -21133680 -23040114 -13564717 -2244724 2413886 889578
10785 889578 -2892625 -6307784 -7597799 -7829928 -11739527 -19877652 -23242899 -14421146
10777 -14421146 -1047868 2387342 -5092342 -10131052 -5375248 1089770 280298 -4449442
10769 -4449442 -5171360 -2156808 -804147 -991913 1923105 7605489 10334644 8691194
10761 8691194 8622900 13649605 17266630 10822535 -3075345 -11792909 -8906570 -3084340
10753 -3084340 -6077237 -16229110 -20840895 -13263627 -254073 8178373 9316999 6377465
10745 6377465 2990528 1702983 2631239 1408680 -6027335 -14991784 -15438226 -6272887
$$ packed form
10801d317250l19227m448781J41889R108290P612106l664210q446778k266403
10793f600364R74649n621289r886676j906434R475397J1319993M658610j524308
10785H89578l782203l415159j290015k32129l909599q138125l365247Q821753
10777a4421146J3373278L435210p479684n038710M755804O465018q09472m729740
10769d449442p21918L014552J352661j87766K915018N682384K729155j643450
10761H691194o8294N026705L617025o444095j3897880q717564K886339N822230
10753c084340k992897j0151873m611785P577268J3009554Q432446J138626k939534
10745F377465l386937j287545R28256j222559p436015q964449m46442R165339
$$ plain form
10737 -6272887 1959577 2630702 1944081 6063028 9180742 4147788 -3296186 -3214597 1369871
10728 1369871 -365546 -8095435 -11127172 -7305516 -5909684 -9535360 -8504963 857782
10720 857782 6687867 -237818 -10213189 -8244313 3969502 12226209 11059034 8001317
10712 8001317 8639665 9918569 9370610 9873305 11961806 10715633 4834475 1117712 4449142
10703 4449142 9466907 8316567 2162461 -1362720 816214 4754481 6115589 3820966
10695 3820966 -1442087 -7200298 -8930506 -4914356 -213256 -534304 -3398799 -1671695
10687 -1671695 4685761 7616914 2804441 -4461915 -7478512 -5823506 -2135251 2583227
10679 2583227 6878503 7732512 5609398 5568220 9142859 10012080 2542539 -9568598 -18031142
$$ packed form
10737f272887Q232464O71125o86621M118947L117714n032954p443974Q1589M584468
10728A369871j735417p729889l031737L821656J395832l625676J030397R362745
10720H57782N830085o925685r975371J968876J2213815Q256707j167175l057717
10712H001317O38348J278904n47959N02695K088501j246173n881158l716763L331430
10703D449142N017765j150340o154106l525181K178934L938267J361108k294623
10695C820966n263053n758211j730208M016150M701100l21048k864495J727104
10687a671695O357456K931153m812473p266356l016597J655006L688255M718478
10679B583227M295276Q54009k123114m1178L574639Q69221p469541j2111137q462544
$$ plain form
10670 -18031142 -19679137 -16952182 -12526956 -8513277 -7736750 -10492721 -11973059 -7127191
10662 -7127191 3341085 14049035 19343550 15654670 4458832 -5513141 -5423405 2031337
10654 2031337 5549740 2224430 1785665 9434854 15932566 12491129 4437991 204294
10646 204294 -2640494 -8667793 -12271236 -8133376 -4936483 -12651353 -23420910 -22213538
10638 -22213538 -10828834 -3470408 -3129684 -1500435 1047030 -3613821 -11373510 -8581816
10630 -8581816 3251798 6859735 -2472433 -8954619 -2924918 4832276 3656095 -1160381
10622 -1160381 -2694245 -4552344 -8140289 -5154290 5285020 8560750 -3007766 -15031053
10614 -15031053 -12800241 -3691392 -1909174 -4358817 -133096 6777342 4482162 -3802714
$$ packed form
10670a8031142j647995K726955M425226M013679P76527k755971j480338M845868
10662g127191J0468276J0707950N294515l688880j1195838r971973Q9736P454742
10654B031337L518403l325310m38765P649189O497712l441437q053138m233697
10646B04294k844788o027299l603443M137860L196893p714870j0769557J207372
10638b2213538J1384704P358426L40724J629249K547465m660851p759689K791694
10630h581816J1833614L607937r332168o482186O029701P757194j176181m816476
10622a160381j533864j858099l587945K985999J0439310L275730j1568516j2023287
10614a5031053K230812R108849J782218k449643M225721O910438k295180q284876
$$ plain form
10606 -3802714 -3587192 7014700 15087248 13770497 9342331 6815549 2934011 -3985222
10598 -3985222 -9219966 -10048067 -9934730 -11548651 -12709345 -11184875 -7765665 -3766904
10590 -3766904 -573388 -1440303 -8357600 -17079472 -20278831 -16344866 -11357002 -11417064 -14979011
10581 -14979011 -13574223 -922876 17450849 26361555 17244770 -167752 -9206314 -6919821
10573 -6919821 -3999258 -5742716 -5941832 -1483883 837260 -2679518 -5517053 -3539189
10565 -3539189 -2903000 -7757946 -11443551 -8626636 -5369918 -7592440 -9991587 -7109292
10557 -7109292 -5485025 -12527180 -21552179 -21060691 -12894052 -8354532 -10581500 -12838413
10549 -12838413 -11245546 -7971488 -3739098 2515066 7337227 5148934 -2664442 -7831603
$$ packed form
10606c802714K15522J0601892Q072548j316751m428166k526782l881538o919233
10598c985222n234744q28101J13337j613921j160694J524470L419210L998761
10590c766904L193516q66915o917297q721872l199359L933965M987864o0062l561947
10581a4979011J404788J2651347J8373725Q910706r116785j7412522r038562K286493
10573f919821K920563j743458j99116M457949K321143l516778k837535J977864
10565c539189O36189m854946l685605K816915L256718k222522k399147K882295
10557g109292J624267p042155r024999M91488Q166639M539520k226968k256913
10549a2838413J592867L274058M232390O254164M822161k188293p813376n167161
$$ plain form
10541 -7831603 -5042058 2593475 7765206 5859103 -1702170 -9697795 -15111373 -19001325
10533 -19001325 -20779578 -16615665 -9090567 -9952980 -22473231 -29932339 -17576301 1905999
10525 1905999 5406175 -4482657 -6063071 1832802 -2370103 -22197056 -32730559 -21234842
10517 -21234842 -7453742 -9055839 -15261066 -11596970 -4623389 -4115838 -4823471 -2919818
10509 -2919818 -6490079 -14220636 -10330770 3944122 4355712 -13909307 -22444156 -8523322
10501 -8523322 819865 -11643942 -22126754 -14598604 -14441143 -35551617 -44023946 -22066936
10493 -22066936 -14293434 -50364018 -80200481 -67488555 -89205794 -226116213 -387163484
10486 -387163484 -383070831 -186432672 14916741 64810232 16913430 3297581 38480032
$$ packed form
10541g831603K789545P635533N171731j906103p561273p995625n413578l889952
10533a9001325j778253M163913P525098q62413j2520251p459108J2356038J9482300
10525A905999L500176r888832j580414P895873m202905j9826953j0533503J1495717
10517b1234842J3781100j602097o205227L664096O973581N07551p07633J903653
10509b919818l570261p730557L889866J4274892M11590j8265019q534849J3920834
10501h523322R343187j2463807j0482812P528150J57461k1110474q472329K1957010
10493b2066936P773502l6070584k9836463J2711926k1717239j36910419j61047271
10486c87163484M092653J96638159K01349413M9893491m7896802j3615849L5182451
$$ plain form
10479 38480032 50782175 28123490 20365187 35358388 33049765 8945285 1063624
10472 1063624 17501729 25361802 12816622 4719207 13260586 21629871 19934346 16199352
10464 16199352 11063594 -1229612 -8936434 3790458 23107451 21121147 1617294
10457 1617294 -6063800 4489608 11708819 8200902 9957591 20603773 22424299 9426222
10449 9426222 -2222000 -3434554 -3619272 -7179754 -5127160 4546188 12322272 16220008
10441 16220008 22051335 24403833 13083498 -1688273 1193181 18024993 24214495 16182715
10433 16182715 16421800 30566080 34214062 15217293 -3368269 -126304 12948859 15217995
10425 15217995 9724178 9416628 11162507 5838792 -747169 1940138 9333955 10477567
$$ packed form
10479C8480032J2302143k2658685p758303J4993201k308623k4104480p881661
10472A063624J6438105P860073j2545180q097415Q541379Q369285j695525l734994
10464A6199352n135758j2293206p706822J2726892J9316993j986304j9503853
10457A617294p681094J0553408P219211l507917J756689J0646182J820526j2998077
10449I426222j1648222j212554j84718l560482K052594R673348P776084L897736
10441A6220008N831327K352498j1320335j4771771K881454J6831812O189502q031780
10433A6182715K39085J4144280L647982j8996769j8585562L241965J3075163K269136
10425A5217995n493817l07550J745879n323715o585961K687307P393817J143612
$$ plain form
10417 10477567 6906659 6447271 7104275 2687086 -3251286 -3633119 -1284649 -2865395
10409 -2865395 -5725632 -3499840 1073266 1390177 -52338 3740113 10564588 11933579
10401 11933579 7439648 5119282 8058239 10220852 6576659 190908 -2348926 1739642
10393 1739642 9297302 14014312 12155260 6840202 4510115 6523592 8008340 5806961
10385 5806961 2477376 770132 -307756 -1447054 -535557 2675062 4316423 2129918
10377 2129918 -765397 -809488 1072896 1997484 1178808 -237902 -94637 4497132 13525251
10368 13525251 20773107 19658598 12712510 9063845 11798825 14662600 12612322 8218539
10360 8218539 5266295 3438719 2563875 4890634 9062800 8685148 1872921 -3873323
$$ packed form
10417A0477567l570908m59388O57004m417189n938372l81833K348470j580746
10409b865395k860237K225792M573106L16911j442515L792451O824475J368991
10401A1933579m493931k320366K938957K162613l644193o385751k539834M088568
10393A739642P557660M717010j859052n315058k330087K013477J484748k201379
10385E806961l329585j707244j077888j139298R11497L210619J641361k186505
10377B129918k895315m4091J882384R24588q18676j416710J43265M591769R028119
10368A3525251P247856j114509o946088l648665K734980K863775k050278m393783
10360H218539k952244j827576q74844K326759M172166l77652o812227n746244
$$ plain form
10352 -3873323 -2069707 2546831 657174 -8203911 -15354570 -14667682 -8985345 -4728405
10344 -4728405 -4222278 -4699345 -2965473 575786 3117269 4142421 6528279 11443691
10336 11443691 15071313 13858853 10491821 9764575 10303334 6543399 -1278528 -5579194
10328 -5579194 -1505357 6777352 12219298 13130215 12773226 13892247 16274728 18156040
10320 18156040 18297052 17015531 15127676 11739140 5010345 -3852437 -10304628 -12127614
10312 -12127614 -11982680 -11945042 -10102403 -6343615 -6099075 -12178689 -17323369 -12497433 -94289
10303 -94289 8330372 5872423 -4302371 -14833494 -18860132 -11860874 3218971 14574669
10295 14574669 13109554 3867285 -1373168 -212481 381060 -2496338 -4893895 -5655786
$$ packed form
10352c873323J803616M616538j889657q861085p150659O86888N682337M256940
10344d728405N06127m77067J733872L541259K541483J025152K385858M915412
10336A1443691L627622j212460l367032p27246N38759l759935p821927m300666
10328e579194M073837Q282709N441946R10917l56989J119021K382481J881312
10320A8156040J41012j281521j887855l388536o728795q862782o452191j822986
10312a2127614J44934L7638J842639L758788K44540o079614n144680M825936J2403144
10303i4289Q424661k457949j0174794j0531123m026638O999258J5079845J1355698
10295A4574669j465115r242269n240453J160687N93541k877398k397557p61891
$$ plain form
10287 -5655786 -7752866 -9510661 -5613478 1566088 2889198 -2333236 -3191778 5923122
10279 5923122 15445354 14257701 5076316 -1079820 184623 4508510 7572509 9108850
10271 9108850 9592630 8020305 3344578 -3687478 -9817912 -10714708 -5224675 2057077
10263 2057077 4724085 556130 -7915574 -16385207 -20038360 -15803722 -7155957 -2422467
10255 -2422467 -4068404 -5178688 -1609758 289828 -3863815 -5414616 3504168 12752188
10247 12752188 6856732 -9661513 -17330966 -10357253 -1696803 1080002 5299224 14508960
10239 14508960 19869861 17863226 18800601 27760965 33038625 25183511 13406674 10148775
10231 10148775 11634387 7854405 1731762 3204126 11131950 15515988 13451881 10382163
$$ packed form
10287e655786k097080j757795L897183P179566J323110n222434q58542R114900
10279E923122R522232j187653r181385o156136J264443M323887L063999J536341
10271I108850M83780j572325m675727p032056o130434q96796N490033P281752
10263B057077K667008m167955q471704q469633l653153M234638Q647765M733490
10255b422467j645937j110284L568930J899586m153643j550801Q918784R248020
10247A2752188n895456j6518245p669453O973713Q660450K776805M219222R209736
10239A4508960N360901k006635R37375Q960364N277660p855114j1776837l257899
10231A0148775J485612l779982o122643J472364P927824M384038k064107l069718
$$ plain form
10223 10382163 8666246 5873331 2022462 -515501 -1615209 -768463 5329233 15258676
10215 15258676 19590387 14223742 9831180 16505125 25435909 20110335 2219073 -8931584
10207 -8931584 -3047261 9283652 14104184 11001786 7565449 6858074 6753030 5421122
10199 5421122 2015487 -4126638 -11162956 -14610835 -12029402 -5582826 879998 4588332
10191 4588332 3858443 -795221 -5176268 -4953876 -1476892 -379196 -3455704 -5752153
10183 -5752153 -2749848 2558963 2939213 -3472898 -9729272 -8038105 -115513 3811680
10175 3811680 -2081617 -11099440 -13093825 -8289600 -4880920 -4535800 -228432 9558975
10167 9558975 15117067 9881304 1486606 43126 2320385 -2048180 -12667255 -17920408
$$ packed form
10223A0382163j715917k792915l850869k537963j099708Q46746O097696R929443
10215A5258676M331711n366645m392562O673945Q930784n325574j7891262j1150657
10207h931584N884323J2330913M820532l102398l436337p07375j05044j331908
10199E421122l405635o142125p036318l447879K581433O446576O462824L708334
10191D588332p29889m653664m381047K22392L476984J097696l076508k296449
10183e752153L002305N308811L80250o412111o256374J691167P922592L927193
10175C811680n893297r017823j994385M804225L408680L45120M307368R787407
10167I558975N558092n235763q394698j443480K277259m368565j0619075n253153
$$ plain form
10159 -17920408 -12045715 -2820304 67569 -3070508 -5012868 -1735912 4162867 7943307
10151 7943307 8147772 7592964 8950231 9850853 5226258 -4318399 -10390869 -6372661 3873305
10142 3873305 10639113 9378066 3332723 -2522494 -5801476 -6276233 -5098728 -4004360
10134 -4004360 -2873654 549249 6585346 11894517 14361189 16534965 20854814 24704109
10126 24704109 24440739 21617314 20554899 21709927 21868396 19344442 15039407 10041698
10118 10041698 5824537 4657831 6042376 5407178 703662 -2727562 644302 7099034
10110 7099034 8100654 2963842 49985 4771028 12710685 16474041 14333215 9775453
10102 9775453 6303884 5283943 6794776 10623136 16758971 24405547 29683744 26928029
$$ packed form
10159a7920408N874693R225411K887873l138077j942360L276956N898779L780440
10151G943307K04465n54808J357267R00622m624595r544657o072470M018208J0245966
10142C873305O765808j261047o045343n855217l278982m74757J177505J094368
10134d004360J130706L422903O036097N309171K466672K173776M319849L849295
10126B4704109k63370k823425j062415J155028J58469k523954m305035m997709
10118A0041698m217161j166706J384545o35198m703516l431224L371864O454732
10110G099034J001620n136812k913857M721043P939657L763356k140826m557762
10102I775453l471569j019941J510833L828360O135835P646576N278197k755715
$$ plain form
10094 26928029 15664423 4349014 2265789 8066261 11473863 7299909 2573038 6828269
10086 6828269 19140461 29034193 28695244 20151087 10313021 3076436 -1329462 -2363596
10078 -2363596 582293 4211925 2854725 -3657196 -7988734 -4872119 1080094 1907731
10070 1907731 -2665864 -6613128 -7162745 -5956089 -3045086 1723572 2817220 -5215390
10062 -5215390 -15737949 -15163257 -2662976 6993177 4820547 -446781 885349 2863393
10054 2863393 -4883867 -18525760 -25446812 -22442178 -16360049 -11174414 -6679936 -6424022
10046 -6424022 -13628473 -20601712 -15523472 -664431 8541786 4993064 -1105542 1292620
10038 1292620 9141086 12601306 9101630 3757113 1397136 3586701 9313115 14428224
$$ packed form
10094B6928029j1263606j1315409k083225N800472L407602m173954m726871M255231
10086F828269J2312192R893732l38949q544157r838066p236585m405898j034134
10078b363596K945889L629632j357200o511921m331538L116615N952213Q27637
10070A907731m573595l947264n49617J206656K911003M768658J093648q032610
10062e215390j0522559N74692J2500281R656153k172630n267328J332130J978044
10054B863393p747260j3641893o921052L004634O082129N185635M494478K55914
10046f424022p204451o973239N078240J4859041R206217l548722o098606K398162
10038A292620P848466L460220l499676n344517k359977K189565N726414N115109
$$ plain form
10030 14428224 14255368 9876964 7489231 8776975 7497476 -276949 -8214499 -8082936
10022 -8082936 -1836258 1878560 961367 1542566 6129743 8122872 1834444 -7984411
10014 -7984411 -12234640 -9508053 -5522517 -2249289 4435129 14785291 20956776 17592341
10006 17592341 10226489 6540722 4600810 -1720417 -9753254 -11241802 -6940629 -6097201
9998 -6097201 -10237063 -9709888 -284800 8510489 7925419 2591337 849810 1323497 -1955398
9989 -1955398 -7837794 -10321102 -7574370 -1794632 4442059 6026878 -2604619 -16422428
9981 -16422428 -20333596 -9753080 -308550 -5298838 -14187158 -9360945 4605155 8114452
9973 8114452 -1745112 -7934901 -2006955 4655704 2188737 -3557540 -4694395 -3490202
$$ packed form
10030A4428224j72856m378404k387733J287744j279499p774425p937550J31563
10022h082936O246678L714818r17193N81199M587177J993129o288428r818855
10014g984411m250229K726587L985536L273228O684418J0350162O171485l364435
10006A7592341p365852l685767j939912o321227q032837j488548M301173Q43428
9998f097201m139862N27175R425088Q795289n85070n334082j741527M73687l278895
9989a955398n882396k483308K746732N779738O236691J584819q631497j3817809
9981a6422428l911168J0580516R444530m990288q888320M826213J3966100L509297
9973H114452r859564o189789N927946O662659k466967n746277j136855J204193
$$ plain form
9965 -3490202 -3537138 -2227071 727876 -492643 -6339437 -8601730 -5055715 -4691690 -10965938
9956 -10965938 -13406500 -5648587 1219805 -4392095 -15347244 -17161557 -9671628 -2986723
9948 -2986723 927202 7211077 13575240 12718430 7233689 6901282 11183401 9144003 -1216585
9939 -1216585 -7870055 -3747605 1828015 -2108465 -11923355 -16414116 -12981914 -7765636
9931 -7765636 -4091139 -5550 4143817 4151797 -577590 -4313260 -2606521 1720281 3666670
9922 3666670 3970615 7140531 12618723 13569751 6712340 -991796 71004 9616677 16961404
9913 16961404 13177358 522786 -10506075 -10977375 -705340 11581570 15775022 10920598
9905 10920598 6880138 11736715 19783749 18447460 6317386 -3963943 -2691398 5232693
$$ packed form
9965c490202m6936J310067K954947j220519n846794k262293L546015L64025o274248
9956a0965938k440562P757913O868392n611900j0955149j814313P489929O684905
9948b986723L913925O283875O364163q56810n484741l32407M282119k039398j0360588
9939a216585o653470M122450N575620l936480r814890m490761L432202N216278
9931g765636L674497M085589M149367P980m729387l735670J706739M326802J946389
9922C666670L03945L169916N478192R51028o857411p704136J062800R545673P344727
9913A6961404l784046j2654572j1028861m71300J0272035J2286910M193452m854424
9905A0920598m040460M856577Q047034j336289j2130074j0281329J272545P924091
$$ plain form
9897 5232693 9708631 8858993 6526988 2239060 -7706874 -21075184 -29205197 -26624530
9889 -26624530 -16751125 -7323170 -2831799 -1516604 1656499 8292656 12787008 8444544
9881 8444544 -2112589 -8093137 -4627522 570128 -645330 -4553107 -3064939 1550869
9873 1550869 -385834 -10069192 -17628360 -16361498 -10027840 -3524699 4185367 12795953
9865 12795953 14657725 4141209 -11496835 -18739497 -13828911 -5577411 -2780313 -5141237
9857 -5141237 -7489456 -7043283 -3826623 1645380 7424427 9661605 6866012 3101288
9849 3101288 3414965 7067740 9003365 7537992 6142525 6808271 6481681 2793202 -743664
9840 -743664 674315 6087500 10703246 12727462 13254494 11074090 4197559 -3177824 -2469096
$$ packed form
9897E232693M475938q49638k332005m287928r945934j3368310q130013K580667
9889b6624530R873405R427955M491371J315195L173103O636157M494352m342464
9881H444544j0557133n980548L465615N197650j215458l907777J488168M615808
9873A550869j936703r683358p559168J266862O333658O503141P710066Q610586
9865A2795953J861772j0516516j5638044p242662M910586Q251500K797098k360924
9857e141237k348219M46173L216660N472003N779047K237178k795593l764724
9849C101288L13677L652775J935625j465373j395467O65746l26590l688479l536866
9840g43664J417979N413185M615746K024216N27032k180404o876531p375383P08728
$$ plain form
9831 -2469096 7500189 16420362 14704276 5398815 -1140703 -926979 1476923 2440196 3746406
9822 3746406 6786466 8529184 6063543 787694 -4812714 -10533422 -14966288 -12878901
9814 -12878901 -2348460 7686101 5260623 -7855284 -15592868 -8468098 2704922 2294812
9806 2294812 -6965400 -8706698 888503 6633881 -1408485 -11518677 -8396905 3386961
9798 3386961 8083587 4035756 3839194 11328560 15680471 11545451 8764554 14279830
9790 14279830 18185685 9468570 -4195196 -6441812 2855068 7042479 -2818691 -15540071
9782 -15540071 -16038804 -4862156 4710995 3845606 -3956733 -10182691 -10975924 -8605014
9774 -8605014 -6813654 -7332257 -10190806 -14665660 -18227449 -16268799 -6365347 6477495
$$ packed form
9831b469096R969285Q920173j716086r305461o539518K13724K403902R63273J306210
9822C746406L040060J742718k465641n275849n600408n720708m432866K087387
9814a2878901J0530441J0034561k425478j3115907p737584P124770J1173020m10110
9806B294812r260212j741298R595201N745378q042366j0110192L121772J1783866
9798C386961M696626m047831j96562P489366M351911m135020k780897N515276
9790A4279830L905855q717115j3663766k246616R296880M187411r861170j2721380
9782a5540071m98733J1176648R573151q65389p802339o225958p93233K370910
9774h605014J791360n18603k858549m474854l561789J958650R903452J2842842
$$ plain form
9766 6477495 12027118 4964914 -8306938 -15426024 -10705422 -433524 4846244 1899313
9758 1899313 -3172006 -4524033 -5080419 -11571027 -22170775 -25589683 -15643476 -1148533
9750 -1148533 4355482 -1184697 -8953859 -12697599 -13184189 -11107952 -5409646 464473
9742 464473 142316 -5298551 -7221310 -2670832 1221299 -107629 -1278756 1950045 3811310
9733 3811310 -1188279 -7416134 -7076918 -3044654 -2133893 -1559385 5414275 14047194 12137568
9724 12137568 -667260 -10217044 -6615501 5145836 15670901 21541144 21563032 13375808
9716 13375808 164971 -7652186 -4757683 1056073 -188758 -7147790 -11500070 -10959030
9708 -10959030 -9815956 -9386696 -6324853 146277 6653425 11734295 16881022 20523111
$$ packed form
9766F477495N549623p062204j3271852p119086M720602J0271898N279768k946931
9758A899313n071319j352027n56386o490608j0599748l418908R946207J4494943
9750a148533N504015n540179p769162l743740m86590K076237N698306N874119
9742D64473l22157n440867j922759M550478L892131j328928j171127L228801J861265
9733C811310m999589o227855L39216M032264R10761N74508O973660Q632919j909626
9724A2137568j2804828r549784L601543J1761337J0525065N870243K1888q187224
9716A3375808j3210837p817157K894503N813756j244831o959032m352280N41040
9708a0959030J143074M29260L061843O471130O507148N080870N146727L642089
$$ plain form
9700 20523111 17653360 8025362 -1250216 -5079971 -7026802 -11406286 -13588982 -6227679
9692 -6227679 6746760 11898582 4192484 -5633704 -6657416 -2876272 -4360289 -9084697
9684 -9084697 -5501958 7646203 16474882 10765641 -2500083 -10554696 -11540457 -11904745
9676 -11904745 -13348712 -11861397 -6832652 -2349673 -317492 531015 -362739 -4358928
9668 -4358928 -8178513 -6773872 -1943610 -862965 -4829671 -6527428 -764778 8403639
9660 8403639 14077929 14239455 9895208 1172845 -10154936 -18277354 -18326155 -11825931 -4144780
9651 -4144780 1339601 4205677 4831925 3797127 1102085 -5543371 -18004199 -31267365
9643 -31267365 -34635301 -23583439 -6529309 5022637 9462017 12460683 15016879 12642047
$$ packed form
9700B0523111k869751r627998r275578l829755j946831m379484k182696P361303
9692f227679J2974439N151822p706098r826188j023712L781144j484017m724408
9684i084697L582739J3148161Q828679n709241j3265724q054613r85761l64288
9676a1904745j443967J487315N028745M482979K032181Q48507q93754l996189
9668d358928l819585J404641M830262J080645l966706j697757N762650R168417
9660H403639N674290J61526m344247q722363j1327781q122418m8801O500224P681151
9651d144780N484381K866076O26248j034798k695042o645456j2460828j3263166
9643c1267365l367936J1051862J7054130J1551946M439380K998666K556196k374832
$$ plain form
9635 12642047 5933273 2709483 6341654 9344639 4010638 -5676340 -9209048 -3718228
9627 -3718228 3895382 7937170 9645502 10531474 7351717 -1479832 -9566908 -9285411 -2692702
9618 -2692702 1039199 -1191474 -2575492 2653193 10838407 14966562 13821795 10516716
9610 10516716 6203395 775696 -3271912 -3664111 -2871083 -3693450 -2338783 6432450 17697961
9601 17697961 18863669 6510922 -7070506 -8922904 -832225 5960344 6444822 5140761
9593 5140761 6323467 8303149 7753382 4411846 345165 -2131606 -1608055 429360 -449209
9584 -449209 -5905935 -9987990 -5226965 5921902 11643770 5377079 -5399567 -9180405
9576 -9180405 -4841043 -155916 1239770 3748317 10291249 16311548 16604778 12593031
$$ packed form
9635A2642047o708774l223790L632171L002985n334001r686978l532708N490820
9627c718228P613610M041788J708332Q85972l179757q831549q087076K81497O592709
9618b692702L731901k230673j384018N228685Q185214M128155j144767l305079
9610A0516716m313321n427699m047608l92199P93028q22367J354667Q771233J1265511
9601A7697961J165708j2352747j3581428j852398Q090679O792569M84478j304061
9593E140761J182706J979682n49767l341536m066681k476771N23551K037415q78569
9584d49209n456726m082055M761025J1148867N721868o266691j0776646l780838
9576i180405M339362M685127J395686K508547O542932O020299K93230m011747
$$ plain form
9568 12593031 8347010 3737584 -2915694 -8551559 -8414899 -4130683 -2006712 -3376102
9560 -3376102 -3526442 -1004193 -286024 -2846877 -3799984 -1740155 -3399540 -11557605 -16401322
9551 -16401322 -9139503 1664260 -9453 -13998371 -23714464 -20057569 -11928995 -9330357
9543 -9330357 -9334728 -5883286 -1852994 -1600117 -625084 5893915 10770160 3565575 -11707812
9534 -11707812 -20014135 -15605484 -7457824 -3780650 -2466187 141899 1574177 -283015
9526 -283015 -1333647 1817855 5414337 5291744 4627566 7860642 11111663 7006541 -2637974
9517 -2637974 -7298556 -1932645 6263665 8002078 3455655 -298572 46806 714029 -2491278
9508 -2491278 -8047061 -10485051 -6639360 870341 5903909 4520350 -902287 -3740136
$$ packed form
9568A2593031m246021m609426o653278n635865J36660M284216K123971j369390
9560c376102j50340K522249P18169k560853r53107K059829j659385q158065m843717
9551a6401322P261819J0803763j673713j3988918r716093L656895Q128574K598638
9543i330357m371L451442M030292K52877R75033O518999M876245p204585j5273387
9534a1707812q306323M408651Q147660L677174J314463K608086J432278j857192
9526b83015j050632L151502L596482j22593o64178L233076L251021m105122r644515
9517b637974m660582N365911Q196310J738413m546423l754227L45378O67223l205307
9508b491278n555783k437990L845691P509701N033568j383559n422637k837849
$$ plain form
9500 -3740136 -673219 3465183 1240735 -6431179 -9163676 -582003 10529547 9211774
9492 9211774 -6001872 -20041799 -20570682 -12892736 -10033537 -14230618 -16966667 -14093323
9484 -14093323 -10684356 -10421518 -9840025 -6477140 -4724179 -8460156 -13797368 -14706202 -11408839
9475 -11408839 -7749662 -4097416 1225676 6477628 8748333 9613827 12198368 14110377
9467 14110377 10334655 2892176 179300 5163715 11093826 11576151 8384204 5370999
9459 5370999 996427 -6885203 -13393228 -11623881 -3585919 1600467 889375 1352738 8619768
9450 8619768 18022413 21984178 21078412 21265737 23106062 21283455 14549280 8542991 6554877
9441 6554877 4331688 -1725638 -6925796 -4935550 1621667 4099860 -200396 -5551622
$$ packed form
9500c740136L066917M138402k224448p671914k732497Q581673J1111550j317773
9492I211774j5213646j4039927n28883P677946K859199m197081k736049K873344
9484a4093323L408967K62838N81493L362885J752961l735977n337212r08834L297363
9475a1408839L659177L652246N323092N251952K270705Q65494K584541J912009
9467A4110377l775722p442479k712876M984415N930111M82325l191947l013205
9459E370999m374572p881630o508025J769347Q037962N186386p11092M63363P267030
9450H619768R402645L961765r05766J87325J840325j822607o734175o006289j988114
9441F554877k223189o057326n200158J990246O557217K478193m300256n351226
$$ plain form
9433 -5551622 -6973659 -5700584 -4764250 -4537861 -3849459 -1321886 4275788 10444204 9617976
9424 9617976 -1227026 -11320523 -7191370 6236219 8817370 -6003359 -19826369 -15896067
9416 -15896067 -3403003 -1170897 -8037376 -7713133 2946702 10474389 8590225 6211013
9408 6211013 8778594 9250668 3420185 -1353038 110877 2154751 1027026 2923264
9400 2923264 10334590 13148141 4289146 -6734973 -7603715 -957000 3437769 5089953
9392 5089953 8253751 9226676 2763777 -5029041 -4985013 -995960 -2812082 -7391417 -4162660
9383 -4162660 4039854 3664820 -5834552 -9571639 -1682754 5642285 3341332 -961476
9375 -961476 1361858 5625260 5039569 3393871 5585745 6326397 -37376 -7279328 -6742623
$$ packed form
9433e551622j422037J273075R36334K26389O88402K527573N597674O168416q26228
9424I617976j0845002j0093497M129153J3427589K581151j4820729j3823010L930302
9416a5896067J2493064K232106o866479L24243J0659835P527687j884164k379212
9408F211013K567581M72074n830483m773223J463915K043874j127725J896238
9400B923264P411326K813551q858995j1024119q68742O646715M394769J652184
9392E089953L163798R72925o462899p792818M4028L989053j816122m579335L228757
9383d162660Q202514l75034r499372l737087P888885P325039k300953m302808
9375i61476K323334M263402n85691j645698K191874P40652o363773p241952N36705
$$ plain form
9366 -6742623 -1843620 -1231478 -3345779 -205921 7282360 10142195 5818075 736923
9358 736923 -1341569 -3580161 -7889699 -11178253 -11434525 -10741405 -10824640 -11072182 -11329091
9349 -11329091 -11257577 -7250869 3699255 16533516 20825913 12697195 -850706 -10753538
9341 -10753538 -14186172 -12656265 -7122884 1482516 9797710 13649473 11916002 7584128
9333 7584128 4894659 5127568 5219428 2070596 -1775392 -95712 8062335 15697920 17034309
9324 17034309 14848998 14294336 14107641 10522348 6448497 8480353 15736030 19833945
9316 19833945 16878219 12155528 10929241 11169633 8619966 3879503 632670 62087
9308 62087 77706 -1788805 -6136205 -10437665 -10074189 -3630039 3308282 3855553 -834477
$$ packed form
9366f742623M899003O12142k114301L139858P488281K859835m324120n081152
9358G36923k078492k238592m309538l288554k56272O93120q3235k47542k56909
9349a1329091P1514M006708J0950124J2834261M292397q128718j3547901r902832
9341a0753538l432634J529907N533381Q605400Q315194L851763j733471m331874
9333G584128k689469K32909R1860l148832l845988J679680Q158047P635585J336389
9324A7034309k185311n54662j86695l585293m073851K031856P255677M097915
9316A9833945k955726m722691j226287K40392k549667m740463l246833n70583
9308F2087J5619j866511m347400m301460L63476O444150O938321N47271m690030
$$ plain form
9299 -834477 -3155967 -557447 732474 -4230743 -11387422 -13978126 -11607399 -8183207
9291 -8183207 -4727247 -12572 3766532 2028296 -5139169 -11407533 -11263365 -6339516
9283 -6339516 -3449662 -7186110 -14833218 -18338279 -11873478 1977105 13947415 16150142
9275 16150142 8120596 -4044391 -12673892 -13376984 -7784910 -1968780 -168284 -342220
9267 -342220 1818826 5870920 7944654 8432070 12243298 19829573 24166737 20213054 12104155
9258 12104155 6542334 3778769 507737 -2507438 -2371525 -780728 -1611064 -3320165
9250 -3320165 -1147983 3654927 4702855 1398396 701955 5319132 8336535 4545164
9242 4545164 -240885 1711157 7256839 7580051 3010176 2529217 8445302 11688465 5912796
$$ packed form
9299h34477k321490K598520J289921m963217p156679k590704K370727L424192
9291h183207L455960M714675L779104j738236p167465o268364J44168M923849
9283f339516K889854l736448p647108l505061O464801J3850583J1970310K202727
9275A6150142q029546j2164987q629501p03092N592074N816130J800496j73936
9267c42220K161046M052094K073734M87416L811228P586275M337164l953683q108899
9258A2104155n561821k763565l271032l015175J35913J590797q30336j709101
9250c320165K172182M802910J047928l304459o96441M617177L017403l791371
9242D545164m786049J952042N545682L23212m569875m80959N916085L243163n775669
$$ plain form
9233 5912796 -2233898 -2992481 2417128 4970949 1566567 -2298704 -2471892 -1193528 -1184940
9224 -1184940 -1164462 520787 3100591 6574643 12365031 17706085 15183776 3055220
9216 3055220 -8774277 -9906277 -3407644 -861543 -5221038 -7744624 -2928317 3091748
9208 3091748 3223803 174583 -162595 263934 -4176998 -11221957 -12666962 -7215764 -2512941
9199 -2512941 -2955882 -3727695 -312049 3330026 1237290 -5432055 -11530214 -15564375 -17452421
9190 -17452421 -12558979 2832781 20823683 26492638 16251023 3591619 1687236 7181758
9182 7181758 8200506 2917308 257820 3812571 6029541 1683590 -2075066 3764938
9174 3764938 15001761 18402292 9529856 -1892290 -5854468 -3712563 -1810709 135479
$$ packed form
9233E912796q146694p58583N409609K553821l404382l865271j73188J278364Q588
9224a184940K0478J685249K579804L474052N790388N341054k522309j2128556
9216C055220j1829497j132000O498633K546101m359495k523586M816307O020065
9208C091748J32055l049220l37178M26529m440932p044959j445005N451198M702823
9199b512941m42941p71813L415646L642075k092736o669345o098159m034161j888046
9190a7452421M893442J5391760J7990902N668955j0241615j2659404j904383N494522
9182G181758J018748n283198k659488L554751K216970m345951l758656N840004
9174C764938J1236823L400531q872436j1422146l962178K141905J901854J946188
$$ plain form
9166 135479 6736342 15789160 18253816 10828302 1139395 -3251544 -4591727 -8010632
9158 -8010632 -10237982 -3746646 9923101 20040197 20652940 16438953 12625821 7764525
9150 7764525 940226 -2031093 3163053 10584133 11346589 5730091 324255 -3387960
9142 -3387960 -8782988 -14573935 -15184745 -10775693 -8038500 -9862480 -12444826 -13935353
9134 -13935353 -16923689 -19694791 -14599410 -447288 11582988 11386651 3502688 154431
9126 154431 4850147 9931286 8099345 169347 -7804475 -10636153 -7605272 -2456130
9118 -2456130 1033200 3727968 8123060 11103720 6330066 -4598583 -11530465 -10206963
9110 -10206963 -8775807 -13996744 -19749778 -17719900 -11534722 -9613664 -10447149 -7279888
$$ packed form
9166A35479O600863R052818K464656p425514r688907m390939j340183l418905
9158h010632k227350O491336J3669747J0117096O12743m213987l813132m861296
9150G764525o824299k971319N194146P421080P62456n616498n405836l712215
9142c387960n395028n790947o10810M409052K737193j823980k582346j490527
9134a3935353k988336k771102N095381J4152122J2030276j96337p883963l348257
9126A54431M695716N081139j831941p929998p973822k831678L030881N149142
9118b456130L489330K694768M395092K980660m773654j0928649o931882J323502
9110a0206963J431156n220937n753034K029878O185178J921058q33485L167261
$$ plain form
9102 -7279888 -2571202 -3950763 -8391573 -5190909 5296989 10725465 6690947 2911072
9094 2911072 5195817 5885569 -551728 -5959129 -2555444 2712991 -187743 -7023551
9086 -7023551 -6732459 -505950 232264 -7572189 -14931190 -15762277 -13922195 -13548981 -12706573
9077 -12706573 -9909170 -8089804 -7700826 -3308580 7598673 18093106 19806212 13495583
9069 13495583 6278650 1561159 -2379591 -5657432 -5102995 1859 5506710 7414760
9061 7414760 5848656 2640608 -1392676 -4637281 -3799360 1525987 5935838 4244554
9053 4244554 -1112160 -3577406 -2394123 -2801385 -5784955 -5255767 916319 4314800 -2932992
9044 -2932992 -15669606 -22319816 -20456412 -16688004 -13230928 -5701424 4700002 8476351
$$ packed form
9102g279888M708686j379561m440810L200664J0487898N428476m034518l779875
9094B911072K284745O89752o437297n407401L403685N268435k900734o835808
9086g023551K91092O226509P38214p804453p359001q31087J840082L73214Q42408
9077a2706573K797403J819366L88978M392246J0907253J0494433J713106o310629
9069A3495583p216933m717491l940750l277841N54437N104854N504851J908050
9061G414760j566104l208048m033284l244605Q37921N325347M409851j691284
9053D244554n356714k465246J183283m07262k983570N29188O172086L398481p247792
9044b932992j2736614o650210J863404L768408L457076P529504J0401426L776349
$$ plain form
9036 8476351 2170895 -4516308 -2960463 1493725 -87459 -3789702 1388008 14256467
9028 14256467 20474049 12384177 -875310 -7163313 -6555298 -6976601 -11277676 -15959837
9020 -15959837 -18834752 -20196599 -17711024 -7731675 6827750 16063913 14043405 6559911
9012 6559911 4140000 9328475 14909345 14277041 9510708 7382063 9850029 11606386
9004 11606386 7230406 -1495674 -7443771 -7084904 -5140098 -8280610 -15804597 -20614203
8996 -20614203 -19899277 -19630273 -24904484 -30564236 -28100507 -19595240 -16457364 -23436656
8988 -23436656 -31978531 -32462703 -25646714 -17639918 -10688880 -4940618 -2881153 -4644387
8980 -4644387 -4504552 -192328 108424 -9568144 -18599373 -11804455 6506247 16241206
$$ packed form
9036H476351o305456o687203J555845M454188j581184l702243N177710J2868459
9028A4256467O217582q089872j3259487o288003O08015m21303m301075m682161
9020a5959837k874915j361847K485575R979349J4559425R236163k020508p483494
9012F559911k419911N188475N580870o32304m766333k128645K467966J756357
9004A1606386m375980q726080n948097L58867J944806l140512p523987m809606
8996b0614203P14926K69004n274211n659752K463729Q505267L137876o979292
8988b3436656q541875m84172O815989Q006796O951038N748262K059465j763234
8980d644387J39835M312224L00752r676568r031229O794918J8310702R734959
$$ plain form
8972 16241206 10617400 5022545 11600668 21438263 21612620 15119666 10611086 4907652
8964 4907652 -7439142 -16195877 -6800151 13964698 23472285 15271312 6834259 11142650
8956 11142650 18571496 15424742 4952830 -1618410 -3100464 -4723684 -5460919 -2070157
8948 -2070157 644757 -3279641 -8320203 -4688723 4847274 8548420 4557337 2643061
8940 2643061 6911576 10568512 10148969 11146958 14941945 13428857 3479002 -5422158 -6422251
8931 -6422251 -6829951 -13967052 -19768394 -12719778 2052064 8897306 3776457 -3363600
8923 -3363600 -5762410 -5629679 -3708226 2893600 11002031 12502453 7816052 6169361
8915 6169361 9427280 8275484 -879252 -7964344 -5234057 214413 -1315173 -6917850
$$ packed form
8972A6241206n623806n594855O578123R837595J74357o492954m508580n703434
8964D907652j2346794q756735R395726K0764849R507587q200973q437053M308391
8956A1142650P428846l146754j0471912o571240j482054j623220p37235L390762
8948b070157K714914l924398n040562L631480R535997L701146l991083j914276
8940B643061M268515L656936m19543R97989L794987j513088r949855q901160j000093
8931f422251m07700p137101n801342P048616J4771842O845242n120849p140057
8923c363600k398810J32731J921453O601826Q108431J500422m686401j646691
8915F169361L257919j151796r154736p085092K730287N448470j529586n602677
$$ plain form
8907 -6917850 -7880210 -4147670 -2036339 -3089131 -4567148 -6589959 -9982356 -10545317 -3665795
8898 -3665795 7741650 16196854 17739704 12512815 2364277 -7030202 -8101690 -1588946
8890 -1588946 2203314 -1331368 -3708845 544642 1800023 -7758167 -15891526 -6676616
8882 -6676616 12201832 18849105 10422649 5344716 11788760 16357360 9482228 847799
8874 847799 -41988 93202 -5721604 -8685192 369551 11327641 7560341 -8277838
8866 -8277838 -17196078 -10150601 2054330 5228067 -2432919 -12544018 -16827527 -13052341
8858 -13052341 -5133903 1080289 3165877 2190524 -1839157 -9596247 -17011008 -17576667
8850 -17576667 -12792167 -12372556 -19658917 -25039080 -20145065 -10775982 -7574164 -10282335
$$ packed form
8907f917850r62360L732540K111331j052792j478017k022811l392397n62961O879522
8898c665795J1407445Q455204J542850n226889j0148538r394479j071488O512744
8890a588946L792260l534682k377477M253487J255381r558190q133359R214910
8882f676616J8878448O647273q426456n077933O444044M568600o875132q634429
8874H47799q89787J35190n814806k963588R054743J0958090l767300j5838179
8866h277838q918240P045477J2204931L173737p660986j0111099m283509L775186
8858a3052341P918438O214192K085588r75353m029681p757090p414761n65659
8850a7576667M784500M19611p286361n380163M894015R369083L201818k708171
$$ plain form
8842 -10282335 -10555555 -5907791 -1388688 50130 339794 962768 1995494 4919772 9907252
8833 9907252 12085679 6889298 -2438006 -8619779 -9953607 -10490350 -12480739 -14274798
8825 -14274798 -14019312 -10399914 -2232066 7420056 10184094 2139384 -8340465 -10067732
8817 -10067732 -4170055 -1587682 -6671921 -12065671 -10682436 -4730685 -471125 -283650
8809 -283650 -2686029 -5685878 -7840287 -9120595 -11646017 -16643237 -20854681 -19544482
8801 -19544482 -13009836 -6636250 -4570525 -6394028 -9459245 -11357808 -10720288 -8346590
8793 -8346590 -6560517 -5482744 -2540372 1964136 3089580 -839115 -3404733 660205
8785 660205 5682894 2434474 -7461790 -13248913 -10006404 -3094089 2382403 7481535
$$ packed form
8842a0282335k73220M647764M519103J438818K89664O22974J032726K924278M987480
8833I907252K178427n196381r327304o181773j333828n36743j990389j794059
8825a4274798K55486L619398Q167848R652122K764038q044710j0479849j727267
8817a0067732N897677K582373n084239n393750J383235N951751M259560J87475
8809b83650k402379k999849k154409j280308k525422m997220m211444J310199
8801a9544482O534646O373586K065725j823503l065217j898563O37520K373698
8793h346590J786073J077773K942372M504508J125444l928695k565618M064938
8785F60205N022689l248420r896264n787123L242509O912315N476492N099132
$$ plain form
8777 7481535 12980085 15370562 12729403 8076918 3539073 -3005567 -11845137 -17418737
8769 -17418737 -15088156 -8324999 -4518112 -5620344 -7017242 -4992087 -1821770 -2249005
8761 -2249005 -6487294 -9153742 -6442495 -2288779 -3413848 -8705864 -9519087 -2720624
8753 -2720624 3118899 -527554 -9854805 -14843809 -13301928 -10989474 -10533566 -8571871
8745 -8571871 -3183479 3108366 7765997 9972086 8914581 5757545 5160325 8678125
8737 8678125 9648462 2232114 -7606670 -9379811 -3727847 -162837 -1065063 -367075 2071207
8728 2071207 -1124745 -9510045 -12214996 -5866677 -1389384 -5645517 -9619180 -4726942
8720 -4726942 1527742 -836101 -5056146 2299028 18037364 25741909 20733902 15763725
$$ packed form
8777G481535N498550K390477k641159m652485m537845o544640q839570n573600
8769a7418737K330581O763157L806887j102232j396898K025155L170317m27235
8761b249005m238289k666448K711247M153716j125069n292016q13223O798463
8753b720624N839523l646453r327251m989004J541881K312454M55908J961695
8745h571871N388392O291845M657631K206089j057505l157036n97220L517800
8737H678125R70337p416348r838784j773141N651964L565010r02226O97988K438282
8728B071207l195952q385300k704951O348319M477293m256133l973663M892238
8720d726942O254684k363843m220045P355174J5738336P704545n008007m970177
$$ plain form
8712 15763725 19941923 26370432 25660598 19588232 14021403 7818028 -2084510 -10732401
8704 -10732401 -10172886 -1773733 5355306 7671288 10542741 16941257 21082859 17773593
8696 17773593 11478032 9284245 9069869 3009213 -8696091 -16752494 -16762601 -15250477
8688 -15250477 -17720008 -18963954 -11820418 805683 10431706 14706099 16314263 14225552
8680 14225552 5970562 -3142739 -3496811 5335243 13483580 14499678 11666745 8869086
8672 8869086 4218298 -3382540 -9040230 -8349744 -3898623 -1250397 -2416487 -5595535
8664 -5595535 -6928282 -1435270 11643747 23025979 20495441 4903866 -8425406 -8304093
8656 -8304093 -315846 4001109 3018877 3178424 7214460 12048752 15012181 15498187 12803801
$$ packed form
8712A5763725M178198O428509p09834o072366n566829o203375r902538q647891
8704a0732401N59515Q399153P129039K315982K871453O398516M141602l309266
8696A7773593o295561k193787k14376o060656j1705304q056403j0107J512124
8688a5250477k469531j243946P143536J2626101R626023M274393J608164k088711
8680A4225552q254990r113301l54072Q832054Q148337J016098k832933k797659
8672H869086m650788p600838n657690O90486M451121K648226j166090l179048
8664e595535j332747N493012J3079017J1382232k530538j5591575j3329272J21313
8656h304093P988247M316955r82232J59547M036036M834292K963429M86006k694386
$$ plain form
8647 12803801 7633807 3395408 1699568 -503388 -5443854 -9866141 -9942742 -7003390
8639 -7003390 -4278533 -2099828 -363316 -895882 -2995104 -2177160 1796893 2405821 -1900488
8630 -1900488 -1441313 9801102 20211354 14249240 -3795698 -13815787 -7375214 2386051
8622 2386051 1171344 -8165737 -13118897 -8184789 2206630 11170366 14266862 11169131
8614 11169131 6380001 4896746 5249103 1417502 -6832904 -11634056 -7967523 -1060676
8606 -1060676 1156994 -1984734 -5745836 -7426849 -7402932 -6187597 -4778972 -4932259 -5203931
8597 -5203931 -112725 12135308 23985919 25881689 17646591 7741247 2509100 1225068
8589 1225068 1239030 2489681 5362187 7904125 7371304 2910824 -3999964 -10286633 -12588584
$$ packed form
8647A2803801n169994m238399j695840k202956m940466m422287p6601K939352
8639g003390K724857K178705J736512n32566k099222Q17944L974053O08928m306309
8630a900488M59175J1242415J0410252n962114j8044938j0020089O440573R761265
8622B386051j214707r337081m953160M934108J0391419Q963736L096496l097731
8614A1169131m789130j483255L52357l831601q250406m801152L666533O906847
8606a060676K217670l141728l761102j681013K3917J215335J408625j53287k71672
8597e203931N091206J2248033J1850611J895770q235098r905344n232147j284032
8589A225068J3962J250651K872506K541938n32821m460480o910788o286669k301951
$$ plain form
8580 -12588584 -9896586 -4996690 -1645750 -823861 -1587415 -4043514 -7862841 -8840565 -2311544
8571 -2311544 8638945 13569644 6705264 -5187009 -11052846 -8840961 -5651253 -6367711
8563 -6367711 -8013618 -5953213 -512505 4630845 6858062 5170414 -411040 -7311340
8555 -7311340 -10748103 -8542543 -4085219 -2101993 -2769508 -2224092 2196339 9042410 13866793
8546 13866793 11920843 1896803 -10943832 -17514947 -13391790 -3168018 5119675 7122784
8538 7122784 2215118 -8342435 -18706080 -19083371 -6632787 7231660 8952549 810081
8530 810081 -2581537 4231099 10369337 6132158 -2812049 -5221805 -270001 4015009
8522 4015009 2849186 -2141796 -7792833 -10816823 -8124654 -1939091 -353592 -6158700
$$ packed form
8580a2588584K691998M899896L350940Q21889p63554k456099l819327r77724O529021
8571b311544J0950489M930699o864380j1892273n865837K211885L189708p16458
8563f367711j645907K060405N440708N143350K227217j687648n581454o900300
8555g311340l436763K205560M457324J983226o67515N45416M420431O846071M824383
8546A3866793j945950j0024040j2840635o571115M123157J0223772Q287693K003109
8538G122784m907666j0557553j0363645l77291J2450584J3864447J720889q142468
8530H10081l391618O812636O138238m237179q944207k409756M951804M285010
8522D015009j165823m990982n651037l023990K692169O185563J585499n805108
$$ plain form
8514 -6158700 -10184726 -4319390 3824532 734586 -11162226 -14888032 -3153975 12052024
8506 12052024 18068918 17096541 16331716 14268068 7299879 1562567 5562882 14898729
8498 14898729 16284631 6121669 -5038999 -7219176 -1455624 5704409 9860831 8489295
8490 8489295 385731 -10938358 -18531142 -19574149 -17404981 -14794496 -11126728 -7978255
8482 -7978255 -10127924 -17032726 -20024917 -13342584 -2425827 4300100 6554602 8791813
8474 8791813 10661183 8511818 3079246 -1793728 -5643988 -9714425 -11517240 -8354975
8466 -8354975 -3765023 -3004066 -4774411 -5242760 -6768355 -12976244 -18322467 -14132015 -3239279
8457 -3239279 3779557 5758714 10368764 16727598 15051244 6179694 3710034 10843325
$$ packed form
8514f158700m026026N865336Q143922l089946j1896812l725806J1734057J5205999
8506A2052024O016894r72377p64825k063648o968189n737312M000315R335847
8498A4898729J385902j0162962j1160668k180177N763552P160033M156422j371536
8490H489295q103564j1324089p592784j043007K169168K610485L667768L148473
8482g978255k149669o904802k992191O682333J0916757O725927K254502K237211
8474H791813J869370k149365n432572m872974l850260m070437j802815L162265
8466h354975M589952P60957j770345m68349j525595o207889n346223M190452J0892736
8457c239279P018836J979157M610050O358834j676354q871550k469660P133291
$$ plain form
8449 10843325 13004610 2372182 -7878829 -5692947 307656 -1840535 -5938905 -1030677
8441 -1030677 6961840 6732909 3761712 9532687 17275996 11750676 -2446258 -6811391
8433 -6811391 -656130 -1775183 -14343943 -21040387 -12035724 1173740 7719134 11583873
8425 11583873 15806619 13514827 4924534 3447010 12881991 17001376 5119380 -9549573
8417 -9549573 -11930099 -8741431 -13066379 -20461336 -19966803 -16299532 -19448789 -21429408
8409 -21429408 -6654580 18964339 31770980 22911982 7370988 -648310 -2550624 -2524004
8401 -2524004 1775309 9099617 10587225 4433511 2342087 11929525 22354157 17966990
8393 17966990 90487 -15230842 -18342722 -15183711 -14961523 -16963701 -14159538 -5583429
$$ packed form
8449A0843325K161285j0632428j0251011K185882O000603k148191m098370M908228
8441a030677P992517k28931k971197N770975P743309n525320j4196934m365133
8433f811391O155261j119053j2568760o696444R004663J3209464O545394L864739
8425A1583873M222746k291792q590293j477524R434981M119385j1881996j4668953
8417i549573k380526L188668m324948p394957M94533L667271l149257j980619
8409b1429408J4774828K5618919J2806641q858998j5540994q019298j902314K6620
8401b524004M299313P324308J487608o153714k091424R587438J0424632m387167
8393A7966990j7876503j5321329l111880L159011K22188k002178K804163Q576109
$$ plain form
8385 -5583429 1399493 1689217 -530911 649664 2812032 -347375 -6813354 -7531424 -615070
8376 -615070 5117032 3735463 -5477 -1022692 -2360724 -6232515 -5559654 5792579
8368 5792579 20512733 25703614 19376484 10166651 4164064 965386 -71164 1313643
8360 1313643 2719184 1962712 1611758 3888019 4333874 -1546503 -8635786 -8358752 -2382935
8351 -2382935 -739420 -7066243 -14606464 -16880095 -14177922 -9038990 -2684016 3274763
8343 3274763 7558360 11548834 15748908 15863626 8627143 -948632 -5510301 -6244249 -9568924
8334 -9568924 -14785101 -14374939 -6539047 1431955 3476314 1136928 -1219685 -1056825 2652832
8325 2652832 8186807 9978182 5001990 -870336 482805 8022590 13862018 14832519
$$ packed form
8385e583429O982922K89724k220128J180575K162368l159407o465979p18070O916354
8376f15070N732102j381569l740940j017215j338032l871791O72861J1352233
8368E792579J4720154N190881o327130r209833o002587l198678j036550J384807
8360A313643J405541p56472l50954K276261M45855n880377p089283K77034N975817
8351b382935J643515o326823p540221k273631K702173N138932O354974N958779
8343C274763M283597L990474M200074J14718p236483r575775m561669p33948l324675
8334i568924n216177M10162P835892P971002K044359k339386k356613J62860L709657
8325B652832N533975J791375m976192n872326J353141P539785N839428R70501
$$ plain form
8317 14832519 13651089 10831926 4995718 -33879 1378354 6417761 7086674 3907951
8309 3907951 5597515 13656779 18256004 12822341 3228123 -1668124 -975347 348954
8301 348954 -1742107 -8215011 -16080272 -19030191 -14599080 -9382247 -10101269 -12366885 -8025751
8292 -8025751 -529927 13191 -4291064 -636648 12343311 19928929 13731707 3886510
8284 3886510 2011082 5491359 6633195 5167404 3293762 -206478 -2473298 5157181
8276 5157181 22057342 32973296 28125760 17366995 12846051 9390671 -3123798 -17923495
8268 -17923495 -19657547 -8825264 -51102 1533449 4786481 12963572 16310322 8629471
8260 8629471 -2133426 -6013216 -3858071 -1894150 -993627 2140210 7363402 10002373
$$ packed form
8317A4832519j181430k819163n836208n029597J412233N039407O68913l178723
8309C907951J689564Q059264M599225n433663r594218m896247O92777J324301
8301C48954k091061o472904p865261k949919M431111N216833p19022k265616M341134
8292h025751P495824N43118m304255L654416J2979959P585618o197222r845197
8284C886510j875428L480277J141836j465791j873642l500240k266820P630479
8276E157181J6900161J0915954m847536j0758765m520944l455380j2514469j4799697
8268a7923495j734052J0832283Q774162J584551L253032Q177091L346750p680851
8260H629471j0762897l879790K155145J963921R00523L133837N223192K638971
$$ plain form
8252 10002373 6248604 -2100355 -7491417 -2758602 9704574 17420361 11292152 -2544974
8244 -2544974 -10260664 -7956455 -4378881 -6274413 -9473691 -7531604 -2495614 -1994086
8236 -1994086 -8865172 -17978727 -22348801 -19830120 -13928113 -9258285 -6888964 -4881961
8228 -4881961 -2884597 -3327513 -6853073 -9821683 -8880701 -5035433 -294950 6200621 14550907
8219 14550907 19952864 17707369 10228461 3516312 -1246598 -6089266 -8173495 -2108173
8211 -2108173 8808962 12882478 5599093 -2859596 -1776201 4604954 3880197 -5769269
8203 -5769269 -13162406 -10658880 -4154044 -2981280 -6713044 -7579477 -1681639 8159988
8195 8159988 17848394 23977178 22333300 11792338 -508707 -5449912 -4320353 -6850062
$$ packed form
8252A0002373l753769q348959n391062M732815J2463176P715787o128209j3837126
8244b544974p715690K304209L577574j895532l199278J942087N035990N01528
8236a994086o871086r113555m370074K518681N902007M669828K369321K007003
8228d881961J997364m42916l525560k968610R40982L845268M740483O495571Q350286
8219A4550907N401957k245495p478908o712149m762910m842668k084229O065322
8211b108173J0917135M073516p283385q458689J083395O381155p24757r649466
8203e769269p393137K503526O504836J172764l731764q66433N897838R841627
8195H159988R688406O128784j643878j0540962j2301045m941205J129559k529709
$$ plain form
8187 -6850062 -14817816 -17210695 -6816533 7765985 14621644 14791829 16033344 17542066
8179 17542066 13799927 9016542 12682135 21359514 19911496 3840973 -12704333 -15789220
8171 -15789220 -7091134 4396458 14564667 21433877 20678056 12555827 5768219 6466299
8163 6466299 9703075 8743172 6160348 7934865 12411460 13419538 10181544 6862639
8155 6862639 5826568 7140520 10425447 12013433 6139176 -5109790 -10108249 -3673348
8147 -3673348 2617297 -3784898 -16510949 -18561581 -7051899 3347893 1404848 -8099827
8139 -8099827 -14509792 -13846458 -8293787 -1336184 3237541 3405264 2097408 3267846 4445477
8130 4445477 -399708 -9880002 -14511125 -9588456 -2227697 -1747373 -7911117 -12987213
$$ packed form
8187f850062p967754k392879J0394162J4582518O855659J70185J241515J508722
8179A7542066l742139m783385L665593Q677379j448018j6070523j6545306l084887
8171a5789220Q698086J1487592J0168209O869210p55821q122229o787608O98080
8163F466299L236776r59903k582824J774517M476595J008078l237994l318905
8155F862639j036071J313952L284927J587986n874257j1248966m998459O434901
8147c673348O290645o402195j2726051k050632J1509682J0399792j943045r504675
8139h099827o409965O63334N552671O957603M573725J67723j307856J170438J177631
8130D445477m845185r480294m631123M922669P360759M80324o163744n076096
$$ plain form
8122 -12987213 -12439102 -9389188 -9137854 -11850356 -11823702 -4521624 6340634 11627452 7746535
8113 7746535 977682 -1639821 -1283202 -2879972 -5930962 -6075461 -3243916 -1572956 -2262036
8104 -2262036 -2510686 -1010395 822800 2419518 3930388 3688192 855896 -958088 1691847
8095 1691847 5508592 4571554 -549697 -4361000 -5455431 -6532258 -6900725 -3715762 -311500
8086 -311500 -3647086 -12171300 -15947602 -11467482 -6616005 -6889876 -6499959 429519 8247767
8077 8247767 7606152 -846373 -8714550 -11788526 -12115635 -11196879 -8651927 -5996486 -5091543
8068 -5091543 -4042618 -650745 1686324 -1544871 -6428389 -3563157 7945223 16928896
8060 16928896 14174344 4038539 -2592727 -2259115 -4155 556022 1341653 3954693
$$ packed form
8122a2987213N48111L049914K51334k712502K6654P302078J0862258N286818l880917
8113G746535o768853k617503L56619j596770l050990j44499K831545J670960o89080
8104b262036k48650J500291J833195J596718J510870k42196k832296j813984K649935
8095A691847L816745r37038n121251l811303j094431j076827l68467L184963L404262
8086c11500l335586q524214l776302M480120M851477k73871L89917O929478P818248
8077H247767o41615q452525p868177l073976l27109R18756K544952K655441R04943
8068e091543J048925L391873K337069l231195m883518K865232J1508380Q983673
8060A6928896k754552j0135805o631266L33612K254960N60177P85631K613040
$$ plain form
8052 3954693 5779422 4253961 1118609 -286053 475880 1338310 676167 -1912639 -5592147
8043 -5592147 -7417505 -4469252 711263 528452 -7582703 -14816276 -10907041 1374724
8035 1374724 8821524 4993296 -2604978 -4444394 -852037 1823349 826267 -2405996
8027 -2405996 -7018532 -12631740 -16744555 -16751768 -13430323 -9744520 -7877602 -9146388 -13908676
8018 -13908676 -19478993 -21382513 -18749747 -14936706 -11319220 -5692000 769827 1552889
8010 1552889 -5534200 -12786714 -12645876 -8038551 -6022844 -6178680 -3621937 45657 -1688956
8001 -1688956 -8658353 -12736015 -9364157 -3807097 -4103675 -11894606 -20978438 -22566803
$$ packed form
8052C954693J824729j525461l135352j404662P61933Q62430o62143k588806l679508
8043e592147j825358K948253N180515j82811q111155p233573L909235J2281765
8035A374724P446800l828228p598274j839416L592357K675386r97082l232263
8027b405996m612536n613208m112815p213L321445L685803J866918j268786m762288
8018a3908676n570317j903520K632766L813041L617486N627220O461827P83062
8010A552889p087089p252514J40838M607325K015707j55836K556743L667594j734613
8001a688956o969397m077662L371858N557060k96578p790931r083832j588365
$$ [...]
##END NTUPLES=NMR SPECTRUM
##END=
