##TITLE=31Pdec_SR-157-K3-TFAA6
 CDCl3, 24 sc
 5.6.2023
##JCAMPDX= 6.0         $$ Bruker NMR JCAMP-DX V2.0
##DATA TYPE= NMR SPECTRUM
##DATA CLASS= NTUPLES
##ORIGIN= UXNMR, Bruker Analytische Messtechnik GmbH
##OWNER= root
$$ XWIN-NMR		Version 3.5
$$ Tue Jun  6 16:22:29 2023 Russian Standard Time (UT+4h)  she@DPX200
##.OBSERVE FREQUENCY= 81.013821
##.OBSERVE NUCLEUS= ^31P
##.ACQUISITION MODE= SIMULTANEOUS
##.ACQUISITION SCHEME= undefined
##.AVERAGES= 24
##.DIGITISER RES= 16
##SPECTROMETER/DATA SYSTEM= spect
##.PULSE SEQUENCE= zgpg30
##.SOLVENT NAME= CDCl3
##.SHIFT REFERENCE= (INTERNAL, CDCl3, 0, 248.564)
##AUDIT TRAIL= $$ (NUMBER, WHEN, WHO, WHERE, WHAT)
$$ ##TITLE= Audit trail, XWIN-NMR		Version 3.5
$$ ##JCAMPDX= 5.01
$$ ##ORIGIN= Bruker BioSpin GmbH
$$ ##OWNER= she
$$ F:/spectra/data/she/nmr/P31/1/pdata/1/auditp.txt
$$ ##AUDIT TRAIL=  $$ (NUMBER, WHEN, WHO, WHERE, WHAT)
(   1,<2023-06-06 16:21:35.45 +0400>,<she>,<DPX200>,
      <created by zg, POWCHK disabled, PULCHK disabled
       configuration hash MD5:
       00 E9 B6 7A A2 85 ED C7 34 08 36 98 17 FE 4E 26
       data hash MD5: 32K
       5A C9 50 E7 22 04 23 CB 69 28 29 CE 49 46 2C B0>)
(   2,<2023-06-06 16:21:39.42 +0400>,<she>,<DPX200>,
      <Start of raw data processing
       efp BC_mod = 2 LB = 1 FT_mod = 6 PKNL = 1 PHC0 = -10645.81 PHC1 = -22.31514 SI = 64K 
       data hash MD5: 64K
       06 AA 69 80 F3 DD AA 3A BA CB C7 D2 96 15 E7 16>)
(   3,<2023-06-06 16:21:54.20 +0400>,<she>,<DPX200>,
      <pk PHC0 = 4.40557 PHC1 = 0 
       data hash MD5: 64K
       FD FA 8F 52 F0 EA D5 B7 77 7C F0 FD 5C 82 72 0F>)
$$ ##END=
$$ 
$$ hash MD5
$$ C9 A8 E7 DA B7 5B 31 93 05 04 5E 75 42 AB 3A AF
##$RELAX= 
##$RELAX= 
##$RELAX= 
##$RELAX= 
##$RELAX= 
##$RELAX= 
##$RELAX= 
##$RELAX= 
##$RELAX= 
$$ Bruker specific parameters
$$ --------------------------
##$DU= <F:/spectra>
##$EXPNO= 1
##$NAME= <P31>
##$PROCNO= 1
##$TYPE= <nmr>
##$USER= <she>
##$AMP= (0..31)
100 100 100 100 100 100 100 100 100 100 100 100 100 100 100 100 100 100 
100 100 100 100 100 100 100 100 100 100 100 100 100 100 
##$AQSEQ= 0
##$AQ_mod= 1
##$AUNM= <au_zg>
##$AUTOPOS= <>
##$BF1= 81.014009
##$BF2= 200.13
##$BF3= 200.13
##$BF4= 200.13
##$BF5= 200.13
##$BF6= 200.13
##$BF7= 200.13
##$BF8= 200.13
##$BYTORDA= 1
##$CFDGTYP= 0
##$CFRGTYP= 5
##$CHEMSTR= <none>
##$CNST= (0..31)
1 1 145 1 1 1 1 1 1 1 1 1 1 1 1 1 1 1 1 1 1 1 1 1 1 1 1 1 1 1 1 1 
##$CPDPRG= <waltz16>
##$CPDPRG1= <>
##$CPDPRG2= <waltz16>
##$CPDPRG3= <>
##$CPDPRG4= <mlev>
##$CPDPRG5= <mlev>
##$CPDPRG6= <mlev>
##$CPDPRG7= <mlev>
##$CPDPRG8= <mlev>
##$CPDPRGB= <>
##$CPDPRGT= <>
##$D= (0..31)
0 1 0 0 0 0 0 0 0 0 0 0.03 2e-05 3e-06 0 0 0 0 0 0 0 0 0 0 0 0 0 0 0 0 
0 0 
##$DATE= 1686054094
##$DBL= (0..7)
120 120 120 11 120 120 24 19 
##$DBP= (0..7)
150 150 150 150 150 150 150 150 
##$DBP07= 0
##$DBPNAM0= <>
##$DBPNAM1= <>
##$DBPNAM2= <>
##$DBPNAM3= <>
##$DBPNAM4= <>
##$DBPNAM5= <>
##$DBPNAM6= <>
##$DBPNAM7= <>
##$DBPOAL= (0..7)
0.5 0.5 0.5 0.5 0.5 0.5 0.5 0.5 
##$DBPOFFS= (0..7)
$$ [...]
##$SUBNAM2= <"">
##$SUBNAM3= <"">
##$SUBNAM4= <"">
##$SUBNAM5= <"">
##$SUBNAM6= <"">
##$SUBNAM7= <"">
##$SUBNAM8= <"">
##$SUBNAM9= <"">
##$SW= 501.771253377433
##$SWIBOX= (0..15)
0 1 3 0 0 0 0 0 0 0 0 0 0 0 0 0 
##$SW_h= 40650.406504065
##$TD= 32768
##$TD0= 1
##$TE= 0
##$TE2= 300
##$TE3= 300
##$TEG= 300
##$TL= (0..7)
0 120 53 12 22 120 120 120 
##$TP= (0..7)
150 150 150 150 150 150 150 150 
##$TP07= 0
##$TPNAME0= <>
##$TPNAME1= <>
##$TPNAME2= <>
##$TPNAME3= <>
##$TPNAME4= <>
##$TPNAME5= <>
##$TPNAME6= <>
##$TPNAME7= <>
##$TPOAL= (0..7)
0.5 0.5 0.5 0.5 0.5 0.5 0.5 0.5 
##$TPOFFS= (0..7)
0 0 0 0 0 0 0 0 
##$TUNHIN= 0
##$TUNHOUT= 0
##$TUNXOUT= 0
##$USERA1= <user>
##$USERA2= <user>
##$USERA3= <user>
##$USERA4= <user>
##$USERA5= <user>
##$V9= 5
##$VALIST= <valist>
##$VCLIST= <CCCCCCCCCCCCCCC>
##$VD= 0
##$VDLIST= <DDDDDDDDDDDDDDD>
##$VPLIST= <PPPPPPPPPPPPPPP>
##$VTLIST= <TTTTTTTTTTTTTTT>
##$WBST= 1024
##$WBSW= 4
##$XGAIN= (0..3)
0 0 0 0 
##$XL= 0
##$YL= 0
##$YMAX_a= 5086
##$YMIN_a= -5149
##$ZGOPTNS= <>
##$ZL1= 120
##$ZL2= 120
##$ZL3= 120
##$ZL4= 120
##$ABSF1= 0
##$ABSF2= 0
##$ABSG= 0
##$ABSL= 0
##$ALPHA= 0
##$AQORDER= 0
##$ASSFAC= 0
##$ASSFACI= 0
##$ASSFACX= 0
##$ASSWID= 0
##$AUNMP= <proc_1d>
##$AZFE= 0.1
##$AZFW= 0.5
##$BCFW= 0
##$BC_mod= 2
##$BYTORDP= 0
##$COROFFS= 0
##$CY= -3
##$DATMOD= 1
##$DC= 0
##$DFILT= <>
##$DTYPP= 0
##$F1P= 0
##$F2P= 0
##$FCOR= 1
##$FTSIZE= 65536
##$FT_mod= 6
##$GAMMA= 0
##$GB= 0
##$INTBC= 1
##$INTSCL= 6.047779e-11
##$ISEN= 30
##$LB= 1
##$LEV0= 0
##$LPBIN= 0
##$MAXI= 10000
##$MC2= 0
##$MEAN= 0
##$ME_mod= 0
##$MI= 50
##$NCOEF= 0
##$NC_proc= -6
##$NLEV= 6
##$NOISF1= 182.463
##$NOISF2= 159.3651
##$NSP= 0
##$NTH_PI= 0
##$NZP= 0
##$OFFSET= 248.5645
##$PC= 4
##$PHC0= -10641.4
##$PHC1= -22.31514
##$PH_mod= 1
##$PKNL= yes
##$PPARMOD= 0
##$PSCAL= 0
##$PSIGN= 0
##$REVERSE= no
##$SF= 81.0140089999694
##$SI= 65536
##$SIGF1= 159.3651
##$SIGF2= -187.1042
##$SINO= 113.3802
##$SIOLD= 16384
##$SREGLST= <1H.CDCl3>
##$SSB= 0
##$STSI= 65536
##$STSR= 0
##$SW_p= 40650.406504065
##$SYMM= 0
##$S_DEV= 0
##$TDeff= 32768
##$TDoff= 0
##$TI= <>
##$TILT= no
##$TM1= 0
##$TM2= 0
##$TOPLEV= 0
##$USERP1= <user>
##$USERP2= <user>
##$USERP3= <user>
##$USERP4= <user>
##$USERP5= <user>
##$WDW= 1
##$XDIM= 65536
##$YMAX_p= 481622346
##$YMIN_p= -26676961
$$ End of Bruker specific parameters
$$ ---------------------------------
##NTUPLES= NMR SPECTRUM
##VAR_NAME=  FREQUENCY,     SPECTRUM/REAL,   SPECTRUM/IMAG
##SYMBOL=    X,             R,               I
##VAR_TYPE=  INDEPENDENT,   DEPENDENT,       DEPENDENT
##VAR_FORM=  AFFN,          ASDF,            ASDF
##VAR_DIM=   65536,         65536,           65536
##UNITS=     HZ,            ARBITRARY UNITS, ARBITRARY UNITS
##FACTOR=    0.620285442955139, 1,           1
##FIRST=     20137.2065510682, 0,            0
##LAST=      -20513.1999529968, 0,           0
##MIN=       -20513.1999529968, -26676961,   0
##MAX=       20137.2065510682, 481622346,    0
$$ Real data points
##PAGE= N=1
##DATA TABLE= (X++(R..R)), XYDATA
$$ [...]
##PAGE= N=2
##DATA TABLE= (X++(I..I)), XYDATA
13236C37532J143527J193901L34342q31220j406714j058527l44620r2763k99558
13227a024100P1J251556K177283J131612j319889k536898j163143R15611J118503
13218E50606l44852j140174l79785M26935J05627m51086q7931O57253O30169j876
13208c5114k67333j48456l74765p86620l80409Q92897J673745J010644l33748
13199A250841r88203o77457j61769L4722Q8653K37508L38298J92729q2418k11139
13189B1765j22441k1933j42895m75867p36070o11653p5912N52763Q83672P91192
13179F2621M89867K95130L17180L83667K46447j62689o62198r17127o08387K74361
13169b81128J142912J065582k60805j837734k164933q89657P59231J413602R93212
$$ plain form
13236 337532 1481059 2674960 3009302 2178082 771368 -287159 -631779 -724542 -1024100
13227 -1024100 -1024029 227527 2404810 3536422 2216533 -320365 -1483508 -567897 550606
13218 550606 205754 -934420 -1314205 -887270 -781643 -1232729 -1320660 -663407 -33238 -35114
13208 -35114 -302447 -450903 -825668 -1612288 -1992697 -1099800 573945 1584589 1250841
13199 1250841 262638 -414819 -576588 -541866 -453213 -215705 122593 315322 232904 21765
13189 21765 -100676 -122609 -265504 -741371 -1477441 -2089094 -2165006 -1612243 -728571 62621
13179 62621 552488 847618 1164798 1548465 1794912 1632223 970025 52898 -555489 -281128
13169 -281128 861784 1927366 1666561 -171173 -2336106 -3225763 -2466532 -1052930 -59718
13160e9718L41249n1335k86929l47509m2212K86193q9276j056228j394234l75384
13150c075383R88411J168654K13414m21560m9409M19419J59650k17521J89808
13141f24517R43507Q96937J1318o05648l46509K47143M80384J97218n12986j299063
13131f12216j271509N5214J483292J238699l72523j094561q0785Q16428J96942
13122C58981n30288K45164J259342M35955j314178j327759M41760J402505N85738
13113A557220k05753O6263J05031p97436j212706l66048K02945n08687r13271
13104b072442L40443J686475J118309m77349r25457k02375K26835K15938M96554
13095D06931N24154n37585j539420q26977O57989O30496o40036p41606O96911
$$ plain form
13160 -59718 281531 230196 -56733 -404242 -446454 -160261 -249537 -1305765 -2699999 -3075383
13150 -3075383 -2086972 -918318 -704904 -1126464 -1175873 -756454 -596804 -814325 -624517
13141 -624517 318990 1215927 1227245 621597 275088 522231 1002615 1199833 686847 -612216
13131 -612216 -1883725 -1828511 -345219 893480 520957 -573604 -654389 162039 358981
13122 358981 -171307 73857 1333199 1769154 454976 -872783 -431023 971482 1557220
13113 1557220 1351467 1417730 1522761 725325 -487381 -853429 -650484 -1159171 -2072442
13104 -2072442 -1731999 -45524 1072785 595436 -330021 -532396 -305561 -89623 406931
13095 406931 931085 393500 -1145920 -1972897 -1314908 -684412 -1324448 -2066054 -1369143
13086a369143J436472N76952j18053L52734N50775l83654q53015L45898J641542
13077B180508J088737o69913j695938j511114q42325L7445J013568J331099O89130
13068A621197R7800K21112N4822j189036k139839j125254R85444J841744R17963
13059A285953k12439n03547l74807j94997K46459O44822K99596m27149l70967
13050C92924M12952M84619o26125j457957q19882L92324O58808R1602n3038M65782
13040e7991N71066k84119j129621q14092L88980J190378J003667N06130L93641
13031A768039L34577k84688j103674j153620l30421M14980M58667J82960L9947
13022C26767j22826l74869k75355K48090M56177j4535l33897K45508J023307Q35858
$$ plain form
13086 -1369143 67329 644281 526228 878962 1429737 1046083 193068 538966 2180508
13077 2180508 3269245 2599332 903394 -607720 -1450045 -1412600 -399032 932067 1621197
13068 1621197 1718997 1940109 1994931 805895 -1333944 -2459198 -1473754 367990 1285953
13059 1285953 1073514 569967 195160 163 246622 891444 1191040 763891 392924
13050 392924 805876 1290495 664370 -793587 -1613469 -1221145 -562337 -470735 -523773 -57991
13040 -57991 513075 228956 -900665 -1714757 -1325777 -135399 868268 1374398 1768039
13031 1768039 2102616 1817928 714254 -439366 -769787 -354807 103860 286820 326767
13022 326767 203941 -170928 -446283 -198193 257984 243449 -90448 155060 1178367 2014225
13012B014225j54285q04411p16473m26937j85710J70167K89863l49001j108357
13003a270919o56190Q69101J579635M21756j209881j421034l78822K99016N8801
12994a708537r5644N13626J191894J056234K87482l49248n65935n26147k30731
12985d27006L62236Q13651N24646l52861r26018o83449j15692N5846j76963l05071
12975a230681q1468L13071N96423M75408k55378j203267j320426n6641J635952
12966a127007K225822J458651M86381J32290l7415o36199j352320j487738r85428
12957a322963l15705K60974P56702J022831P64134k1024q61982j124556n62827
12948a404416L14328O37931K34724k5788N48509J270326R13022m48377j431378
$$ plain form
13012 2014225 1859940 1055529 339056 -87881 -273591 -103424 186439 -162562 -1270919
13003 -1270919 -1927109 -1058008 521627 943383 -266498 -1687532 -2066354 -1767338 -1708537
12994 -1708537 -1804181 -1290555 -98661 957573 1245055 895807 329872 -196275 -427006
12985 -427006 -64770 748881 1273527 920666 -5352 -688801 -804493 -748647 -925610 -1230681
12975 -1230681 -1312149 -999078 -402655 72753 -182625 -1385892 -2706318 -2762959 -1127007
12966 -1127007 1098815 2557466 3043847 3176137 3138722 2502523 1150203 -337535 -1322963
12957 -1322963 -1638668 -1377694 -620992 401839 1165973 1144949 282967 -841589 -1404416
12948 -1404416 -1090088 -452157 -217433 -243221 305288 1575614 2488636 2040259 608881
12939F08881j202610l32425L38824O30153N44713n0236q13541r71522m48832l4605
12929a731200q04L56558J226329J534081N77306o42679q10689j93583L302m55791
12919a37170p55477m70503m69K60875L29003L12796L01355L66718K84635k98166
12909A93597j045278r84595P7925R93108Q19917J36498l2063K03713Q8310l75027
12899G6105n77645l71735l7254L36351O03008L09491m48403o54406J74441R71203
12889C81156O70996p2113m0359M81230L35045m34017p68876m38778r3098J44207
12879A65393N17760M60333o59557j861825j510918J09900J074532P18272K91498
12870f94612M93570M57723k30167n28793J49170Q07526O56493L96867N94837L46801
$$ plain form
12939 608881 -593729 -926154 -587330 42823 587536 537300 -276241 -1247763 -1696595 -1731200
12929 -1731200 -1732004 -1375446 -149117 1384964 1962270 1319591 508902 315319 318621 -137170
12919 -137170 -892647 -1363150 -1363619 -1102744 -773741 -460945 -159590 207128 491763 193597
12909 193597 -851681 -1836276 -1758351 -765243 54674 191172 159109 362822 451132 76105
12899 76105 -501540 -873275 -910529 -574178 28830 338321 -110082 -764488 -590047 381156
12889 381156 1052152 980039 939680 1420910 1755955 1321938 553062 114284 21186 165393
12879 165393 683153 1143486 483929 -1377896 -2888814 -2778914 -1704382 -986110 -694612
12870 -694612 -201042 256681 26514 -502279 -353109 454417 1110910 1507777 2102614 2449415
12860B449415j016151k178330j452786O14702J813302J105924l59949r50251k66432
12851b40556Q25885J193197M19634q23791j447826j089643l14077K84922O02067
12842e90188O18941K67886j05762O0677O17337P49402K30666j98534k0224L53493
12832A983694M06815J70240k92475j057422j610392j078057K49824Q40058J29921
12823b57794m29630L92812J528572J199974l06503j137799o61222j3017O2058
12814C77451J99683Q38218J129273K67718j051683j468937p79265n4349o4779
12805f06670l26274K6884Q71070J129973K30193r49487j043191L8252Q99434L99707
12795F69891q95190j410079m52825J036197J618354R18069j15801m13579J191
$$ plain form
12860 2449415 1433264 -745066 -2197852 -1583150 230152 1336076 976127 25876 -240556
12851 -240556 585329 1778526 2198160 1374369 -73457 -1163100 -1477177 -1192255 -590188
12842 -590188 28753 296639 190877 251554 868891 1618293 1848959 1650425 1630201 1983694
12832 1983694 2390509 2560749 2268274 1210852 -399540 -1477597 -1227773 -387715 -257794
12823 -257794 -687424 -294612 1233960 2433934 2127431 989632 328410 315393 377451
12814 377451 577134 1415352 2544625 2812343 1760660 291723 -487542 -541891 -606670
12805 -606670 -932944 -906060 -34990 1094983 1325176 375689 -667502 -629250 270184 669891
12795 669891 -225299 -1635378 -2088203 -1052006 566348 1484417 1368616 955037 956228
12786I56228K44181j07251m79438l28651o8989l35504p93560n98143J56078M69095
12776h85954m126m47791k41346J55608J99418K57889Q24283J376561R89156j69595
12766B054103q85018n33496R6511o891o04402n71741L66867J037291L99515q35404
12756E17335j077837j81080K86761n60979j485619r65766N09078J253779Q69236
12747h35092M70449O82784Q66232M62417j57065n13637o61590o53356k41069N20270
12737e9657J061212R79314M28303k17053n83905l83129J13961N7834p36713j109919
12727d49752k28546P45801K51436r48663p13699R15144J485276l2481j556193
12718e31677j139180J98364M28017l60798n97607J04258O84888M60359k18674
$$ plain form
12786 956228 1200409 1093158 613720 285069 216080 -119424 -912984 -1511127 -1355049 -885954
12776 -885954 -890080 -1337871 -1579217 -1423609 -1224191 -966302 -142019 1234542 2223698 2054103
12766 2054103 1169085 635589 732100 725209 120807 -450934 -84067 953224 1352739 517335
12756 517335 -560502 -741582 -454821 -1015800 -2501419 -3467185 -2958107 -1704328 -835092
12747 -835092 -364643 318141 1184373 1646790 1489725 976088 314498 -338858 -579927 -59657
12737 -59657 1001555 1980869 2409172 2192119 1608214 1225085 1339046 1396880 660167 -449752
12727 -449752 -678298 67503 318939 -629724 -1343423 -428279 1056997 1024516 -531677
12718 -531677 -1670857 -1472493 -1044476 -1405274 -2002881 -1898623 -1213735 -753376 -972050
12709i72050p87846r13447m70167J88473M18470K39056L33639O82019L40802p72970
12699a714021j237258k35366J020021J151270N98301L71037J48521o73305j212758
12690a783558m06840P78557O46955k75603K5851J506114J779947q9379j863742
12681C18302j328551O14225J530556Q67472J26489K61889N55008J48912n88547
12672B505755p82869l82015p9724k27759m97855n84226n66578m04535J99144J015644
12662A94982J148479L75225j62645L68223R17150Q5520j387257j531712k48765
12653b40800O33896M57434M94499J137234R21070n65934j361324l42017O06946
12644A741004k92661j563726r65300O26224P41523m93248q10217J71377N04597
$$ plain form
12709 -972050 -1759896 -2673343 -3143510 -2955037 -2536567 -2297511 -1963872 -1281853 -941051 -1714021
12699 -1714021 -2951279 -3186645 -2166624 -1015354 -417053 -46016 102505 -570800 -1783558
12690 -1783558 -2190398 -1411841 -764886 -1040489 -1014638 491476 2271423 2182044 318302
12681 318302 -1010249 -396024 1134532 2002004 2128493 2390382 2945390 3094302 2505755
12672 2505755 1722886 1340871 1261147 1033388 535533 -48693 -615271 -1019806 -820662 194982
12662 194982 1343461 1718686 1556041 1924264 2841414 2926934 1539677 7965 -240800
12653 -240800 393096 850530 1345029 2482263 3403333 2837399 1476075 1134058 1741004
12644 1741004 1448343 -115383 -1080683 -454459 287064 -206184 -1016401 -845024 -340427
12635c40427m80014j042691q1190J125629J090112J68670m16043k11763M62960
12626B75243J071438J038617K88747l68770k86020o5935n07766j056213p40111
12617c50770k1883K8151j95740L86422J186709P09649n87964p57780K66065M74286
12607A137145o04201q99282O49006K141261J652399q5037j313728j603320j213716
12598a39473k0933J427715J528726j37387j691775j518915m20533J79076M70265
12589c23234J036386J085358p2330j162480p24808L47404K38949p20071p22237
12580a017063L81904R61460M05838j59428n4136M8530k72292l83028J04638N74034
12570E90457M20070j71911p25750r16286n06335L04593O43335K0169o74822l26834
$$ plain form
12635 -340427 -820441 -1863132 -1944322 -818693 271419 440089 24046 -187717 275243
12626 275243 1346681 2385298 2674045 2305275 2019255 1953320 1445554 389341 -350770
12617 -350770 -372653 -344502 -540242 -153820 1032889 1742538 1154574 396794 662859 1137145
12607 1137145 532944 -366338 282668 2423929 4076328 3991291 2677563 1074243 -139473
12598 -139473 -160406 1267309 2796035 2658648 966873 -552042 -972575 -793499 -323234
12589 -323234 713152 1798510 1726180 563700 -161108 186296 425245 -294826 -1017063
12580 -1017063 -635159 326301 732139 572711 518575 567105 294813 -88215 16423 590457
12570 590457 1010527 838616 112866 -803420 -1309755 -1005162 -361827 -341658 -1016480 -1343314
12560a343314O22176Q69691L94480K94533O05246J34860j202503j746079n72362
12551a943272R53169J167941M11161J30768O14521R06269M78218k01133n95692
12542A921950o60117m94385j67308O0180j14444n53991p24037l34010K75359M83589
12532c07214P3594m81976n14691M353L67643J05899k82722r2949L99946L38291
12522c89826k02217j47486P93171J360026N51793o58189n93035N82840R93436
12513B290513j58908j330504q93410M32814O40291n91863j443802o40325P63667
12504i31527J022590J21876n32740k72579K26737L21932J53911j09383o13948
12495f13131j048056o42845M86775J032520K82087p07103o33366J91170N93892
$$ plain form
12560 -1343314 -721138 148553 543033 837566 1442812 1577672 375169 -1370910 -1943272
12551 -1943272 -990103 177838 588999 719767 1334288 2240557 2718775 2517642 1921950
12542 1921950 1261833 767448 600140 660320 545876 -8115 -732152 -1066162 -790803 -307214
12532 -307214 -233620 -715596 -1230287 -1225934 -858291 -752392 -1035114 -1128063 -728117 -389826
12522 -389826 -592043 -739529 53642 1413668 1965461 1307272 714237 1297077 2290513
12513 2290513 2131605 801101 -92309 340505 980796 388933 -1054869 -1695194 -931527
12504 -931527 91063 212939 -319801 -592380 -365643 -43711 110200 817 -613131
12495 -613131 -1661187 -2304032 -1817257 -784737 -502650 -1209753 -1843119 -1651949 -1058057
12486a058057M15127L21306K83565k54629r20946p02206K25985M99733k64589
12477a454711p98486k70030L83827J10257n09594l24725M81804Q23182M79288
12468a079188K16813M30422P27941P29754M13552j75254p85731p92780J9008Q07730
12458E12267P17275K25797L50326Q04711L69934q88377j375247m17178N56101
12449H55609J57263q98685j024180r5858P09234P70409M44211M8592l40331l60178
12439B66086J47245L32371o49259j898803j559848L98096J747603J034173m09183
12430e91519n51869M43381Q80278K97554j30191K27269N30485P1519n67187o18410
12420h690l45785l20259k67604L60722J123670R86973p1210q26734m27156N19177
$$ plain form
12486 -1058057 -642930 -321624 -38059 -292688 -1213634 -1915840 -1689855 -1190122 -1454711
12477 -1454711 -2253197 -2523227 -2139400 -2029143 -2538737 -2863462 -2381658 -1558476 -1079188
12468 -1079188 -862375 -431953 295988 1025742 1439294 1264040 478309 -314471 -295463 512267
12458 512267 1229542 1455339 1805665 2610376 2980310 2091933 716686 299508 855609
12449 855609 1012872 114187 -909993 -1005851 -296617 473792 918003 966595 626264 266086
12439 266086 413331 745702 96443 -1802360 -3362208 -2964112 -1216509 -182336 -591519
12430 -591519 -1143388 -700007 180271 477825 347634 574903 1105388 1176907 609720 -8690
12420 -8690 -354475 -674734 -942338 -581616 542054 1529027 1457817 631083 203927 723104
12410G23104Q63266L42838l84073o97285m70905J38311P98702J041833O88883
12401C044674J40656j80176m49865r39735j180323n17706N73937Q26424N1191
12392A369077m71386K2073N98984K76445l18788j74420J93035l52298j357380
12383b14658j297481j08872O40372K60605j87671M8915K73910l2513j47113L55235
12373d09271N66230n3191l96150M31192J297674P88719l58773n08008N3533k37153
12363A174802j207088j024583N72935J514917N93397o50162l83011Q24456J165656
12354B581319K93786o12269p75066m73095j30257J28300J60952r9151l44966l08863
12344D20690k49673m51227n66917j49895M50219M93821m786l21899j66966P127
$$ plain form
12410 723104 1586370 1929208 1545135 847850 376945 515256 1313958 2355791 3044674
12401 3044674 3185330 3005154 2555289 1615554 435231 -82475 491462 1317886 1369077
12392 1369077 897691 919764 1518748 1795193 1476405 1301985 1495020 1142722 -214658
12383 -214658 -1512139 -1621011 -980639 -720034 -907705 -858790 -584880 -617393 -764506 -409271
12373 -409271 156959 103768 -292382 138810 1436484 2225203 1866430 1358422 1411955 1174802
12363 1174802 -32286 -1056869 -483934 1030983 1624380 974218 591207 1415663 2581319
12354 2581319 2875105 2262836 1487770 1014675 884418 1012718 1173670 1074519 729553 420690
12344 420690 171017 -280210 -847127 -997022 -546803 -52982 -57768 -379667 -546633 -539506
12334e39506p2804n3773K61145L60600k19047r93333r93822n4867Q54958P38882
12324g11567k63709j044443p79054K03325Q84092P33614K08257O5862M19800O59181
12314C75358K44657n86174r83674l71869Q28277J471762Q58138m19925j063159
12305C53391n39483L75360O91546L93670J01763n7238m57053r39632p47923J58998
12295f66601O59078P1474n95857j14455Q29246N05681r56287j367884K28013J840944
12285D33352J359014l70175j021272l07230J04362l27201l82163L34692N21751
12276C45130l57765q48987O1309J071041O37828n06641o41224K18299P10759N09398
12266A199147M24129N36440J16967o70982p63404p1941K46516k74343p07053m20004
$$ plain form
12334 -539506 -612310 -666083 -404938 -44338 -263385 -1256718 -2250540 -2305407 -1450449 -711567
12324 -711567 -975276 -2019719 -2798773 -2595448 -1711356 -977742 -769485 -703623 -283823 375358
12314 375358 620015 33841 -949833 -1321702 -493425 978337 1836475 1416550 353391
12305 353391 -186092 189268 880814 1274484 1376247 1319009 861956 -77676 -825599 -666601
12295 -666601 -7523 63951 -531906 -646361 182885 688566 -267721 -1635605 -1407592 433352
12285 433352 1792366 1422191 400919 93689 198051 -129150 -511313 -176621 345130
12276 345130 -12635 -861622 -800313 270728 908556 401915 -239309 -21010 689749 1199147
12266 1199147 1623276 2159716 2276683 1605701 842297 770356 1016872 742529 35476 -384528
12256c84528m4847j39777k11167J50499L47113r1994m84174j43165L25817N5105
12246f21118m65963j52355P04770P00739m43637j329228r59461j11330J09916
12237b567667L5614O39355J616695J622459L69604q02158q41613l63181m10034
12228g00926p57332m63281M67416J114875J075879P54564L41636l40413r42129
12219E50289p60053k6595J97243k42438k76677M37916O86648k88130j282619q75561
12209a879977M16906J117398J013941Q78462O71359k38720j376202j392278r9511
12200h88622J109198J094244J67637o41226o26920K20862J085997Q71236l05855
12191B086551q19062J55627R80081q3204j745249j338668Q23667J636590P4310
$$ plain form
12256 -384528 -429375 -569152 -780319 -629820 -282707 -374701 -858875 -1002040 -676223 -621118
12246 -621118 -1087081 -1239436 -534666 166073 -277564 -1606792 -2566253 -2677583 -2567667
12237 -2567667 -2532053 -1892698 -276003 1346456 1716060 913902 72289 -290892 -700926
12228 -700926 -1458258 -1921539 -1454123 -339248 736631 1491195 1832831 1492418 550289
12219 550289 -209764 -236359 -39116 -281554 -558231 -120315 566333 278203 -1004416 -1879977
12209 -1879977 -1463071 -345673 668268 1546730 2218089 1979369 603167 -789111 -888622
12200 -888622 220576 1314820 1482457 841231 214311 435173 1521170 2392406 2086551
12191 2086551 1267489 1423116 2403197 2319993 574744 -763924 59743 1696333 1770643
12182A770643j197785k39851J067482L39270j323730j284846L24037J116634M14992
12173I86846j37571K60811M47539k52491p45938k03786M38642J01186o85902q10802
12163f01466l58973j57690k25890P9228O79778P13828r7104r53769j070562n29300
12153b521920K01060Q79472J240677Q37671k12973q69560l74217N35671N69739
12144B85620j93258m75262J15174N23741J39274j98605J36809K76744n50934j321853
12134a262550o65351Q10031J345958O59667k6677k47261o65189j203434p94704
12125b049510O04673J559276J309755P43948N69753J96229o98963j143986n79943
12116E11232j10810o57967j152934k06555J393108J667489M00900o83405n65660
$$ plain form
12182 1770643 572858 333007 1400489 1739759 416029 -868817 -544780 571854 986846
12173 986846 849275 1110086 1557625 1305134 559196 355410 794052 895238 209336 -601466
12163 -601466 -960439 -1118129 -1344019 -1264791 -585013 128815 31711 -922058 -1992620 -2521920
12153 -2521920 -2320860 -1441388 -200711 636960 423987 -445573 -819790 -284119 285620
12144 285620 92362 -382900 -267726 256015 395289 196684 333493 610237 59303 -1262550
12134 -1262550 -1927901 -1117870 228088 887755 861078 613817 -51372 -1254806 -2049510
12125 -2049510 -1444837 114439 1424194 2168142 2737895 2934124 2235161 1091175 511232
12116 511232 400422 -257545 -1410479 -1617034 -223926 1443563 1844463 1161058 595398
12107E95398p6205j57929m36803j62661M15034M20440l23355j003293q50811j06118
12097a686303L03369K3181k00797L41965J052776P51092m19667r68211k72921
12088a075516M00480j06630r16955m15150J184975J991011J029630n66632j214905
12079C10308p43686j33655m9975k33414j53682K12143M31079K88349Q2997Q6723
12069I7187O0053k46475m32298l7638L84180j73999j401847j638373j53056J623066
12059a919200J978129J114929M27918L23669M6107o79742j151063r00990l43913
12050a104156K5585K48002M49792M76649K87230J61263K05046J02827l22219o77997
12040a47978n01775N5319M15280L35356J24816Q1587P0347j20914k76776l2272
$$ plain form
12107 595398 519193 361264 -75539 -238200 176834 597274 273919 -729374 -1580185 -1686303
12097 -1686303 -1382934 -1359753 -1560550 -1218585 -165809 585283 165616 -802595 -1075516
12088 -1075516 -675036 -781666 -1698621 -2113771 -928796 1062215 2091845 1525213 310308
12079 310308 -433378 -567033 -617008 -850422 -1004104 -791961 -360882 -72533 10464 97187
12069 97187 157240 -89235 -521533 -559171 -174991 -348990 -1750837 -3389210 -3542266 -1919200
12059 -1919200 58929 1173858 1601776 1925445 1971552 1291810 140747 -760243 -1104156
12050 -1104156 -1078571 -830569 -380777 95872 383102 544365 749411 852238 530019 -147978
12040 -147978 -649753 -594434 -179154 156202 281018 362605 432952 312038 35262 2990
12030B990M09706L74509k78132p64374m03533L87994O84579L29361k5031P957
12020G26026J22196j6525k78945l60466j38056L01999O61759N49005o1477o62602
12010H42914q44221p72827o78519l74544J74898M21001Q8609j79472J15251L80613
12000h26297J02617N4481Q97131J478688M55669j059391q06362R29900J526313
11991B752749J45233j043611n16528L53098l6934r35405r41897l61985j37335
11982g22615k7647M47092O57598R2825l64938N0242N20096K31267p84N92038R29865
11971B405039l5082j061527n55436M78769M7099j221243j005647O09870J064402
11962G26244m60734j706761r91393M13673P39231L49611M11228O23842J8685r74989
$$ plain form
12030 2990 412696 787205 509073 -255301 -658834 -270840 413739 743100 718069 726026
12020 726026 848222 831697 552752 192286 54230 356229 1017988 1566993 1505516 842914
12010 842914 -1307 -774134 -1452653 -1827197 -1652299 -1231298 -1142689 -1322161 -1206910 -826297
12000 -826297 -723680 -669199 227932 1706620 2162289 1102898 296536 1226436 2752749
11991 2752749 2897982 1854371 1337843 1690941 1654007 718602 -223295 -585280 -722615
11982 -722615 -750262 -303170 354428 447253 82315 132557 652653 883920 883136 1475174 2405039
11971 2405039 2369957 1308430 752994 1231763 1278862 57619 -948028 -338158 726244
11962 726244 265510 -1441251 -2432644 -2018971 -1279740 -930129 -518901 104941 123626 -851363
11952h51363r14491N08610J882005J704369L7645j526172j429175J85780J495168
11943A092376J014792o76609j788770j544946p20512j96569j1574J06606K36631
11934b488575M83609Q94156J014773L48135o10358o77682L78763J328035J042610
11925A713466p7607p61302m79866J42549L19232J1667k29595p9360J75655J47798
11915H82637k8978L4240K58777K12191j01883k63023k73994n30644q17183l73304
11905a001164O74918J078836K64462p34485q90504o06238n81698l93235N34095
11896a655013J444841J182889L8601o64779m29249J55469O09654Q71223P40837
11887B294473J07693n15099n61234j89377J86466N21811O04117j78899j604471
$$ plain form
11952 -851363 -1765854 -1257244 624761 2329130 2366775 840603 -588572 -402792 1092376
11943 1092376 2107168 1430559 -358211 -1903157 -2623669 -2820238 -2831812 -2725206 -2488575
11934 -2488575 -2004966 -1110810 -96037 252098 -358260 -1035942 -657179 670856 1713466
11925 1713466 1635859 874557 394691 537240 856472 868139 638544 559184 734839 882637
11915 882637 853659 887899 1146676 1358867 1256984 993961 719967 189323 -627860 -1001164
11905 -1001164 -326246 752590 1017052 282567 -607937 -1214175 -1795873 -2189108 -1655013
11896 -1655013 -210172 972717 1011318 346539 -82710 72759 682413 1553636 2294473
11887 2294473 2402166 1887067 1325833 1136456 1322922 1844733 2448850 2269951 665480
11878F65480k197375j196491J44818N03963M83988J065401J408242L33147j067320
11869A43853p86708P47886J254368K43252n03204j49824N2301p21928j529050
11860a249054j470922q85218j51314Q62338J664322J268846l5916p67365m78173
11851a242456j46928j14413L30920R88965O56572m39252n20433O33904R87850
11842A134729k29274r45406J94515J253681J88799j558598j301086O13463J553085
11833I03908P15929k06396r6239L11759K59938J1355j94273n65886q59349m23861
11823a43115N96906J241545J041336L58019n27292j543967k069686j272167N16908
11814a801513J780369J525736K88550p60800r95721m73605L53871Q14184M92771
$$ plain form
11878 665480 -1531895 -2728386 -2583568 -2079605 -1595617 -530216 878026 1211173 143853
11869 143853 -642855 105031 1359399 1602651 1099447 949623 1001924 279996 -1249054
11860 -1249054 -2719976 -3605194 -3756508 -2894170 -1229848 38998 3082 -764283 -1242456
11851 -1242456 -1389384 -1503797 -1172877 -183912 472660 33408 -487025 146879 1134729
11842 1134729 905455 -39951 154564 1408245 1597044 38446 -1262640 -649177 903908
11833 903908 1619837 1413441 1317202 1628961 1888899 1900254 1705981 1140095 280746 -143115
11823 -143115 453791 1695336 2736672 3094691 2567399 1023432 -1046254 -2318421 -1801513
11814 -1801513 -21144 1504592 1793142 1032342 36621 -436984 -83113 731071 1223842
11805A223842k35481o12340m86462l52034l94966k31165K13245L36344j53465
11796f92482n02739J39030J335766J687306O05447q46882j226229m44640K41414
11787B95991j08873r56584j000111J97632J608961J802856M94705j068726j395529
11778a29678m02978N40394M01560k19719j71888L91179L41120l99879n89973K14168
11768b5694P35992L7650q12262m14976O12472N52599o87316j409550o14753P91788
11758a234050J492002J263310O39719k454n53415r10666r70343p05229k62012
11749a243138k6976j93280j86920O85216J766747J408075n46579j961399j214076
11740a512330M80931J008116M01336J38901M09538K51783k14695O059O25491L65679
$$ plain form
11805 1223842 988361 376021 -110441 -462475 -857441 -1088606 -875361 -539017 -692482
11796 -692482 -1195221 -1056191 279575 1966881 2572328 1725446 499217 54577 295991
11787 295991 187118 -769466 -1769577 -1571945 37016 1839872 2334577 1265851 -129678
11778 -129678 -532656 7738 409298 189579 17691 408870 749990 350111 -239862 -25694
11768 -25694 710298 747948 -64314 -479290 133182 685781 -1535 -1411085 -2025838 -1234050
11758 -1234050 257952 1521262 2160981 2158527 1605112 694446 -275897 -981126 -1243138
11749 -1243138 -1270114 -1463394 -1650314 -965098 801649 2209724 1663145 -298254 -1512330
11740 -1512330 -1031399 -23283 378053 516954 926492 1178275 963580 969639 1595130 1960809
11730A960809o27994q51013k0619N32144K40634m2210j7263l85928r47246m98170
11720f56856P96910J184192J90273n40560j47820M3905q10545j337229m25315
11711a703045O47192M12595k40843K51608J320257J247971j0009j002441j134426
11702b11141j022300r05205l46762O03691J235919J156196O14256L6462k17729
11693I43387n5533N000o11800j339877r01907O05646J418323O62743k46313J31979
11683F11648J015294Q41771k16873q12721o37053m57167n37226n30604m94488
11674a217419o37051m75673M30316J306529J051749j6653o07013l92963j94278
11665g52456l45499k19406M77891J088699J011784M80891j874l78515q16570j144103
$$ plain form
11730 1960809 1332815 481802 461183 993327 1233961 1191751 1174488 788560 -158686 -656856
11720 -656856 140054 1324246 1514519 973959 826139 870044 59499 -1277730 -1703045
11711 -1703045 -1055853 -643258 -884101 -632493 687764 1935735 1925726 923285 -211141
11702 -211141 -1233441 -2138646 -2485408 -1881717 -645798 510398 1124654 1161116 943387
11693 943387 887854 892854 281054 -1058823 -1960730 -1355084 63239 725982 479669 611648
11683 611648 1626942 2468713 2251840 1439119 802066 344899 -192327 -722931 -1217419
11674 -1217419 -1854470 -2330143 -1899827 -593298 458451 441798 -165215 -558178 -752456
11665 -752456 -1097955 -1317361 -839470 249229 1261013 1741904 1740030 1361515 544945 -599158
11655e99158q67393J95508J368996J507097K85462j147699j420215o29523N438
11646a301487k5707j19298R0109K54515L21182O59048R25594K65836r71905j272038
11636a174151k44775P10967O69794L89501M78129K34888n87723p75971J81253
11627a18088P50374j53972j061967k86200J174648J277346K34064j84034K69075
11618A901246L20367k97942o12665l92543l06176l33274P6398N14115J43675n42148
11608D71053l56571M45678N57026r1967l76973j25400j81024m30438P2974R43428
11598I27786O76823o44454j119330r3121P47187K22281m70287N2332J062766J060296
11588B422279R9841o27525o31891l24472m8030J09950N5046p8102L0169J97084
$$ plain form
11655 -599158 -1466551 -1271043 97953 1605050 1890512 742813 -677402 -1306925 -1301487
11646 -1301487 -1327194 -1446492 -1356383 -1101868 -780686 -121638 803956 1069792 97887 -1174151
11636 -1174151 -1418926 -707959 -38165 351336 829465 1064353 476630 -299341 -118088
11627 -118088 632286 478314 -583653 -869853 304795 1582141 1816205 1632171 1901246
11618 1901246 2221613 1923671 1311006 918463 612287 279013 355411 869526 1013201 471053
11608 471053 114482 560160 1117186 1025219 648246 522846 341822 -88616 -15642 927786
11598 927786 1604609 960155 -159175 -252296 494891 717172 246885 299217 1361983 2422279
11588 2422279 2522120 1894595 1262704 938232 890202 1000152 1055198 977096 1007265 1204349
11578A204349j28375p02601n22586M49537Q09631j86951j183289n64642J069546
11569B44619J612570K72016j498004j865912n77606J042432J522431O25509m79344
11560H98711n62595J67104M35504j97502p20422l32133K96297J90574l78332n29041
11550g31835k59393j37828l5042N13892J003127M93481n71723o60794M16791R60789
11540I91465l3225j234979j032967N7512M91595K10241L06727P76512N62191k65573
11530H29499l57153N67090J105358N37443k3384K43240L77599m29385j084035
11521A766272m62319L67169j82497j370692j223831J73057Q89020M23136K82333
11512F61648J031347J197806q3721j432837j354107l57973K26612K22642K10852
$$ plain form
11578 1204349 1075974 373373 -149213 300324 1109955 923004 -260285 -824927 244619
11569 244619 1857189 2129205 631201 -1234711 -1812317 -769885 752546 1378055 898711
11560 898711 336116 503220 938724 741222 20800 -311333 -15036 175538 -202794 -731835
11550 -731835 -991228 -1129056 -1164098 -650206 352921 846402 274679 -386115 30676 991465
11540 991465 958240 -276739 -1309706 -1252194 -760599 -550358 -243631 532881 1095072 829499
11530 829499 472346 1039436 2144794 2682237 2658853 2902093 3279692 2850307 1766272
11521 1766272 1303953 1671122 1488625 117933 -1105898 -932841 -43821 379315 661648
11512 661648 1692995 2890801 2807080 1374243 20136 -337837 -111225 111417 322269
11503C22269K42852R4171M281J94055K96745K9582k18124r5860R5565N3000J1963
11492A030499J44190J69145O256L364J27276j46227p26292p39487O531M75164
11482C50419j7697o95789n56603J86593O73994O42523L77954P4072j60107j98415
11472F76944j56882j87357J2649O35745Q71841j36223j513389j454889L5158J036066
11462a80337P07860L56734Q22413R82376O232r48693p58552k28243l60257m17443
11452a7910M84983J342079P97173m40230o99069k927K61811l01428p89324n89644
11442D5514J20107R86277J463976Q84609m26767j027176l90773J19460m88066
11433A287161j040946k67613P70009L33137j014016j295994k58899N88743O08567
$$ plain form
11503 322269 565121 659292 663573 857628 1154373 1183955 965831 869971 965536 1018536 1030499
11492 1030499 1174689 1343834 1350090 1353454 1480730 1334503 608211 -131276 -124745 350419
11482 350419 332722 -363067 -919670 -733077 -59083 583440 961394 1035466 875359 676944
11472 676944 520062 332705 345354 981099 1852940 1716717 203328 -1251561 -1216403 -180337
11462 -180337 527523 884257 1706670 2689046 2695278 1746585 988033 759790 399533 -17910
11452 -17910 467073 1809152 2606325 2166095 1467026 1464099 1725910 1424482 635158 45514
11442 45514 165621 1151898 2615874 3500483 3073716 2046540 1655767 1775227 1287161
11433 1287161 246215 -21398 748611 1081748 67732 -1228262 -1487161 -898418 -289851
11424b89851N66659P20624L75055n37670j084456p50126M390O28077R01309O46835
11414A180846m9275o11267p00230o23895m57785K11505R73860N27673r82209j340385
11404a871162L90210J749116L75216k017027k016489K47907J469872L41079r17768
11395b249046n03758N21544O54925L03664M06493N72907L2818p47565o88604K57598
11385a439024J000050O74328l03701o12388M02445J627606J383359j72269j048103
11376A512303l19923M84770j06668j190208j143597k15848L20094M61647R75537
11367G78107J462070R08125l60785j048132p79494j69348L91957O70460J61312
11358B014272q85318j061709J11843R79427K69297o91386k67165N98893K15250
$$ plain form
11424 -289851 276808 997432 1372487 834817 -249639 -999765 -995375 -367298 534011 1180846
11414 1180846 1131571 520304 -179926 -803821 -1261606 -1050101 -76241 451432 -530777 -1871162
11404 -1871162 -1480952 268164 643380 -1373647 -3390136 -3142229 -1672357 -1331278 -2249046
11395 -2249046 -2752804 -2231260 -1576335 -1272671 -866178 -293271 -260453 -1008018 -1696622 -1439024
11385 -1439024 -438974 235354 -68347 -680735 -278290 1349316 2732675 2560406 1512303
11376 1512303 1192380 1677150 1570482 380274 -763323 -979171 -659077 -197430 778107
11367 778107 2240177 3148302 2787517 1739385 959891 790543 1182500 1852960 2014272
11358 2014272 1128954 67245 179088 1158515 1427812 736426 469261 1068154 1283404
11349A283404o61011k82221O92498L47817q72222r10860J74743M80657j50895
11340A01910q3671P29786N91207o24933j154877n70154k51042l93505K97887J521182
11330A63790J242699o13999j516671l79716P24204J39797q87354p64011q8357
11321a979618k1835j97000J71757P32524Q49408O25553J97476n57396j035841
11312a214972k95389J073545J312384K61560k49899N50189J067639N4946j332238
11303A227765j401050k65990Q08687J137743P72076L3528m32794j25279M33236
11294B187922K53288o52126j416621j635294j286970k1962J791946K181656p825
11285A394014k512530k139272N87349K155235J191781k76050p02384p86777r10734
$$ plain form
11349 1283404 622393 340172 1032670 1380487 508265 -402595 -227852 252805 101910
11340 101910 18239 748025 1339232 714299 -440578 -1010732 -1261774 -1655279 -1357392 163790
11330 163790 1406489 792490 -724181 -1103897 -379693 -239896 -1127250 -1891261 -1979618
11321 -1979618 -2001453 -2198453 -2026696 -1294172 -444764 180789 378265 -179131 -1214972
11312 -1214972 -1510361 -436816 875568 1137128 887229 1437418 2505057 2560003 1227765
11303 1227765 -173285 -439275 369412 1507155 2279231 2312759 1879965 1754686 2187922
11294 2187922 2441210 1789084 372463 -1262831 -2549801 -2571763 -779817 1401839 1394014
11285 1394014 -1118516 -3257788 -2670439 -515204 676577 400527 -301857 -1088634 -1999368
11276a999368k01484R91659Q84144m66659p47942O65169J462242L57849q13353
11267A32257m79799K09696O6057J13989J161320J748212P17118m53337j09556
11258C105957P38499K16658j376220k289745j773966l01033J315063J878869N21636
11249B035718j522097j720730J70076J479926O71316m58084q0169P19624K44298
11240A539878q50388j073497o93019o77592o63816L0848Q11821R63938R33826
11231C21999R55232J47797j439609j872311k87937J153272M06530j197948j178774
11222b991749K23741R27758N07188K46309N42216O34520L99660L62708L50229
11213A202580j04929m91514p2158N92028M13712l69608n72771L7335N12613K12810
$$ plain form
11276 -1999368 -2200852 -1209193 -325049 -791708 -1539650 -874481 587761 945610 132257
11267 132257 -347542 -137846 -71789 42200 1203520 2951732 3668850 3215513 3105957
11258 3105957 3844456 4061114 2684894 395149 -1378817 -1679850 -364787 1514082 2035718
11249 2035718 513621 -1207109 -1037033 442893 1114209 656125 575956 1295580 1539878
11240 1539878 689490 -384007 -1077026 -1754618 -2418434 -2387586 -1575765 -611827 321999
11231 321999 1277231 1425028 -14581 -1886892 -2174829 -1021557 -615027 -1812975 -2991749
11222 -2991749 -2768008 -1840250 -1333062 -1086753 -544537 89983 489643 852351 1202580
11213 1202580 1097651 606137 533979 1126007 1539719 1170111 597340 634675 1147288 1360098
11203A360098m64990p24141j62240Q18865J213672N70271j66732P7220O93960
11194C215983L23025o59153n77010N71753R04052j48515q70224k99297J98525
11185B659139m56201j147574o75692J96618K58040k53749n42094n37170k85190
11176g83873M42220J170567R57594J16787r3046K39157j23718r13853n58536O86744
11166A140043Q38863j18726l0775J236384J153302q07451j846853p28307J18249
11157I54729o69668q27137Q55425J606347l73128k078432n83787J846417J627299
11148B358065l11630q62981j85024l63727r22016j51015R29626L07886r19123
11139a19939m20650Q79439M75436q94131n37292J071606R96875q51856j549938
$$ plain form
11203 1360098 895108 170967 8727 827592 2041264 2611535 2444803 2522023 3215983
11194 3215983 3539008 2879855 2302845 2874598 3778650 3630135 2759911 2460614 2659139
11185 2659139 2202938 1055364 379672 576290 834330 580581 38487 -498683 -783873
11176 -783873 -341653 828914 1786508 1903295 1810249 2049406 1925688 1011835 453299 1140043
11166 1140043 1978906 1860180 1829405 3065789 4219091 3411640 1564787 836480 954729
11157 954729 285061 -542076 313349 1919696 1546568 -531864 -1115651 730766 2358065
11148 2358065 2046435 1183454 998430 634703 -287313 -438328 491298 799184 -119939
11139 -119939 -540589 338850 814286 -79845 -617137 454469 1451344 599488 -950450
11130i50450k55469O75432K2993n99045k1025P34022P14772M04316K51653M7947
11120A025146J4521N48664R71565L96538n33412o17771j53664j21910k08941L06894
11110A627630O90558l8892j028664r03606q3653L17828N60480J025383N69969
11101B737033j289399k347622q53433J073594N41645j226696r14176J258111K047719
11092A026776O41974n33007k71246M4554k84149j99503M89522N31411k90227p71792
11082C84313n41021k66090J45356J070150J417665N6718j611561j375060J35447
11073e84083N27595k96125m09752L80409M72081k01456j89914L81023J12932n46425
11063c53715M8577J237954Q21295q29053j172902j1290K89265p28677r08957K65127
$$ plain form
11130 -950450 -1205919 -530487 -507494 -1106539 -1127564 -393542 321230 725546 977199 1025146
11120 1025146 1039667 1588331 2559896 2956434 2423022 1805251 1651587 1529677 1320736 1627630
11110 1627630 2318188 2279296 1250632 347026 263373 581201 1141681 2167064 2737033
11101 2737033 1447634 -899988 -1753421 -679827 -138182 -1364878 -2279054 -1020943 1026776
11092 1026776 1668750 1135743 864497 909051 624902 425399 914921 1446332 1156105 384313
11082 384313 -156708 -422798 -277442 792708 2210373 2267091 655530 -719530 -584083
11073 -584083 -56488 -352613 -762365 -381956 90125 -111331 -301245 79778 192710 -353715
11063 -353715 -305138 932816 1754111 925058 -247844 -259134 30131 -698546 -1607503 -1342376
11053a342376P12495j66923l57338P99087J256605J25005p18773k43538k1930
11044D2314q55595r93835N00928J679076R42369l24894k99448M59660N92299K72025
11034B014899K09320R1494m30553p03031k57699K98306M20938L15055L2725n95387
11024A396067r49444k94998N39311J74127p88522o27411K88113l180j279769j058604
11014b604310J150669K708016J918255K71448m86023o73800q68679n22970K74524
11005A167130K20611o98525o17818R78000J953717R00504o36068r00631n84674
10996A782246r85628j568153j194869j33658P60038J395548J706011J105273j65319
10987B701489p55807l19977j84099q94042j037737K25068J383456Q66404n19726
$$ plain form
11053 -1342376 -629881 -796804 -1154142 -355055 901550 1026555 307782 64244 42314
11044 42314 -813281 -1807116 -1306188 372888 1315257 990363 690915 1150575 1742874 2014899
11034 2014899 2224219 2315713 1885160 1182129 924430 1222736 1643674 1958729 1991454 1396067
11024 1396067 446623 151625 690936 865063 76541 -550870 -262757 -265937 -1545706 -2604310
11014 -2604310 -1453641 1254375 3172630 3444078 2958055 2284255 1415576 892606 1167130
11005 1167130 1387741 689216 71398 1049398 3003115 3903619 3267551 2366920 1782246
10996 1782246 796618 -771535 -1966404 -2100062 -1340024 55524 1761535 2866808 2701489
10987 2701489 1945682 1625705 1441606 547564 -490173 -265105 1118351 1984755 1465029
10978A465029j026893m82793J24757M27743O38080O37553K91197n0026j75398
10969A849249l75637o42325m48409K17464O03175L52665q0755l58671n23409l69520
10959B23827K06741M24483l38598j043880l41698R18130P45477n72875p03920
10950d82313Q25994J714861O42101p26653p03841j32765l94898q67475k12763
10941c37752J161471J679217Q58530l22875q34380m93960J45054L32188r6153
10932B091340m32163r8268L90381K61780j93783j97382J20945Q1646k92193n61396
10922A170907p60427q23429q2460J288222J581264M8539j321180o59318O28261
10913A070379J97829j141154q57681Q00145J283392K24726j96660O33446Q39602
$$ plain form
10978 1465029 438136 -44657 80100 507843 1145923 1783476 2074673 2024647 1849249
10969 1849249 1473612 831287 382878 600342 1203517 1556182 1475427 1116756 593347 223827
10959 223827 430568 855051 516453 -527427 -869125 49005 794482 221607 -482313
10950 -482313 343681 2058542 2700643 1973990 1270149 1137384 742486 -124989 -337752
10941 -337752 823719 2502936 3361466 3038591 2204211 1710251 1855305 2187493 2091340
10932 2091340 1659177 1560909 1951290 2213070 2019287 1821905 1942850 2024496 1732303 1170907
10922 1170907 410480 -412949 -495409 792813 2374077 2422616 1101436 442118 1070379
10913 1070379 1268208 127054 -730627 69518 1352910 1577636 1380976 2014422 2854024
10904B854024l28000j217217p89483l6812K62377N71109Q37354K24719r13925
10895A464146j138145l24473K38712J89755K58974L31833j89435m87367N05805
10886H49805J551286P23845r07921n79685J480020K224105O52462j046910j387436
10877C559571j138243p96793L9110O01022l06187j460107o90010R83656O63033
10868A455052j129495r97011J254162J976383l1496j514858m57541R03653N60173
10859B019022j40768J24373J64897p36108j005271P3905Q25857M84104N37414
10850B347425J276978P63852j149187j711853k7993J069571n8854j061433m8603
10841A399903J056267K77773q70661m05665P13026Q44801M71985L72237j69513
$$ plain form
10904 2854024 2526024 1308807 519324 482512 744889 1315998 2153352 2378071 1464146
10895 1464146 326001 1528 240240 429995 688969 1020802 831367 344000 849805
10886 849805 2401091 3124936 2217015 1637330 3117350 5341455 5993917 4947007 3559571
10877 3559571 2421328 1624535 1663645 2264667 1958480 498373 -191637 792019 1455052
10868 1455052 325557 -671454 582708 2559091 2527595 1012737 555196 1458849 2019022
10859 2019022 1878254 2002627 2167524 1431416 426145 500050 1325907 1810011 2347425
10850 2347425 3624403 4388255 3239068 1527215 1499222 2568793 2509939 1448506 1399903
10841 1399903 2456170 2733943 1863282 1457617 2170643 3015444 3487429 3859666 3690153
10832C690153j171968r34117P36420J354500j26496j253322k74053R33203M70470
10823C424790l72376o6755K13623o80919j211980k1195J246131P09223o02120
10814B638422q46688k79707J14991M97858P56155j79910j818687j780323K33351
10805f64538J297350j2985j180817k16216R95871M24766m59566K66382J352889
10796A803136Q70467l29397n66877l38355o90141q92255j84990L99541J07517
10787A78646J907N68440M31837p44841j004416M06309J370004O19415j29363L05043
10777B002981L89261o99115j069398J91249R60656N7110m69968N48737R42045
10768B853558m81977j220994L09160J480900J01656j516982o90860J069548J252759
$$ plain form
10832 3690153 2518185 1584068 2320488 3674988 3548492 2295170 2021117 2954320 3424790
10823 3424790 3052414 2985659 3199282 2518363 1306383 1285188 2531319 3240542 2638422
10814 2638422 1791734 1512027 1627018 2124876 2881031 2701121 882434 -897889 -664538
10805 -664538 632812 619827 -560990 -777206 218665 643431 183865 450247 1803136
10796 1803136 2673603 2344206 1777329 1438974 748833 -143422 -328412 71129 178646
10787 178646 180553 748993 1180830 435989 -568427 -162118 1207886 1827301 1697938 2002981
10777 2002981 2392242 1693127 623729 814978 1775634 1832744 1362776 1911513 2853558
10768 2853558 2371581 1150587 1459747 2940647 3042303 1525321 834461 1904009 3156768
10759C156768O54729Q52474P20377q28810j814857n84588Q10348J77549r33549
10750B210441l91530O10906L15921j08496O30670Q91739n64194j471826j6455
10741B107176J424667L56005j316811q59271M18203L1337r82221m73684N57695
10732A263096K65408k46161N53149J127018q7984j081413J92709J652100O97022
10723D334944r82858o06973N96383O3382j077513l64636J092070P68437m62621
10714C360615k64118N56927j15789j294879p59529N38123K49258r38444p66687
10705E65477L55254M64807k13335k12841J58128l9845j02545N63550O71730k93026
10695A917354m13559J039626J627540J53757p54598M45423R94663q96379k115833
$$ plain form
10759 3156768 3811497 4663971 5384348 4555538 2740681 2156093 2966441 3143990 2210441
10750 2210441 1818911 2429817 2745738 2637242 3267912 4159651 3595457 2123631 2107176
10741 2107176 3531843 3887848 2571037 1711766 2129969 2161306 1179085 705401 1263096
10732 1263096 1528504 1282343 1835492 2962510 2874526 1793113 1985822 3637922 4334944
10723 4334944 3352086 2745113 3341496 3404878 2327365 1962729 3054799 3823236 3360615
10714 3360615 3096497 3653424 3537635 2242756 1483227 2021350 2270608 1332164 565477
10705 565477 920731 1385538 1172203 959362 1117490 1077645 975100 1538650 2210380 1917354
10695 1917354 1503795 2543421 4170961 4324718 3570120 4015543 5010206 4113827 1997994
10686A997994k08635J704247L63135j679039q29687R43036N732k081212j546874
10677a331303P64140J347402K70876L0325N16990J33825l75161K45633O42083
10668B244810l10026n89751J043720J846115k2760j518420j06560J347548N09
10659C935185j401204J63744J888999L38246j871112r35845R74492K1318k000184
10650A113639j381306M29245J91940n63868R37642K524657J156738p26391K95353
10641C977649J833656K73953k062563j358767M52326J7646n33799J525106K748053
10632F873260l15189l286250r78962K787240J665749j837880j382179J436779
10624D962568Q80294j498236k71666K528056Q95867l165458k692759J397925K047431
$$ plain form
10686 1997994 1789359 3493606 3856741 2177702 1348015 2291051 2296783 215571 -1331303
10677 -1331303 -567163 780239 1051115 1081440 1598430 1732255 1357094 1602727 2244810
10668 2244810 1934784 1345033 2388753 4234868 4212108 2693688 2587128 3934676 3935185
10659 3935185 2533981 2697725 4586724 4924970 3053858 2118013 3092505 3113823 1113639
10650 1113639 -267667 161578 353518 -210350 727292 3251949 4408687 3682296 3977649
10641 3977649 5811305 6085258 4022695 2663928 3116254 3133900 2600101 4125207 6873260
10632 6873260 6558071 3271821 2292859 5080099 6745848 4907968 3525789 4962568
10624 4962568 5842862 4344626 4072960 6601016 7496883 4331425 1638666 3036591 5084022
10615E084022j013282j545111J084939J418933j006455j112398J313096J253393
10607E477137j389489j462268J402371K151190p9860j010075J35078k3028j330551
10598C870505n12620J426046Q05315r67490Q1844K058018M02428k671595j633984
10589B858467J775098J569698j198163p90366J859507J205771j587124p86371
10581D906517K320025J589801j934174j912539J022852Q28743j794323j016260
10573D010642K009629J172697k058862r92190K909864K238490k092147k341261
10565D856862J365214J615195j835433k075283J126942J374578j110567j98154
10557E119354L017373J886128k039087j315251K613615J812699k470216j989525
$$ plain form
10615 5084022 4070740 2525629 3610568 5029501 4023046 2910648 4223744 5477137
10607 5477137 4087648 2625380 4027751 6178941 6099081 5089006 5224084 5201056 3870505
10598 3870505 3357885 4783931 5589246 4621756 4703600 6761618 7164046 4492451 2858467
10589 2858467 4633565 6203263 5005100 4214734 6074241 7280012 5692888 4906517
10581 4906517 7226542 8816343 6882169 4969630 5992482 6821225 5026902 4010642
10573 4010642 6020271 7192968 5134106 4141916 7051780 9290270 7198123 4856862
10565 4856862 6222076 7837271 6001838 3926555 5053497 6428075 5317508 5119354
10557 5119354 8136727 10022855 7983768 6668517 9282132 11094831 8624615 6635090
10549F635090K203682J714478k498368j988950K180621J495955k583300j097798
10541F061410M151477L349445j980407j602097L207542K148344l220794k188482
10533I926438L323862J848526m480766l163061L903281L398910l166343k052106
10525I538741N175047M084364l649184k689179N225195L708969n398888m311259
10517A1683806N345360M400986n714955m184507P915677P709756m865407n485292
10509A6805424O888891O831645o752502o283238R648579J0588917n863900o473986
10501B5389830J1822077J2236645q580275q361877J7254393J8546615j0796474
10494E7510934j0431707L0059876L5261257j2045603q606517Q6285026J22773262
$$ plain form
10549 6635090 8838772 10553250 8054882 6065932 8246553 9742508 7159208 6061410
10541 6061410 10212887 13562332 11581925 9979828 13187370 15335714 12114920 9926438
10533 9926438 13250300 15098826 10618060 7454999 11358280 14757190 11590847 9538741
10525 9538741 14713788 18798152 15148968 12459789 17684984 21393953 15995065 11683806
10517 11683806 17029166 21430152 15715197 11530690 19446367 27156123 22290716 16805424
10509 16805424 23694315 30525960 23773458 17490220 27138799 37727716 31863816 25389830
10501 25389830 37211907 49448552 40868277 32506400 49760793 68307408 57510934
10494 57510934 47079227 77139103 112400360 100354757 91748240 178033266 300806528
10487C00806528l2412256k45484355k60151145n9832269J09480923R0443268l705406
10480a00854712j4570382L3132647L3805471o567047j1778142J6443254J7982455
10473c2406456p158210r232656J2257441J3971173n865954r232634O895331R555979
10465b1215986m544044o649030O009808P647366l889236m910880O166225O948597
10457a4437180l967200n038326N450860O719169l691346n955787L439001O214022
10449a1266787j920619m650822K364483M581596j838246l529219K813550M531360
10441h914704j497146l418820J672371K807729k340873l212191K145438L433518
10433i324678j149347j771383K876513K982270k424107l148453K074264K946506
$$ plain form
10487 300806528 268394272 22909917 -237241228 -297073497 -187592574 -97149306 -100854712
10480 -100854712 -115425094 -82292447 -48486976 -55054023 -66832165 -50388911 -32406456
10473 -32406456 -39564666 -48797322 -36539881 -22568708 -28434662 -37667296 -30771965 -21215986
10465 -21215986 -25760030 -32409060 -26399252 -18751886 -22641122 -27552002 -21385777 -14437180
10457 -14437180 -18404380 -23442706 -17991846 -11272677 -14964023 -20919810 -17480809 -11266787
10449 -11266787 -13187406 -17838228 -15473745 -10892149 -12730395 -16259614 -13446064 -8914704
10441 -8914704 -10411850 -13830670 -12158299 -9350570 -11691443 -14903634 -12758196 -9324678
10433 -9324678 -10474025 -12245408 -9368895 -6386625 -8810732 -11959185 -9884921 -6938415
10425f938415k321897l616010J522509L636449j87710j601815J917694K547243
10417e041952j805869l335164K75896J870586o49967q52842K404517K447550j345310
10408f032555j691835K133374K410469k014805l176143R16760K731256l76817
10400e100296j930926N06780J280263j225016j356533J859651K167924j530475
10392e328628k573688P61500K106480n63904j396126J428379K133753j063434
10384d495668k351795L47882J595895p24352j612867P60772J565606p18417j209929
10375f842873J380330J886292j081799k113861O47998K003764k74580j537910
10367e932639M01415J356808o01492j527781L66154J557360O24208M84624J332204
$$ plain form
10425 -6938415 -9260312 -12876322 -11353813 -7717364 -7905074 -9506889 -7589195 -5041952
10417 -5041952 -6847821 -10182985 -9907089 -8036503 -8686470 -9539312 -7134795 -4687245 -6032555
10408 -6032555 -7724390 -5591016 -3180547 -5195352 -8371495 -7454735 -4723479 -5100296
10400 -5100296 -7031222 -6524442 -5244179 -6469195 -7825728 -5966077 -3798153 -5328628
10392 -5328628 -7902316 -7140816 -5034336 -5598240 -6994366 -5565987 -3432234 -4495668
10384 -4495668 -6847463 -6499581 -4903686 -5628038 -7240905 -6480133 -4914527 -5632944 -6842873
10375 -6842873 -5462543 -3576251 -4658050 -6771911 -6123913 -4120149 -4394729 -5932639
10367 -5932639 -5531224 -4174416 -4775908 -6303689 -5937535 -4380175 -3755967 -3271343 -1939139
10358a939139o8247k570913j252110K832041L119248p98162k129628P81264J737291
10349b88355j360850k729464K0431J528862o97677j693840Q72097K069956m66645
10340b745485j821396N15978J683652j034131k829969m71005J927157J130363
10332c644836L22385J601353J402434j660243k799184J9109J542396j092952k638636
10323f948174N22368L297289J073029j892999m17076K351941J167408j886573
10315b732787j832804L13084M32213r41741n36337J212278J588636P45138M13084
10306a339236J32923r95208j581869n96917K24839l05975m55586P75938J355717
10297b785374J82008o21641J57795N61994l92813p65589J6530k20615j459168
$$ plain form
10358 -1939139 -2007386 -4578299 -5830409 -2998368 120880 -677282 -2806910 -2025646 -288355
10349 -288355 -1649205 -4378669 -4358238 -2829376 -3527053 -5220893 -4348796 -2278840 -2745485
10340 -2745485 -4566881 -4050903 -2367251 -3401382 -6231351 -6702356 -4775199 -3644836
10332 -3644836 -3322451 -1721098 -318664 -1978907 -4778091 -4758982 -3216586 -4309538 -6948174
10323 -6948174 -6425806 -3128517 -2055488 -3948487 -4365563 -2013622 -846214 -2732787
10315 -2732787 -4565591 -4252507 -3820294 -4762035 -5298372 -4086094 -2497458 -1752320 -1339236
10306 -1339236 -1206313 -2201521 -3783390 -4380307 -4155468 -4461443 -4917029 -4141091 -2785374
10297 -2785374 -2603366 -3225007 -3067212 -2505218 -2898031 -3663620 -3647090 -3867705 -5326873
10288e326873n87539K322268K745756n43289k572473l20006K314435J478643n58566
10279a047644m98201L06817l23608q84282J64403Q53261j62347n01363J126956
10270i66008J764764l41812k035878r22835K44780r88354j961531m6569K127019
10261c126424J345081n89097n72402M80968M44102J76770P40918M24762j403166
10252b078488j694339R14225K586720N11732j917090q87855J367101J074914l62024
10243d85104K54333J572663N34416j541010j398911J95912K94852p46984o55108
10234a974941O0026m24322j138259k47346R57945L63142p74303k01639R04810
10225b474887K01961j206604p69535P69414Q92675r6253j03597O18752K58974
$$ plain form
10288 -5326873 -5914412 -3592144 -846388 -1389677 -3962150 -4282156 -1967721 -489078 -1047644
10279 -1047644 -1545845 -1239028 -1562636 -2446918 -2282515 -1429254 -1591601 -2092964 -966008
10270 -966008 798756 456944 -1578934 -2501769 -2256989 -3245343 -5206874 -5253443 -3126424
10261 -3126424 -1781343 -2370440 -2942842 -2461874 -2017772 -1841002 -1100084 -675322 -2078488
10252 -2078488 -3772827 -2858602 -271882 239850 -1677240 -2565095 -1197994 -123080 -485104
10243 -485104 -230771 1341892 1876308 335298 -1063613 -867701 -572849 -1319833 -1974941
10234 -1974941 -1914915 -2339237 -3477496 -3724842 -2766897 -2403755 -3178058 -3379697 -2474887
10225 -2474887 -2272926 -3479530 -4249065 -3479651 -2586976 -2683229 -2786826 -2168074 -1909100
10216a909100r17020j208719n39711Q6414O91029J292313P29767r86723j514569
10207d276319J09435J331037L05955q47846j548J118986M28389m80071M35028
10198a876954J538672O01705r20473p02950J65185l00579r93955k59604M66174
10189b282779l45546o96596J217090K760456J068788j471725j054708R57002O97809
10180H49791j296378j534518j07442n4344j431768j510182q0395N45351J81366
10171d438519O42148J605473J149056k13565l50868L91496J04513o36902P6938
10162a670230J316525O99148j006852j102642J55257L63662l20766P7996Q72297
10153f15605j47627j873919j260837R79770J262559n37631r53991P44767J460412
$$ plain form
10216 -1909100 -2826120 -4034839 -4574550 -4488136 -3797107 -2504794 -1775027 -2761750 -4276319
10207 -4276319 -4166884 -2835847 -2529892 -3377738 -3379286 -2260300 -1831911 -2311982 -1876954
10198 -1876954 -338282 263423 -657050 -1360000 -1194815 -1495394 -2489349 -2748953 -2282779
10189 -2282779 -2628325 -3324921 -2107831 652625 1721413 249688 -805020 151982 849791
10180 849791 -446587 -1981105 -2088547 -2142891 -3574659 -5084841 -5165236 -4619885 -4438519
10171 -4438519 -3796371 -2190898 -1041842 -1255407 -1606275 -1214779 -1110266 -1747168 -1670230
10162 -1670230 -353705 345443 -661409 -1764051 -1608794 -1245132 -1565898 -1487902 -615605
10153 -615605 -763232 -2637151 -3897988 -2918218 -1655659 -2193290 -3147281 -2402514 -942102
10144i42102J01203p05585K27723O94826l58048q78823J81282R56754L72674j12105
10134d62201J30550l93400j773824j665954N34589K059109J145351k46680n132
10125f77592R08023Q11276J40767j08984l97684j138170j271387j75231Q21047
10116a087935M88200l53407m01661J01602K62713J29025J55339J64951j38800
10107f79973m81139n08880k38238K41220P15480O22216j31982n07530K79530J216910
10097E27614Q19927n41324j271047r54124m01312R9314O99078P93443p1385p22733
10087a022549R3417J350560J166465j13864o91737m58701o77061j129464n39958
10078b022892N24754K64290r53764r30688N11919J171091K99131l42088J34517
$$ plain form
10144 -942102 -840899 -1546484 -1318761 -623935 -981983 -1860806 -1679524 -722770 -350096 -462201
10134 -462201 -331651 -725051 -2498875 -4164829 -3630240 -1571131 -425780 -672460 -677592
10125 -677592 230431 1041707 1182474 1073490 675806 -462364 -1733751 -1908982 -1087935
10116 -1087935 -599735 -953142 -1354803 -1253201 -990488 -861463 -706124 -541173 -679973
10107 -679973 -1161112 -1669992 -1908230 -1667010 -951530 -329314 -461296 -968826 -689296 527614
10097 527614 1347541 806217 -464830 -1418954 -1820266 -1720952 -1021874 -228431 -299816 -1022549
10087 -1022549 -929132 421428 1587893 1474029 782292 323591 -353470 -1482934 -2022892
10078 -2022892 -1498138 -1233848 -2187612 -3118300 -2606381 -1435290 -1136159 -1478247 -1343730
10069a343730L79126k86618m97819M61810J143556L62788r67405j499208j116654
10060c364154k16929Q59510J232372K46193r14585m94860Q53733Q43318n66250
10051a521652r55755L87774J218257K42543p76498k74008N69989K98156k71100
10042a082294J02222P26407M21336l64059o47506o43896q06362n64952M27877
10033b431227J111558N78653l57801n36566k48936l31134n36354j81529M45295
10024b488041N80087K28782p3204j43097m7977K36921N08750L68488n4026j89941
10014a073258m7182j95166o25725p10988l54056k3931K67554P09353O89835l02702
10004a666266j107848k63463J271892J183560l98198r15885M01909J320448M78268
$$ plain form
10069 -1343730 -964604 -1251222 -1749041 -1287231 -143675 219113 -748292 -2247500 -3364154
10060 -3364154 -3581083 -2721573 -1489201 -1243008 -2157593 -2652453 -1798720 -955402 -1521652
10051 -1521652 -2477407 -2089633 -871376 -628833 -1405331 -1679339 -1109350 -811194 -1082294
10042 -1082294 -980072 -253665 167671 -196388 -843894 -1487790 -2294152 -2859104 -2431227
10033 -2431227 -1319669 -741016 -1098817 -1635383 -1884319 -2215453 -2751807 -2933336 -2488041
10024 -2488041 -1907954 -1679172 -1752376 -1895473 -1943450 -1706529 -1197779 -829291 -883317 -1073258
10014 -1073258 -1120440 -1315606 -1941331 -2652319 -3006375 -3030306 -2762752 -2053399 -1363564 -1666266
10004 -1666266 -2774114 -3037577 -1765685 -582125 -980323 -1896208 -1494299 -173851 304417
9995C04417n13044k10347K86121j46660m10452M53888J013919j28758j646765
9986i97681j613077o35175m55889q59571m28088P08050J210906Q38229L88329
9977a843967Q7795k09789q4311N46155O14391l59040r41426L883J129114O96577
9967c60618m34003k69462R41782J312234N02004j96154l63626o13448p25820j5316
9957b22427Q29414N73992l01180m29271r9537n29792j177247n31632P83079O75613
9947d28988p08451j000494M10402J417313P73322k11966k93346P104P7949J82638
9937B25483J36520o08981j190118k00679J447784J435126j2006l97425N23995
9928A359699L48936j201793j396121M04966J224855j99743j099638J37808J063416
$$ plain form
9995 304417 -208627 -418974 -132853 -279513 -689965 -236077 777842 649084 -997681
9986 -997681 -2610758 -3245933 -3701822 -4561393 -4989481 -4281431 -3070525 -2232296 -1843967
9977 -1843967 -1756172 -1965961 -2050272 -1504117 -889726 -1248766 -2190192 -2186309 -1057195 -360618
9967 -360618 -794621 -1064083 -122301 1189933 1691937 1495783 1132157 518709 -207111 -222427
9957 -222427 606987 1180979 879799 450528 350991 -178801 -1356048 -1887680 -1104601 -428988
9947 -428988 -1137439 -2137933 -1727531 -310218 463104 251138 -42208 -35104 42845 225483
9937 225483 362003 -246978 -1437096 -1637775 -189991 1245135 1233129 835704 1359699
9928 1359699 1708635 506842 -889279 -484313 740542 540799 -558839 -421031 642385
9919F42385M0452o43720N00555J101782j47501n30868J112776J356783j095872
9910B336772j808379J223258K651548o41490k608066J191848M048636o0239l561610
9901B772278J777083P048267M2016q764379J754190K4813072K6709056m018076
9893E2133507l4235842l0390714l950470R759571K331115m873457j62293M753687
9885d634896R40899l204539k31706L312506Q65806k352092m60189K360105Q66495
9876b537611j580802m59020J367689J12733j422959P6485J630868K848j706786
9867d516555q6846J812856K84629j903356p63490J499131R43027p53503j5218
9858c499325J595399O72677j274824q69646N36433k48631j689955l81665K026329
$$ plain form
9919 642385 682837 39117 539672 1641454 1493953 963085 2075861 3432644 2336772
9910 2336772 528393 1751651 4403199 3761709 1153643 2345491 6394127 6333888 2772278
9901 2772278 4549361 11597628 11639644 2875265 4629455 29442527 56151583 52133507
9893 52133507 17897665 -12493049 -16443519 -6683948 -4352833 -9226290 -9388583 -4634896
9885 -4634896 -3693997 -6898536 -7130242 -3817736 -2951930 -5304022 -5764211 -3404106 -2537611
9876 -2537611 -4118413 -4577433 -3209744 -3097011 -4519970 -4443485 -2812617 -2809769 -4516555
9867 -4516555 -4603401 -2790545 -2505916 -4409272 -5172762 -3673631 -2730604 -3484107 -3499325
9858 -3499325 -1903926 -1231249 -2506073 -3375719 -2839286 -3087917 -4777872 -5159537 -3133208
9849c133208J390865j322359j539342J068733K456412J191226k04934m82937r07431
9840a482975j488832q34916M02750L31716l49628M22940J698141Q27494j398215
9831a871525j578657N24335J611584M11076p06276j58063P19638O43015J31304
9822b73569k63103o41849n51022L25820O76430n62401j702846o99358J075640
9813b616258R42619l40003K6037J600553J303773r94912k065673p87110L67235
9804b563739p157k65516N78856J021003K42703k55529M45247J064319N87746k32407
9794F15526p29900j210869j387000m33371R28884R40331k87485r18209n22556
9785c004649l12014l32288M58159J342057N34950j124501r04692J004771J425528
$$ plain form
9849 -3133208 -1742343 -3064702 -4604044 -3535311 -1078899 112327 -92607 -575544 -1482975
9840 -1482975 -2971807 -3806723 -3403973 -3072257 -3421885 -2998945 -1300804 -473310 -1871525
9831 -1871525 -3450182 -2925847 -1314263 -903187 -1609463 -1767526 -1047888 -404873 -273569
9822 -273569 -536672 -1178521 -1729543 -1403723 -727293 -1289694 -2992540 -3691898 -2616258
9813 -2616258 -1673639 -2013642 -1987605 -387052 916721 -78191 -2143864 -2930974 -2563739
9804 -2563739 -2570896 -2836412 -2257556 -1236553 -993850 -1249379 -804132 260187 847933 615526
9794 615526 -114374 -1325243 -2712243 -3145614 -2216730 -1276399 -1563884 -2482093 -3004649
9785 -3004649 -3316663 -3648951 -3190792 -1848735 -1313785 -2438286 -3342978 -2338207 -912679
9776i12679k93950r90579O90717J741101L3933j899890j184728P26139R04481
9767a185455k79883o15335j41232l54262q43568j01396J202340R61542o60432
9758b017681j180122L17864J765060J320810j9094k43889N62299N18527r98970
9749B4804k188296j381499L60028O58993o08823j086678L60220J807748J304868
9740g48635j69096n28209K04472N69791L20298J83511l2871q40237j411382p88470
9730c240828O2231k59290q96413j12983J407054J489446K02862l09661M71638
9721a185944Q74897K03540l84550l46873l98196n03984J22196Q94616M21874p18096
9711a020520n85308O46280Q40974k48885n38756M49752N84715r44399j928157
$$ plain form
9776 -912679 -1206629 -2197208 -1506491 234610 268543 -1631347 -2816075 -2089936 -1185455
9767 -1185455 -1465338 -2080673 -2221905 -2576167 -3419735 -3521131 -2318791 -1357249 -2017681
9758 -2017681 -3197803 -2879939 -1114879 205931 186837 -57052 505247 1023774 24804
9749 24804 -2163492 -3544991 -3184963 -2525970 -3134793 -4221471 -3861251 -2053503 -748635
9740 -748635 -917731 -1445940 -1241468 -671677 -351379 -167868 -200739 -1040976 -2452358 -3240828
9730 -3240828 -3178597 -3437887 -4334300 -4447283 -3040229 -1550783 -1347921 -1657582 -1185944
9721 -1185944 -311047 -107507 -492057 -838930 -1237126 -1741110 -1618914 -724298 -302424 -1020520
9711 -1020520 -1605828 -959548 -118574 -367459 -906215 -456463 128252 -816147 -2744304
9702b744304p87861R16826J213695N26695J98868K68964J59151j00560m01156
9693g49682q15267q12357J01308Q47851N385j446009j195967N04044J039434j19811
9683b641071n24324Q60762J802050P07728q10918r61726m62924m50856l77827
9674b859106J97631K30815o04565p33045N29258J366413M68620o72648l82609
9665b459236M96890M95185K7318M2415R7208k88666k18376P56601J243781L25821
9655E18941n68786m4771Q11743L90537p18810j034153o82248n35479k62525O92774
9645a432777J427829Q86842j99216m90568j39029l8381m7449L35632N01765l54372
9635D50276j573376j776494p24381O54436J454575J250599K28352n57606j29205
$$ plain form
9702 -2744304 -3532165 -2615339 -1401644 -874949 -676081 -407117 -247966 -348526 -749682
9693 -749682 -1564949 -2377306 -2275998 -1428147 -1422762 -2868771 -4064738 -3560694 -2521260 -2641071
9683 -2641071 -3165395 -2304633 -502583 205145 -605773 -1567499 -2030423 -2481279 -2859106
9674 -2859106 -2661475 -2430660 -3035225 -3768270 -3239012 -1872599 -1403979 -2076627 -2459236
9665 -2459236 -1962346 -1467161 -1439843 -1397428 -1300220 -1588886 -1807262 -1050661 193120 518941
9655 518941 -49845 -94616 717127 1107664 388854 -645299 -1327547 -1863026 -2125551 -1432777
9645 -1432777 -4948 881894 682678 192110 53081 14700 -32749 302883 804648 450276
9635 450276 -1123100 -2899594 -3623975 -2969539 -1514964 -264365 -36013 -593619 -722824
9626g22824Q16626O34549o49971j237228m76681K13331k7589k63071N75k20062
9616a932345j081446j070367K27055J024126M47323J39091J080157J538421K51281
9607F23296r98532m21211N98500N6881j104640r19101l5773l40963j340559j047057
9597d929159M31933J122760M76737j57842m4286K04331K20633L54559O51286P25665
9587i43383M30589j86719r37137j012458K36164J582454R48145j148447j680363
9578b711155J92807J471045J83584j263348k95510J287961N18539j429977j249882
9569c295936P78181J373047j78169j178903k40941Q82073O99995P0830O3276K53009
9559g73538L5272k41089j48957J42678L59488L01945k13704p07998j52806J210027
$$ plain form
9626 -722824 93802 728351 78380 -1158848 -1635529 -1422198 -1449787 -1712858 -1712283 -1932345
9616 -1932345 -3013791 -4084158 -3857103 -2832977 -2385654 -2246563 -1166406 372015 623296
9607 623296 -375236 -796447 -197947 -141066 -1245706 -2164807 -2200580 -2541543 -3882102 -4929159
9597 -4929159 -4497226 -3374466 -2897729 -3055571 -3099857 -2895526 -2674893 -2320334 -1669048 -943383
9587 -943383 -512794 -699513 -1636650 -2649108 -2412944 -830490 117655 -1030792 -2711155
9578 -2711155 -2518348 -1047303 -863719 -2127067 -2422577 -1134616 -616077 -2046054 -3295936
9569 -3295936 -2517755 -1144708 -1322877 -2501780 -2742721 -1860648 -1160653 -1089823 -1026547 -773538
9559 -773538 -738266 -979355 -1128312 -985634 -626146 -324201 -537905 -1245903 -1398709 -188682
9549a88682J459832j38155j415164m10452J358277J186616n87946j452291q38565
9540a026530l87386o39705m69393K82746L95904l03936n20797K29542R78771J100354
9530c60430R01437M85156j91303l85645M56835J204331M75823r22527j149600
9521E14077l95541l71084j097222q84126M58594J074249J52619q50213p09801
9512b108448j4069M23905P96810J218300J100116L38188k85567m35799o68964
9503C64472j141776j149561l84506M43860O24550K32775k61755m78843k87196
9494b037980k0730j51282l49386K09259J094845O88152j044347j708429Q070J922553
9484a389275J594613J06440p5419O56379J96682j093572j001194L17036M54890
$$ plain form
9549 -188682 1271150 1132995 -282169 -692621 665656 1852272 1264326 -187965 -1026530
9540 -1026530 -1413916 -2053621 -2523014 -2240268 -1844364 -2148300 -2669097 -2439555 -1460784 -360430
9530 -360430 541007 1026163 834860 449215 906050 2110381 2586204 1663677 514077
9521 514077 118536 -252548 -1349770 -2233896 -1775302 -701053 -548434 -1398647 -2108448
9512 -2108448 -2122517 -1698612 -901802 316498 1416614 1754802 1469235 1033436 364472
9503 364472 -777304 -1926865 -2311371 -1867511 -1242961 -1010186 -1271941 -1750784 -2037980
9494 -2037980 -2058710 -2209992 -2559378 -2350119 -1255274 -567122 -1611469 -3319898 -3311828 -1389275
9484 -1389275 205338 311778 236359 892738 1089420 -4152 -1005346 -688310 -233420
9475b33420q89773j315503L0646J043403M28419k63935L43171J132629P11009
9466I86646k53867m43503L3407K73959J5402m73788q57368o41796K50521P91078
9456c19309J09988p92057l65234P75093O76928n37687o76249Q12958J797726Q76010
9446B358167o23098j033505n57064m2165M39159P54062K80104p18476r90949l61150
9436d94915j07446o04997o05148L08485P16754n9907n17474M67168J541387R89570
9426A633477o26277j576972j424013q38222j16272O37681Q35510L04828J6301
9417a153959O43599J203193M10773j217101j830954n36878J597597K621593J449904
9408C187767j005077k366348j228668R66395J588725K83203p87918l59788K38529
$$ plain form
9475 -233420 -1123193 -2438696 -2408050 -1364647 -936228 -1200163 -856992 275637 986646
9466 986646 732779 289276 322683 596642 612044 138256 -719112 -1360908 -1110387 -319309
9456 -319309 -209321 -1001378 -1366612 -591519 85409 -452278 -1128527 -315569 1482157 2358167
9446 2358167 1735069 701564 144500 102335 541494 1295556 1575660 857184 -133765 -494915
9436 -494915 -602361 -1207358 -1812506 -1504021 -787267 -847174 -1364648 -897480 643907 1633477
9426 1633477 1007200 -569772 -1993785 -2832007 -2948279 -2310598 -1475088 -1170260 -1153959
9417 -1153959 -510360 692833 1103606 -113495 -1944449 -2481327 -883730 1737863 3187767
9408 3187767 2182690 -183658 -1412326 -445931 1142794 1425997 638079 278291 516820
9399E16820l58417j189876o48518Q03957J308389L41984p24715o36731K79681
9390c07426P71989J92638p98958j028467l22759J94187k34927p26839j39907R08341
9380a492128Q68061k49846q85386l62978M15188P92198J060937J098181K01610
9371A445837j197296j506727l57286P00358N87967O0730q9100l41278r32979q48061
9361b477835L46404J230436N86859n88140o62154J55897N00610J40862l7845J93281
9351f11625J75167k79901n37874k01923L21022M04644j05994p63281q95757l15631
9341b811153L64380M92511K70198K85323M50338K71005j10925j87375j08958k59603
9331a344259j84933O04718J163095K54928j276996j405909j56317M17627k69958
$$ plain form
9399 516820 158403 -1031473 -1679991 -876034 432355 774339 49624 -587107 -307426
9390 -307426 464563 657201 -141757 -1170224 -1492983 -1298796 -1533723 -2260562 -2400469 -1492128
9380 -1492128 -624067 -873913 -1759299 -2122277 -1707089 -914891 146046 1244227 1445837
9371 1445837 248541 -1258186 -1615472 -915114 -327147 -266417 -355517 -696795 -1629774 -2477835
9361 -2477835 -2131431 -900995 -314136 -902276 -1564430 -1408533 -907923 -767061 -804906 -611625
9351 -611625 -436458 -716359 -1254233 -1456156 -1135134 -730490 -836484 -1599765 -2495522 -2811153
9341 -2811153 -2446773 -1954262 -1684064 -1398741 -948403 -677398 -788323 -975698 -1084656 -1344259
9331 -1344259 -1529192 -924474 238621 493549 -783447 -2189356 -2345673 -1928046 -2198004
9322b198004m83330N22429J079059J80413o45846j28665N06463l6162o90396j81474
9312b075513L99664l71549j330447n25758J289461J736042N96487j58573K84898
9303a55288P52639M90687Q2315j58694o36144j090729o46214M74360R62937M32323
9293E08192j67307l50081o58494j094141p16805N28247J157092K62329r81724
9284a512692r98295k3302N24955K48316Q5864N86084R93015M12623q01534j415388
9274a900354q58293J59890O89839O70809N75490L70156l27352j137229r94043
9265b751087K98341J483245J430038N57301n0347k68770o96527j214659r45190
9256b157655K97144J473137J573227P69065m4046l86858m49212m69619l70368
$$ plain form
9322 -2198004 -2681334 -2158905 -1079846 -899433 -1545279 -1673944 -1167481 -1203643 -1894039 -2075513
9312 -2075513 -1675849 -2047398 -3377845 -3903603 -2614142 -878100 -281613 -440186 -155288
9303 -155288 597351 1088038 1170353 1011659 375515 -715214 -1361428 -887068 75869 508192
9293 508192 340885 -9196 -667690 -1761831 -2478636 -1950389 -793297 -530968 -1512692
9284 -1512692 -2510987 -2534289 -2009334 -1761018 -1675154 -1089070 -96055 316568 -484966 -1900354
9274 -1900354 -2758647 -2598757 -1908918 -1238109 -662619 -292463 -619815 -1757044 -2751087
9265 -2751087 -2452746 -969501 460537 1017838 967491 698721 2194 -1212465 -2157655
9256 -2157655 -1860511 -387374 1185853 1954918 1910872 1524014 1074802 605183 234815
9247B34815r0665R0264j02333m03846k63703K87250N31632J21080l00915p0765
9237C2814L86977K12876m46678o27561j11999K33512r9524m49008p6271O87085
9227b57777R66822N10856k14428p37491q98340o79115j80421K62237K53837k42484
9217a216304p39474o34733Q4762O96472O05436J80542J71342M36268J59876n90599
9207h46412p15194Q3901O09513Q0624n57839k95829K32315L8018l89589j11736
9197a872228M40542L88162J51497L99613K96390r60820j817083l23555K145890
9188a151592K242332k91052k085884j211791L87565N77224J34423N41829J247982
9179C91036J097489N10021L10791L2183q04266j213215l83728N38121J62022p93117
$$ plain form
9247 234815 144150 234414 132081 -271765 -535468 -248218 283414 404494 103579 32814
9237 32814 419791 632667 185989 -441572 -553571 -320059 -419583 -868591 -944862 -257777
9227 -257777 709045 1219901 1005473 267982 -630358 -1309473 -1489894 -1227657 -973820 -1216304
9217 -1216304 -1955778 -2590511 -2505749 -1809277 -1203841 -1023299 -851957 -415689 -255813 -846412
9207 -846412 -1561606 -1477705 -868192 -787568 -1345407 -1641236 -1408921 -1370903 -1760492 -1872228
9197 -1872228 -1431686 -1043524 -892027 -492414 -196024 -1156844 -2973927 -3297482 -1151592
9188 -1151592 1090740 799688 -1286196 -2497987 -2110422 -1533198 -1398775 -856946 391036
9179 391036 1488525 1998546 2309337 2341520 1537254 324039 -59689 478432 640454 -152663
9169a52663p36763J48425M22543j10060l02854K42796O73336M22517j08252m62117
9159C6908o44292o58581l65284J19543M50992M76821L01073R7233O4887K81427
9149A60727N02303M84064M05765M05687Q96j099885j916477j247982L06332R20320
9139a078250K52196j21639O20056J229252N45042o32594q79236j41870N92681
9130C85638O87122J50488o28698r60952m94438Q0558k0790k24939M28874J180420
9120E83283M79822j072386j242647J05162O31493m30024r28776K40893R92603
9111f40577k37583j586807r89013L17517K83301k20696P18456K224524J993209
9102A862331L06793n25474n769K89364j58039k64773J92777J47688o32600j155477
$$ plain form
9169 -152663 -889426 -741001 -318458 -428518 -731372 -488576 184760 607277 499025 36908
9159 36908 -607384 -1265965 -1631249 -1511706 -1060714 -583893 -282820 -185587 -120700 160727
9149 160727 663030 1147094 1552859 1958546 1959442 859557 -1056920 -2304902 -1998570 -1078250
9139 -1078250 -826054 -947693 -327637 901615 1446657 814063 -65173 -207043 385638
9130 385638 1072760 1223248 594550 -366402 -860840 -780282 -801072 -1026011 -597137 583283
9120 583283 1063105 -9281 -1251928 -1146766 -515273 -945297 -1874073 -1633180 -640577
9111 -640577 -878160 -2464967 -3453980 -3136463 -2853162 -3073858 -2355402 -130878 1862331
9102 1862331 2169124 1643650 1637881 1927245 1769206 1504433 1697210 1844898 1212298 56821
9092E6821j002343o65795k25971N29940R38471K26629q33502q31158L4064M04611
9082a368233J09041J66067P17403Q65941M41522J32588k1523n59649j180588j062981
9072a760412m12592r3547m1384L13511N27138q3373o42085J65777J501080J252547
9062G26660n00232j323813r7731J427486J395674J79274q23905j018040m74135
9053e08762N32166J157866N20619q26977j238912k75133O58878M57263k52652
9044B24356m35348j70386j28488m74127q97195j023055m93389O22539J436403
9035a338690J150592L07334O8306L57417N3107r20293j221488k30752Q42931O95302
9025b36234k98931p93450k33167O96680R47381J33353r93103j166707j40811P64726
$$ plain form
9092 56821 -945522 -1611317 -1837288 -1307348 -368877 -142248 -975750 -1806908 -1772844 -1368233
9082 -1368233 -1259192 -1093125 -375722 490219 931741 1064329 1042806 483157 -697431 -1760412
9072 -1760412 -2173004 -2266551 -2307935 -1994424 -1467286 -1550659 -2192744 -2026967 -525887 726660
9062 726660 226428 -1097385 -1195116 232370 1628044 1807318 983413 -34627 -508762
9053 -508762 23404 1181270 1701889 874912 -364000 -639133 19745 477008 224356
9044 224356 -210992 -381378 -509866 -983993 -1881188 -2904243 -3397632 -2775093 -1338690
9035 -1338690 -188098 119236 187542 544959 598066 -322227 -1543715 -1774467 -931536 -236234
9025 -236234 -535165 -1328615 -1561782 -865102 82279 215632 -777471 -1944178 -2084989 -1320263
9015a320263L30261q25057j126805k34727P91970J191963J120508P64973J05879
9006G98702m82513n14164k15081j13388j05188P6162J4873n27247n98109N24962
8996a140991J576857Q86069p98574j273787l92888j07972q96397q65574Q43046
8987b170211K322247J813842K14219p49379j005532j251367j145888j21067J079251
8978a013885J278387N92953K2307o0200K7318O9808p2877n88937j053123n25540
8968a323789Q80945J574201O43106o19631o31174L4985k58768j356187j463436
8959b519748q3294J087528P14508k80312l39016L42864L62086m81036q12404M3843
8949a964981P84026Q8684j033546m24653J830019K952579J154259j727305k607341
$$ plain form
9015 -1320263 -990002 -1815059 -2941864 -3176591 -2384621 -1192658 -72150 692823 798702
9006 798702 316189 -197975 -413056 -526444 -631632 -555470 -540597 -1067844 -1665953 -1140991
8996 -1140991 435866 1321935 523361 -750426 -1143314 -1251286 -2147683 -3013257 -2170211
8987 -2170211 152036 1965878 2180097 1430718 425186 -826181 -1972069 -2093136 -1013885
8978 -1013885 264502 857455 879762 819562 846880 916688 843811 254874 -798249 -1323789
8968 -1323789 -442844 1131357 1774463 1154832 523658 558643 299875 -1056312 -2519748
8959 -2519748 -2603042 -1515514 -801006 -1081318 -1420334 -1077470 -715384 -1196420 -2008824 -1964981
8949 -1964981 -1180955 -1092271 -2125817 -2550470 -720451 2232128 3386387 1659082 -948259
8940i48259j120060M79858P77963N74708P35908O59055k83542j248115j073796
8931a446280j04726L20182j67386n63655q2851P02788P29532j3250m66801p2051
8921a164498L52344j36451j026145j040481j78626K60276j55286l02452M53885
8912b937434J104305Q36191M75203P61453O99656o05754j789993j083120O20197
8903a919296R65819j47333o38814J33536N40039j62708n00664M38232J226007
8894f5182M81679p94710q61189R4574N23578l1455n03136l1779R25771J252377
8884I90528M52812p43273j088270l46613K71119j93931r01625m68677P30312J075200
8874b22418L43403K6956P26825J074780K8540j340099j447591m46695K69325P1105
$$ plain form
8940 -948259 -2068319 -1588461 -810498 -235790 500118 1159173 875631 -372484 -1446280
8931 -1446280 -1551006 -1230824 -1398210 -1961865 -2044716 -1341928 -612396 -625646 -1092447 -1164498
8921 -1164498 -812154 -948605 -1974750 -3015231 -3193857 -2933581 -3088867 -3391319 -2937434
8912 -2937434 -1833129 -996938 -521735 239718 939374 333620 -1456373 -2539493 -1919296
8903 -1919296 -953477 -1100810 -1739624 -1606088 -1066049 -1228757 -1729421 -1291189 -65182
8894 -65182 416497 -378213 -1239402 -1144828 -621250 -652705 -1155841 -1187620 -261849 990528
8884 990528 1443340 700067 -388203 -734816 -463697 -657628 -1559253 -2027930 -1297618 -222418
8874 -222418 120985 147941 874766 1949546 1978086 637987 -809604 -1256299 -986974 -915869
8864i15869m20584m56170L611M38605M01354N0242o4876O0181k74040j131208
8854b308754j306587j42096R18783K47685j181532j018859P72430J840790J168476
8845a009664L19390L91215L33367n53956q89451L58950J728381J452758K11587
8836B342577k70977m7883k76084p27601k30071Q76389Q97041n31534j728536j348632
8826a045311j01415M60351p7269q05742p78225l105P28467Q12658M89263L41137
8816B0809L38107l8879p28012r18673k23803O78044R36023M73763k49113p94669
8806e06403p79416l5570Q92727J046174K27585o56156p21710n7698O35407P77506
8796H22446J73544q04527j238884n84698M29099O26902M6204k22708J83875M71576
$$ plain form
8864 -915869 -1336453 -1792623 -1789012 -1350407 -949053 -898811 -963687 -903506 -1177546 -2308754
8854 -2308754 -3615341 -3757437 -2838654 -2590969 -3772501 -4791360 -4018930 -2178140 -1009664
8845 -1009664 -690274 -299059 34308 -519648 -1409099 -1050149 678232 2130990 2342577
8836 2342577 2071600 2023717 1747633 1020032 789961 1666350 2563391 2031857 303321 -1045311
8826 -1045311 -1146726 -686375 -763644 -1569386 -2347611 -2350716 -1622249 -809591 -320328 20809
8816 20809 358916 320037 -407975 -1326648 -1550451 -872407 63616 537379 288266 -506403
8806 -506403 -1285819 -1321389 -428662 617512 845097 188941 -532769 -590467 44940 822446
8796 822446 995990 191463 -1047421 -1632119 -1203020 -576118 -529914 -752622 -568747 -97171
8786i7171J57347k72653m28658n14854m66304J41388R44958Q55567k41700j081772
8776a003852q09493K3231O67082J054398J022904J60529r43464q44757N36659
8767a36763J368021N32941p11054q32102k71465j97118l68903Q3868P46648N13634
8757G27707m82420j060147p52080j26010L22083N17736L88348K0746j36417K2075
8747e58379q4101o36446p96165q6540M87133r8413j056429q50612L93662J054728
8737b231562M74414j93997J29562Q87391P95759l38095j352661j171849r2106
8728c093144O49090M99826K04105M42260O43954Q9980n11913l2936R17899P24176
8718E33297m00720n15731O85097J067500l11234j247006R6574J865872J200778
$$ plain form
8786 -97171 60176 -212477 -641135 -1155989 -1622293 -1480905 -535947 319620 77920 -1003852
8776 -1003852 -1813345 -1790114 -1123032 -68634 954270 1114799 171335 -673422 -136763
8767 -136763 1231258 1764199 1053145 221043 -50422 -247540 -616443 -532575 214073 727707
8757 727707 245287 -814860 -1566940 -1692950 -1370867 -853131 -464783 -444037 -580454 -558379
8747 -558379 -642480 -1278926 -2075091 -2161631 -1674498 -1772911 -2829340 -3679952 -3286290 -2231562
8737 -2231562 -1757148 -1951145 -1821583 -934192 -138433 -476528 -1829189 -3001038 -3093144
8728 -3093144 -2444054 -1944228 -1740123 -1297863 -653909 -563929 -1075842 -1108778 -190879 533297
8718 533297 132577 -383154 301943 1369443 1058209 -188797 -92223 1773649 2974427
8709B974427j256040k361832j216661J862j12277l20651N78520J586687J334912
8700A208947L75627Q9253L76152Q6769p52637q51008N4966M14752p59792j971032
8690a728003j202708Q38346J426627j44362j451125p56237L45540j35784j065360
8681c873066k36916J534435J608960P8664l87357P89295J229652K9678o04245
8672A69100N00258J167043k88484j936724j416407K58278P56642K72268M82127
8663c5899J190943Q65419m22419j145600q42445l82150k42193k76532n51866q80517
8653b723259l94628R45144J557551N48806n07237P4443J316687J256389J16433
8644B190329n09237n17664q56119j129444k63434J042697J094280N2703m23426
$$ plain form
8709 2974427 1718387 -643445 -1860106 -1858244 -1970521 -2291172 -1712652 -125965 1208947
8700 1208947 1584574 1673827 2049979 2136748 1384111 533103 588069 1002821 243029 -1728003
8690 -1728003 -2930711 -2092365 -665738 -810100 -2261225 -3017462 -2671922 -2807706 -3873066
8681 -3873066 -4109982 -2575547 -966587 -887923 -1275280 -485985 743667 773345 169100
8672 169100 669358 1836401 1547917 -388807 -1805214 -1546936 -790294 -518026 -35899
8663 -35899 1155044 2020463 1598044 452444 -390001 -772151 -1014344 -1290876 -1842742 -2723259
8653 -2723259 -3117887 -2172743 -615192 -66386 -573623 -499180 817507 2073896 2190329
8644 2190329 1681092 1163428 307309 -822135 -1085569 -42872 1051408 1104111 680685
8635F80685p1937j41267q12749r25785k74155R4739n4854Q5801N07624M06525
8625e05373Q2069O07275J487222R61511r68408k077605j166587K71518N11202
8616g97176p2226k02421J87658K56078j73062l74164J92668J074230J162438k697
8606A251326j291241j086451M31716J240825K65691j179980j573834j163505o14946
8597c720399M15477J746386J732671l3082j096471K37517J697421N78342j462441
8588I5421j008670J194314J410091p03812j654694j89305R32720J12722o31476
8579d42689J63977Q90615L30082j00395M51291L52990j055093j509198J61775
8570g56645J334855j31208j873591p55179J759833J857273n09229j744388l12221
$$ plain form
8635 680685 608748 467481 -345268 -1271053 -1545208 -1450469 -1505323 -1419522 -911898 -505373
8625 -505373 -423304 183971 1671193 2632704 1664296 -413309 -1579896 -1308378 -797176
8616 -797176 -869402 -1071823 -884165 -628087 -801149 -1175313 -982645 91585 1254023 1251326
8606 1251326 -39915 -1126366 -694650 546175 811866 -368114 -1941948 -3105453 -3720399
8597 -3720399 -3304922 -1558536 174135 141053 -955418 -717901 979520 1557862 95421
8588 95421 -913249 281065 1691156 987344 -667350 -856655 76065 188787 -442689
8579 -442689 -278712 611903 941985 841590 1292881 1645871 590778 -918420 -756645
8570 -756645 578210 447002 -1426589 -2181768 -421935 1435338 926109 -818279 -1130500
8561a130500J386142J140702j59730o69809l33710k32857n79743n95578J18355
8552a056728R02026Q10738j39998q08463l33251O01796O43051k82357q92093m18181
8542i73460N30299J070793R45388K50477o45214r50662l64907Q9455n30694j310003
8532a888528q20025K86193K45245o33621m33611P97129R72244k05423o16552L19723
8522a977226N26446o49197q35845R90921K062188L15026j816928j207449R81802
8513a610262J499602J29875q37951p12061n78220n18657J24478N81440k21327
8504b143083j150797m24993J061967R94429l77949o49524O30255J407033P64340
8495A11678R7195K30480J53687o60923j114102n28390J53561N0044l92952m49513
$$ plain form
8561 -1130500 255642 1396344 1236614 566805 233095 238 -579505 -1175083 -1056728
8552 -1056728 -154702 656036 516038 -292425 -625676 -23880 619171 336814 -555279 -973460
8542 -973460 -443161 627632 1573020 1823497 1178283 227621 -137286 -47831 -578525 -1888528
8532 -1888528 -2708553 -2422360 -2177115 -2810736 -3244347 -2447218 -1474974 -1680397 -2296949 -1977226
8522 -1977226 -1450780 -2099977 -2935822 -1944901 117287 432313 -1384615 -2592064 -1610262
8513 -1610262 -110660 19215 -818736 -1530797 -2109017 -2627674 -2503196 -1921756 -2143083
8504 -2143083 -3293880 -3718873 -2656906 -1662477 -2040426 -2689950 -2059695 -652662 111678
8495 111678 208873 439353 593040 -67883 -1181985 -1710375 -1556814 -1506770 -1899722 -2349235
8485b349235p8278N05888J000067P68181k52490p09563M85767K032794J739561
8476C142692j34937j234801p29074j73453m82212n38397L96460J130570N20880
8467A897728p53892j468569j441483r54634K3013J162089J577267J081099M98056
8458A620674J91990m10289j305622j442932n18782K44389M3979j93691M46351
8449a323933J120725N76406p18769j228770n71521K07871L10845J8887j18338
8440a726597o1355n6209j16164K1021M75541Q60632N89617k68300q15500m32580
8430a529894L34910N65156K12682j28240k57467l19402j67594K65871M18679m3637
8420f48936l44060K23024Q17809K56463q37815q61895J20428N37348J9339j73625
$$ plain form
8485 -2349235 -2427513 -1921625 -921558 -153377 -405867 -1115430 -629663 1403131 3142692
8476 3142692 3007755 1772954 1043880 870427 388215 -150182 246278 1376848 1897728
8467 1897728 1143836 -324733 -1766216 -2720850 -2697837 -1535748 41519 1122618 1620674
8458 1620674 1812664 1402375 96753 -1346179 -1864961 -1620572 -1576593 -1770284 -1323933
8449 -1323933 -203208 373198 -345571 -1574341 -2145862 -1937991 -1627146 -1608259 -1726597
8440 -1726597 -1787952 -1844161 -1960325 -1939304 -1463763 -603131 -13514 -281814 -1097314 -1529894
8430 -1529894 -1194984 -629828 -417146 -545386 -802853 -1122255 -1289849 -1023978 -605299 -648936
8420 -648936 -992996 -769972 47837 304300 -533515 -1395410 -1274982 -737634 -718295 -891920
8410h91920L80493N65571j6068k48399K88539M00174m51535r37992j31669Q10388
8400b32418N91896j68259k52586J58277K34374M0787l0849k66122p76247p54315
8390a455462J36726P62834K38681m83829j81355N71992M68143l30971o61861k95849
8380a230951R2850K25127J29323m58413j258132r73314P93619K154296J287012
8371G61417o95454j251118q2944Q85108P35831M06895M10262M8717p92027j151165
8361g24478p29240k83816L7650Q55103J675495R73175j091224k089609o35041
8352b011985J462326J714761K18691j077774j255653r74972p95452m71249J98060
8343b993247Q71628J086399O57607j70842o89673k82294O81544J087390N37187
$$ plain form
8410 -891920 -511427 54144 38076 -210323 78216 478390 26855 -911137 -1042806 -232418
8400 -232418 359478 191219 -61367 96910 331284 372071 341222 75100 -701147 -1455462
8390 -1455462 -1318736 -555902 -317221 -801050 -982405 -410413 57730 -273241 -935102 -1230951
8380 -1230951 -1138101 -912974 -783651 -1242064 -2500196 -3473510 -2679891 -525595 761417
8371 761417 65963 -1185155 -1268099 -382991 352840 759735 1169997 1218714 426687 -724478
8361 -724478 -1453718 -1737534 -1699884 -844781 830714 1803889 712665 -1376944 -2011985
8352 -2011985 -549659 1165102 1383793 306019 -949634 -1924606 -2720058 -3191307 -2993247
8343 -2993247 -2121619 -1035220 -377613 -548455 -1238128 -1520422 -838878 248512 785699
8334G85699j17639j04312J79203k8876o44986j007986q43175l68314J30643L77840
8324a641903K41589J35223O41602J375062J080073n14067j818923j290780M54491
8315a337633J474683J000720L274m97306n17966m07116j14538L73487N90295J85795
8305G53695l93488m14621M6951J23374n11914q93292j8257J428054J643558K18210
8295A982270j088943p91974K33509K95966m44299n17181K34936N34768N3561r6886
8285C95727M83813P99006M18785J96778L58397j06403j205270j218788M19027
8276E41072J562422M95318j179426j008601M04769N30019r41104j766190p68783
8267b130504O59513R58350L17367k83433m23254j61613K63519L84656k070l60875
$$ plain form
8334 785699 668060 563748 742951 714075 69089 -938897 -1782072 -2150386 -2019743 -1641903
8324 -1641903 -1400314 -1265091 -623489 751573 1831646 1317579 -501344 -1792124 -1337633
8315 -1337633 137050 1137770 1141044 643738 125772 -281344 -395882 -22395 567900 753695
8305 753695 360207 -54414 -7463 115911 -396003 -1289295 -1307552 120502 1764060 1982270
8295 1982270 893327 101353 334862 630828 186529 -330652 -95716 439052 492613 395727
8285 395727 879540 1678546 2097331 2294109 2652506 2546103 1340833 122045 541072
8276 541072 2103494 2598812 1419386 410785 815554 1345573 404469 -1361721 -2130504
8267 -2130504 -1470991 -512641 -195274 -478707 -901961 -1063574 -800055 -415399 -417469 -778344
8257g78344k18446k3461k77644m71503o7252K33732l24634q71264j56484J159549
8247a795751J389481M86186j91070l17056n95258o87669L48807J646774J219619
8238A504063o67865j501486m26740N37382J7097o72654k05106N38424M12497k0995
8228d85383j6633j40316o80630n08762Q01439J572000N61124q09911p16520J54362
8218b69230O6906p22168o73961J95961M46533k71896p64419j96031R84198J825063
8208F20956J581975J49286j390061j467100r0649Q74570L42185m79279k72494
8199a30611L01469J44549k28302R2566N36587K01835l84679m04125l29401o44040
8189h44152m98556M68590P12847n89848j388859M9567J676168P19158j398717
$$ plain form
8257 -778344 -996790 -1020251 -1297895 -1769398 -1836650 -1602918 -1927552 -2798816 -2955300 -1795751
8247 -1795751 -406270 79916 -111154 -428210 -1023468 -1711137 -1362330 284444 1504063
8238 1504063 836198 -665288 -1092028 -554646 -537549 -1210203 -1415309 -876885 -464388 -485383
8228 -485383 -502016 -642332 -1322962 -1831724 -1030285 541715 1102839 292928 -423592 -269230
8218 -269230 -202324 -924492 -1598453 -1402492 -955959 -1227855 -1992274 -2188305 -1204107 620956
8208 620956 2202931 2352217 962156 -504944 -595593 278977 621162 141883 -130611
8199 -130611 170858 315407 87105 179671 716258 918093 533414 129289 -200112 -844152
8189 -844152 -1342708 -874118 -161271 -751119 -2139978 -2090411 -414243 304915 -1093802
8180a093802j152920J110711J685791k40904j348704J54091J849726J437605N6786
8171B458380m28087l30174n03228m73220J5755n9271q87121r02952M55799J344849
8161F90730N20401n00799j25101O36083K36698o08694m75649P6259k47724q55787
8151f53583l45745P50066P23465l51920o84938L89952J581207J676496Q04061
8142C889061m00832j489487j924648j303541j15281N43215J86132o23388r86430
8133b225199m42679P05374J504885J172747Q4277n63061k82754K04689K35525
8124C93804N5609K1863q0465l71783m19668k5389L45378M06628M60689N39843
8114A326509J48778o51447r88069n59189j54308k25559j68474L04635M00207k93963
$$ plain form
8180 -1093802 -2246722 -1136011 549780 308876 -1039828 -885737 963989 2401594 2458380
8171 2458380 2030293 1700119 1196891 723671 739426 680155 -206966 -1109918 -654119 690730
8161 690730 1211131 710332 585231 1221314 1458012 849318 373669 449928 202204 -653583
8151 -653583 -999328 -249262 474203 122283 -562655 -172703 1408504 3085000 3889061
8142 3889061 3488229 1998742 74094 -1229447 -1344728 -801513 -615381 -1238769 -2225199
8133 -2225199 -2667878 -1962504 -457619 715128 799405 236344 -46410 158279 393804
8124 393804 449413 471276 390811 19028 -400640 -426029 -80651 325977 786666 1326509
8114 1326509 1475287 823840 -164229 -723418 -877726 -1103285 -1271759 -967124 -566917 -860880
8104h60880q69731n79131r912K02584N09171J149216J103951k07103j404366r73945
8094a940146L54633P76014J78026p2003L93577N38283j09099p46816p44854m55493
8084a827878k99935j15989K52204N09196L79358L3410j52959q252K88273L67976
8074e74596J14391j29155j26510k53641p62871r05046Q6146J351054J238220j42411
8064a04419q84315j67524O14140K77034l99611l12836K15105M28847M17044L58380
8054D41845o1668n42528r2372R97488R80571m33934j143235o6189Q39439q8334
8044H31083j208267m23931J025241O15541j167639j756323o65707L73069O87612
8035a689321J012540J089879k8036j507866j467347j12365N79504K19084K83715
$$ plain form
8104 -860880 -1730611 -2309742 -2319654 -2117070 -1607899 -458683 645268 438165 -966201 -1940146
8094 -1940146 -1585513 -809499 -631473 -703476 -309899 228384 119285 -627531 -1372385 -1827878
8084 -1827878 -2127813 -2243802 -1991598 -1482402 -1103044 -1069634 -1222593 -1230845 -942572 -574596
8074 -574596 -460205 -589360 -715870 -969511 -1732382 -2637428 -2551282 -1200228 37992 -104419
8064 -104419 -988734 -1156258 -542118 -265084 -664695 -977531 -762426 -333579 83465 441845
8054 441845 380177 -162351 -254723 742765 1723336 1289402 146167 79978 919417 831083
8044 831083 -377184 -801115 224126 839667 -327972 -2084295 -2750002 -2376933 -1689321
8035 -1689321 -676781 413098 385062 -1122804 -2590151 -2702516 -2123012 -1903928 -1620213
8026a620213J056530J168449M21213K08577O81484L02914j108436j619083l92549
8017i01114Q32064N58265l72604o07467k46268P6095L49413N30242K78953m6159
8007D51420K56611N80509l33884j811852j662702K50582J398225M67396p02548
7998a106243l58268M62371J39409p63060q21864j18954N12322J098459J711519
7989G55691J479505P1383j130256r10560m2484J89706p8820k67970p19357j445025
7979b098187j098587Q48557K363799J509397l92615o83862N22637Q48439k76388
7970A543190r03711n5242P65626K84116n51527m02180L01583L15027l87571p86880
7960A22431m77834j02171k30616n43789l42571M24704R88789P42593R3912j41722
$$ plain form
8026 -1620213 -563683 604766 1025979 1234556 1916040 2218954 1110518 -508565 -901114
8017 -901114 -69050 489215 116611 -490856 -737124 -661029 -311616 218626 497579 451420
8007 451420 708031 1288540 954656 -857196 -2519898 -2269316 -871091 -403695 -1106243
7998 -1106243 -1464511 -1002140 -862731 -1625791 -2447655 -2566609 -2054287 -955828 755691
7989 755691 2235196 2306579 1176323 265763 223279 412985 334165 66195 -653162 -2098187
7979 -2098187 -3196774 -2348217 15582 1524979 1132364 448502 971139 1819578 1543190
7970 1543190 639479 584237 1349863 1633979 1082452 680272 981855 1296882 909311 122431
7960 122431 -355403 -457574 -688190 -1231979 -1574550 -1149846 -161057 581536 675448 533726
7950E33726o118k54158r04292r80258j24364N91168K37142m81057k98652O79341
7940a007522J202965O84032k21575p13138o97771n20941m36144m37424l56413
7931b503931j40023P255M9348M48024J356607J737547N03514j411351j695654
7922a648664O8386J441866N34258j147479q85498J268438K625780J589278n40373
7913C305992j616866j100348n1516L78499k8870o19794o99097l53987k37603n00014
7903a523604n22562N3536P56878J110445J236131J184906N50519o37130j487317
7894G21802j386541p64155j68431M34918Q53515M04907o84802r36140K33790J329419
7884C8282J025462K30532L31312P32917J36001q57043p35348O1869k05050j351207
$$ plain form
7950 533726 527608 273450 -630842 -1611100 -1735464 -1144296 -907154 -1388211 -1686863 -1007522
7940 -1007522 195443 879475 657900 -55238 -753009 -1273950 -1710094 -2147518 -2503931
7931 -2503931 -2643954 -2636699 -2587351 -2139327 -782720 954827 1458341 46990 -1648664
7922 -1648664 -1580278 -138412 395846 -751633 -1637131 -368693 2257087 3846365 3305992
7913 3305992 1689126 588778 537262 915761 886891 267097 -432000 -785987 -1023590 -1523604
7903 -1523604 -2046166 -1992630 -1235752 -125307 1110824 2295730 2846249 2209119 721802
7894 721802 -664739 -1428894 -1597325 -1162407 -308892 96015 -588787 -1524927 -1291137 38282
7884 38282 1063744 1294276 1625588 2358505 2494506 1637463 902115 963984 758934 -592273
7874e92273j270655N66834K003723J328099m09835j171719n71187K29943K75558
7865C88488l41642q30873n18708L11814N70526j10444n89586R9525J025755P07131
7855G11986m74535r09963l64741o1787l84787m43858R0595N92362Q88318J186373
7845H29963P82256r76824k585604j817338O06138J629366N73742N8289J286692
7836C86680J866864J01024j820191j415096P1682J81571n15651K3820J231416
7827A12119R03506p37772j368061m86096J42971j66908k04261M65289P65454M16008
7817a57751M48450R54512P11296l81005p98100l2724M86862k0348l37665M16160
7807A289687J075276L95395q84918j344677r43811m91226j70350J79533K67111
$$ plain form
7874 -592273 -1862928 -1296094 707629 2035728 1625893 454174 -117013 112930 388488
7865 388488 46846 -784027 -1302735 -990921 -420395 -530839 -1120425 -1020900 4855 711986
7855 711986 237451 -672512 -1037253 -1099040 -1483827 -1927685 -1837090 -1244728 -356410 829963
7845 829963 1612219 635395 -1950209 -3767547 -3161409 -1532043 -958301 -900012 386680
7836 386680 2253544 2354568 534377 -880719 -809037 -627466 -1143117 -1119297 112119
7827 112119 1015625 277853 -1090208 -1576304 -1433333 -1600241 -1804502 -1339213 -573759 -157751
7817 -157751 290699 1245211 1956507 1575502 777402 744678 1231540 1211192 873527 1289687
7807 1289687 2364963 2760358 1875440 530763 -413048 -904274 -1074624 -895091 -627980
7798f27980n0370k05864J11758L11579L7575q1743L00229L85461k93256o94356
7788h06967J13572J170342R88172o3550l73661L55126P97047J53248q44550j244417
7778B44362j015695n95838j80037J96612L91376K11895l77253r54963o26779R65557
7768a740763K505869K050733k42091j799084j028312M18313K71839q63879p80373
7759a207748N55269J082263K01375m45756n6392Q0946p47318j160125j57199R09698
7749i44987N10688m89361k91704Q99489J318035M10483o12652p83880l98186q818
7739c90893K88314L77858m508o25448p70389k18147L63271K73318l27599o04059
7729a638282l557J024310J341120M09489q26111r30241R7303P21635L8690r18315
$$ plain form
7798 -627980 -678350 -884214 -772456 -460877 -423302 -505045 -204816 180645 -112611 -806967
7788 -806967 -693395 476947 1465119 1401569 1027908 1383034 2180081 2333329 1488779 244362
7778 244362 -771333 -1367171 -1547208 -1350596 -959220 -747325 -1124578 -2079541 -2706320 -1740763
7768 -1740763 765106 2815839 2573748 774664 -253648 164665 436504 -427375 -1207748
7759 -1207748 -652479 429784 631159 185403 129011 209957 -537361 -1697486 -1854685 -944987
7749 -944987 -434299 -923660 -1215364 -315875 1002160 1412643 799991 16111 -382075 -390893
7739 -390893 -102579 275279 270771 -354677 -1125066 -1343213 -979942 -706624 -1034223 -1638282
7729 -1638282 -1641839 -617529 723591 1133080 306969 -623272 -525969 195666 234356 -683959
7719f83959p56037K68752Q65260P05346N33946N72831J82722p30864j192782n36302
7709g71087N64232J012732O30712K0607m24330p31658q32576n10857Q1663L85987
$$ plain form
7719 -683959 -1439996 -1171244 -305984 399362 933308 1506139 1688861 957997 -234785 -771087
7709 -771087 -206855 805877 1436589 1457196 1032866 301208 -531368 -1042225 -960562 -574575
$$ [...]
##END NTUPLES=NMR SPECTRUM
##END=
