##TITLE=31Pdec_SR-157-K3-TFAA4
 CDCl3, 24 sc
 6.7.2023
##JCAMPDX= 6.0         $$ Bruker NMR JCAMP-DX V2.0
##DATA TYPE= NMR SPECTRUM
##DATA CLASS= NTUPLES
##ORIGIN= UXNMR, Bruker Analytische Messtechnik GmbH
##OWNER= root
$$ XWIN-NMR		Version 3.5
$$ Thu Jul  6 16:32:59 2023 Russian Standard Time (UT+4h)  she@DPX200
##.OBSERVE FREQUENCY= 81.013821
##.OBSERVE NUCLEUS= ^31P
##.ACQUISITION MODE= SIMULTANEOUS
##.ACQUISITION SCHEME= undefined
##.AVERAGES= 24
##.DIGITISER RES= 16
##SPECTROMETER/DATA SYSTEM= spect
##.PULSE SEQUENCE= zgpg30
##.SOLVENT NAME= CDCl3
##.SHIFT REFERENCE= (INTERNAL, CDCl3, 0, 248.564)
##AUDIT TRAIL= $$ (NUMBER, WHEN, WHO, WHERE, WHAT)
$$ ##TITLE= Audit trail, XWIN-NMR		Version 3.5
$$ ##JCAMPDX= 5.01
$$ ##ORIGIN= Bruker BioSpin GmbH
$$ ##OWNER= she
$$ F:/spectra/data/she/nmr/P31/1/pdata/1/auditp.txt
$$ ##AUDIT TRAIL=  $$ (NUMBER, WHEN, WHO, WHERE, WHAT)
(   1,<2023-07-06 16:31:54.01 +0400>,<she>,<DPX200>,
      <created by zg, POWCHK disabled, PULCHK disabled
       configuration hash MD5:
       00 E9 B6 7A A2 85 ED C7 34 08 36 98 17 FE 4E 26
       data hash MD5: 32K
       35 12 E5 40 D2 88 21 42 7E 19 DB 60 94 28 4C E6>)
(   2,<2023-07-06 16:31:58.45 +0400>,<she>,<DPX200>,
      <Start of raw data processing
       efp BC_mod = 2 LB = 1 FT_mod = 6 PKNL = 1 PHC0 = -10675.41 PHC1 = 64.08481 SI = 64K 
       data hash MD5: 64K
       78 8B B3 6C 5D AA 3A 48 81 42 C5 7D 96 7C E1 F7>)
(   3,<2023-07-06 16:32:19.10 +0400>,<she>,<DPX200>,
      <pk PHC0 = -5.351091 PHC1 = -5.8 
       data hash MD5: 64K
       5A 75 1F 55 71 61 D9 A7 49 17 FA 1C 35 EF 0F F7>)
(   4,<2023-07-06 16:32:22.14 +0400>,<she>,<DPX200>,
      <abs ABSG = 5 
       data hash MD5: 64K
       61 99 99 A2 1E 92 2F 55 8A FE D3 E5 A2 72 A8 8A>)
$$ ##END=
$$ 
$$ hash MD5
$$ 68 87 A1 B9 47 53 C8 6A D3 5F 4F 07 0D 1E 7F 9D
##$RELAX= 
##$RELAX= 
##$RELAX= 
##$RELAX= 
##$RELAX= 
##$RELAX= 
##$RELAX= 
##$RELAX= 
##$RELAX= 
$$ Bruker specific parameters
$$ --------------------------
##$DU= <F:/spectra>
##$EXPNO= 1
##$NAME= <P31>
##$PROCNO= 1
##$TYPE= <nmr>
##$USER= <she>
##$AMP= (0..31)
100 100 100 100 100 100 100 100 100 100 100 100 100 100 100 100 100 100 
100 100 100 100 100 100 100 100 100 100 100 100 100 100 
##$AQSEQ= 0
##$AQ_mod= 1
##$AUNM= <au_zg>
##$AUTOPOS= <>
##$BF1= 81.014009
##$BF2= 200.13
##$BF3= 200.13
##$BF4= 200.13
##$BF5= 200.13
##$BF6= 200.13
##$BF7= 200.13
##$BF8= 200.13
##$BYTORDA= 1
##$CFDGTYP= 0
##$CFRGTYP= 5
##$CHEMSTR= <none>
##$CNST= (0..31)
1 1 145 1 1 1 1 1 1 1 1 1 1 1 1 1 1 1 1 1 1 1 1 1 1 1 1 1 1 1 1 1 
##$CPDPRG= <waltz16>
##$CPDPRG1= <>
##$CPDPRG2= <waltz16>
##$CPDPRG3= <>
##$CPDPRG4= <mlev>
##$CPDPRG5= <mlev>
##$CPDPRG6= <mlev>
##$CPDPRG7= <mlev>
##$CPDPRG8= <mlev>
##$CPDPRGB= <>
##$CPDPRGT= <>
##$D= (0..31)
0 1 0 0 0 0 0 0 0 0 0 0.03 2e-05 3e-06 0 0 0 0 0 0 0 0 0 0 0 0 0 0 0 0 
0 0 
##$DATE= 1688646713
##$DBL= (0..7)
120 120 120 11 120 120 24 19 
##$DBP= (0..7)
150 150 150 150 150 150 150 150 
##$DBP07= 0
##$DBPNAM0= <>
##$DBPNAM1= <>
$$ [...]
##$SUBNAM3= <"">
##$SUBNAM4= <"">
##$SUBNAM5= <"">
##$SUBNAM6= <"">
##$SUBNAM7= <"">
##$SUBNAM8= <"">
##$SUBNAM9= <"">
##$SW= 501.771253377433
##$SWIBOX= (0..15)
0 1 3 0 0 0 0 0 0 0 0 0 0 0 0 0 
##$SW_h= 40650.406504065
##$TD= 32768
##$TD0= 1
##$TE= 0
##$TE2= 300
##$TE3= 300
##$TEG= 300
##$TL= (0..7)
0 120 53 12 22 120 120 120 
##$TP= (0..7)
150 150 150 150 150 150 150 150 
##$TP07= 0
##$TPNAME0= <>
##$TPNAME1= <>
##$TPNAME2= <>
##$TPNAME3= <>
##$TPNAME4= <>
##$TPNAME5= <>
##$TPNAME6= <>
##$TPNAME7= <>
##$TPOAL= (0..7)
0.5 0.5 0.5 0.5 0.5 0.5 0.5 0.5 
##$TPOFFS= (0..7)
0 0 0 0 0 0 0 0 
##$TUNHIN= 0
##$TUNHOUT= 0
##$TUNXOUT= 0
##$USERA1= <user>
##$USERA2= <user>
##$USERA3= <user>
##$USERA4= <user>
##$USERA5= <user>
##$V9= 5
##$VALIST= <valist>
##$VCLIST= <CCCCCCCCCCCCCCC>
##$VD= 0
##$VDLIST= <DDDDDDDDDDDDDDD>
##$VPLIST= <PPPPPPPPPPPPPPP>
##$VTLIST= <TTTTTTTTTTTTTTT>
##$WBST= 1024
##$WBSW= 4
##$XGAIN= (0..3)
0 0 0 0 
##$XL= 0
##$YL= 0
##$YMAX_a= 6720
##$YMIN_a= -7162
##$ZGOPTNS= <>
##$ZL1= 120
##$ZL2= 120
##$ZL3= 120
##$ZL4= 120
##$ABSF1= 248.5645
##$ABSF2= -253.2056
##$ABSG= 5
##$ABSL= 3
##$ALPHA= 0
##$AQORDER= 0
##$ASSFAC= 0
##$ASSFACI= 0
##$ASSFACX= 0
##$ASSWID= 0
##$AUNMP= <proc_1d>
##$AZFE= 0.1
##$AZFW= 0.5
##$BCFW= 0
##$BC_mod= 2
##$BYTORDP= 0
##$COROFFS= 0
##$CY= -3
##$DATMOD= 1
##$DC= 0
##$DFILT= <>
##$DTYPP= 0
##$F1P= 0
##$F2P= 0
##$FCOR= 1
##$FTSIZE= 65536
##$FT_mod= 6
##$GAMMA= 0
##$GB= 0
##$INTBC= 1
##$INTSCL= 6.047779e-11
##$ISEN= 30
##$LB= 1
##$LEV0= 0
##$LPBIN= 0
##$MAXI= 10000
##$MC2= 0
##$MEAN= 0
##$ME_mod= 0
##$MI= 50
##$NCOEF= 0
##$NC_proc= -6
##$NLEV= 6
##$NOISF1= 182.463
##$NOISF2= 159.3651
##$NSP= 0
##$NTH_PI= 0
##$NZP= 0
##$OFFSET= 248.5645
##$PC= 4
##$PHC0= -10680.76
##$PHC1= 58.28481
##$PH_mod= 1
##$PKNL= yes
##$PPARMOD= 0
##$PSCAL= 0
##$PSIGN= 0
##$REVERSE= no
##$SF= 81.0140089999694
##$SI= 65536
##$SIGF1= 159.3651
##$SIGF2= -187.1042
##$SINO= 113.3802
##$SIOLD= 16384
##$SREGLST= <1H.CDCl3>
##$SSB= 0
##$STSI= 65536
##$STSR= 0
##$SW_p= 40650.406504065
##$SYMM= 0
##$S_DEV= 0
##$TDeff= 32768
##$TDoff= 0
##$TI= <>
##$TILT= no
##$TM1= 0
##$TM2= 0
##$TOPLEV= 0
##$USERP1= <user>
##$USERP2= <user>
##$USERP3= <user>
##$USERP4= <user>
##$USERP5= <user>
##$WDW= 1
##$XDIM= 65536
##$YMAX_p= 189890963
##$YMIN_p= -445489952
$$ End of Bruker specific parameters
$$ ---------------------------------
##NTUPLES= NMR SPECTRUM
##VAR_NAME=  FREQUENCY,     SPECTRUM/REAL,   SPECTRUM/IMAG
##SYMBOL=    X,             R,               I
##VAR_TYPE=  INDEPENDENT,   DEPENDENT,       DEPENDENT
##VAR_FORM=  AFFN,          ASDF,            ASDF
##VAR_DIM=   65536,         65536,           65536
##UNITS=     HZ,            ARBITRARY UNITS, ARBITRARY UNITS
##FACTOR=    0.620285442955139, 1,           1
##FIRST=     20137.2065510682, 0,            0
##LAST=      -20513.1999529968, 0,           0
##MIN=       -20513.1999529968, -445489952,  0
##MAX=       20137.2065510682, 189890963,    0
$$ Real data points
##PAGE= N=1
##DATA TABLE= (X++(R..R)), XYDATA
$$ [...]
47004 -357693 -88669 -32523 -535587 -1076565 -947292 -206366 369789 199589 -485436 -1016820
46994 -1016820 -1107052 -999077 -815652 -273643 603526 1001524 281070 -817675 -839519 468124
46984 468124 1772130 1871183 928114 -252268 -1145033 -1226834 74031 2230110 3375262
46975 3375262 2423606 757348 468474 1418112 1623267 410908 -587721 -7185 1290802
46966 1290802 1682717 972523 62082 -648176 -1346136 -1861875 -1819705 -1507302 -1564909 -1867294
46956 -1867294 -1628725 -695077 82168 -14006 -670073 -1036733 -663676 257783 1187850 1578251
46946 1578251 1246374 598961 261025 403096 677024 823741 978319 1252969 1373223
46937 1373223 977451 86759 -918443 -1652616 -1899619 -1572821 -741234 254298 856290
46928 856290 672343 -79282 -634853 -434235 253168 758578 1001031 1521016 2434378 3044641
46918 3044641 2899871 2569742 2715337 2953317 2527668 1720331 1528945 2059226 2351327
46909 2351327 1943746 1514021 1561752 1443810 396430 -1160393 -2063777 -1790627 -868959
46900 -868959 -193843 -331099 -1218436 -2213960 -2646282 -2463440 -2054550 -1500912 -628093 193215
46890 193215 213402 -431306 -597043 155864 666296 -183815 -1701533 -2253781 -1370170 21478
46880 21478 1053156 1582775 1650807 1274548 731353 278209 -247645 -834640 -689266 768309
46870 768309 2549674 2909977 1540657 -109793 -771313 -533803 11719 605915 939183
46861 939183 584470 -136789 -214994 526532 935933 270026 -517587 -172627 934417 1397306
46851 1397306 812408 69971 -173891 -163947 -138153 149148 642820 625756 -268494 -1276806
46841 -1276806 -1402630 -760644 -362802 -685391 -1134953 -1092272 -878301 -1242889 -2236550 -3093660
46831 -3093660 -3101453 -2172045 -732396 436047 452348 -786368 -1993234 -1699631 -289251
46822 -289251 257977 -831085 -1778853 -723245 1510586 2536383 1648790 320672 -245183
46813 -245183 -344488 -461880 -427394 -362562 -983597 -2241662 -2883929 -2159837 -933900 -319067
46803 -319067 -160300 281138 997511 1506712 1769794 1967284 1924342 1517331 1092709 807612
46793 807612 213331 -795305 -1364500 -856808 91089 610571 940145 1630987 2157817
46784 2157817 1693450 776754 717756 1534318 1923810 1288970 415393 3782 -118339 -53499
46774 -53499 519738 1231502 849362 -914037 -2415251 -1979009 -234988 512747 -857645
46765 -857645 -2926660 -3464334 -1988396 -134300 439968 -26263 -78360 620532 664495
46756 664495 -937515 -2957706 -3353241 -1938329 -445500 -120377 -497744 -646296 -404064
46747 -404064 4182 558102 1127688 1310333 1000091 497284 -160681 -1185992 -2134261
46738 -2134261 -2001313 -703887 474039 548089 95355 121662 491166 437367 27136 19966
46728 19966 530351 831872 497745 -37134 -167307 159280 508723 434015 -109780 -641481
46718 -641481 -620623 -172336 11917 -333088 -691829 -713318 -845733 -1477187 -2069841 -1890382
46708 -1890382 -1106175 -354600 311081 1101824 1509484 813027 -501803 -982887 -77741
46699 -77741 1203731 1736976 1478692 926492 351928 62719 524216 1520146 1932208 1189613
46689 1189613 370589 891410 2422068 3163842 2213338 657112 -1863 329114 665916
46680 665916 544059 490578 1012298 1799175 2147959 1770384 911782 -89098 -1077937 -2032663
46670 -2032663 -2942278 -3657660 -3742737 -2724573 -825645 746918 792280 -510636 -1693817
46661 -1693817 -1670758 -881658 -462230 -711712 -958264 -757724 -534656 -802364 -1207506 -844030
46651 -844030 480837 1675266 1409212 -295798 -1947669 -2342003 -2057948 -2577995 -4067748
46642 -4067748 -4910509 -3769488 -1359791 438922 722739 115970 -465259 -757902 -865509
46633 -865509 -774001 -469581 -185407 -255794 -776276 -1424303 -1630465 -1157839 -582857 -803896
46623 -803896 -1835597 -2539962 -1949146 -450183 789029 1143228 765611 -7379 -788976
46614 -788976 -1069913 -749846 -390011 -247459 364001 1778583 2719625 1808217 -54246
46605 -54246 -607772 429782 915160 -317466 -1623514 -1234271 -12165 91046 -943958
46596 -943958 -1564034 -1276739 -1093199 -1640716 -2471956 -3192496 -3792802 -3778988 -2416432 -200130
46586 -200130 1137297 623926 -831557 -1770903 -1848336 -1676750 -1681221 -1699768 -1408962 -758096
46576 -758096 -115900 -35386 -615347 -1200867 -1148598 -755686 -820026 -1303814 -1152323 318744
46566 318744 2372567 3483890 2803561 956124 -439246 -248230 904880 1242708 116330
46557 116330 -996644 -577175 623625 740619 -208965 -308295 1159266 2492426 2160927
46548 2160927 941183 380429 498185 357325 -84551 -150344 139637 158777 -193802 -581762
46538 -581762 -1067775 -1762590 -2049499 -1377558 -523145 -733764 -1736439 -1986549 -1003015
46529 -1003015 -55401 -160043 -738614 -933157 -1056243 -1731400 -2417279 -1965561 -345443
46520 -345443 1178955 1581255 1054157 404948 110424 193181 561113 1077626 1438388 1303850
46510 1303850 660148 -58980 -342324 -109933 247411 370083 316294 331948 419198 397607
46500 397607 311442 446655 879870 1299320 1434451 1438750 1599365 1802829 1648203 1158619
46490 1158619 987423 1550032 2188819 1815807 453651 -574824 -394052 190995 -36905
46481 -36905 -797530 -840844 -151082 -162670 -1418194 -2412756 -1676521 14843 659179 -349956
46471 -349956 -1761820 -2295606 -1827944 -856945 181714 879298 893229 297447 -495080
46462 -495080 -1165300 -1493467 -1178303 -243046 549008 379564 -538301 -1184430 -1065149 -729722
46452 -729722 -885118 -1543648 -2199412 -2451604 -2315350 -2109258 -1986578 -1518053 -162455
46443 -162455 1629738 2487693 1864749 956574 991400 1342093 605956 -978240 -1793758
46434 -1793758 -1377358 -970349 -1291737 -1471661 -850926 -265082 -519108 -871181 -285909
46425 -285909 742817 969122 392496 126870 554228 894640 647029 313554 366963 403095
46415 403095 -108382 -768286 -620461 512657 1617015 1650153 803639 176743 297237
46406 297237 575430 409460 115300 196241 307919 -192445 -1057584 -1466665 -1287034 -1020266
46396 -1020266 -700625 -36745 418762 -335387 -1885641 -2357642 -904146 957272 1335887
46387 1335887 324589 -546177 -419574 306866 985509 1366914 1455716 1340893 1053674
46378 1053674 404786 -628976 -1322337 -791999 636763 1572173 1356902 710957 260803
46369 260803 -286211 -931047 -820284 109516 323796 -1097067 -2579159 -2003831 257679
46360 257679 1906015 1785251 789808 49819 -190272 13378 539010 790375 312552
46351 312552 -151853 558784 2112511 2753902 1540360 -470274 -1516844 -853729 914021
46342 914021 2476724 2768201 1910334 1120430 1152942 1282552 594007 -359098 -363259 451524
46332 451524 813870 340756 -22420 372636 1065226 1409769 1230341 552236 -276828 -366394
46322 -366394 643785 1554044 1027092 -238970 -410754 579607 969984 88875 -800833
46313 -800833 -998840 -1427499 -2340374 -2273545 -674243 504374 -336747 -1710454 -1311637
46304 -1311637 302928 726849 -370501 -895329 159914 1251517 901197 -172693 -516429
46295 -516429 -118690 55261 -135774 124237 1187280 2310562 2585091 1981140 1241161
46286 1241161 968403 1062451 1017226 543344 -225468 -949975 -1281421 -993492 -222096 515367
46276 515367 815686 757488 495981 -172752 -1323918 -2322902 -2479956 -2053229 -1731901 -1325058
46266 -1325058 -91034 1618054 2350705 1566774 420749 -39493 -265488 -1009669 -1873326
46257 -1873326 -2154934 -2257596 -2936228 -3688560 -3300648 -1855515 -872036 -1188972 -1788766
46248 -1788766 -1278657 180251 1166109 967506 513080 1044419 2323982 2834339 1764316
46239 1764316 35268 -1015823 -1173638 -851664 82050 1701420 2776512 1833578 -462356
46230 -462356 -1648476 -674371 721543 557481 -841425 -1788735 -1582161 -801179 -105753
46221 -105753 191544 -58241 -574235 -684351 -237386 152030 210212 395409 625746 -126021
46211 -126021 -2003966 -3264207 -2417014 -400536 810275 934738 1154156 1791233 1972244
46202 1972244 1372513 664849 190214 -397871 -1024908 -1024067 -346352 137662 -131093 -714130
46192 -714130 -974138 -856439 -676131 -673355 -868528 -966180 -540967 305407 834139 681232
46182 681232 463269 775688 1212395 1156933 879896 870117 693822 -310881 -1647972 -2179221
46172 -2179221 -1730674 -1060042 -523411 79111 602489 671557 489738 457462 297326 -318513
46162 -318513 -705431 -66802 920037 904378 -22062 -598674 -600734 -1001378 -1866876 -1947252
46152 -1947252 -817034 228599 81168 -708152 -992002 -453392 514742 1330371 1296753
46143 1296753 212030 -867370 -592049 782870 1647056 1265285 436412 -109904 -416899
46134 -416899 -278259 718419 1795913 1495511 92197 -425509 532985 1114755 51593
46125 51593 -1335520 -1456125 -820211 -538253 -279962 453500 658962 -481694 -1556403
46116 -1556403 -769897 1146289 2061089 1695101 1496767 1834188 1674920 902904 663338
46107 663338 1178478 1253577 373625 -511914 -817375 -1279817 -2401030 -3337789 -3150120 -2091515
46097 -2091515 -960120 -57444 617679 948130 1010809 1108474 1085946 366739 -925866 -1693310
46087 -1693310 -1243235 -240629 301501 337541 422284 581807 413631 79165 312440 1290981
46077 1290981 2178097 2183561 1646614 1499893 1834790 1745881 821617 2101 254687 972033
46067 972033 734424 -571725 -1590175 -1490332 -855204 -307601 352546 1037249 828836
46058 828836 -444529 -1332836 -705800 467905 642358 48696 -41004 376463 263925
46049 263925 -375685 -524571 -123071 -198705 -916647 -1217345 -671226 -90573 62127 321802
46039 321802 850450 970601 612602 693742 1390281 1572998 791175 272772 889346 1608707
46029 1608707 1295097 710682 1145225 2160127 2486694 2332348 2778896 3325645 2223317
46020 2223317 -543844 -2591494 -2149893 -235928 1003190 866285 64396 -855975 -1825332
46011 -1825332 -2480633 -2246482 -1205886 -170957 192394 -110524 -677177 -1076591 -990174
46002 -990174 -400170 294562 601788 398768 -70513 -544728 -887809 -1029510 -1031508 -1100150
45992 -1100150 -1276293 -1270460 -923558 -629795 -821927 -1147235 -765789 432716 1480509
45983 1480509 1440127 429676 -663615 -1082347 -665084 87769 261877 -549182 -1398578
45974 -1398578 -873201 869180 2003441 1595642 1024795 1720536 2673901 1933471 -216878
45965 -216878 -1676456 -1800883 -1954833 -2629400 -2467399 -1001038 -64174 -1047600 -2590534
45956 -2590534 -2673354 -1529436 -698796 -429398 24389 427926 -66003 -1074944 -1364385
45947 -1364385 -748209 15656 799872 1872120 2523273 1825848 500758 82609 407810
45938 407810 17742 -1033402 -1155958 -235367 -76208 -1125968 -1376224 225179 1745669
45929 1745669 1377915 366262 674418 1601180 1308156 378265 933573 2802201 3479371
45920 3479371 2022056 347071 45326 227620 -438202 -1490524 -1838948 -1729460 -2023074
45911 -2023074 -2423197 -1930711 -625302 346620 434513 184149 16408 -409421 -1227322
45902 -1227322 -1648047 -943886 293673 699350 -87248 -930983 -795419 -203152 -429009
45893 -429009 -1537801 -2147735 -1364786 -123140 47491 -902873 -1538389 -898048 372744
45884 372744 1102236 1117414 1126305 1442844 1544277 945399 -100347 -1079483 -1910997 -2639062
45874 -2639062 -2784904 -1807277 -210663 673007 339366 -231471 -67076 455281 519559
45865 519559 334530 544218 735505 -9453 -1226520 -1297093 174267 1657975 1867530
45856 1867530 1256929 697264 85241 -712049 -836795 221343 1207794 605730 -996790
45847 -996790 -1614966 -670718 447718 601024 189987 7712 158747 556053 1306202
45838 1306202 2001327 1610515 -188409 -2210096 -2909228 -1910107 -83369 1336465 1446475
45829 1446475 229720 -1143635 -1255528 -168442 485855 -291384 -1377271 -1126834 179492
45820 179492 675486 -499333 -2106688 -2494286 -1459549 -84807 591552 321425 -432673
45811 -432673 -889479 -554086 260677 743722 585067 344181 631546 1315583 1852511 2049208
45801 2049208 2097260 2115825 2088822 2050942 1896018 1192095 -280717 -1880596 -2526019 -1811903
45791 -1811903 -307049 1159661 1983250 1731958 487475 -647024 -364730 1061434 1725192
45782 1725192 511488 -1264027 -1610229 -586344 -22991 -844140 -2046903 -2448774 -2148685
45773 -2148685 -1782296 -1376283 -634946 322464 1164567 1848975 2446640 2856128 3040212
45764 3040212 3103571 2829305 1690118 -249133 -1940664 -2362641 -1559185 -313141 751287
45755 751287 1331148 1251322 689925 207474 25402 -315946 -1038475 -1364171 -448477 1224788
45745 1224788 2216537 1845908 847422 307932 532939 1033749 1184696 816272 414813
45736 414813 639481 1447921 2022977 1851337 1376311 1108392 707332 -261717 -1203711 -1211814
45726 -1211814 -627785 -678380 -1569208 -2176623 -1871372 -1421508 -1561970 -1775960 -1285047 -397760
45716 -397760 33422 -94917 -290234 -472796 -878566 -1177162 -656216 641007 1757251
45707 1757251 2015066 1748914 1596300 1625163 1555639 1417979 1456006 1542048 1208976 341113
45697 341113 -550789 -942285 -935287 -1029774 -1384387 -1594725 -1227937 -361744 481061 804463
45687 804463 523671 27813 -115995 328009 1018382 1403470 1266848 752510 31659 -705645
45677 -705645 -1088748 -936918 -758132 -1225223 -2051608 -2149618 -1212536 -327620 -461064 -1095270
45667 -1095270 -1162079 -685609 -474133 -598282 -373736 217919 300422 -428241 -1043067 -753298
45657 -753298 -142634 -358545 -1507884 -2544900 -2619149 -1981178 -1448898 -1322282 -1116152
45648 -1116152 -364271 590893 935087 448411 -210487 -417704 -313082 -361993 -667583 -1067112
45638 -1067112 -1430717 -1465823 -764619 467844 1326833 1414844 1426801 1801009 1659593 242916
45628 242916 -1352477 -1390655 -52248 848196 569771 194551 551285 1086735 1214701
45619 1214701 1215535 1241424 914572 539147 1195113 2812234 3620903 2529302 710747 -271136
45609 -271136 -617457 -1302888 -2123837 -2221568 -1657195 -1017802 -214658 924347 1618789 1178783
45599 1178783 408757 432059 769539 282877 -562560 -356002 647893 736035 -334265
45590 -334265 -769932 359349 1645129 1631414 844701 427126 209964 -522760 -1425646
45581 -1425646 -1619930 -1152669 -737754 -545859 -305806 -160295 -374287 -534672 -94344
45572 -94344 488810 218680 -849303 -1526199 -1217760 -772183 -1095194 -1689203 -1386437 -172332
45562 -172332 666346 336215 -368453 -311550 270511 229773 -536106 -736202 379841 1781099
45552 1781099 2050087 1211374 294901 -274379 -820859 -1425095 -1893506 -2389500 -2965675
45543 -2965675 -2800153 -1238029 612619 901461 -269398 -859957 28479 873806 300940
45534 300940 -817431 -1034133 -596679 -525279 -610476 -48901 756191 809910 391717 509658
45524 509658 827631 38921 -1696786 -2608070 -1969547 -1101886 -1058460 -1047691 -247690 304991
45514 304991 -777957 -2706946 -3194871 -1492122 676334 1409536 736970 -45821 -314144
45505 -314144 -614307 -1486669 -2498727 -2735093 -1990641 -1071361 -791785 -994518 -917075 -337710
45495 -337710 190476 291726 349237 801511 1308432 1118683 84592 -1114731 -1705872
45486 -1705872 -1479988 -808187 -300892 -393956 -964699 -1341421 -944019 45930 856838 1004223
45476 1004223 794843 865142 1376391 1836132 1698466 987087 195214 -368296 -860694 -1393387
45466 -1393387 -1572622 -1019853 -203465 -76743 -736911 -1164604 -717966 -150162 -361941
45457 -361941 -758531 -61954 1432585 1867899 496863 -1028446 -961797 59512 195799
45448 195799 -667815 -907432 36192 693661 25870 -770154 -143812 1230164 1347814
45439 1347814 -105137 -1256912 -714135 683691 1340488 1059359 870003 1328295 1897332
45430 1897332 1858085 1167052 364120 1877 181409 454137 280086 -278986 -552668 -133594
45420 -133594 556206 865933 763756 682588 802716 997326 1301912 1855029 2416218 2488522
45410 2488522 1948867 1085734 66857 -1029855 -1690009 -1299276 -242674 214480 -320787
45401 -320787 -555567 707244 2613648 3233745 2234624 1311181 1765838 2843374 3043508
45392 3043508 2150291 1156192 814833 1137640 1885916 2631135 2563658 1207487 -676862
45383 -676862 -1763617 -1782314 -1589639 -1563872 -1072210 44833 703176 240662 -156478 927334
45373 927334 2668592 2805687 919555 -736112 -281347 1299418 1747268 639346 -390899
45364 -390899 -105472 963762 1632560 1493110 907653 332087 38730 14207 -161530 -895025
45354 -895025 -1813269 -1950989 -1060795 -208151 -505377 -1629661 -2265156 -1813941 -934936
45345 -934936 -404448 -240715 -214754 -477088 -1107920 -1551610 -1217084 -412069 27639 -39143
45335 -39143 43652 508650 647251 -75204 -1053886 -1325181 -862206 -374556 -124497 206565
45325 206565 568830 435202 -111265 -103952 905016 1879671 1563935 290320 -439064 -100833
45315 -100833 127851 -849996 -2360757 -2766082 -1591242 -92506 317165 -398607 -1193677
45306 -1193677 -1349706 -1149406 -1220964 -1614738 -1767433 -1281820 -482154 -29608 -72449 -58103
45296 -58103 461344 1082257 988083 104413 -632950 -372152 636737 1397816 1233469 161814
45286 161814 -1401428 -2738620 -2911058 -1563420 324913 1266200 982379 521447 514313
45277 514313 372323 -278480 -534362 364928 1437057 1169476 -132582 -700638 92179
45268 92179 965732 795744 35541 -427272 -571069 -665971 -461766 166897 578497 270608
45258 270608 -203240 -74164 446997 664310 555572 516514 394894 -221594 -1060028 -1516746
45248 -1516746 -1751495 -2376028 -3130180 -2992116 -1782507 -612136 -341692 -479667 -143648
45239 -143648 582300 890170 406230 -502395 -1338907 -1857652 -1914608 -1400418 -458545 438740
45229 438740 797059 515963 -1878 -185827 225581 1020463 1727701 1913654 1472926 915462
45219 915462 1136062 2342866 3349329 2758669 959291 -63114 670765 1777167 1518541
45210 1518541 163220 -764874 -768570 -536711 -375921 -22749 204969 -375016 -1402836
45201 -1402836 -1765504 -1453299 -1620346 -2462440 -2622349 -1384933 7911 215248 -240344
45192 -240344 -31536 837300 1184996 455256 -696722 -1386283 -1306436 -746751 -318192 -397099
45182 -397099 -546194 32003 1213878 1820802 1113688 -345826 -1680900 -2607977 -2922542
45173 -2922542 -2245447 -1035488 -696252 -1681591 -2557296 -2042344 -890286 -447566 -469138
45164 -469138 -21253 403815 -333003 -1708134 -2090638 -1343754 -798321 -723024 -45406 1167104
45154 1167104 1279098 -102345 -1003260 104327 2121888 3191413 3190600 3007235 2710804
45145 2710804 2006455 1433593 1499452 1421578 306874 -1065119 -1235034 -354245 152781
45136 152781 -102141 -229335 -60024 -536827 -1717680 -2139117 -1043309 156926 -184899
45127 -184899 -1506008 -1850069 -629775 757344 1044101 628425 584003 1014257 1125110
45118 1125110 561879 -76563 -119555 300721 511202 156477 -471284 -828602 -646152 -166348
45108 -166348 -5705 -597190 -1568035 -1926582 -1211296 -202323 25081 -416859 -398697 519222
45098 519222 1346444 1016811 -175697 -1110507 -1374412 -1501248 -1805347 -1777436 -953409 146125
45088 146125 537538 165260 169500 1371699 2871082 2914770 1225248 -425832 -473656 445592
45078 445592 677080 52871 -152684 461032 763873 120987 -429501 123378 1054046 989366
45068 989366 -73861 -959453 -1032544 -703530 -529291 -729783 -1378178 -2256917 -2707669 -2334474
45058 -2334474 -1626391 -1229258 -980269 -468404 -137270 -751388 -1908306 -2190266 -955319
45049 -955319 880145 1995451 1871733 793650 -563962 -1412332 -1411940 -1096314 -1172414 -1490431
45039 -1490431 -1421124 -1063795 -1078437 -1362707 -1083374 -246704 -18567 -967800 -2059365 -2064397
45029 -2064397 -1096755 -78631 513330 660693 320946 -280965 -504657 -195020 -147615
45020 -147615 -931951 -1866730 -2013173 -1607870 -1523714 -1758928 -1553628 -775097 -116534 39672
45010 39672 4113 -3467 -148098 -401452 -466103 -410410 -671573 -1291598 -1786388 -1868160 -1685808
44999 -1685808 -1318697 -705231 -99079 151076 326119 990676 1786641 1544921 -23341
44990 -23341 -1667186 -2170926 -1779239 -1429463 -1346912 -1204084 -1024450 -978995 -726195 46886
44980 46886 677777 143817 -1395449 -2587332 -2523466 -1579523 -494603 519299 1416073
44971 1416073 1847628 1603748 1028840 538983 132563 -229942 -239337 261335 823163 1050541
44961 1050541 1331950 2128678 2777786 2036721 14650 -1421688 -793469 1081652 2091553
44952 2091553 1371222 -617 -719251 -707358 -553144 -345154 196578 834061 888856 228076
44942 228076 -464937 -586392 -296672 -94698 -149689 -349533 -612642 -763517 -443166 364322
44932 364322 965637 686271 -171197 -692539 -598278 -437985 -512084 -417403 64867 458238
44922 458238 476670 660304 1401614 1983862 1528720 453006 -88662 51039 22051 -329632
44912 -329632 -155295 680127 964533 -698 -1076862 -908954 17991 233038 -409662
44903 -409662 -754294 -474446 -609725 -1653584 -2491863 -1999763 -717297 -24273 -254929
44894 -254929 -566943 -407567 -238314 -740409 -1890672 -2994014 -3322552 -2680364 -1622825
44885 -1622825 -1159520 -1958424 -3676658 -5148699 -5318124 -4043882 -2117038 -564364 129398
44876 129398 185105 -9879 -355504 -723568 -502743 842422 2640220 3189891 1622100
44867 1622100 -871721 -2311848 -2161877 -1598041 -1693324 -2172285 -2184064 -1582280 -931578
44858 -931578 -655608 -705296 -885845 -1050218 -1007060 -603885 33050 543062 629816 202892
44848 202892 -641268 -1529963 -1817155 -1062318 393671 1594257 1830705 1186224 247597
44839 247597 -410139 -429818 161291 744458 514550 -500279 -1195692 -685131 492010
44830 492010 1130527 1070549 1220933 1855403 1977037 868850 -637175 -1222165 -794412
44821 -794412 -291277 -195232 -170338 26409 193540 263650 444136 677896 648885 441920
44811 441920 554205 1116553 1708696 2048741 2206669 2029525 1165203 -39495 -482313
44802 -482313 314737 1404291 1604925 1022268 761839 1448805 2592671 3200605 2589454
44793 2589454 866118 -950951 -1553604 -572671 945054 1596329 943782 -417702 -1643601
44784 -1643601 -2084427 -1449664 -172027 650608 253341 -992477 -2114627 -2514044 -2025027
44775 -2025027 -630638 1123834 1952891 1098308 -435476 -939013 -246456 105065 -916791
44766 -916791 -2515323 -3316840 -3041006 -2355891 -1731713 -1105859 -369735 341369 775319
44757 775319 776704 485523 323666 532967 775223 510426 -318033 -1317354 -2144386 -2515017
44747 -2515017 -2069299 -942604 -141416 -411957 -996528 -673700 153961 -81738 -1461485
44738 -1461485 -2165915 -1324009 -442230 -855344 -1462359 -678160 718282 775858 -418063
44729 -418063 -969954 -301492 245569 79021 365785 1649388 2463419 1552764 4548
44720 4548 -248248 908707 1941975 1883837 1144085 458300 96802 10623 4467 -135881
44710 -135881 -240199 127710 706040 411371 -1036749 -2122858 -1334041 572565 1468420
44701 1468420 725848 -355964 -964948 -1790685 -3049100 -3270650 -1366283 1256265 2152665
44692 2152665 857235 -877177 -1498020 -1050740 -334796 79454 -110961 -827672 -1356210
44683 -1356210 -1083787 -532348 -665328 -1148014 -580886 1218223 2558105 2201937 1061003
44674 1061003 579334 617370 261981 -241281 -38160 420648 -147530 -1560108 -2144242
44665 -2144242 -1313501 -475170 -694556 -989170 -42456 1519980 1913532 692378 -761719
44656 -761719 -1096058 -391291 328667 328474 -217215 -488613 95264 1110482 1478054 752133
44646 752133 -297049 -638994 -143523 505976 691272 362090 11876 350143 1538305
44637 1538305 2583577 2145229 248918 -1518085 -1921957 -1403367 -989066 -835903 -685051
44628 -685051 -883602 -1806066 -2804777 -2868619 -1981856 -866439 162519 1018860 1043429 -280001
44618 -280001 -2066753 -2830754 -2440805 -2026439 -2091371 -2126032 -2024809 -2284534 -2584876 -1801874
44608 -1801874 70281 1513240 1637268 1343154 1598525 1913958 1471773 593215 58534
44599 58534 -54045 110351 860016 2123198 2801844 2046384 495873 -702333 -1377241
44590 -1377241 -1885631 -2001423 -1419195 -735067 -742417 -1195759 -1300006 -953054 -537279 -38371
44580 -38371 611626 891994 433377 -198034 -449296 -714498 -1200039 -918032 623356 1776620
44570 1776620 859695 -871904 -772152 1084319 2035620 1131558 370749 928406 1085940
44561 1085940 -571412 -2419474 -2325400 -1025242 -698524 -1491253 -1793354 -1177146 -771333
44552 -771333 -995075 -958129 -194023 683479 1242183 1731452 2103914 1816457 916841 233637
44542 233637 139003 49972 -504599 -1128774 -1209004 -670281 169466 937457 1247432 956150
44532 956150 473367 285995 201797 -282906 -920713 -878843 -110276 342232 -200466 -1067824
44522 -1067824 -1232307 -689025 -259447 -441571 -1031186 -1603458 -1820133 -1418139 -424322
44513 -424322 597561 911206 354220 -474093 -875376 -806920 -870329 -1529267 -2435490 -2727854
44503 -2727854 -2047562 -980878 -278366 70309 560401 1180735 1343634 899526 573972
44494 573972 978521 1608247 1403888 219145 -801400 -500917 922983 2108250 2024183
44485 2024183 1032559 350525 633259 1368869 1692268 1437723 1063770 724462 -37991
44476 -37991 -1437756 -2681766 -2638594 -1324833 -183535 -463623 -1642427 -2081924 -1171911
44467 -1171911 -37691 129307 -390259 -608388 -432522 -533112 -1005147 -1285657 -1324096
44458 -1324096 -1697433 -2390244 -2538110 -1739431 -671681 -23252 253047 259637 -175376 -622636
44448 -622636 -69242 1366051 1945196 665051 -992898 -1063180 69327 491410 -237963
44439 -237963 -813407 -684162 -837650 -1759328 -2359790 -1652528 -217593 736649 806877 317394
44429 317394 -302993 -547239 -59652 668994 588149 -515173 -1643634 -1938030 -1571932
44420 -1571932 -994303 -269761 355397 264108 -468052 -744242 25582 899610 805221 223264
44410 223264 387414 1279761 1606556 717810 -430412 -487108 686325 1891665 1868186
44401 1868186 580459 -762855 -1030919 -338956 395694 766968 1070963 1329928 1071167
44392 1071167 272329 -367125 -458406 -458179 -820541 -1352410 -1726604 -1870982 -1600429 -772444
44382 -772444 -77842 -582279 -2054533 -2912307 -2370094 -1403323 -940080 -502461 447130
44373 447130 1255089 1352927 1403217 1814009 1518689 -96862 -1409060 -769054 590555
44364 590555 237380 -1584482 -2316073 -1045481 470207 856076 669919 456536 -282938
44355 -282938 -1318672 -1127307 681742 2175632 1620010 -247471 -1620660 -1959459 -1754278
44346 -1754278 -1193885 -340570 274752 297876 18765 -498346 -1660146 -3021265 -3142498
44337 -3142498 -1799574 -832158 -1425198 -2048936 -925039 764978 468041 -1670684 -2853477
44328 -2853477 -1710400 37086 489847 58014 73797 538799 505591 -267134 -1163383
44319 -1163383 -1659246 -1592444 -924820 65870 700429 600966 220021 191640 434426 402282
44309 402282 13472 -231458 -43995 232608 177450 -55915 44332 554564 868939 424343
44299 424343 -538333 -1250714 -1357164 -1165990 -947443 -515008 249320 955671 1223216 1262525
44289 1262525 1445527 1595577 1298799 744028 576098 879671 951484 322348 -497386 -673965
44279 -673965 -163248 249653 -45569 -812367 -1420830 -1679483 -1856640 -1938332 -1403822 -106992
44269 -106992 1025381 894055 -193105 -609110 578372 2276251 2609335 1154581 -698296
44260 -698296 -1542425 -1487844 -1626042 -2327791 -2632774 -1556722 359174 1463041 1071978
44251 1071978 383551 740289 1665617 1659200 582105 -97579 424617 1134791 919897 300802
44241 300802 512110 1594402 2400788 2147209 1166334 335675 336800 1248273 2392354 2808422
44231 2808422 2212059 1203739 387807 -167974 -456895 -338374 -129212 -442479 -986200
44222 -986200 -621469 726061 1466207 654089 -369487 -26687 971114 927817 106768
44213 106768 231602 1437411 1980355 1133244 241206 353757 723679 492859 193933
44204 193933 497296 812306 326595 -569184 -1042097 -1203537 -1606357 -1960495 -1499465 -333076
44194 -333076 560387 622167 252641 76605 225356 370380 98822 -726472 -1730580 -2224802
44184 -2224802 -1845503 -943139 -235608 -127925 -356502 -228948 649066 1787565 2246069
44175 2246069 1807589 1208435 889724 297283 -867613 -1545231 -695917 750047 827174
44166 827174 -676903 -1845370 -1254266 344080 1311152 962578 -241617 -1358890 -1545344
44157 -1545344 -854857 -471664 -1166054 -1824189 -961275 639496 835091 -332804 -494005
44148 -494005 1056304 1936705 604405 -891202 -163531 1613561 1618727 -260366 -1659382
44139 -1659382 -1453003 -666560 -139165 307788 512363 -25814 -735958 -503557 334545
44130 334545 350598 -570127 -1040631 -538384 -81631 -199688 -66900 733844 1215456 543282
44120 543282 -683938 -1429531 -1486546 -1226583 -982778 -1019661 -1279740 -1102006 -147275 617856
44110 617856 192077 -470209 469305 2663093 3664383 2492143 926666 466469 253018
44101 253018 -695413 -1347485 -590790 442013 115412 -904362 -813875 257042 667012
44092 667012 260963 541412 1795473 2329055 1175765 -303799 -469127 341173 651245
44083 651245 5245 -759938 -855406 -244514 750659 1819083 2638183 2951292 2785024 2400807
44073 2400807 1977066 1436321 665729 -92334 -241747 518281 1604207 2011956 1473453
44064 1473453 726504 462174 527001 517055 608345 1165907 1855810 1888243 1144521 473807
44054 473807 673987 1493346 1843011 929770 -888243 -2427873 -2907037 -2648128 -2331874
44045 -2331874 -1910494 -906022 416400 1122190 989237 836291 1109329 1129471 339590
44036 339590 -629448 -919712 -670243 -414399 -7747 817028 1437387 1020220 -166647
44027 -166647 -1147578 -1569215 -1641347 -1238892 -282201 382725 -106820 -1035330 -915613 127835
44017 127835 388937 -744676 -1781407 -1396056 -219531 489678 653045 814043 872717
44008 872717 560380 346508 674296 942780 450325 -200687 54537 882041 961840 162547
43998 162547 -191720 497612 1081983 496550 -573707 -840959 -386972 -318803 -904546 -1295716
43988 -1295716 -1064941 -839112 -1096905 -1383078 -1313502 -1477624 -2447361 -3478206 -3274016
43979 -3274016 -1818207 -387720 238451 511160 872163 902581 219222 -711108 -1293129
43970 -1293129 -1571068 -1669243 -1302647 -602122 -572204 -1736679 -3061278 -3341685 -2991881
43961 -2991881 -3158778 -3663536 -3406849 -2468502 -2002503 -2029422 -1234508 570136 1592721
43952 1592721 584103 -1226533 -1803523 -839043 422886 1012657 865387 316628 -97645
43943 -97645 144141 837128 1119626 756008 520877 748569 579686 -515584 -1589702
43934 -1589702 -1689938 -1416305 -1705052 -2056908 -1547483 -762072 -884217 -1408588 -792375
43925 -792375 781184 1386064 369314 -597806 -149184 820423 800529 -61560 -428900
43916 -428900 331527 1625436 2427636 2028649 579803 -727948 -724205 240553 715616
43907 715616 283865 123025 1004666 2035778 2170950 1756850 1545871 1247859 294791
43898 294791 -795715 -1138395 -943305 -965937 -1014675 -391619 504046 462953 -663694 -1671589
43888 -1671589 -1703484 -1104830 -440041 207525 649335 342545 -781574 -1956974 -2434423
43879 -2434423 -2168109 -1536542 -1004186 -1050631 -1622691 -1673745 -302848 1517178 1638465
43870 1638465 -339454 -2156075 -1794002 -149607 439393 -519430 -1392381 -1051508 -171936
43861 -171936 287296 488142 964963 1453053 1290928 491491 -310946 -756633 -1006136 -1130703
43851 -1130703 -759619 427675 2008107 2864839 2161692 359240 -969338 -656503 793854
43842 793854 1802465 1553298 795555 695942 1389264 2030302 1928802 1142824 121881
43833 121881 -691216 -871266 -157714 1108023 1981077 1715726 554275 -479708 -598892
43824 -598892 31415 595741 560313 213005 205093 627427 849267 479767 126723 600541
43814 600541 1490203 1427747 115053 -850663 -67502 1424566 1334787 -559896 -1817614
43805 -1817614 -623884 1632300 2191703 519517 -1279853 -1367386 -180538 641145 267291
43796 267291 -867453 -1900305 -2277099 -2025969 -1703817 -1863762 -2375766 -2512592 -1819713
43787 -1819713 -616703 422474 834587 478618 -434848 -1250445 -1248729 -392987 577827
43778 577827 937978 587075 -94216 -550242 -259968 721842 1402140 819113 -483191
43769 -483191 -914715 -116251 372582 -539548 -1632085 -1090605 735126 1816115 1311690
43760 1311690 385733 164854 414459 610747 953047 1612575 2009142 1638442 913722
43751 913722 478348 261639 -103652 -415623 -191440 432381 723099 246082 -602525 -923124
43741 -923124 -114691 1403843 2313742 1717888 331201 -326756 11338 44964 -1026975
43732 -1026975 -2205706 -2214835 -1381392 -916278 -973665 -701193 59345 415212 -127775 -929974
43722 -929974 -1230429 -1075384 -899504 -824413 -729600 -581000 -434095 -413803 -729980 -1331648
43712 -1331648 -1621164 -1074043 -137539 151000 -426889 -914934 -506776 378681 731872
43703 731872 188385 -791659 -1631773 -2095725 -2220918 -2140468 -1935329 -1553283 -969867 -382961
43693 -382961 772 294132 675132 903715 644879 276522 660623 1849725 2695404
43684 2695404 2207646 793140 -369393 -764653 -781679 -850833 -1018489 -1295273 -1800283
43675 -1800283 -2407902 -2662818 -2287485 -1615517 -1339566 -1795337 -2527752 -2688350 -1978715
43666 -1978715 -1039809 -638006 -636507 -255595 683221 1392001 1191958 393675 -223769 -346411
43656 -346411 -169341 82279 263211 253316 156359 261638 521011 468443 21217 -102723
43646 -102723 710206 2005541 2757910 2553428 1747134 748681 -205975 -766628 -645801
43637 -645801 -91509 328269 394197 268980 -1304 -498919 -1017987 -1171602 -960325 -829200
43627 -829200 -1114936 -1685676 -2036013 -1578497 -192845 1249676 1477643 449585 -253560
43618 -253560 546682 1861240 1912085 750998 23135 290537 283465 -863916 -2273803
43609 -2273803 -2938859 -3221163 -3732146 -3958309 -3273299 -2389692 -2397041 -2970862 -2977374 -2467249
43599 -2467249 -2514541 -3116934 -2864445 -1170833 520853 624422 -406980 -785030 210971
43590 210971 1528707 1933682 1415729 763416 397941 152444 -85699 -130237 -1844 -213321
43580 -213321 -1184331 -2563416 -3509644 -3603067 -3134737 -2508019 -1774210 -909650 -166458 163381
43570 163381 132141 -1230 -184008 -574291 -1124534 -1373539 -838216 329620 1217722 986529
43560 986529 -95528 -818748 -480055 250502 343438 -154031 -401868 -163728 21966 -3315
43550 -3315 277937 1008020 1573097 1591880 1354175 908104 -230093 -1839935 -2528831 -1423392
43540 -1423392 498144 1742349 2195222 2551803 2597483 1580256 -2122 -589499 274371
43531 274371 1299337 1330735 686148 124389 -381390 -1049177 -1346944 -675969 429704
43522 429704 782026 167865 -330843 147079 1083904 1437852 1235365 1511247 2579766
43513 2579766 3224772 2271783 384235 -723929 -632517 -544236 -1150075 -1555480 -950970
43504 -950970 -62736 63741 -312529 -386116 -316659 -685670 -1159946 -1091847 -863034 -1164389
43494 -1164389 -1476272 -886951 35009 19143 -565833 -213444 936110 1089282 -112239
43485 -112239 -874332 -325021 109848 -461374 -587737 824796 2167399 1642767 371913
43476 371913 492394 1466260 1086469 -562234 -1121465 58376 789854 -400022 -1999144
43467 -1999144 -1957330 -555420 536890 728022 590820 346072 -316857 -1224677 -1651414
43458 -1651414 -1283814 -565062 -60410 32743 -260723 -896088 -1685084 -2155464 -1794340 -590016
43448 -590016 769736 1547786 1814879 2227460 2866006 2944426 2030166 867631 390787
43439 390787 516745 620964 616192 707642 632325 149824 -186386 122457 323220 -618770
43429 -618770 -2116782 -2504809 -1457529 -343401 21339 383645 1343869 2165776 2084670
43420 2084670 1542652 1264869 1203410 1245688 1859814 3005150 3397810 2089472 65320
43411 65320 -961715 -834072 -819125 -1566532 -2448842 -2848339 -2933060 -2947827 -2640014 -1771022
43401 -1771022 -673125 27877 44611 -294136 -309222 341334 1154944 1258875 494603 -384452
43391 -384452 -710728 -551116 -223845 105851 107285 -544162 -1255499 -799350 798776 1697974
43381 1697974 562297 -1452694 -2204681 -1307595 -98171 463952 401616 -261353 -1436531
43372 -1436531 -2126757 -1293767 380313 1119427 523196 -154307 -318348 -813617 -1904443
43363 -1904443 -2340710 -1408176 -314694 -315058 -775513 -447789 458033 970314 1209935 1862402
43353 1862402 2373089 1480820 -541891 -1871497 -1643327 -1033635 -1303136 -1992151 -1880639
43344 -1880639 -885662 -35244 59335 -172729 -157445 -39680 -363667 -1177455 -1828778 -1742780
43334 -1742780 -1154979 -744104 -605769 -90129 1124459 2291415 2419189 1546750 642372
43325 642372 366244 503902 615479 644438 671330 514526 -97722 -1157240 -2365635 -3322237
43315 -3322237 -3620945 -3035702 -1854092 -845378 -585348 -849892 -956950 -710482 -617812
43306 -617812 -962812 -1106872 -319129 881113 1088365 -30526 -1041793 -655238 483574
43297 483574 923658 673082 896877 1614144 1417239 -185523 -1796966 -2234492 -2113227
43288 -2113227 -2324494 -2348259 -1450134 -369184 -155833 -227423 574552 1637754 1379198
43279 1379198 150187 116627 1933632 3597044 3282157 1529989 -198691 -1421793 -2060361
43270 -2060361 -1616441 -311687 275488 -759163 -2009433 -1715545 -468214 -209151 -1141677
43261 -1141677 -1576214 -748080 69297 -353608 -1489883 -2022266 -1468823 -318960 635464
43252 635464 702265 -252308 -1418974 -1761660 -1305969 -1016339 -1293526 -1488142 -1126667 -610276
43242 -610276 -255887 340471 1294693 1710935 927315 -160907 -119240 1003504 1759455
43233 1759455 1368227 645099 580002 902790 702071 -91316 -677226 -714546 -803863 -1291150
43223 -1291150 -1322126 46176 2053377 2653739 1038616 -1240394 -2329577 -2370202 -2714584
43214 -2714584 -3543145 -3700435 -2709582 -1448629 -608891 120236 893705 1116476 710785
43205 710785 689544 1509431 2014160 1219291 153076 444874 1761743 2284444 1445279
43196 1445279 575297 779742 1657435 2410845 2881339 3017172 2495459 1482745 814444
43187 814444 809756 742614 76663 -603318 -596294 -300109 -601935 -1536038 -2316521 -2399704 -1892793
43176 -1892793 -1180865 -670682 -624432 -823142 -766794 -580811 -1124600 -2614496 -3806102
43167 -3806102 -3445944 -2053120 -1201450 -1323322 -1418230 -911029 -508715 -814902 -1201866
43158 -1201866 -787084 182250 680802 248906 -637730 -1293522 -1402412 -1030642 -489139
43149 -489139 -124047 7126 145005 374140 399653 -25305 -697064 -1195899 -1281332 -892550
43139 -892550 -108477 639661 713441 32466 -598722 -372390 527880 1251550 1405003 1347433
43129 1347433 1445439 1544132 1286297 643020 11553 -125717 277160 625888 324592 -311979
43119 -311979 -375135 145370 44872 -1219334 -2255889 -1608238 -232169 -371359 -2118647
43110 -2118647 -3085802 -1956207 -373359 -232746 -893746 -696962 150210 220349 -473502
43101 -473502 -654225 -274641 -615779 -1744499 -2033837 -874973 71187 -592034 -1801538
43092 -1801538 -1738165 -547490 178415 -72949 -269505 342972 1281838 1777349 1682658 1229086
43082 1229086 579001 -142675 -765527 -1120292 -1023827 -460227 41795 -272782 -1289207
43073 -1289207 -1836810 -1184254 -100138 346396 381577 847305 1474167 1269087 478213
43064 478213 593746 2058023 3358410 3080339 1749649 844447 883782 1363184 1843047
43055 1843047 2139522 1950869 1245784 690501 820008 1069080 525962 -561860 -1033266
43046 -1033266 -536172 51303 151733 388327 1368197 2413881 2394346 1368523 468794
43037 468794 292955 342525 211672 427904 1535319 2915734 3287916 2228963 582142
43028 582142 -619895 -1075513 -1024819 -747466 -475368 -327939 -86047 544547 1253165 1274475
43018 1274475 536410 -13061 217389 443307 -264441 -1267982 -1086242 311593 1232325
43009 1232325 557443 -854603 -1617798 -1614175 -1469867 -1059873 234719 2017050 2818042
43000 2818042 1882591 257623 -418098 137394 609766 -222102 -1937741 -2891066 -2089126
42991 -2089126 -294100 947915 1058211 762675 845297 1200865 1300912 1075537 960786
42982 960786 1329799 2144564 2977450 3217820 2520829 1249010 241152 -20468 211225
42973 211225 482908 689735 894830 982618 850001 742326 1062231 1857834 2620732 2585467
42963 2585467 1368369 -452858 -1587419 -1318376 -415766 -174078 -658760 -771905 -142678
42954 -142678 145985 -752394 -2012100 -2241595 -1340761 -334719 142064 215197 -45720
42945 -45720 -749305 -1487820 -1421923 -294052 1181843 2060025 1911906 914676 -338556
42936 -338556 -1145296 -1209499 -838148 -437597 -115312 -34081 -596051 -1696554 -2308914 -1596823
42926 -1596823 -104395 921547 1048712 694415 86172 -734080 -1149965 -476125 763520
42917 763520 1267193 809238 479143 836750 1100216 660397 179262 403090 869236 711427
42907 711427 49953 -322623 -164737 108309 207330 169122 -4008 -372965 -890989 -1493561
42897 -1493561 -2066835 -2182305 -1416324 -174381 471090 101873 -613833 -1165739 -1918809
42888 -1918809 -2948162 -3207106 -1956250 -272281 154076 -686731 -1278982 -796467 81453
42879 81453 492706 278828 -569889 -2111412 -3695011 -4072623 -2867455 -1191782 -289160
42870 -289160 -210815 -320862 -445361 -846571 -1472385 -1899723 -1883622 -1538285 -1105128 -825263
42860 -825263 -845583 -1003893 -938879 -629206 -508826 -772458 -939684 -544095 35003 -9003
42850 -9003 -759537 -1404346 -1278671 -575300 173498 828447 1431498 1593308 777114 -681825
42840 -681825 -1431873 -491406 1412141 2384787 1282649 -1253108 -3634684 -4719100 -4308125
42831 -4308125 -2920026 -1486564 -820210 -865857 -765588 -75224 516114 269707 -279751
42822 -279751 -15894 986750 1503091 1033385 445311 376232 230481 -470951 -892961 -246209
42812 -246209 499892 -167454 -1726887 -1999279 -340992 1195293 681201 -1051348 -1760155
42803 -1760155 -838618 358072 702387 361534 -180009 -734343 -852914 -5252 1213450
42794 1213450 1318744 123530 -498350 855002 2764073 2627295 163870 -2254903 -2680588
42785 -2680588 -1492119 -27689 1152495 1955825 1979052 1078046 -11866 -509937 -514344
42776 -514344 -418498 -89360 539591 740879 -47722 -986711 -748224 537246 1422065 1184606
42766 1184606 535370 142470 -307428 -1105290 -1649538 -1304600 -408538 260868 493158
42757 493158 528110 420024 108877 -270803 -670809 -1302079 -2013034 -1993395 -791536 755470
42747 755470 1383609 948188 330826 12137 -318328 -701317 -491927 531679 1381075
42738 1381075 836762 -1108816 -3277333 -4553656 -4683178 -3989871 -2810307 -1362602 70065
42729 70065 1085491 1412553 1208849 943279 839013 598672 -57619 -749304 -772825 -64839
42719 -64839 666888 885960 795048 758887 712431 517945 399154 497392 430760 -62746 -408709
42708 -408709 69703 907269 925936 -52732 -879055 -706081 -15792 407520 584303 737690
42698 737690 458328 -544570 -1500644 -1559762 -1314355 -1997092 -3248820 -3181101 -1072300
42689 -1072300 1360495 2188097 1691263 1520301 2240601 2986506 3173360 3217827 3459441
42680 3459441 3488805 2943556 2166546 1605121 1136717 459768 -278696 -717593 -851983 -939009
42670 -939009 -1032127 -998475 -859916 -740052 -556979 -166584 167798 -142071 -1234859 -2355946
42660 -2355946 -2510690 -1546347 -346915 115334 -276415 -909975 -1279668 -1365167 -1260582
42651 -1260582 -897584 -354979 -87508 -455782 -1164788 -1525008 -1230144 -567562 116411
42642 116411 802343 1545576 2130921 2201856 1662252 851860 332616 443087 964535 1313424
42632 1313424 1211157 1027424 1201825 1457136 1031118 -219411 -1367385 -1362161 -218363
42623 -218363 1015252 1372829 816792 -4263 -601180 -1085022 -1783034 -2589271 -2941104
42614 -2941104 -2508458 -1655340 -983840 -595771 -121520 615549 1317125 1576782 1221320
42605 1221320 344681 -620967 -927341 -117363 1303488 2295803 2486459 2364022 2134727
42596 2134727 1214956 -576191 -2052306 -1836691 -210424 1131601 1119099 279699 -354732
42587 -354732 -437125 -132592 452254 1178416 1743024 2077332 2420774 2633579 2048841 606354
42577 606354 -471041 -65755 1105266 1272420 136432 -614777 219142 1504221 1383865
42568 1383865 -22215 -842036 -167699 813537 744840 -18295 -233761 329148 854475
42559 854475 964767 1127348 1512383 1460846 555804 -488271 -657641 27555 672550 823016
42549 823016 930796 1422736 1949199 1956443 1611729 1591790 2005397 2068522 1105506 -466999
42539 -466999 -1539851 -1538582 -812831 170395 1440663 3023302 4301071 4467137 3476361
42530 3476361 2034708 728667 -273550 -705897 -177884 1042194 1930671 1913647 1586411
42521 1586411 1604157 1461221 361418 -1053075 -1146475 351220 1675840 1346379 125854
42512 125854 -260085 418848 941210 735829 530123 758714 661375 -360707 -1452849
42503 -1452849 -1330992 -123529 758682 492599 -225217 -287108 372716 788602 180977
42494 180977 -1143404 -2130903 -2106795 -1413014 -813904 -472293 46413 774477 1008913 314595
42484 314595 -737646 -1387138 -1728247 -2217342 -2557042 -2031001 -816583 13626 -115996
42475 -115996 -760692 -1402578 -1948953 -2094202 -1299649 104367 850280 445114 -26582
42466 -26582 389304 1030007 930986 651721 1266673 2188685 1846941 394131 -211612 766631
42456 766631 1581769 676070 -956461 -1406401 -686189 -341330 -903917 -1430402 -1408392 -1496292
42446 -1496292 -2083044 -2517964 -2354205 -2187013 -2466287 -2451189 -1367516 97851 647636
42437 647636 324995 328737 958312 1108795 153146 -942686 -1077568 -539316 -194659 -64866
42427 -64866 204183 207388 -550146 -1338808 -1037649 -63654 90238 -737391 -1094070 -358536
42417 -358536 239441 -278110 -1127919 -1323068 -1281817 -1707895 -2141807 -1913470 -1412290 -1136109
42407 -1136109 -665412 49105 -205725 -1711292 -2193298 166882 3218514 3300941 667349
42398 667349 -820943 472811 1870441 1020960 -672865 -972476 -359716 -471138 -1092093
42389 -1092093 -1042531 -505993 -271600 58903 996739 1507881 637396 -281094 554690 2185788
42379 2185788 2062139 46807 -1387582 -1027015 -410987 -911788 -1649030 -1333649 -357927
42370 -357927 166398 147599 137445 143554 -137990 -479580 -333640 403195 1272170 1649445
42360 1649445 1178675 214206 -253320 328787 1259090 1523982 1243912 1229603 1374333 724582
42350 724582 -848402 -2295125 -2883596 -2896503 -2644420 -1976571 -1074613 -579704 -570374 -497432
42340 -497432 -402095 -937672 -1784965 -1466927 482833 2378894 2360970 607416 -1291014
42331 -1291014 -2358403 -2750584 -2883922 -2903486 -2691621 -1949272 -657171 442670 577250
42322 577250 220789 595228 1750893 2453671 2272160 2181523 2478533 1874290 -227272
42313 -227272 -2188318 -2333450 -1326927 -780788 -705054 -87511 1001994 1738004 2157872
42304 2157872 2596919 2257971 369840 -1789524 -2179871 -988270 -157175 -128522 536198
42295 536198 2120622 2878914 1948924 865908 1054182 1739293 1640520 1063093 860947
42286 860947 730229 122655 -238625 582914 1899422 2215402 1445757 860328 1056257
42277 1056257 1344827 1120013 610217 121000 -416253 -851750 -635354 364205 1453964
42268 1453964 1930094 1896375 1902699 2027844 1738417 693161 -592552 -1151595 -627991 362985
42258 362985 1083606 1487036 1794758 1714070 861343 -246862 -621557 -309059 -420413 -1313161
42248 -1313161 -1835153 -1055394 234244 714185 475434 584420 1180979 1354773 873577
42239 873577 707283 1405722 2004492 1294071 -429491 -1687123 -1666443 -1027679 -788808
42230 -788808 -1012801 -998078 -450689 121068 241603 140282 232250 364794 167047 -106540
42220 -106540 167976 889680 1158536 492146 -570062 -1333354 -1701151 -1712772 -1142653 -182611
42210 -182611 217704 -426133 -1109660 -598805 567820 537954 -1267844 -3156266 -3244849
42201 -3244849 -1664310 40925 1049457 1770601 2408760 2214700 750746 -854721 -926828
42192 -926828 583179 1904517 1718116 720347 249225 149482 -816444 -2737844 -4079153
42183 -4079153 -3673611 -2086865 -561028 435402 1061229 1404429 1632315 2119640 2723352
42174 2723352 2586880 1381360 76257 -325189 -169345 -373610 -896493 -1048590 -821693
42165 -821693 -736650 -728830 -398279 -91319 -423024 -885510 -379468 807511 1076910 -71982
42155 -71982 -1170855 -928857 74213 621227 571736 373821 -73481 -882440 -1280672 -535708
42145 -535708 678669 1051919 518583 228110 741164 1381474 1493338 1308439 1240986 1173875
42135 1173875 894249 595956 471977 302103 -53940 -136349 551782 1614293 1978278
42126 1978278 1167604 -25573 -381588 431108 1627271 2288240 2252504 1939339 1598500
42117 1598500 1080076 309280 -335784 -305122 533930 1680592 2394236 2331985 1776108 1149597
42107 1149597 438999 -532324 -1268121 -730366 1199316 2955183 2840105 1130892 -262350
42098 -262350 -204398 592361 1093906 1410940 2050956 2596752 2205660 1098760 551699 1311631
42088 1311631 2697779 3467743 3145211 2291782 1714002 1605735 1506727 1112067 892821
42079 892821 1465583 2383353 2302430 768000 -819646 -733105 989198 2756706 3470253
42070 3470253 3451596 3365351 3190648 2623793 1778499 990182 398143 168864 708817 2104804
42060 2104804 3605549 4236174 3881294 3300324 3084527 3073406 2889435 2550997 2270789
42051 2270789 2034860 1783325 1734213 2035101 2265267 1904937 1309800 1505543 2727789
42042 2727789 3819805 3590622 2282536 1118999 827467 1267692 2099391 2948651 3178139
42033 3178139 2500879 1773612 2150798 3362473 3924376 3314432 2761812 3315350 4228714
42024 4228714 4108589 2825956 1378116 510828 374609 968660 1983808 2659368 2681757
42015 2681757 2763733 3453326 3981726 3473571 2783622 3593670 5758571 7128837 6397474
42006 6397474 4789825 4300649 5313992 6705362 7493955 7606616 7514235 7772675 8603288
41997 8603288 9497935 9601338 8833704 8225947 8805502 10564225 12823404 15118493 17361665
41988 17361665 19675972 22560974 26723371 32150522 37800924 42976892 48755320 57242344
41980 57242344 69510423 85220574 104369771 127855270 154624025 178482610 189890963
41973 189890963 182947023 160807377 133315097 109148398 90882193 77014286 66351037
41966 66351037 58941905 54284630 51039587 48605670 47515117 48253073 50950131 56065996
41958 56065996 63879746 73439932 83821594 96328409 112756053 130334527 140962721
41951 140962721 137970083 122696515 102621034 84112938 69037344 57165111 48419323
41944 48419323 42014347 36034879 29548156 23886369 20628459 19262822 17942671 15823146
41936 15823146 13560382 11933942 10981557 10363029 9807706 9166115 8485019 8018463 7885185
41927 7885185 7866521 7787430 7825358 8108911 8291990 7964406 7299732 6827859 6650104 6347310
41917 6347310 5683976 4950715 4457800 4068862 3514886 2929572 2709082 2878014 2935668 2478555
41907 2478555 1753460 1363685 1551135 2051465 2601483 3189457 3667568 3541691 2566826
41898 2566826 1370553 1009085 1829165 3073916 3708573 3418540 2751448 2536430 3247704
41889 3247704 4635262 5753002 5575898 3953749 1969592 1078459 1745765 3046006 3690193
41880 3690193 3317081 2629936 2406345 2700202 3082160 3312824 3455720 3481183 3161461 2439448
41870 2439448 1625427 1080129 864624 833448 953559 1368417 2129620 2933323 3242661 2833189
41860 2833189 2192533 2069903 2501474 2706418 2318551 2242019 3490254 5354913 5788456
41851 5788456 3993521 1764404 1492679 3300951 4996402 4767810 3150518 2073883
41843 2073883 2503353 3528244 3688832 2755079 1883135 2130544 3249714 4177317 4383723
41834 4383723 4292295 4488181 4996671 5417972 5449625 5218463 5284257 6159174 7548203 8391306
41824 8391306 8173282 7858364 8782454 10863175 12826766 14078782 15259077 16892555 18711239
41815 18711239 20615181 23079970 26118105 29017939 31673434 34851841 38314501 40053608
41807 40053608 38656454 35333436 32218036 29630055 26606496 23302803 20917144 19552451
41799 19552451 18077868 16206287 14984559 14899889 15053889 14735468 14483456 14964037 15913561
41790 15913561 16882034 18126907 20078190 22586474 25307046 28339429 32020902 36464735
41782 36464735 41611619 47397807 53623043 59759609 64768205 67032520 65216637 59891470
41774 59891470 53641834 48545703 44105407 38806518 32973660 28358092 25334515 22614078
41766 22614078 19789835 17928665 17113314 15664929 12890426 10592826 10379015 11102142
41758 11102142 10648434 8978863 7611030 7008984 6321362 5216057 4311321 3939679 3782533
41749 3782533 3639577 3570164 3473356 3339661 3525754 3994062 3869062 2683213 1443339
41740 1443339 1387827 2226630 2704012 2374763 1703724 975980 346218 432204 1508386 2549761
41730 2549761 2441975 1693337 1505578 1683495 1222914 560104 1118251 2618072 3096253
41721 3096253 2079850 1549081 2805778 4344932 4153329 2564084 1352957 1164299 1308045
41712 1308045 1260258 977497 354086 -377551 -257386 1181689 2778780 3045089 2242129
41703 2242129 1952486 2814746 3920412 4422493 4539561 4748821 4990872 5027316 4834461
41694 4834461 4333722 3374470 2284660 1874085 2533669 3686375 4362041 4056133 2988912
41685 2988912 1908615 1689465 2687462 4375049 5943775 7221654 8518403 9668577
41677 9668577 10023265 9602001 9454964 10417840 12176663 14123225 16454235 19599212 23077477
41668 23077477 25961486 28227058 30510385 32511696 32843892 30825128 27353107 23524145
41660 23524145 19524216 15635594 13090819 12541808 12493927 10929765 8158693 6350886
41652 6350886 6267823 6289829 5114254 3604474 3060065 3254366 3431646 3891373 5037759
41643 5037759 5893661 5317374 4054710 3789598 4506416 4608620 3559959 2549480 2322346
41634 2322346 2184136 1671514 1442130 1684044 1298426 -175319 -1244218 -509770 1060268
41625 1060268 1515828 830157 686949 1703303 2634773 2517574 2045802 2243639 2926147
41616 2926147 3228433 2930367 2549258 2517716 2777560 2936536 2542307 1503916 458457
41607 458457 362252 1473335 3051847 4233234 4778536 4748758 4008974 2593095 1203581
41598 1203581 687437 1058754 1535511 1554131 1306754 1220273 1348933 1475188 1484043 1392215
41588 1392215 1195899 882952 474379 -29257 -534940 -614330 258405 1914989 3224485
41579 3224485 3105117 1776920 608090 664327 1731227 2801379 3143257 2741688 2028245
41570 2028245 1456629 1216967 1208912 1324132 1644051 2112134 2190419 1404646 268658 -35479
41560 -35479 765883 1432670 759099 -766763 -1586619 -1073944 -106599 321299 266406 366918
41550 366918 791205 1086253 872357 381058 233929 682546 1176284 1009487 435180 548625
41540 548625 1694622 2646212 2133664 719380 127011 895675 1845984 1972456 1656162
41531 1656162 1543374 1351950 632022 -101482 -31766 577733 661949 -82067 -757317 -513522
41521 -513522 391270 983713 644716 -348867 -1080716 -770133 413969 1323263 986381
41512 986381 -130463 -425893 1025823 3270487 4451995 3846492 2466752 1607687 1364908
41503 1364908 1022531 461731 354220 954123 1590115 1757089 1931381 2632851 3323902
41494 3323902 3147399 2312500 1688458 1301463 495478 -434144 -247512 1125701 1903678
41485 1903678 873233 -586402 -208134 2035957 3890331 3759682 2453183 1779424 2405227
41476 2405227 3559397 4181045 3831227 2815028 1846388 1505531 1815021 2362776 2802527
41467 2802527 3061788 3122434 2901094 2423086 1890836 1494626 1323543 1506533 2219946 3394618
41457 3394618 4523612 4963331 4517563 3682962 3210006 3365268 3709302 3688287 3331109
41448 3331109 3181021 3595738 4321714 4769159 4572320 3917410 3426877 3597852 4231865
41439 4231865 4631672 4494117 4217477 4088083 3806394 3408066 3902706 5858087 7817739
41430 7817739 7647156 5502627 3934665 4656558 6710274 8485288 9991892 12001315
41422 12001315 14258454 16056428 17729725 20060546 22788519 25229657 28017610 32702788
41414 32702788 39689250 47944038 56844916 67074265 79375789 93203467 106513065
41407 106513065 116040864 118258489 111695877 98754443 84189582 71465220 61231829
41400 61231829 52912137 46172085 40651510 35871396 32063639 29908576 29020580 28033173
41392 28033173 26693946 26367961 27704507 29397311 30393270 31828726 35261020 40212971
41384 40212971 45251273 50617744 57883368 67535867 78821152 91530139 105540775 118181046
41376 118181046 124340697 120690354 108875334 93699172 79064659 66436868 56090404
41369 56090404 48174063 42415951 37788745 33119926 28097838 23580901 20635677 19039915
41361 19039915 17169532 14006762 10841721 9843763 10982957 11754795 10411036 8070481
41353 8070481 6714859 6382294 5801546 4922615 4933749 5908581 6273353 5129478 3686625
41344 3686625 3581545 4774178 5944763 6200195 5532648 4241347 2872233 2291410 2804898
41335 2804898 3441173 3089053 2187541 2182093 3272241 3969705 3355097 2575313 3177603 4800891
41325 4800891 5699092 5169402 4268660 4109350 4504809 4627779 4207285 3587142 3105309
41316 3105309 2881042 2915554 3034187 2930196 2547687 2272983 2540782 3360193 4342033 5095531
41306 5095531 5608247 6367920 7899372 9793038 10454060 8615476 5194715 2763561 2739645
41297 2739645 3871018 4102451 3175272 2434596 2591220 2918843 2678329 2211356 2209753 2666697
41287 2666697 3058563 3105726 2927358 2743611 2754103 3088595 3612035 3916352 3674723 2943288
41277 2943288 2131809 1790209 2234100 3090358 3456951 2991831 2622491 3525132 5568942
41268 5568942 7620817 9311791 11315085 13531998 14309207 12438481 9077300 6540361
41260 6540361 5661912 5428098 4865368 4105797 3619910 3466375 3477725 3381714 2675728 1208421
41250 1208421 -89087 -19327 1176656 1941406 1498237 720420 432277 68157 -1041360
41241 -1041360 -2063845 -1660864 -60771 1195350 1410782 1395088 1892456 2514095 2595120
41232 2595120 2156094 1503502 636660 -355393 -909724 -681980 -218973 -235696 -455477 84149
41222 84149 1572507 2984650 3345840 2873939 2440652 2300546 1966613 1225979 587151
41213 587151 478787 560722 310324 -64345 74969 698027 968717 335664 -777772 -1570113
41203 -1570113 -1666418 -1109625 -72766 1049965 1665448 1469678 637467 -598437 -1963821
41194 -1963821 -2535991 -1125651 1937796 4284386 4008244 2165202 1350034 2088225 2394847
41185 2394847 1114412 -251343 -17394 1032819 1033590 18996 -315469 592537 1473186
41176 1473186 1475159 1409999 2070226 2687837 2165205 957274 455852 883655 1065901 349782
41166 349782 -402136 -184384 679946 1155539 1012030 890719 1123640 1342277 1266381 1101563
41156 1101563 975814 663376 110720 -423825 -1030237 -2168106 -3550838 -3848420 -2336279
41147 -2336279 -198885 843266 792048 1101381 2319308 3249789 2683179 916638 -811352
41138 -811352 -1548420 -949060 775534 2713591 3684515 3309062 2290403 1496652 1290119
41129 1290119 1730250 2581728 3019146 2336587 1181703 950729 1626936 1599467 265290
41120 265290 -746335 -87356 1030335 700113 -651279 -1053295 -137145 600959 453492
41111 453492 317652 675379 768381 345592 406082 1350950 1993835 1465672 708416 819011
41101 819011 1093632 233383 -1314458 -1868586 -1019135 -61909 65659 -170154 -229274 -531400
41091 -531400 -1409759 -2003352 -1271832 239227 684086 -827021 -2933510 -3465843 -1932504
41082 -1932504 -77694 124509 -1338450 -2649474 -2342949 -920412 -76768 -565070 -1275468
41073 -1275468 -633029 1349272 2897767 2520303 790243 -398460 -113921 801625 1234479
41064 1234479 1224806 1418474 1850535 2055740 1922913 1613424 986162 37152 -341139 814439
41054 814439 2886520 4011550 3422389 2389721 2276588 2702522 2527523 1813504 1613277
41045 1613277 2249569 3078503 3908352 5396169 7669653 9596294 10088294 9431422 8596623
41036 8596623 7787949 6574865 5149079 4339637 4227986 3790876 2470454 1268460 1431108
41027 1431108 2575638 3147846 2554388 1779866 1764314 2182127 2244504 1867691 1444150 1071413
41017 1071413 663358 429896 660711 1268054 1919500 2344129 2312297 1832689 1584119 2379170
41007 2379170 3802812 4339647 3542052 3019399 4158864 5781187 5576391 3338638 1123566
40998 1123566 378114 612068 1061489 1938047 3369928 4482453 4453641 3627079 2837252
40989 2837252 2306862 1831117 1455602 1345504 1339191 1079309 434615 -280452 -334205 825465
40979 825465 2531223 3053374 1694352 89040 131974 1238085 1434218 711432 939763
40970 939763 2373348 2936779 1782485 858197 1512775 2112286 1063418 -81132 844495
40961 844495 2741334 2884361 1308644 460389 1068906 1513912 1204732 1408206 2228791
40952 2228791 1828564 -245369 -1644491 -641147 1259714 1835954 1368762 1398457 1812089
40943 1812089 1441043 634667 900532 2223558 2832546 1899501 767335 905826 1920576
40934 1920576 2340521 1535107 97195 -1161671 -1868905 -1923201 -1267603 8547 1557868
40925 1557868 2919328 3793981 4176933 4222961 4017404 3536100 2818597 2107870 1791481
40916 1791481 2175115 3205638 4418086 5372237 6195723 7361660 8775789 9555176 9090478
40907 9090478 7859237 6636540 5387396 3752719 2223883 1685149 1854889 1453903 229446
40898 229446 -443673 345344 1458374 1250606 -44468 -676931 183015 1522141 2038210
40889 2038210 1634227 1053548 757970 669386 664596 839161 1279180 1798255 2020259 1748314
40879 1748314 1185963 663041 213718 -280237 -523212 133175 1760970 3374163 3870399
40870 3870399 3324240 2912439 3560881 4999755 6208463 6571274 6533251 7178957 9059416
40861 9059416 11351095 12393409 11261627 8643256 6020020 4291680 3448118 3156136
40853 3156136 3096059 2928945 2549555 2324261 2533973 2680584 2052453 992556 719782
40844 719782 1572978 2326207 1889742 919510 790624 1498482 1777054 1160978 639706 978193
40834 978193 1595872 1749899 1771228 2168426 2351941 1528993 382949 381556 1454317 1889116
40824 1889116 943839 73464 659412 1774951 1578342 151385 -662202 -42843 766240
40815 766240 501716 -405548 -807969 -463667 169565 971712 1989997 2693487 2430579
40806 2430579 1491045 807254 602017 214620 -572194 -935411 -209433 1020357 1681641
40797 1681641 1641018 1646159 2032768 2225429 1649964 612554 10219 412371 1550512 2525022
40787 2525022 2501916 1451387 218968 -335116 -158690 304781 952964 1886041 2571228
40778 2571228 2137999 823626 157558 1022877 2310026 2385257 1289612 400059 300527
40769 300527 259904 -206407 -548917 -319796 -15705 -191366 -534051 -485654 -206331 -237165
40759 -237165 -577949 -753026 -625464 -585291 -898643 -1251650 -1130671 -550034 -137449 -236165
40749 -236165 -128823 1123601 2932936 3360491 1804183 387501 1242185 3263570 3556514
40740 3556514 1729163 340576 774562 1253200 90491 -1430685 -1267811 76846 627676
40731 627676 133996 -8518 678123 1385213 1827743 2428727 2839091 2161584 758795
40722 758795 172686 1019542 2373388 3347206 3873851 3831778 2918257 1687443 1323171
40713 1323171 2000766 2664726 2664470 2388489 2123667 1648621 1177115 1263718 1487332 765694
40703 765694 -640932 -1116899 -256382 345412 -254387 -729652 159920 1255259 812000
40694 812000 -575088 -868453 239520 1057264 685822 235355 809516 1664625 1200963
40685 1200963 -865140 -3014777 -3490466 -2028947 38895 1333009 1757287 2000379 2152846
40676 2152846 1696852 768247 315794 708251 1202740 1213623 1097854 1188369 1132483 837476
40666 837476 963854 1675874 2023182 1537710 1304755 2208502 3156039 2567234 867571
40657 867571 -122246 236115 1057793 1791831 2666870 3344461 2875801 1353518 199730
40648 199730 364005 1333048 2212060 2681753 2596144 1762816 555006 -197614 -283760 -235184
40638 -235184 -233828 68440 481220 279214 -379398 -406263 259611 120152 -1443250 -2553604
40628 -2553604 -1161626 1873003 3673251 2962595 1242903 385939 530578 761258 653949
40619 653949 424284 268378 250182 465428 835931 1037938 991579 1086350 1534217 1843727
40609 1843727 1465428 739107 542284 979042 1123009 411618 -296452 249568 1835586
40600 1835586 2785177 2037237 523710 -66492 557008 1125832 700016 -108526 -116372 832489
40590 832489 1810238 2069409 1772038 1459091 1296548 1071941 674555 338866 456510 1173269
40580 1173269 2062218 2287970 1419044 89700 -579523 -356752 -157858 -617722 -1065231
40571 -1065231 -610959 317752 588156 215231 299029 1042542 1287360 543364 40188 786709
40561 786709 1840512 1840921 1271521 1556290 2513246 2541912 1246989 122241 298674 1082722
40551 1082722 1264915 726860 189874 230993 942819 1859527 2115492 1466512 981715 1613450
40541 1613450 2374379 1561064 -273032 -634045 1151878 2689375 2067657 576637 320790
40532 320790 945406 769751 -124390 -196255 827382 1617178 1399133 708438 109384 -310049
40522 -310049 -239729 661764 1870654 2461510 2404005 2396689 2677150 3026574 3525274 4116420
40512 4116420 3900915 2255397 263007 -465785 -105133 -184573 -1092814 -1728399 -1576050
40503 -1576050 -1313699 -1165296 -459027 735805 1224666 568801 -125616 42936 559511
40494 559511 650910 381269 -19946 -666316 -1213725 -778629 681458 2064420 2750161
40485 2750161 3230423 3560636 2784784 842528 -544157 -200479 665289 466076 -161410
40476 -161410 404812 1814872 2127061 868984 -280990 -99082 624283 716767 409280
40467 409280 567028 1049433 935280 107163 -345478 410596 1631032 1746127 418716
40458 418716 -816515 -439458 1057033 1901884 1515361 1127642 1793593 2941513 3408754
40449 3408754 2949425 2044819 1049802 299148 349345 1237406 1997938 1724940 706959
40440 706959 -186058 -721978 -1086365 -960521 94326 1511250 2029605 1263903 172802
40431 172802 -219676 63051 331091 201438 -131808 -339858 -366730 -342725 -182053 462049
40421 462049 1564879 2320486 1986355 1061114 798062 1404143 1679644 848954 -279367
40412 -279367 -696602 -755227 -1279889 -1865336 -1402850 13652 1039008 959855 461093 315229
40402 315229 374145 264409 179405 400322 672676 669640 631370 939111 1358177 1348624 992778
40391 992778 904651 1099779 708895 -654975 -1829198 -1338136 464298 1614981 1207436
40382 1207436 680172 1665930 3578288 4535543 3955331 2799641 1725209 647448 -35591
40373 -35591 389370 1356746 1400370 572425 642235 2164492 3261235 2457930 932662 447163
40363 447163 660727 356449 51 854052 2333669 2538478 1193071 17531 116856
40354 116856 820021 1334848 1878908 2690627 3263075 3121833 2434787 1530704 603892 -18763
40344 -18763 -134635 -140127 -409229 -428500 422801 1503195 1563776 620165 -150433 -293163
40334 -293163 -420412 -659623 -340920 494530 838769 449893 381399 1180425 1932486 1818760
40324 1818760 1367748 1369923 1668064 1791291 1727431 1354831 260820 -1067181 -1098292 635772
40314 635772 2368174 2207646 513241 -1006618 -1627408 -1658625 -1009604 557708 2118392
40305 2118392 2284463 1290169 846466 1636551 2387511 1985611 1209109 1390456 2236351
40296 2236351 2210271 857594 -366090 63437 1759196 2918832 2584190 1691222 1612403
40287 1612403 2276768 2476609 1834572 1525918 2696607 4853000 6428613 6598758 5931429
40278 5931429 5379188 5216545 5106084 4792723 4368474 3902369 3154748 1963388 805923
40269 805923 495628 1130318 1818532 1822816 1509764 1619376 2045786 2136134 1924798 2151849
40259 2151849 3080793 4119017 4650574 4524490 3796213 2836325 2638083 4018890 6395641
40250 6395641 8256335 8903122 8785003 8200266 6968424 5513786 4833122 5002917 5088371
40241 5088371 4903684 5310710 6298141 6624026 6226796 6994777 9780573 12562690 13361398
40232 13361398 13211944 13994471 14827452 13413829 10089035 7527984 6638870 5657857 3596396
40223 3596396 1789482 1260485 1088226 517522 468130 1568802 2592134 2385468 1772864
40214 1772864 1931281 2260721 1631456 643688 738736 1757627 2231791 1709035 1061209
40205 1061209 715721 329197 219024 1313435 3249564 4165803 3215772 1998402 2446278
40196 2446278 4246068 5558998 5720668 5911317 7245631 9401156 11428372 12917451
40188 12917451 13770358 13573640 12083653 10040004 8659707 8325271 8408632 8322183 7966933
40179 7966933 7140399 5543289 3730025 2962658 3409277 3505170 2110416 353564 -40818
40170 -40818 529500 315338 -668922 -469151 1545630 3371261 3271524 2191158 1952103
40161 1952103 2534388 2773507 2625671 2862223 3171454 2516597 1213280 817165 1728036
40152 1728036 2529347 2202728 1596979 1942273 2959154 3316063 2341432 591164 -854179
40143 -854179 -1175982 -333453 797122 1192123 878836 889733 1766763 2756196 2947251 2588086
40133 2588086 2603285 3230142 3862627 4021486 3785910 3358462 2868401 2647387 3060188 3816107
40123 3816107 3947262 2899103 1421614 922624 1878751 3235972 3622359 2898834 2060634
40114 2060634 1705214 1334790 517110 -33567 603783 1971195 2678400 2344960 1916814
40105 1916814 1855851 1324604 -161281 -1432760 -1082178 582382 2083711 2690713 2650767
40096 2650767 2015623 621934 -879130 -1319433 -527480 538969 1286239 1957774 2456698
40087 2456698 2064895 874288 229235 938030 2104347 2609589 2711108 3069890 3173521
40078 3173521 2221782 990191 1118400 2617897 3712283 3503999 3323523 4629138 6667490
40069 6667490 7351366 5976712 3987489 3012025 2969326 2558790 1227397 -32087 -77917
40060 -77917 697706 814727 -223808 -1208394 -943003 189734 1084512 1522017 1890655
40051 1890655 1954799 1259898 446645 651362 1579052 1713625 732191 126670 809693 1649352
40041 1649352 1365435 523237 374342 803689 883791 692024 1047721 1917575 2561830 2968535
40031 2968535 3677628 4331775 3926335 2611330 1781126 2026791 2333526 1824144 1075965
40022 1075965 991463 1375672 1492704 1311074 1330777 1612910 1729307 1469926 1108613 1104377
40012 1104377 1732674 2722116 3217730 2625418 1530273 1062924 1279105 1132112 310123
40003 310123 -108033 511184 1092980 547219 -256093 330903 2115555 3169522 2428904
39994 2428904 798806 -398304 -744002 -273623 929453 2118818 2035865 522754 -817419
39985 -817419 -434978 1232853 2431792 2274363 1438403 893398 712082 247492 -958305
39976 -958305 -2542596 -3457376 -2938299 -1516970 -653565 -981991 -1405217 -590608 1041505
39967 1041505 1798975 1119461 359518 749291 1558299 1217677 -295723 -1362230 -1017975
39958 -1017975 -265604 -562838 -1748706 -2305385 -1397360 207927 1322433 1660215 1630511
39949 1630511 1471284 1230505 1231254 1773576 2416659 2277099 1220863 184147 70840 851086
39939 851086 2010882 3266794 4318732 4442436 3138065 1024014 -613647 -1149801 -961850
39930 -961850 -581399 -206704 -23945 -184062 -284376 307001 1301935 1512139 497011
39921 497011 -654753 -860282 -514013 -499289 -529460 221530 1355584 1687315 1307146 1521655
39911 1521655 2491029 2683221 1381457 48974 56779 559787 188104 -390467 408621
39902 408621 2138146 2715908 1650224 705309 1003847 1511757 1154658 549979 481666
39893 481666 278933 -785925 -1727613 -1181374 308521 1070562 877026 945970 1544205
39884 1544205 1461890 249727 -681144 -19402 1584867 2575817 2575223 2400275 2512856 2517126
39874 2517126 2138769 1807595 1944564 2194993 1860079 959385 365628 642825 1134316
39865 1134316 794025 -186253 -409878 756303 2073731 1987867 677254 -341015 -255997
39856 -255997 366547 761981 806339 650308 390536 209598 150815 -172140 -890439 -1159332
39846 -1159332 -177813 1244812 1462329 392190 -308406 241323 1024512 1133823 1292833
39837 1292833 2323734 3457830 3480933 2553164 1608433 823417 -12703 -427054 4502
39828 4502 511244 197563 -259484 473885 2123601 3025702 2452685 1242648 221174
39819 221174 -476229 -513468 593319 2249117 3045510 2614557 1951138 1665521 1335437
39810 1335437 899125 1087568 1846343 1870664 596023 -718254 -912346 -698090 -1345650
39801 -1345650 -2649983 -3474740 -3487932 -3067867 -2182480 -746995 387207 262937 -515251
39792 -515251 -314227 1182247 2344887 1709672 -182465 -1605220 -1739209 -1316263 -1316726
39783 -1316726 -1580050 -1090232 447737 1893064 1983215 948743 64947 -148259 -260511
39774 -260511 -498549 -226076 766693 1613010 1619750 1192264 922322 749241 634844 954122
39764 954122 1477199 1189784 53225 -395135 582405 1341433 291338 -1347103 -1313256
39755 -1313256 58740 390889 -918099 -1932496 -1439356 -597942 -646662 -1013560 -741477
39746 -741477 -203732 -267288 -865114 -1351863 -1423571 -1008170 -88633 831364 961907 371001
39736 371001 -16907 105351 46010 -417083 -450018 345198 1074445 965507 554431 630080
39726 630080 962290 927005 568250 281607 191509 398170 962799 1211113 216456 -1473042
39716 -1473042 -1957644 -598487 950408 1267374 1119096 1616595 2065747 1408134 409875
39707 409875 371026 740417 213716 -629263 -166223 1274976 1725880 799816 226771 916587
39697 916587 1707744 1561560 1010933 757358 580280 330778 418000 666609 237833 -701259
39687 -701259 -828074 151401 838353 480891 271186 1222664 2338237 2198158 1043969
39678 1043969 -19801 -662383 -849557 -11857 1737976 2647496 1348972 -905376 -1739182
39669 -1739182 -819154 131132 21360 -622266 -1124955 -1419285 -1318148 -557439 286468
39660 286468 250976 -492758 -781839 -207528 486857 803704 985204 974768 276071 -797967
39650 -797967 -1069508 -231984 526387 243675 -524129 -805322 -671187 -830040 -1460275 -2139707
39640 -2139707 -2441563 -2133084 -1272571 -395376 -24976 132818 725038 1416496 1133392
39631 1133392 -92737 -823124 -289191 580192 951798 1421497 2408538 2682473 1177902
39622 1177902 -783425 -1017898 403777 1522446 1580690 1628318 2055459 1775514 451227
39613 451227 -519361 -270338 18046 -797669 -1680346 -1044254 441925 632775 -795442
39604 -795442 -1697185 -484627 1690471 2592658 1754754 661990 559205 1120970 1345309
39595 1345309 887135 60932 -884738 -1784636 -2100846 -1299414 164586 1002166 618081
39586 618081 -182149 -506588 -646352 -1204214 -1636173 -927831 535192 1183838 529778
39577 529778 -115197 335841 1209240 1301312 614730 -91204 -699666 -1576369 -2455057 -2557403
39567 -2557403 -1687191 -381592 871409 1787371 1856087 719392 -934181 -1742630 -1278332
39558 -1278332 -629974 -977018 -2097326 -2812830 -2612051 -2182053 -2249101 -2469800 -1991785
39549 -1991785 -891579 -270771 -622245 -861576 222850 2047653 2852054 2077667 919590
39540 919590 420907 396950 656752 1738886 3469487 4185488 2833552 864664 438964
39531 438964 1396685 1696707 494046 -966591 -1458528 -1061778 -167186 1134152 2207905
39522 2207905 1968221 521140 -572323 -415907 49232 -175036 -409811 466028 1944933
39513 1944933 2459368 1653368 821377 1050468 1881055 2070922 1121054 -241972 -902308
39504 -902308 -536884 105439 216427 -30433 55002 376569 86032 -953212 -1705719 -1407131
39494 -1407131 -589315 -63921 286139 895020 1385938 1051759 97089 -513458 -267570
39485 -267570 567599 1606472 2579008 3066000 2765683 2012072 1431693 1148415 854428
39476 854428 481863 183103 -140522 -534399 -393613 868288 2496685 2806727 1350725
39467 1350725 -239000 -271988 834685 1329577 641731 -37832 211020 578356 -179044
39458 -179044 -1725332 -2505168 -1919998 -1026026 -807204 -810687 -187250 742535 971601 392724
39448 392724 -181646 -392458 -632940 -966314 -865926 -306934 -96318 -643734 -1236204 -1077581
39438 -1077581 -397210 -12134 -298440 -978900 -1434574 -985018 511160 2089315 2430438
39429 2430438 1447430 332610 -207967 -726238 -1605210 -2067711 -1461601 -535519 -390008
39420 -390008 -869337 -992471 -418611 416174 1102226 1385748 1028561 260906 -219137 -291003
39410 -291003 -610308 -1150955 -779570 724171 1600037 530632 -1115165 -1276836 -366350
39401 -366350 -299177 -1193328 -1520737 -1162080 -1622448 -3016404 -3449069 -2081727 -487684
39392 -487684 -19652 73125 773525 1455775 1272718 795853 841117 958807 499217 70733
39382 70733 529558 1412945 1693485 1330493 878808 316008 -548430 -1210110 -1202628 -1020973
39372 -1020973 -1153468 -935500 296115 1570083 1356696 -85418 -998142 -648067 -59191
39363 -59191 -117692 -386851 -206511 238453 512246 668713 826098 714621 196795 -300399
39353 -300399 -349501 -75100 259470 754894 1476760 1955060 1735320 1261478 1477005 2393217
39343 2393217 2747865 1612282 -134221 -747218 99678 944516 683160 39245 234388
39334 234388 1166202 1954164 2490339 3055427 2967620 1376061 -713234 -1107121 495893
39325 495893 1884350 1469873 324412 109866 622655 771164 630713 882747 1179363
39316 1179363 765586 98758 223079 942954 1153503 725390 597182 1118477 1659317
39307 1659317 1822273 1796103 1549217 883304 258897 376095 958311 1140197 997415 1373734
39297 1373734 2176303 2304704 1514325 881330 952733 843844 -125310 -1133587 -1075878 -138973
39287 -138973 684496 926663 764234 472229 408391 905353 1583007 1434497 207529 -988469
39277 -988469 -1124641 -609425 -415831 -487982 6907 1197971 2237246 2414854 1829130
39268 1829130 1008577 442818 400035 702342 768599 287042 -310572 -405625 26229 562934
39258 562934 915579 888476 170443 -1138484 -2035656 -1446127 407493 2062127 2341169
39249 2341169 1412584 351909 101762 853462 2007194 2663118 2413070 1587169 580889
39240 580889 -611624 -1762355 -1935861 -594785 1182429 1777145 1251021 1152312 1903316
39231 1903316 1979982 521351 -772179 99145 2218142 2701285 655834 -1667109 -2051507
39222 -2051507 -1013383 -454361 -869220 -1133099 -444193 733426 1549592 1681876 1264590
39213 1264590 507859 -419586 -1361962 -2032954 -1888214 -569419 1278322 2211027 1561889
39204 1561889 347041 -63704 268549 246291 -437778 -951415 -758098 -313592 -103785
39195 -103785 67204 492377 1068867 1686688 2308315 2419237 1407127 -85675 -354831
39186 -354831 1017432 2113820 1177553 -717985 -1057588 476150 1515331 388194 -1596603
39177 -1596603 -2003583 -277307 2051871 3413818 3414539 2430780 1108554 305049 586764
39168 586764 1422563 1522792 425418 -764642 -775229 114891 549297 102626 -195001
39159 -195001 417352 1207238 1132162 421711 -7417 -138227 -633212 -1295932 -1145124 -184559
39149 -184559 255898 -511292 -1374448 -1024028 170437 793423 308035 -530000 -842758
39140 -842758 -491762 19574 2581 -811953 -1798476 -1966409 -1220548 -480702 -245540 104078
39130 104078 1035115 1866864 1886951 1556472 1526858 1275569 78296 -1246848 -1150678 259938
39120 259938 1179166 617714 -361709 -269885 1032232 2550092 3234503 2538415 775921
39111 775921 -746642 -776809 361370 1020201 279240 -1029339 -1657249 -1482651 -1233767
39102 -1233767 -1346067 -1650916 -1752678 -1281197 -148735 1112617 1650767 1227350 506417
39093 506417 191287 268203 355385 399924 649013 1107372 1338761 893596 -58610 -659777
39083 -659777 -299422 377050 93407 -1128524 -1602613 -301444 1403746 1566183 471987
39074 471987 -19892 471289 457030 -581339 -1010374 450465 2694253 3847617 3677217
39065 3677217 3136833 2490591 1302126 -191218 -1001975 -688112 99217 426149 -899
39056 -899 -660758 -776455 -264679 -64390 -950370 -2134233 -2038844 -580340 577056 481747
39046 481747 205280 828815 1502289 888591 -481231 -946634 -238058 414785 462610 645190
39036 645190 1268450 1452869 686546 -107716 119082 996949 1380392 1049526 858475 1259602
39026 1259602 1484695 603823 -959928 -1573013 -241071 2064936 3365465 2788630 1212835
39017 1212835 -133822 -993314 -1727910 -2302727 -2213234 -1233871 134552 933798 480347
39008 480347 -859516 -1678049 -840664 1135413 2572972 2561624 1727681 1036093 738202
38999 738202 779848 1244236 1822362 1718386 761047 -128645 -218958 51784 52819 61228 505538
38988 505538 901827 596896 -53265 -349442 -565185 -1400794 -2470802 -2578381 -1429410
38979 -1429410 -18363 715044 747638 524393 450513 801586 1448784 1758921 1338457 610369
38969 610369 89512 -406279 -1079740 -1351640 -788152 -223797 -653163 -1461708 -1247604 -113591
38959 -113591 518626 311432 421232 1253870 1670787 1078472 545861 835467 892779 -344084
38949 -344084 -1843313 -1785577 -264673 886097 682898 -8255 -105985 252205 267658 -319889
38939 -319889 -1010520 -1133970 -452901 558290 975024 209536 -1423009 -3035184 -3912284
38930 -3912284 -3793240 -2779721 -1406323 -559256 -726249 -1322861 -1300296 -505100 151636
38921 151636 115054 81150 821379 1649033 1174685 -416506 -1139183 108290 1785112
38912 1785112 1791298 448658 -202197 365492 621987 -160696 -654949 26745 566001 -338667
38902 -338667 -1606997 -1531992 -665622 -744761 -1546640 -1296255 42704 476684 -640756
38893 -640756 -1395683 -415202 955286 928338 -11490 -313822 16566 -135323 -689651 -439957
38883 -439957 702715 1250247 326451 -973315 -1128911 -269827 222247 -113783 -67693
38874 -67693 1395633 3259847 3447988 1624916 -173605 -231445 681662 861146 340872
38865 340872 397816 1010356 858335 -111881 -264109 921995 1616082 451163 -1047326
38856 -1047326 -546814 1571289 2610722 1185919 -1107197 -1796015 -200631 2281564
38848 2281564 3807556 3670857 2622872 1850586 1665869 1413543 649168 -146849 -286498
38839 -286498 221430 863523 1311935 1584670 1852104 2286329 2741880 2575574 1380560
38830 1380560 -85205 -494850 401001 1559885 2153795 2246713 1854872 691161 -726891
38821 -726891 -1157414 -513184 -226852 -896724 -1126636 113985 1543092 1542129 671097 336505
38811 336505 166802 -1048038 -2636109 -2736031 -1401838 -626478 -1245363 -2106439 -2524406
38802 -2524406 -3175012 -3973732 -3477278 -1529156 -383157 -1627505 -3621588 -3743766 -2014345
38793 -2014345 -663481 -844760 -1611184 -1882742 -1727915 -1496084 -1046569 -345007 100594
38784 100594 -25222 -243611 43241 585989 520299 -461457 -1581516 -1826211 -1099300 -205519
38774 -205519 216077 273759 257266 76513 -368963 -765391 -832570 -767148 -706844 -261025
38764 -261025 713404 1391811 1006793 215585 297409 1158119 1386659 379325 -835559
38755 -835559 -1193904 -878420 -585364 -551318 -811968 -1462526 -2066602 -1662257 -21057 1756346
38745 1756346 2447320 1920590 791574 -357660 -999339 -772316 -123346 -17591 -484917
38736 -484917 -392545 702402 1548333 974228 -315757 -871818 -602154 -448201 -599199
38727 -599199 -474090 -118299 -158939 -483603 -354350 108035 -101718 -1169001 -1960134 -1631964
38717 -1631964 -686031 19316 328877 377982 80171 -341756 -162675 764306 1455447 1143920
38707 1143920 535891 730361 1384190 1218644 256449 148882 1762179 3610700 3686103
38698 3686103 2118556 779905 535529 335405 -675623 -1607228 -1365604 -659295 -1001434
38689 -1001434 -2222209 -2604353 -1507835 -240954 116461 187226 726436 1000309 93598
38680 93598 -1156665 -1157202 -12667 632167 121927 -384404 95783 938952 1121672 817922
38670 817922 953612 1757065 2518156 2548296 1862158 1010770 526684 467153 437521 182054
38660 182054 -7858 190270 438084 171807 -369905 -330112 437059 1028869 807437 286665
38650 286665 190815 283476 -131251 -903080 -1010833 143894 1922126 3039535 2738858
38641 2738858 1365127 -48278 -733544 -761760 -674930 -751223 -888061 -987046 -962401 -504581
38631 -504581 488434 1237007 675948 -990265 -2138512 -1617273 -74765 1148781 1681710
38622 1681710 1878536 1640325 645287 -551193 -850986 -115719 637762 665718 214084
38613 214084 -330196 -987511 -1518228 -1206521 33655 1116891 1106527 453788 104796
38604 104796 -56792 -822320 -2021050 -2468367 -1666559 -521404 -41970 -220269 -628719
38595 -628719 -1261870 -2127637 -2696488 -2538194 -2003788 -1519501 -745445 603388 1577570
38586 1577570 918897 -961563 -2291000 -2366605 -2262923 -2718287 -2902867 -2201991 -1710977
38577 -1710977 -2460636 -3254841 -2126153 591546 2529980 2516504 1730011 1437933 1368316
38568 1368316 940323 549292 718215 1133900 1380362 1627977 1837589 1353872 159475
38559 159475 -556328 -130656 312001 -412236 -1496819 -1348933 -173284 352894 -310993
38550 -310993 -1003317 -948148 -764454 -999433 -1086084 -432483 508190 965016 921993 896025
38540 896025 1184120 1719599 2208155 2204836 1560399 835449 639832 628181 30418 -844172
38530 -844172 -798262 294754 964163 167056 -1263246 -1951760 -1776948 -1438653 -1112980
38521 -1112980 -617746 -294898 -612663 -1251804 -1557247 -1588871 -1818447 -2109758 -1983957 -1675180
38511 -1675180 -1899547 -2640618 -3121215 -2983863 -2578656 -2057873 -1189417 -242022 -571
38502 -571 -455750 -417227 876185 2442564 2669409 1372792 -51977 -431872 -39974 133803
38492 133803 -256362 -717276 -825086 -779762 -895831 -950765 -501167 265090 532896 -123557
38482 -123557 -1158047 -1709135 -1431573 -444169 983043 2209195 2260544 900646 -630585
38473 -630585 -854393 23126 344125 -702538 -1978557 -2059379 -1169798 -662340 -1027823
38464 -1027823 -1350588 -747021 409383 1015602 556577 -490237 -1360586 -1694164 -1503651
38455 -1503651 -867376 40922 802101 1012294 711156 269927 -131483 -559152 -847465
38446 -847465 -574959 258705 987346 1041547 588750 99437 -287618 -546603 -381586 313674
38436 313674 935225 807530 174607 -132694 63798 94243 -446046 -1039073 -935066 -80045
38426 -80045 852566 1135579 664677 115633 243863 837313 787662 -387120 -1612802 -1538905
38416 -1538905 -311392 786595 1108903 1048943 905064 515314 34615 -59275 136515
38407 136515 108046 24637 437315 792152 -175254 -2099487 -2760512 -1172041 683080
38398 683080 600480 -665514 -721400 846324 2169169 2127932 1721043 2086859 2778346 2726067
38388 2726067 1829801 813969 160082 -146864 -181886 70812 531683 953321 1049790 735321
38378 735321 284528 53808 -45073 -398922 -825212 -451778 1051746 2711251 3413198
38369 3413198 3329714 3360359 3619256 3508421 3001095 2678007 2525995 1874052 697419 -121967
38359 -121967 -166930 -110408 -544332 -1109371 -1301221 -1279088 -1254533 -857094 139964 1061829
38349 1061829 1087242 351050 -401280 -864283 -1149578 -1087500 -453619 242028 141576 -602767
38339 -602767 -677238 731205 2656608 3312194 2126182 335783 -436417 189547 1240303
38330 1240303 1562302 846141 -317537 -1041717 -805422 159539 1012892 1034499 302302
38321 302302 -502822 -907428 -927002 -593098 196461 1118204 1335229 485424 -664697 -1104647
38311 -1104647 -783915 -381524 -226421 -131670 -64376 -234185 -590394 -878991 -1124881 -1456464
38301 -1456464 -1619277 -1384475 -1296248 -2161160 -3790218 -5085103 -5441972 -5247736 -4914692
38292 -4914692 -4328195 -3428414 -2448042 -1361267 -3072 1076800 961894 -78688 -554470
38283 -554470 169091 953131 839618 704552 1744987 3242246 3338466 1661372 -182363
38274 -182363 -662335 217038 1487964 2257617 2088287 1172700 288800 9752 -12427 -433957
38264 -433957 -1084701 -1138101 -277898 1012542 2187552 2901263 2665753 1178155 -877702
38255 -877702 -2159802 -2063971 -1254112 -716904 -839935 -1405866 -1821486 -1326021 288260
38246 288260 2050627 2620777 1850217 828728 310717 -3596 -394598 -367167 438071
38237 438071 1389355 1657343 1317462 987510 833622 633390 461801 571197 773819 638112
38227 638112 274462 337130 1132235 2121804 2455760 1795198 567475 -451176 -797480
38218 -797480 -634470 -396949 -236454 -42288 113845 15705 -179690 -10895 488825 597553
38208 597553 -131949 -1161005 -1625591 -1328303 -661063 59418 658036 835721 458581
38199 458581 -35331 -63005 354229 728639 856787 909943 867187 460917 -225171 -624722
38189 -624722 -373062 190493 365010 -245401 -1400176 -2343170 -2364269 -1566709 -961693 -1374795
38179 -1374795 -2337679 -2607134 -1819597 -994207 -1128909 -1885752 -2167218 -1599275 -794812
38170 -794812 -263949 240373 1024002 1587813 1034577 -654083 -2196767 -2191628 -608207
38161 -608207 1150028 1641317 624899 -1028660 -2295946 -2740084 -2599925 -2388164 -2304753
38152 -2304753 -2011156 -1176222 -148110 395957 494095 896580 1735098 2009093 1068267
38143 1068267 -100000 -71363 940698 1380066 633630 -181426 34739 927809 1521399
38134 1521399 1599510 1569297 1554291 1337749 877571 332257 -186852 -520524 -430845 -2949
38124 -2949 272344 152473 8141 208491 567677 765899 837102 786816 249097 -850618
38114 -850618 -1718925 -1530375 -614046 -100490 -501795 -1286098 -1795491 -1946500 -1954210 -1883183
38104 -1883183 -1633507 -1112991 -407854 108543 95173 -161995 53313 775753 1078829 482135
38094 482135 -61698 505115 1609743 1820489 1021325 488133 845624 1315360 1221682 935975
38084 935975 884079 815853 634887 836116 1427933 1480746 599285 -109603 442861 1593283
38074 1593283 1813089 809924 -324233 -699104 -343061 400021 1189659 1529351 1197502
38065 1197502 793730 1075260 1841781 2250719 2103632 1954057 2011411 1883528 1472762 1176845
38055 1176845 1012220 491368 -283308 -327284 854986 2319137 2739920 1906879 575616
38046 575616 -682895 -1762579 -2450094 -2374207 -1602621 -771432 -479378 -824409 -1514501
38037 -1514501 -2106576 -2146723 -1470607 -502801 56089 42492 76140 715223 1561443 1639692
38027 1639692 684996 -418803 -739711 -450654 -445431 -1049322 -1681050 -1745472 -1270549 -571232
38017 -571232 121485 499834 270558 -247170 -208484 592937 1196982 742639 -205698 -409678
38007 -409678 224480 512599 -228711 -1095659 -717575 973110 2552523 2638372 1378267
37998 1378267 266684 454158 1487111 2068253 1800960 1405436 1221110 618840 -600572
37989 -600572 -1349561 -735412 492353 1090425 1140472 1423376 1689756 1177774 407450 599874
37979 599874 1387914 1052561 -675255 -1981956 -1747219 -1098223 -1286985 -1754489 -1517454
37970 -1517454 -958508 -792977 -491624 713536 2201999 2856993 2779634 2646867 2192061
37961 2192061 993813 83701 851125 2657949 3441806 2653881 1757025 1654572 1512039
37952 1512039 653021 -111731 92220 817414 1254924 1488904 1891797 2189470 2043077
37943 2043077 1842295 2071022 2447727 2415663 1980390 1472863 1044393 932363 1535912 2575510
37933 2575510 2889541 1874318 521997 176982 819548 1491650 1847440 2139767 2076648
37924 2076648 1052988 -486511 -1197306 -630869 188190 350981 238231 584393 1251940
37915 1251940 1649873 1730453 1807364 1822529 1559647 1320656 1630044 2322093 2568316 1895986
37905 1895986 712854 -248688 -618991 -487599 -200167 -111052 -170814 262051 1732243
37896 1732243 3674411 4590563 3588890 1433417 -265138 -640476 -58333 616262 713338
37887 713338 -50476 -1381828 -2333044 -2021043 -686975 409289 429384 -147391 -431500
37878 -431500 -443692 -853998 -1638383 -1875892 -1105790 -129498 96307 -134448 252585 1396989
37868 1396989 2109464 1449842 31170 -746396 -338422 615467 1291800 1345488 713960
37859 713960 -478550 -1685491 -2253120 -2212080 -2212753 -2464714 -2373311 -1548917 -489175 219929
37849 219929 687112 1075843 922524 94 -777166 -492645 144848 -315142 -1700560
37840 -1700560 -2266211 -1328841 -288985 -386123 -880204 -506704 407270 598519 -71791
37831 -71791 -557899 -304901 210867 504395 594457 472572 -6918 -552655 -519613 208965
37821 208965 986853 1218087 954573 610069 523287 857435 1490812 1916482 1616707 622026
37811 622026 -548606 -1448264 -1928048 -1951755 -1586061 -1132846 -931640 -1041777 -1308866 -1559373
37801 -1559373 -1507913 -805443 431741 1438318 1589385 1114591 603806 151317 -455255
37792 -455255 -1012880 -1045673 -529270 82069 401239 235062 -497174 -1402506 -1566357 -594703
37782 -594703 610380 859430 119610 -838611 -1777214 -2898604 -3740066 -3442236 -2140622
37773 -2140622 -952110 -481989 -379802 -406877 -820679 -1573796 -2191620 -2516026 -2522342 -1574230
37763 -1574230 688529 2784678 2555753 278383 -1247817 -399451 1334184 2004442 1826467
37754 1826467 1819184 1714286 1046706 779321 1708715 2426396 1211873 -814950 -941004
37745 -941004 1000358 2243297 1142831 -665473 -923540 316133 1476123 1765899 1528985
37736 1528985 1168153 795769 514976 306630 -111816 -878539 -1645010 -1858216 -1240234
37727 -1240234 -60112 877689 885755 398459 688981 1926372 2374793 702086 -1714057
37718 -1714057 -2461046 -1561903 -1208516 -2102290 -2429293 -1095299 335054 185191 -800653
37709 -800653 -1103270 -1033871 -1761550 -2829795 -2739288 -1505499 -686136 -948895 -1313221 -977873
37699 -977873 -440258 -429933 -877050 -1361650 -1744217 -2042034 -2342731 -2941430 -3875252 -4369076
37689 -4369076 -3637323 -2282238 -1863197 -2800776 -3734408 -3471362 -2621656 -2497378 -3103579
37680 -3103579 -3290500 -2650818 -2147582 -2539407 -3036996 -2328983 -649416 178306 -857097
37671 -857097 -2358006 -2291831 -921234 -566194 -2256840 -4155663 -4182484 -2842095 -1967497
37662 -1967497 -1628707 -288700 2186190 3732309 2859267 659211 -720390 -442816 873592
37653 873592 2250854 2767689 1875404 225135 -612525 -90995 481958 -67497 -938610
37644 -938610 -706024 373366 940038 810980 908015 1161279 444747 -1124508 -1743180
37635 -1743180 -572156 806388 707827 -229574 -355575 261570 120279 -1141614 -2173242
37626 -2173242 -2009977 -1276071 -865236 -649577 -191497 201689 22981 -397382 -294738
37617 -294738 335174 720628 414259 -282078 -1012842 -1786996 -2477083 -2538455 -1701193 -549664
37607 -549664 120952 317329 675048 1364249 1783070 1475318 772781 182878 -385801 -1261889
37597 -1261889 -2172446 -2423111 -1908665 -1340810 -1262198 -1305393 -781960 282831 1122431 1183800
37587 1183800 778331 650798 1041293 1385598 1069393 353461 174979 866458 1505988
37578 1505988 1036895 -255956 -1108506 -1035100 -834402 -1128893 -1388731 -1034432 -625890
37569 -625890 -928829 -1367405 -687362 966964 1953849 1402092 396880 293944 853581
37560 853581 966682 528750 422262 848370 824855 -372218 -2073704 -3001249 -2721419
37551 -2721419 -1836562 -985689 -207845 608585 1080103 618187 -575662 -1281623 -551105
37542 -551105 912349 1346714 108752 -1423376 -1603378 -547057 352869 452388 313333
37533 313333 278705 -141793 -1091084 -1676415 -1173423 -109856 642542 1164809 1926561 2472948
37523 2472948 1884492 419203 -472235 13390 1094188 1577589 1161918 266797 -620338
37514 -620338 -991305 -458540 570117 940053 80219 -1166198 -1600207 -1117724 -511957
37505 -511957 -253928 -189090 -193799 -405670 -834535 -1246878 -1374927 -917572 368181 2138267
37495 2138267 3382839 3434069 2750267 2175335 1843700 1458230 1133579 1072550 822762 -115995
37485 -115995 -1237598 -1642846 -1419176 -1237572 -885802 332469 1849944 2161014 1104157
37476 1104157 151801 41076 -145470 -954470 -1471153 -1159707 -961505 -1363260 -1176833
37467 -1176833 229231 1215040 312013 -1105057 -827040 672283 1193426 465516 178834
37458 178834 738069 714610 -338162 -1106164 -1014817 -1133232 -1906007 -2184507 -1356186 -405787
37448 -405787 35631 683014 1614588 1356693 -666088 -2584700 -2561428 -1286781 -470494
37439 -470494 -338320 -308308 -698002 -1767362 -2257896 -1089844 326349 -234099 -2318303
37430 -2318303 -3307668 -2311414 -1252982 -1724513 -2842779 -3005345 -2122295 -1128572 -450100
37421 -450100 94799 609052 1055545 1398016 1414510 859831 5944 -544077 -669933 -707822
37411 -707822 -592667 125276 1233252 1714425 1049658 -37201 -556858 -433601 -335253
37402 -335253 -769533 -1667843 -2526144 -2746761 -2126806 -1094659 -202445 505212 1223546
37393 1223546 1704559 1464464 589983 -313883 -960671 -1520763 -1946013 -1879352 -1341497 -861839
37383 -861839 -793851 -1025591 -1351866 -1532701 -1081875 226939 1659365 2178075 1876163
37374 1876163 1854043 2491765 2804873 1917767 353130 -656600 -549905 270156 1004769
37365 1004769 1034081 422770 10057 438231 1075624 683733 -800858 -2130956 -2558394
37356 -2558394 -2616055 -2684435 -2061181 -307846 1514200 2017477 1224604 202205 -411327
37347 -411327 -573284 -163394 716656 1146451 262062 -1342062 -2069079 -1226706 306473
37338 306473 1316037 1367521 642987 -500623 -1503463 -1749580 -1167646 -399195 -91526
37329 -91526 -197232 -158446 343136 1021817 1408191 1478242 1587580 1728294 1318349 155199
37319 155199 -858585 -713049 214488 611798 136260 -233031 86238 451804 355599 331848
37309 331848 709415 657084 -404281 -1415341 -1039507 278003 1016725 888688 964304
37300 964304 1645586 1959518 1102154 -419216 -1493904 -1476231 -417422 1045944 1969803
37291 1969803 1908726 1396544 1066747 656184 -282925 -1120731 -822840 268137 642739
37282 642739 -258227 -1356097 -1575421 -970078 67218 1424955 2585157 2567669 1358523
37273 1358523 395695 756282 1653130 1616647 514405 -528099 -746138 -367042 102612
37264 102612 401201 415667 216893 217037 843489 1988368 2996317 3201480 2464476 1341045
37254 1341045 648631 579980 421304 -383366 -1161988 -811128 471647 1296398 1043097
37245 1043097 579960 659365 765382 203434 -713626 -1381857 -1907259 -2514456 -2762626 -2288611
37235 -2288611 -1622698 -1330300 -1056950 -427603 -130153 -874288 -1910445 -1984834 -1327600
37226 -1327600 -1196548 -1691607 -1626839 -638515 145112 -99033 -782870 -1091411 -1084950 -1054997
37216 -1054997 -832040 -365048 -115416 -294694 -503351 -611187 -1103467 -1978669 -2260120
37207 -2260120 -1409471 -397485 -411251 -1133758 -1332531 -693823 10146 316520 518454
37198 518454 719734 506373 -129361 -375760 360366 1478161 1762147 759145 -783298
37189 -783298 -1787033 -1861654 -1397712 -891857 -489132 -230162 -354455 -930812 -1347347 -761204
37179 -761204 778482 2115307 2170497 1052897 -205358 -712629 -342937 336890 509281
37170 509281 -226635 -1395190 -2094518 -1995946 -1520120 -1003507 -361659 196598 -33890 -1145092
37160 -1145092 -2022846 -1688339 -705224 -318576 -591458 -508264 203800 579224 16262 -689009
37150 -689009 -506774 372624 976392 1014062 1123914 1692907 2087946 1423061 -158533 -1441438
37140 -1441438 -1530726 -893400 -554214 -565280 -145790 623140 426458 -1298626 -3052032
37131 -3052032 -3083958 -1811911 -1058540 -1287948 -1200019 -126432 795867 414199 -766111
37122 -766111 -1468636 -1267841 -607153 11791 182505 -340502 -1066728 -931900 321547
37113 321547 1583570 1818236 1340275 957432 670196 204016 127419 1181529 2802438
37104 2802438 3519294 2841739 1802619 1520732 1961569 2232585 1589745 176792 -869275
37095 -869275 -373873 1324463 2284458 1167152 -949607 -1875512 -1005745 339803 917183
37086 917183 657117 -52208 -817350 -920807 89954 1271601 1084711 -339583 -1136365
37077 -1136365 -437262 322502 -283268 -1452234 -1562862 -765457 -589927 -1490106 -2347629
37068 -2347629 -2380435 -2188452 -2568595 -3261103 -3366765 -2489436 -1098112 -171 393378
37059 393378 404921 633540 1066402 970640 -22351 -1092372 -1028229 302392 1771257 2219528
37049 2219528 1474959 216029 -770563 -1157674 -1159994 -1099678 -893474 -227471 715998 1220000
37039 1220000 1028633 853672 1358103 2064588 1977080 1056928 322340 480109 1138983 1551582
37029 1551582 1584231 1625284 1839609 1881454 1364328 439147 -301440 -594527 -935461 -1857924
37019 -1857924 -2950422 -3203065 -2368681 -1277201 -610176 -134235 510174 1089969 1373490
37010 1373490 1632003 1904875 1600361 621444 -5472 317400 445514 -872759 -2702613
37001 -2702613 -2952579 -1433427 -127140 -308404 -1131575 -1497720 -1651223 -2096295 -2287198
$$ [...]
##END NTUPLES=NMR SPECTRUM
##END=
