##TITLE=31Pdec_SR-157-K3-TFAA4'
 CDCl3, 24 sc
 7.7.2023
##JCAMPDX= 6.0         $$ Bruker NMR JCAMP-DX V2.0
##DATA TYPE= NMR SPECTRUM
##DATA CLASS= NTUPLES
##ORIGIN= UXNMR, Bruker Analytische Messtechnik GmbH
##OWNER= root
$$ XWIN-NMR		Version 3.5
$$ Fri Jul  7 13:44:25 2023 Russian Standard Time (UT+4h)  she@DPX200
##.OBSERVE FREQUENCY= 81.013821
##.OBSERVE NUCLEUS= ^31P
##.ACQUISITION MODE= SIMULTANEOUS
##.ACQUISITION SCHEME= undefined
##.AVERAGES= 24
##.DIGITISER RES= 16
##SPECTROMETER/DATA SYSTEM= spect
##.PULSE SEQUENCE= zgpg30
##.SOLVENT NAME= CDCl3
##.SHIFT REFERENCE= (INTERNAL, CDCl3, 0, 248.564)
##AUDIT TRAIL= $$ (NUMBER, WHEN, WHO, WHERE, WHAT)
$$ ##TITLE= Audit trail, XWIN-NMR		Version 3.5
$$ ##JCAMPDX= 5.01
$$ ##ORIGIN= Bruker BioSpin GmbH
$$ ##OWNER= she
$$ F:/spectra/data/she/nmr/P31/1/pdata/1/auditp.txt
$$ ##AUDIT TRAIL=  $$ (NUMBER, WHEN, WHO, WHERE, WHAT)
(   1,<2023-07-07 13:42:38.90 +0400>,<she>,<DPX200>,
      <created by zg, POWCHK disabled, PULCHK disabled
       configuration hash MD5:
       00 E9 B6 7A A2 85 ED C7 34 08 36 98 17 FE 4E 26
       data hash MD5: 32K
       11 24 57 18 13 94 2A 23 9B 67 E9 39 6A 2B 6D 6D>)
(   2,<2023-07-07 13:43:18.18 +0400>,<she>,<DPX200>,
      <Start of raw data processing
       efp BC_mod = 2 LB = 1 FT_mod = 6 PKNL = 1 PHC0 = -10680.76 PHC1 = 58.28481 SI = 64K 
       data hash MD5: 64K
       4A 59 3C AC 54 C4 09 C6 A8 C8 07 A7 81 25 1E B7>)
(   3,<2023-07-07 13:43:32.21 +0400>,<she>,<DPX200>,
      <pk PHC0 = -3.451386 PHC1 = 0 
       data hash MD5: 64K
       B2 D3 79 8B 3E 12 3C E6 5C 2A B2 90 AF 94 E3 F2>)
(   4,<2023-07-07 13:43:48.92 +0400>,<she>,<DPX200>,
      <abs ABSG = 5 
       data hash MD5: 64K
       F0 A4 5D 54 F0 E4 41 CE 89 F1 F7 E5 CD 4E E0 7A>)
$$ ##END=
$$ 
$$ hash MD5
$$ 1A 13 68 2B FA E4 FA 8B B0 8E 79 0D E7 C7 F1 5D
##$RELAX= 
##$RELAX= 
##$RELAX= 
##$RELAX= 
##$RELAX= 
##$RELAX= 
##$RELAX= 
##$RELAX= 
##$RELAX= 
$$ Bruker specific parameters
$$ --------------------------
##$DU= <F:/spectra>
##$EXPNO= 1
##$NAME= <P31>
##$PROCNO= 1
##$TYPE= <nmr>
##$USER= <she>
##$AMP= (0..31)
100 100 100 100 100 100 100 100 100 100 100 100 100 100 100 100 100 100 
100 100 100 100 100 100 100 100 100 100 100 100 100 100 
##$AQSEQ= 0
##$AQ_mod= 1
##$AUNM= <au_zg>
##$AUTOPOS= <>
##$BF1= 81.014009
##$BF2= 200.13
##$BF3= 200.13
##$BF4= 200.13
##$BF5= 200.13
##$BF6= 200.13
##$BF7= 200.13
##$BF8= 200.13
##$BYTORDA= 1
##$CFDGTYP= 0
##$CFRGTYP= 5
##$CHEMSTR= <none>
##$CNST= (0..31)
1 1 145 1 1 1 1 1 1 1 1 1 1 1 1 1 1 1 1 1 1 1 1 1 1 1 1 1 1 1 1 1 
##$CPDPRG= <waltz16>
##$CPDPRG1= <>
##$CPDPRG2= <waltz16>
##$CPDPRG3= <>
##$CPDPRG4= <mlev>
##$CPDPRG5= <mlev>
##$CPDPRG6= <mlev>
##$CPDPRG7= <mlev>
##$CPDPRG8= <mlev>
##$CPDPRGB= <>
##$CPDPRGT= <>
##$D= (0..31)
0 1 0 0 0 0 0 0 0 0 0 0.03 2e-05 3e-06 0 0 0 0 0 0 0 0 0 0 0 0 0 0 0 0 
0 0 
##$DATE= 1688722958
##$DBL= (0..7)
120 120 120 11 120 120 24 19 
##$DBP= (0..7)
150 150 150 150 150 150 150 150 
##$DBP07= 0
##$DBPNAM0= <>
##$DBPNAM1= <>
$$ [...]
##$SUBNAM3= <"">
##$SUBNAM4= <"">
##$SUBNAM5= <"">
##$SUBNAM6= <"">
##$SUBNAM7= <"">
##$SUBNAM8= <"">
##$SUBNAM9= <"">
##$SW= 501.771253377433
##$SWIBOX= (0..15)
0 1 3 0 0 0 0 0 0 0 0 0 0 0 0 0 
##$SW_h= 40650.406504065
##$TD= 32768
##$TD0= 1
##$TE= 0
##$TE2= 300
##$TE3= 300
##$TEG= 300
##$TL= (0..7)
0 120 53 12 22 120 120 120 
##$TP= (0..7)
150 150 150 150 150 150 150 150 
##$TP07= 0
##$TPNAME0= <>
##$TPNAME1= <>
##$TPNAME2= <>
##$TPNAME3= <>
##$TPNAME4= <>
##$TPNAME5= <>
##$TPNAME6= <>
##$TPNAME7= <>
##$TPOAL= (0..7)
0.5 0.5 0.5 0.5 0.5 0.5 0.5 0.5 
##$TPOFFS= (0..7)
0 0 0 0 0 0 0 0 
##$TUNHIN= 0
##$TUNHOUT= 0
##$TUNXOUT= 0
##$USERA1= <user>
##$USERA2= <user>
##$USERA3= <user>
##$USERA4= <user>
##$USERA5= <user>
##$V9= 5
##$VALIST= <valist>
##$VCLIST= <CCCCCCCCCCCCCCC>
##$VD= 0
##$VDLIST= <DDDDDDDDDDDDDDD>
##$VPLIST= <PPPPPPPPPPPPPPP>
##$VTLIST= <TTTTTTTTTTTTTTT>
##$WBST= 1024
##$WBSW= 4
##$XGAIN= (0..3)
0 0 0 0 
##$XL= 0
##$YL= 0
##$YMAX_a= 6922
##$YMIN_a= -7358
##$ZGOPTNS= <>
##$ZL1= 120
##$ZL2= 120
##$ZL3= 120
##$ZL4= 120
##$ABSF1= 248.5645
##$ABSF2= -253.2056
##$ABSG= 5
##$ABSL= 3
##$ALPHA= 0
##$AQORDER= 0
##$ASSFAC= 0
##$ASSFACI= 0
##$ASSFACX= 0
##$ASSWID= 0
##$AUNMP= <proc_1d>
##$AZFE= 0.1
##$AZFW= 0.5
##$BCFW= 0
##$BC_mod= 2
##$BYTORDP= 0
##$COROFFS= 0
##$CY= -3
##$DATMOD= 1
##$DC= 0
##$DFILT= <>
##$DTYPP= 0
##$F1P= 0
##$F2P= 0
##$FCOR= 1
##$FTSIZE= 65536
##$FT_mod= 6
##$GAMMA= 0
##$GB= 0
##$INTBC= 1
##$INTSCL= 6.047779e-11
##$ISEN= 30
##$LB= 1
##$LEV0= 0
##$LPBIN= 0
##$MAXI= 10000
##$MC2= 0
##$MEAN= 0
##$ME_mod= 0
##$MI= 50
##$NCOEF= 0
##$NC_proc= -6
##$NLEV= 6
##$NOISF1= 182.463
##$NOISF2= 159.3651
##$NSP= 0
##$NTH_PI= 0
##$NZP= 0
##$OFFSET= 248.5645
##$PC= 4
##$PHC0= -10684.21
##$PHC1= 58.28481
##$PH_mod= 1
##$PKNL= yes
##$PPARMOD= 0
##$PSCAL= 0
##$PSIGN= 0
##$REVERSE= no
##$SF= 81.0140089999694
##$SI= 65536
##$SIGF1= 159.3651
##$SIGF2= -187.1042
##$SINO= 113.3802
##$SIOLD= 16384
##$SREGLST= <1H.CDCl3>
##$SSB= 0
##$STSI= 65536
##$STSR= 0
##$SW_p= 40650.406504065
##$SYMM= 0
##$S_DEV= 0
##$TDeff= 32768
##$TDoff= 0
##$TI= <>
##$TILT= no
##$TM1= 0
##$TM2= 0
##$TOPLEV= 0
##$USERP1= <user>
##$USERP2= <user>
##$USERP3= <user>
##$USERP4= <user>
##$USERP5= <user>
##$WDW= 1
##$XDIM= 65536
##$YMAX_p= 208675684
##$YMIN_p= -419125174
$$ End of Bruker specific parameters
$$ ---------------------------------
##NTUPLES= NMR SPECTRUM
##VAR_NAME=  FREQUENCY,     SPECTRUM/REAL,   SPECTRUM/IMAG
##SYMBOL=    X,             R,               I
##VAR_TYPE=  INDEPENDENT,   DEPENDENT,       DEPENDENT
##VAR_FORM=  AFFN,          ASDF,            ASDF
##VAR_DIM=   65536,         65536,           65536
##UNITS=     HZ,            ARBITRARY UNITS, ARBITRARY UNITS
##FACTOR=    0.620285442955139, 1,           1
##FIRST=     20137.2065510682, 0,            0
##LAST=      -20513.1999529968, 0,           0
##MIN=       -20513.1999529968, -419125174,  0
##MAX=       20137.2065510682, 208675684,    0
$$ Real data points
##PAGE= N=1
##DATA TABLE= (X++(R..R)), XYDATA
$$ [...]
13256E64605n51204q85286r56492m32641O07246J254363P02658m63689p46174
$$ 564605 13401 -871885 -1828377 -2261018 -1653772 -399409 303249 -160440 -906614
13247i06614K62789J152615N41634r58214j466023k90100J238221J549243O78243
$$ -906614 -643825 508790 1050424 92210 -1373813 -1663913 -425692 1123551 1801794
13238A801794j59510l06767k34754m81175p76569n71262L4026L98790K28781j17141
$$ 1801794 1642284 1335517 1100763 619588 -156981 -728243 -694217 -295427 -66646 -183787
13228a83787k17442p4376J23425L80299P56456J009910P05060j97748j018978
$$ -183787 -401229 -475605 -352180 28119 784575 1794485 2499545 2301797 1282819
13219A282819r34803k8892N44921p7705j143027j088041K57482J302164R75084
$$ 1282819 348016 319124 864045 786340 -356687 -1444728 -1187246 114918 1090002
13210A090002K14728K43244M99253j97237j262204j097040J10989M93169m24673
$$ 1090002 1304730 1547974 2047227 1849990 587786 -509254 -398265 94904 -329769
13201c29769r36410p6081P90841L71007m54822l40902K91010L14832o8799o052
$$ -329769 -1266179 -1342260 -551419 -180412 -635234 -976136 -685126 -370294 -439093 -445145
13191d45145K93812J02395l63197m60957l29691k33382L71058J638342K201101
$$ -445145 -151333 -48938 -412135 -873092 -1202783 -1436165 -1065107 573235 2774336
13182B774336R62741q16420j079338N8743P76706L62093m00438j084912j757308
$$ 2774336 3737077 2920657 1841319 1900062 2676768 3038861 2638423 1553511 -203797
13173b03797j705660l00667J147318P58252q04260j085337K40320R30877P3379
$$ -203797 -1909457 -2210124 -1062806 -304554 -1108814 -2194151 -1953831 -1022954 -949575
13164i49575m99690L27165R36054K9406q24760J67580J781135J564864l69394
$$ -949575 -1449265 -1122100 -186046 -156640 -981400 -813820 967315 2532179 2162785
13155B162785j686833j253988j10788O31257R32305Q55126J27533r48452j355256
$$ 2162785 475952 -778036 -888824 -257567 674738 1529864 1657397 708945 -646311
13146f46311o31337M43086Q20395L91842p8093K0888M49892N14653M8015l41970
$$ -646311 -1277648 -834562 -14167 377675 299582 320470 770362 1285015 1333030 991060
13136I91060k06503J8163k60332p51898p23088j72396K79602M39487N78695O34046
$$ 991060 784557 802720 542388 -209510 -932598 -1104994 -825392 -385905 192790 826836
13126H26836L24762j14177k39935j66625j23790J83845O83896L07026j162054
$$ 826836 1151598 1037421 797486 630861 507071 690916 1374812 1681838 519784
13117E19784j679108K88589K479824J433387j936199l025982l71629K111154J236537
$$ 519784 -1159324 -870735 1609089 3042476 1106277 -1919705 -2291334 -180180 1056357
13108A056357q92744r13620N36870Q44819J43191L31737J086695N95478p17852
$$ 1056357 163613 -750007 -213137 631682 774873 1106610 2193305 2788783 2070931
13099B070931p94324K40211K78638q93795j245453k30585L31548k86447m26754
$$ 2070931 1276607 1516818 1795456 901661 -343792 -574377 -242829 -529276 -956030
13090i56030P67507J622830P78904n52197p24825j51810o5190l78405l99648l72369
$$ -956030 -188523 1434307 2213211 1661014 936189 784379 719189 340784 -58864 -431233
13080d31233p04706p28065J97710J186238R77418m5254m70247j8049L58958K25943
$$ -431233 -1135939 -1864004 -1666294 -480056 497362 452108 -18139 -36188 322770 548713
13070E48713Q4486J41287J0199k75670k01249R1767j79990r44861j013727P1090
$$ 548713 633199 774486 784685 509015 307766 399533 219543 -725318 -1739045 -1667955
13060a667955J039747O62089l64173m39806N63210J223122P03438k61225o77228
$$ -1667955 -628208 33881 -330292 -770098 -206888 1016234 1719672 1458447 781219
13051G81219n15716k55083p4866N0829J35469L77271Q76709R73340j49289j860488
$$ 781219 265503 10420 -64446 -13617 121852 499123 1375832 2349172 2199883 339395
13041C39395k310539r42849M93148M39613k34819J15272J167010J320696L70967
$$ 339395 -1971144 -2913993 -2420845 -1981232 -2216051 -2100779 -933769 386927 757894
13032G57894m38303n82187n62293l64294L74202Q29580j72441j695627j406051
$$ 757894 319591 -262596 -824889 -1189183 -814981 14599 -157842 -1853469 -3259520
13023c259520P92044K173471J086238p68851j089497k3732Q66653R81831O13949
$$ -3259520 -2467476 -294005 792233 23382 -1066115 -1089847 -223194 758637 1372586
13014A372586m6375n20724r131J087964J077846m23243j453747o50512N43288
$$ 1372586 1326211 805487 796356 1884320 2962166 2538923 1085176 434664 977952
13005I77952L36091m82340j98872P09248N55559n03235q87337l84794j11246j56986
$$ 977952 1314043 831703 632831 1342079 1897638 1394403 507066 122272 11026 -145960
12995a45960L33761J009874O33404m85638p18062N0792J44411q97912j325683
$$ -145960 187801 1197675 1831079 1345441 627379 678171 822582 -75330 -1401013
12986a401013o7639J384574J222921m5450n80789J23090Q33900M29063p84771
$$ -1401013 -1468652 -84078 1138843 1093393 512604 635694 1469594 1898657 1113886
12977A113886j543464r96346L78610J231710Q54633n0329m25971j76840J43994
$$ 1113886 -429578 -1425924 -1047314 184396 1039029 988700 562729 385889 529883
12968E29883L79806O44164O10622q8098j017001j366659r78178k39390N73785
$$ 529883 909689 1553853 2164475 2076377 1059376 -307283 -1285461 -1524851 -951066
12959i51066J107860P69788k89647p69595P9410J110819R04712j00267o02166
$$ -951066 156794 926582 636935 -132660 -53250 1057569 1962281 1862014 1259848
12950A259848o92850j230117j635463n84798J299980J783248L34067r97755n98981
$$ 1259848 566998 -663119 -2298582 -2883380 -1583400 199848 533915 -463840 -1062821
12941a062821O59500J132857N99001r8412m31946m63351m87491p49544r63804
$$ -1062821 -403321 729536 1328537 1230125 798179 334828 -152663 -902207 -1866011
12932a866011l91385Q03035J043578m26782j718979p23502J379990J629175n0816
$$ -1866011 -2257396 -1454361 -410783 -837565 -2556544 -3280046 -1900056 -270881 -321697
12923c21697p22930P30703J874182Q44456q08985j011600k75981k5201l6797L66931
$$ -321697 -1044627 -313924 1560258 2404714 1595729 584129 308148 282947 246150 613081
12913F13081M59027m04434j003875j28376J091213Q84513k38038m65895K75693
$$ 613081 1072108 667674 -336201 -464577 626636 1511149 1273111 807216 1082909
12904A082909M87754k32319p73161n47665j48108k3828L0620J40162K57030N32475
$$ 1082909 1570663 1338344 565183 17518 -130590 -154418 -123798 16364 273394 805869
12894H05869Q00826K94964j033236j726385p11511Q33669J054100J01469m79151
$$ 805869 1606695 1901659 868423 -857962 -1569473 -735804 318296 419765 -59386
12885e9386l51384l88170n36330J17777J213701J240451Q3621n97786m5697N04306
$$ -59386 -410770 -798940 -1335270 -1217493 -3792 1236659 1320280 722494 676797 1181103
12875A181103J48146j52203N21144J197746N40272q72904j306358l38628P82701
$$ 1181103 1329249 1177046 1698190 2895936 3436208 2563304 1256946 918318 1701019
12866A701019J033031O74637L32043l5908p74764j622588j750677q14540L90755
$$ 1701019 2734050 3408687 3740730 3704822 2930058 1307470 -443207 -1257747 -866992
12857h66992P49471K37703o6869M21245R18475N32032l17545o29199m37027n36428
$$ -866992 -117521 120182 53313 474558 1393033 1925065 1607520 978321 541294 4866
12847D866q74541n59296M27938Q91690K82269l03972K14422J171269J115787l0293
$$ 4866 -869675 -1428971 -1001033 -109343 172926 -131046 83376 1254645 2370432 2340139
12837B340139q92431o18062Q1203J61245k45347j99404M81932Q18346M8224j178208
$$ 2340139 1447708 829646 910849 1072094 826747 627343 1109275 1927621 1975845 797637
12827G97637j558076p90160K21953P08129P49932N73463Q1110n21055n65891j0139
$$ 797637 -760439 -1550599 -1328646 -620517 129415 702878 783988 262933 -302958 -313097
12817c13097K10640l17240n63313K97956J200694O28606q39383j185518j6387
$$ -313097 -102457 -419697 -983010 -685054 515640 1144246 304863 -880655 -897042
12808h97042Q86115M00494l58748j07366N49448L65333l79344m33710L05530P04080
$$ -897042 -10927 389567 30819 -76547 472901 838234 458890 25180 330710 1034790
12798A034790K92693n3688L76079R69921P43102j66111o96380l85117M0880j65011
$$ 1034790 1327483 1273795 1649874 2619795 3362897 3196786 2500406 2115289 2156169 1991158
12788A991158o13014m28913K47803L50674m06809r29282l92181M36023M02074
$$ 1991158 1378144 949231 1197034 1547708 1140899 211617 -180564 255459 657533
12779F57533k72540n54768l21124k01537j22222M79635J141012P12738o31928
$$ 657533 384993 -169775 -490899 -692436 -814658 -335023 805989 1518727 886799
12770H86799j345246q06592o0166K06289O30760J353159J137853l87833j380865
$$ 886799 -458447 -1265039 -1325205 -1118916 -488156 865003 2002856 1615023 234158
12761B34158m20735R49866M39436j277243j487304L42431J771357J071636n12846
$$ 234158 -186577 763289 1202725 -74518 -1561822 -1219391 551966 1623602 1110756
12752A110756r76295k63996L08824J64801j45247q1824J97280J41031m79061j029857
$$ 1110756 134461 -129535 179289 344090 198843 117019 314299 455330 -23731 -1053588
12742a053588m77176J109313K042396J014894q32914j234259K1902R04344K81379
$$ -1053588 -1530764 -421451 1620945 2635839 1802925 568666 590568 1494912 1776291
12733A776291o01033m23566J91748P5200n04898n77333j70669J6591r2410j45399
$$ 1776291 1175258 751692 943440 1018640 513742 -63591 -234260 -217669 -310079 -455478
12723d55478k14003m29338m00089M1258K14467k82753n90034J38266J205007J369830
$$ -455478 -669481 -1098819 -1498908 -1457650 -1243183 -1525936 -2115970 -1977704 -772697 597133
12713E97133O98449P6659m36167j209403j576121n95282R73220J359865M97725
$$ 597133 1295582 1372241 936074 -273329 -1849450 -2444732 -1471512 -111647 386078
12704C86078J31639Q98968J253586O8557j434707j521517m19209L19093Q5671
$$ 386078 517717 1416685 2670271 2738828 1304121 -217396 -636605 -317512 -231841
12695b31841l49767k28400L39260P25558M50696l00707o39431O6238J099021J060956
$$ -231841 -581608 -810008 -470748 254810 705506 404799 -234632 -168394 930627 1991583
12685A991583j44750r91760m70695M61700L33048p85082j579766j278061k57435
$$ 1991583 1846833 855073 384378 846078 1179126 394044 -1185722 -2463783 -2721218
12676b721218P01254R95992M03539n71816q45067Q7100J374878J771196J066025
$$ -2721218 -2019964 -1023972 -620433 -1192249 -2037316 -1950216 -575338 1195858 2261883
12667B261883J4444p95667j278260j271861m77966Q27148J594627R72848n72974
$$ 2261883 2276327 1480660 202400 -1069461 -1547427 -720279 874348 1847196 1274222
12658A274222j439635n53009J146469J507402j29695j776264j277913O87758J559774
$$ 1274222 -165413 -718422 428047 1935449 1805754 29490 -1248423 -560665 999109
12649I99109N58609m74986k15948K20567m36016j199991m41363J210550J533740
$$ 999109 1557718 1082732 866784 1087351 651335 -548656 -990019 220531 1754271
12640A754271q0799j791128j775817k62326J192902J522351Q75524Q1174k54491
$$ 1754271 1673472 -117656 -1893473 -2155799 -962897 559454 1434978 1516152 1261661
12631A261661k00886j35099j40249j25469k63739n83987m08455O77361J484996
$$ 1261661 1060775 925676 785427 659958 396219 -187768 -596223 81138 1566134
12622A566134M54222j629327k102907k59902J390906Q66153m22412k85632P06554
$$ 1566134 2020356 391029 -1711878 -1971780 -580874 285279 -137133 -422765 283789
12613B83789O20324l96418o88665j68279j50968o52307m42281M31254O69277K30247
$$ 283789 904113 507695 -180970 -349249 -500217 -1152524 -1594805 -1163551 -494274 -264027
12603b64027L74758J088383R11079l05312q75792j29991M86582k8724o71185l88228
$$ -264027 110731 1199114 2110193 1804881 929089 799098 1285680 1256956 585771 197543
12593A97543K77678N24782N68943N82339k3157j210751j737258j019896j76218
$$ 197543 475221 1000003 1568946 2151285 2128128 917377 -819881 -1839777 -2015995
12584b015995j87298m35000j14092L27319L12720L30511P62216Q25714K9909n47095
$$ -2015995 -2203293 -2638293 -2752385 -2425066 -2112346 -1781835 -1019619 -193905 -163996 -711091
12574g11091Q6540R89534P04296l45884n70844K39307P56556K85476m03060m78971
$$ -711091 -624551 364983 1069279 723395 152551 391858 1148414 1433890 1030830 551859
12564E51859j18548O8838r2305k73392r7353L25050L00422n58287j384985q81812
$$ 551859 433311 502149 409844 136452 39099 364149 664571 106284 -1278701 -2160513
12554b160513P40609J742903J185431J01285k35489L2111J88078J91931J35969
$$ -2160513 -1419904 322999 1508430 1609715 1374226 1406337 1594415 1786346 1922315
12545A922315l47699j092088r90408K73038J274598Q73356n0985k61318k19777
$$ 1922315 1574616 482528 -507880 -234842 1039756 1913112 1862127 1600809 1381032
12536A381032p70889j088636r1409J112295O37358r35748j291808r6006O63257
$$ 1381032 610143 -478493 -569902 542393 1179751 244003 -1047805 -1143811 -480554
12527d80554J71250o9690P80791J341204N43097m79118m30035N0429j32808m96785
$$ -480554 -309304 -378994 401797 1743001 2286098 1806980 1376945 1427374 1294566 797781
12517G97781r7396N48403M08107j18026J4501M01202k26136j552147j700463k037
$$ 797781 700385 1248788 1656895 1538869 1553370 1954572 1728436 176289 -1524174 -1526211
12507a526211J841194K001391P46341l58082n75279m00852l47296l09709j25310
$$ -1526211 314983 2316374 3062715 2704633 2129354 1728502 1381206 1071497 946187
12498I46187k0858k19293m81683l64240J74430O55233O07991J06415l13943k51215
$$ 946187 925329 706036 224353 -139887 34543 689776 1297767 1404182 1090239 839024
12488H39024J40606L73849K01247j42151k61442m3541K60314K81340j68087q69750
$$ 839024 979630 1353479 1554726 1412575 1151133 1107592 1367906 1649246 1481159 611409
12478F11409j207226o76458M03128J012683O47558N3119J32767M73532k0077j110947
$$ 611409 -595817 -1272275 -869147 143536 791094 844213 976980 1450512 1430435 319488
12468C19488j224259R5531J156856N41236p08391p37337K63124O02979r9982o09009
$$ 319488 -904771 -809240 347616 888852 180461 -556876 -293752 309227 209245 -399764
12458c99764l74520j57209j94254K54982J050619Q27823o62593j679162j024650
$$ -399764 -774284 -931493 -1125747 -870765 179854 1007677 345084 -1334078 -2358728
12449b358728J81419M80147K49914M37001N57452k18836j071303n97646P70465
$$ -2358728 -2177309 -1697162 -1447248 -1010247 -452795 -671631 -1742934 -2340580 -1570115
12440a570115J332422P26059J50736J79742J54292j84240j76387L34997N79604
$$ -1570115 -237693 488366 639102 818844 973136 788896 612509 947506 1527110
12431A527110K73075R9576L03654R9796q53700j537248r75028K78792R18421N73674
$$ 1527110 1800185 1899761 2203415 2303211 1449511 -87737 -1062765 -783973 134448 708122
12421G08122p1852m39951n58307n67709l97835k3585L44535M70310L41663J41132
$$ 708122 636270 196319 -361988 -929697 -1327532 -1351117 -1006582 -536272 -194609 -53477
12411e3477L3424M1900J28185K77563L84044J89586l75794q69309p38384m5056
$$ -53477 -20053 21847 150032 427595 811639 1001225 625431 -243878 -982262 -1027318
12401a027318O21243R08793Q61380M26060l98013r20239l34256P86641P64164
$$ -1027318 -406075 502718 1364098 1790158 1392145 471906 137650 924291 1688455
12392A688455q03351k119283j567407O8959R43497P66756O33903Q74210P21970
$$ 1688455 885104 -1234179 -2801586 -2732627 -1789130 -1022374 -388471 485739 1207709
12383A207709l0251n69706m29238j05049n6084p0123J08107L04590K89109L3549
$$ 1207709 1177458 607752 178514 73465 17381 -52742 55365 359955 649064 682613
12373F82613m34685r10585r08933k79132L50961M03867K29029L71481M88884M8328
$$ 682613 247928 -662657 -1571590 -1850722 -1499761 -1095894 -866865 -495384 -6500 41828
12363D1828l82686J26530J108676J147662R1244o68168l53538K04303J81095r144
$$ 41828 -340858 -214328 894348 2042010 2133254 1465086 1111548 1315851 1496946 1487802
12353A487802K00297L80177n8919p10812p56392j88573L00225L28680J26264J1724
$$ 1487802 1688099 2068276 2009357 1298545 542153 353580 653805 982485 1108749 1120473
12343A120473L532r9410m05008o54846m07351K92690P27692L96557k62972n81400
$$ 1120473 1124005 1024595 619587 -35259 -442610 -149920 577772 974329 711357 129957
12333A29957o48039q39610q09974k709J057075J160030J68456o84959m68233L60320
$$ 129957 -518082 -1357692 -2167666 -2170375 -1113300 46730 215186 -469773 -938006 -577686
12323e77686P64326L28952m93933q04716k9417J207904J416642J54756j064915
$$ -577686 186640 515592 21659 -783057 -812474 395430 1812072 1966828 901913
12314I01913q24276O7718k756o81330l44623Q46437J016994j59765p70589J12633
$$ 901913 77637 145355 142599 -538731 -883354 -36917 980077 820312 49723 162356
12304A62356R00211K56878p31023n40620M24846R22153Q06632M80190j90374j012040
$$ 162356 1062567 1319445 588422 47802 472648 1394801 2201433 2681623 2491249 1479209
12294A479209r02963L53617J128435K53075j000432r13470k5343N6501n28528
$$ 1479209 576246 929863 2058298 2311373 1310941 397471 372128 428629 -99899
12285i9899l78251N82251J080847O86823J48667j77565n33317o77584k33701J94658
$$ -99899 -478150 104101 1184948 1871771 2020438 1842873 1309556 631972 398271 592929
12275E92929j48784o27624j88590N71191K47976p85655q13050K43534N66717m58121
$$ 592929 444145 -183479 -372069 199122 447098 -338557 -1151607 -908073 -341356 -799477
12265g99477j126625j95485J162624J255489K26542n58470l79885M33269J095288
$$ -799477 -1926102 -2121587 -958963 296526 523068 -35402 -415287 17982 1113270
12256A113270Q44962k87265j027010l14381Q15028M19307j194450j587258L537
$$ 1113270 1958232 1670967 643957 329576 1144604 1563911 369461 -1217797 -1214260
12247a214260J287794M90933r37182q61502K32445N57814J23047J68410N54203
$$ -1214260 73534 564467 -372715 -1234217 -1001772 -443958 -320911 -152501 401702
12238D01702J35028q25055r26336r0346L98358K42880M33738J055369Q76621l76440
$$ 401702 536730 -288325 -1214661 -1305007 -906649 -663769 -230031 825338 1701959 1325519
12228A325519j222801o48033M58958Q99804P89201O86164L67378m46904j079275
$$ 1325519 102718 -545315 -86357 813447 1602648 2288812 2656190 2209286 1130011
12219A130011p31837K17208O82891L00207l14441m84001j63478J19398j77144
$$ 1130011 398174 615382 1298273 1598480 1284039 800038 636560 755958 578814
12210E78814q68499r88150l2224R84534O82158n85640j058274j49313P56255N69423
$$ 578814 -289685 -1277835 -1310059 -325525 356633 -229007 -1287281 -1436594 -680339 -110916
12200a10916L3031J36338M45771K13027q6890K57959O43517R8564r27030j214090
$$ -110916 -77885 58453 504224 717251 630361 888320 1531837 1630401 703371 -510719
12190e10719o55469o1522L50748P70850O59322m73284j524645r13641Q68308J700410
$$ -510719 -1166188 -1227710 -876962 -106112 553210 79926 -1444719 -2358360 -1490052 210358
12180B10358Q94156j11549l28790m07861p01109l06323R16700J348404O2023j346628
$$ 210358 1104514 992965 664175 256314 -444795 -751118 165582 1513986 1576009 229381
12170B29381j009739M26632R96376L68000k38150l78721o99985j190164r40099
$$ 229381 -780358 -353726 642650 1010650 772500 393779 -306206 -1496370 -2436469
12161b436469K00305J178519J216460O11070p2871n41022m24681M52650J266298
$$ -2436469 -2236164 -1057645 158815 769885 697014 155992 -268689 183961 1450259
12152A450259Q14717o56508j356394k88804J237979J265136k78387j609535j404551
$$ 1450259 2264976 1608468 252074 -36730 1201249 2466385 2187998 578463 -826088
12143h26088k03510O14768N66665K85785L03701K97085j65939o54643l74211M90876
$$ -826088 -1029598 -414830 151835 437620 741321 1038406 872467 217824 -156387 334489
12133C34489Q01024P8124p32551o29960N4529L49578R7185j66779l04483n31123
$$ 334489 1135513 1213637 481086 -148874 -94345 255233 352418 185639 -118844 -649967
12123f49967n69010M8354Q83425Q99424L405p34309o67481l70906m08593l07718
$$ -649967 -1218977 -1170623 -287198 612226 615631 -118678 -786159 -1157065 -1565658 -1873376
12113a873376M67011J277644J071077L2346n37418k5684O95407N95903r6991m02016
$$ -1873376 -1406365 -128721 942356 974702 437284 411600 1107007 1702910 1605919 1203903
12103A203903q6887J08199k69992o87311n43112j63975k31674n97958m72612L00897
$$ 1203903 1117016 1225215 955223 267912 -275200 -439175 -670849 -1268807 -1741419 -1440522
12093a440522R61620R31988M72522M1876k80133m43286k14472K68136L57035k04073
$$ -1440522 -478902 453086 925608 967484 687351 244065 29593 297729 654764 450691
12083D50691p60802n93291J69049Q55953J001706M84182m70672j097462o36288
$$ 450691 -310111 -903402 -734353 121600 1123306 1607488 1136816 39354 -596934
12074e96934N15890J007147L70394k76529j1519M85405K55577k62211j61945J83000
$$ -596934 -81044 926103 1296497 1019968 1008449 1493854 1749431 1487220 1325275 1508275
12064A508275j70037q43427o14525M28189Q15640r7440j252372j480784q19292
$$ 1508275 1338238 494811 -119714 308475 1124115 1026675 -225697 -1706481 -2525773
12055b525773M5251O24828O46967J07170m48743m23403l3395L9429k04382j19927
$$ -2525773 -2480522 -1855694 -1208727 -1101557 -1550300 -1973703 -2007098 -1967669 -2172051 -2291978
12045b291978M52832R75298J093872Q97648M09675k81831n61781K6475P84773
$$ -2291978 -1839146 -863848 230024 1127672 1537347 1255516 693735 720210 1504983
12036A504983O27159k92858q45911o48171k83986Q923M60041O74002N467r12244
$$ 1504983 2132142 1839284 993373 345202 61216 70139 530180 1204182 1209649 297405
12026B97405p00440M73090R00124M3378o01108l3385O87348L94508l20142l71459
$$ 297405 -403035 70055 970179 1013557 412449 379064 1066412 1460920 1140778 769319
12016G69319P6208L07143K66607Q107p76765j582305r05339J364199K791539J400664
$$ 769319 845527 1152670 1419277 1427384 650619 -931686 -1837025 -472826 2318713 3719377
12006C719377j289130k169918o98982Q59828Q76974p79n98568p30084o22092k65448
$$ 3719377 2430247 260329 -438653 421175 1298149 1297370 698802 -31282 -653374 -918822
11996i18822K02309M25632L65564K00968j36268n41712l08258Q02655J563109
$$ -918822 -716513 -290881 74683 275651 139383 -402329 -710587 92068 1655177
11987A655177P47010p76504j049263M2281O66411J94p01114n24472l67466r30428
$$ 1655177 2402187 1625683 576420 618701 1285112 1285306 584192 59720 -307746 -1238174
11977a238174j071836K62801J831880J658536K121j051842n85999K93203N13684
$$ -1238174 -2310010 -2047209 -215329 1443207 1445328 393486 -192513 100690 614374
11968F14374K98646J27493q5725l06688j53487R1968n07804j787779j986896j37705
$$ 614374 913020 1040513 954788 648100 494613 586581 78777 -1709002 -3695898 -3833603
11958c833603K085613K361179Q75510j76240Q4632K98830m84359j178220o25014
$$ -3833603 -1747990 613189 1488699 1312459 1397091 1695921 1211562 33342 -591672
11949e91672L65072L30096n18833q14095k70142J49368P0318J81974P24478Q84569
$$ -591672 -226600 103496 -415337 -1229432 -1499574 -1350206 -1279888 -1097914 -373436 511133
11939E11133J79716o36571o65113n8093M66456O44924N89906K52251l29208o04854
$$ 511133 690849 54278 -610835 -668928 -202472 442452 1032358 1284609 955401 350547
11929C50547j02985O65137O15251m23715j232556o66163P48194J359817N71281
$$ 350547 247562 912699 1527950 1104235 -128321 -794484 -46290 1313527 1884808
11920A884808l52555j79550L74480k20465j651148j879120k45207J262699Q88000
$$ 1884808 1532253 1352703 1727183 1506718 -144430 -2023550 -2268757 -1006058 -118058
11911a18058k32865P9204J541951J800491L8199j816168j848279m78783O44752
$$ -118058 -350923 -271719 1270232 3070723 3108922 1292754 -555525 -1034308 -389556
11902c89556Q15590N09392L04317L49289M82061L94359m7879n00983n09910j44242
$$ -389556 426034 935426 1239743 1589032 2071093 2465452 2417573 1916590 1406680 1262438
11892A262438J78794L45165M47729K84227l16743q86071q30047l41272J4563K71454
$$ 1262438 1441232 1786397 2234126 2518353 2201610 1315539 485492 144220 158783 430237
11882D30237O45377N89226m27893j490171j120981M11616J242210N62749m05615
$$ 430237 1075614 1664840 1236947 -253224 -1374205 -962589 279621 842370 436755
11873D36755m59274N3782K81402J27893j19423l11453j56384N13270R88660M38663
$$ 436755 -22519 31263 312665 440558 321135 9682 -146702 366568 1355228 1793891
11863A793891n13224n13476J35019k32412j596300j793578m958J631707J330866
$$ 1793891 1280667 767191 902210 669798 -926502 -2720080 -2725038 -1093331 237535
11854B37535M02547P67296J618902R84695o72329j058808K74907J317511P01538
$$ 237535 640082 1407378 3026280 4010975 3338646 2279838 2554745 3872256 4573794
11845D573794o04905j084525n88397L8748J63239k55166p97172q67007k95023
$$ 4573794 3968889 2884364 2295967 2334715 2497954 2242788 1445616 578609 283586
11836B83586L49943M02110j30867p05904q10231k22867P36199J120884L41264
$$ 283586 633529 1035639 904772 198868 -611363 -834230 -98031 1022853 1364117
11827A364117o85679n16345N12643N07348r43149j787220o30669R74891R22319
$$ 1364117 678438 162093 674736 1182084 238935 -1548285 -2178954 -1204063 -281744
11818b81744l21742q42351k85599L06619P23956J453536J881872Q42423j155812
$$ -281744 -603486 -1445837 -1731436 -1424817 -700861 752675 2634547 3476970 2321158
11809B321158k187433j494744k07227N49649P47691O21735K08600j37096j7028
$$ 2321158 133725 -1361019 -1568246 -1018597 -270906 350829 559429 422333 405305
11800D05305J71429j92472o83283l87420M31916O13634l90l55112L1723M33623
$$ 405305 576734 384262 -299021 -686441 -254525 359109 358719 3607 35330 468953
11790D68953K89305j9239o2917L290j9336n3535j04482k13790j41700J89637K74244
$$ 468953 758258 739019 676102 679392 660056 606521 502039 288249 146549 336186 610430
11779F10430j07794j51648P08629J416891O53680r11988j468326q71107o46889
$$ 610430 502636 350988 1059617 2476508 3130188 2218200 749874 -121233 -768122
11770g68122j172957r97772M95120J756935J373725P9887o17310n03608k14382
$$ -768122 -1941079 -2938851 -2443731 -686796 686929 766816 149506 -354102 -568484
11761e68484J63268Q02154J216866Q36568P1431j82782J42125K74556k02498p62081
$$ -568484 -405216 396938 1613804 2450372 2521803 2339021 2481146 2755702 2553204 1791123
11751A791123n93527M27163J446898J344797n4273j572411j847875q20476L56075
$$ 1791123 1197596 1624759 3071657 4416454 4362181 2789770 941895 121419 477494
11742D77494P18802K86110l84800p77238o05926m0378K96412P4399j76829J53872
$$ 477494 1196296 1482406 1097606 320368 -285558 -325936 -29524 44875 -131954 21918
11732B1918O95880O04946p4383m67745k30036P2437N725j49698j9885L30624N96618
$$ 21918 717798 1322744 1248361 780616 550580 623017 628742 479044 459159 789783 1386401
11721A386401M66360k07382r58402q41673K29302Q34314j37550j502225j123808
$$ 1386401 1852761 1645379 686977 -154696 74606 908920 771370 -730855 -1854663
11712a854663Q98531K109097J098711o36873j018481j43016M11022M2815m20584
$$ -1854663 -956132 1152965 2251676 1614803 596322 453306 864328 907143 486559
11703D86559k97684J07140K56465J35785K3472p01j9889J6596K26429M28896K10017
$$ 486559 188875 296015 552480 688265 711737 711036 691147 707743 934172 1363068 1573085
11692A573085l83369n89149M1432O53773P9207j240754j569058m25618N89314
$$ 1573085 1189716 600567 641999 1295772 1374979 134225 -1434833 -1860451 -1271137
11683a271137K65771l67566J13506J103257J028584j0139m75258J03085N67462
$$ -1271137 -1005366 -1372932 -1259426 -156169 872415 862276 387018 490103 1057565
11674A057565P9861p69436r75944k96757O13511O84121n00246j635398p82118
$$ 1057565 1137426 367990 -607954 -904711 -291200 392921 -107325 -1742723 -2524841
11665b524841J669848K670540O16255j880464j523545Q28642J694312L25107p83491
$$ -2524841 -854993 1815547 2431802 551338 -972207 -143565 1550747 1875854 1092363
11656A092363l77672Q2422k26756j24715O67501M83966j063238j764210l84467
$$ 1092363 714691 797113 570357 445642 1113143 1597109 533871 -1230339 -1614806
11647a614806J119345Q62002L3399M34872J219452O49560o21952p60348k5210
$$ -1614806 -495461 366541 399940 834812 2054264 2703824 2081872 1321524 1296314
11638A296314j05693r35781q48145L71399J064137M64719k64518j48965K75205
$$ 1296314 1190621 254840 -593305 -221906 842231 1306950 1042432 893467 1168672
11629A168672K91928J26150Q5204j68404p57100r72756l08323N49385N33537l28288
$$ 1168672 1460600 1586750 1671954 1503550 746450 -226306 -534629 14756 548293 220005
11619B20005r30143n26588L70732P23625K65191l08332l41733Q6548O02712J063525
$$ 220005 -710138 -1236726 -865994 -142369 122822 -185510 -527243 -440695 162017 1225542
11609A225542J252583P03812m72009j155686n54233M65393M71809m18242p83005
$$ 1225542 2478125 3181937 2709928 1554242 1000009 1465402 1937211 1518969 735964
11600G35964j11656O02466N93700K91023K34218K37439L5340k54216n85420r44455
$$ 735964 624308 1226774 1820474 2111497 2345715 2583154 2618494 2364278 1778858 834403
11590H34403q25142R4831Q30457J26672j354064j633950m35532L92036j0563j62681
$$ 834403 9261 104092 934549 1061221 -292843 -1926793 -2362325 -1970289 -1980852 -2143533
11580b143533R51502J863176R85783p21396j268563n29555J71029L56910N26367
$$ -2143533 -1192031 671145 1656928 935532 -333031 -862586 -691557 -334647 191720
11571A91720P13443N40406J75522q5544n53779j248974j150425K29393J437088
$$ 191720 905163 1445569 1621091 1535547 981768 -267206 -1417631 -1188238 248850
11562B48850R46258l32958l42127Q45834J177910l7055j123137q01375K5788J17034
$$ 248850 1195108 862150 520023 1365857 2543767 2506712 1383575 582200 607988 725022
11552G25022j23829K68322Q88111N44470p00477j396764o98090M94646Q09705
$$ 725022 601193 869515 1757626 2302096 1601619 204855 -493235 1411 811116
11543H11116J82366l18561j48318J22862K8226K6322M54732N76451k15073r48289
$$ 811116 993482 674921 526603 649465 677691 704013 1158745 1735196 1520123 571834
11533E71834l38044R19350R55859k03726n18900O33127J188762k38318j831001
$$ 571834 233790 1153140 2108999 1905273 1386373 2019500 3208262 2969944 1138943
11524A138943j266078O46222J251378L0405j024836o68915J58026L41112J67763
$$ 1138943 -127135 519087 1770465 1800870 776034 107119 265145 606257 774020
11515G74020K88369M71364J74273m48761p63708m96396J5596K53962J03830L58
$$ 774020 1062389 1533753 1708026 1259265 495557 -839 14757 268719 372549 372907
11505C72907K75482M70222n0477q01642n68279N76505R71587j20877j084784l23444
$$ 372907 648389 1118611 1068134 266492 -301787 274718 1246305 1125428 40644 -282800
11495b82800J142814J178944j85432r48461k65788O00776N67907J33370M8663
$$ -282800 860014 2038958 1853526 905065 639277 1240053 1807960 1941330 1989993
11486A989993J44338J07898J67225L36450N6118p40461j144371n67895K64834
$$ 1989993 2134331 2242229 2409454 2745904 2802022 2061561 917190 349295 614129
11477F14129L56034j70191m38896j14507L71046N53188K98499l12534r33335j002572
$$ 614129 970163 799972 361076 246569 617615 1170803 1469302 1156768 223433 -779139
11467g79139l77723K40968P4460n94979o35485M21536J596230J577422L36227
$$ -779139 -1156862 -915894 -841434 -1436413 -2071898 -1650362 -54132 1523290 1859517
11458A859517q46640q97183m1264O91963O22967j35445r96341j318458p99483
$$ 1859517 1012877 115694 74430 766393 1389360 1253915 257574 -1060884 -1860367
11449a860367J60144O87483L90491j32608j14831L14331M00682p0278m73653k37081
$$ -1860367 -1700223 -1012740 -622249 -754857 -869688 -555357 -154675 -224953 -698606 -935687
11439i35687M34391Q58186O76483K81228L71049Q97552P72319o32972j959735
$$ -935687 -501296 356890 1033373 1314601 1685650 2583202 3355521 2722549 762814
11430G62814j227119J073592K052386M26892j516179j464509n55778r82210j874413
$$ 762814 -464305 609287 2661673 3088565 1572386 107877 -447901 -1430111 -3304524
11421c304524p54573J877528K961401J700253M32087L48355m9675j319355j531005
$$ -3304524 -4059097 -2181569 779832 2480085 2912172 3260527 3210852 1891497 360492
11412C60492M5761J044912r2683j281578l39211J242040R26919n87017q35560
$$ 360492 406253 1451165 1358482 76904 -262307 979733 1906652 1319635 484075
11403D84075K08657N43504k15845n59244N9508O78526Q12314P35773J79717j125730
$$ 484075 692732 1236236 1020391 461147 520655 1199181 2011495 2747268 2926985 1801255
11393A801255k027430j181512O43893J495383J057174N76761M77707J64758k31067
$$ 1801255 -226175 -1407687 -763794 731589 1788763 2365524 2843231 3007989 2776922
11384B776922j16214p1264r66875j815241r57847Q54374J250953J06269k65915
$$ 2776922 2660708 2589444 1622569 -192672 -1150519 -296145 954808 1061077 795162
11375G95162Q49459J352136P3414j156739o73453L00992l8064j045203r36011
$$ 795162 1644621 2996757 3070171 1913432 1239979 1540971 1502907 457704 -478307
11366d78307K90828J180063J082166M29077m21884j139429r92234J08227Q51889
$$ -478307 -187479 992584 2074750 2503827 2081943 942514 -49720 58507 910396
11357I10396K12445p89538m85051Q35356J334619M00379o31595o35726q9791J09141
$$ 910396 1122841 333303 -151748 683608 2018227 2418606 1787011 1151285 1061494 1170635
11347A170635j5075o066R7457L9842k8334J42303L53035K76105J9275j49432l50476
$$ 1170635 1155560 1149494 1246951 1286793 1258459 1400762 1753797 2029902 2049177 1899745 1549269
11336A549269p49606q88271j78413Q80855R11210m51739j669658j117189P14858
$$ 1549269 799663 -88608 -267021 613834 1525044 1073305 -596353 -1713542 -998684
11327i98684J801741J155793k12920r44218q71854n58395k26839J80917M63939
$$ -998684 803057 1958850 1745930 801712 -70142 -628537 -855376 -674459 -210520
11318b10520L67382P4633J7392L15201O54002O21195J26112l76840l06382J17646
$$ -210520 156862 231495 248887 564088 1218090 1839285 1965397 1588557 1282175 1399821
11308A399821j28506j286391j866142m89163J740940K310376P13850r45945j079895
$$ 1399821 1271315 -15076 -1881218 -2370381 -629441 1680935 2394785 1448840 368945
11299C68945m68527l03490k58261K97265P45521L42917k84306j64728M46860P42852
$$ 368945 -99582 -403072 -661333 -364068 381453 724370 440064 275336 722196 1465048
11289A465048O43564K84273o40872j794935j735473j6838J509862J191868J05804
$$ 1465048 2108612 2392885 1752013 -42922 -1778395 -1795233 -285371 906497 1012301
11280A012301J23782P05881Q8959j249658j201070K21873P24494l88953j052696
$$ 1012301 1136083 1841964 1930923 681265 -519805 -297932 426562 37609 -1015087
11271a015087J2918J226156R29982J2005N7829O21133K42225r35307j442941q11757
$$ -1015087 -1002169 223987 1153969 1165974 1223803 1844936 2087161 1151854 -291087 -1102844
11261a102844n875K30488J15626m5107l39706o65449n12683L24757J274679J486609
$$ -1102844 -1108719 -878231 -762605 -807712 -1147418 -1812867 -2325550 -2000793 -726114 760495
11251G60495O63206o03300j214022m89445J021932J851762J094382n15779j408688
$$ 760495 1423701 820401 -393621 -883066 138866 1990628 3085010 2569231 1160543
11242A160543j023834l19513k59002m45012N8082R60205R24167l30757j287679
$$ 1160543 136709 -182804 -441806 -886818 -828736 131469 1055636 724879 -562800
11233e62800p10091N28098P85253R2379j48673M56520P72513Q1642q53863j036189
$$ -562800 -1272891 -744793 40460 132839 -15834 440686 1213199 1294841 440978 -595211
11223e95211m16666M72899J070173Q10278l03424j082164l70944J048887J279928
$$ -595211 -1011877 -538978 531195 1341473 1038049 -44115 -415059 633828 1913756
11214A913756J87549l50605M56646R68657j49295j688738j772655n14288O26324
$$ 1913756 2101305 1750700 2207346 3176003 3026708 1337970 -434685 -948973 -322649
11205c22649R67901P27195M2266p96926r91799k78160M33774L69751n9131k75712
$$ -322649 645252 1372447 1414713 617787 -374012 -652172 -218398 151353 92222 -183490
11195a83490m38714n23660J01428J214374J389471K72042m34868L38080J061457
$$ -183490 -622204 -1145864 -1044436 169938 1559409 1831451 1396583 1734663 2796120
11186B796120J11078j358818j206137K55080R13522J80344n80723n13420j47260
$$ 2796120 2907198 1548380 342243 597323 1510845 1691189 1110466 597046 449786
11177D49786K0458J67703M25154O81653Q72638P07230j71800j120329q54427L27127
$$ 449786 470244 637947 1063101 1744754 2617392 3324622 3152822 2032493 1178066 1505193
11167A505193M18316j066320j858433n79575P28175L6929j039118j27573J412592
$$ 1505193 1923509 857189 -1001244 -1580819 -852644 -815715 -1854833 -1982406 -569814
11158e69814O86139j394535j229980J409464K762196J022935j092633r92155Q2718
$$ -569814 116325 -1278210 -2508190 -1098726 1663470 2686405 1593772 601617 684335
11149F84335j12386j021577o42415R85120J849388Q63882q65885j552955o90958
$$ 684335 571949 -449628 -1092043 -106923 1742465 2606347 1740462 187507 -503451
11140e03451N67201Q39359K00387j18834J95110O738j063915j498920l10373R45921
$$ -503451 63750 903109 1103496 984662 1179772 1186510 122595 -1376325 -1686698 -740777
11130g40777N04995n98427k00021J298685J527062l3343j398367j195526j37954
$$ -740777 -235782 -834209 -1034230 264455 1791517 1758174 359807 -835719 -973673
11121i73673P08684J101592R41180K05193l74200q5596N19175N64066M16174P11902
$$ -973673 -264989 836603 1777783 1982976 1608776 1523180 2042355 2606421 3022595 3734497
11111C734497O95355m90649j712600j305152R1081N26380o0026j50336L76053
$$ 3734497 4429852 3939203 2226603 921451 1012532 1538912 1478886 1328550 1704603
11102A704603K44243n27739n77038K64024Q04663P06726N33127j7520j418274
$$ 1704603 1948846 1421107 844069 1108093 1912756 2619482 3152609 3135089 1716815
11093A716815k337075j133733J022316J448154R7727o41698j08751K0376o04935
$$ 1716815 -620260 -1753993 -731677 716477 814204 172506 63755 84131 -520804
11084e20804k67660J252231J746292K91732j064650n87427O92674J006606K28343
$$ -520804 -788464 463767 2210059 2501791 1437141 849714 1542388 2548994 2777337
11075B777337p39413j177345o02003P16268J253006Q8671j159543n23513R19081
$$ 2777337 2037924 860579 258576 974844 2227850 2316521 1156978 633465 1552546
11066A552546P05480o71222o02605Q30634Q94512p79264j408175n9043P22934
$$ 1552546 2258026 1586804 984199 1814833 2709345 1930081 521906 462863 1185797
11057A185797m30459j364098l97872R06104Q72975M10926O30843O51199k93556
$$ 1185797 755338 -608760 -1006632 -100528 772447 1183373 1814216 2465415 2171859
11048B171859j092522q28076k97774j22788K86450P98374K08582j169275j355721
$$ 2171859 1079337 251261 -46513 -169301 117149 915523 1124105 -45170 -1400891
11039a400891j20214M54497k33190k76104Q60221J053783m10342j212628k15271
$$ -1400891 -1521105 -1066608 -1299798 -1575902 -715681 338102 -72240 -1284868 -1500139
11030a500139M40732m90502q89372N96004J693788O15022n50522K81260J249699
$$ -1500139 -1059407 -1549909 -2439281 -1843277 -149489 465533 -84989 196271 1445970
11021A445970L2221j706364j180372O48056R69235o8135l00786K51231r3495j051879
$$ 1445970 1478191 -228173 -1408545 -760489 208746 140611 -160175 91056 -2439 -1054318
11011a054318q33492M44144R62106L83131O8194M62302O87654M62513L61117M45640
$$ -1054318 -1887810 -1443666 -481560 -98429 -30235 432067 1119721 1582234 1943351 2388991
11001B388991L13205Q1709l947k58782p33648p07887m7983K08512l12243m07150
$$ 2388991 2702196 2783905 2779958 2521176 1787528 1079641 1031658 1240170 927927 520777
10991E20777O27413J613879J395717M75853l74475j306909k040251j368887O05751
$$ 520777 1148190 2762069 4157786 4633639 4259164 2952255 912004 -456883 148868
10982A48868J771689R44026m50351q64900o63196m78134L6208N51751j87293j613778
$$ 148868 1920557 2864583 2414232 1549332 886136 408002 444210 995961 808668 -805110
10972h05110j261743J020200K025281K70689j336306l37918J255660P79787n21503
$$ -805110 -2066853 -1046653 978628 1249317 -86989 -424907 830753 1610540 1089037
10963A089037k23012Q23829M87850n29218l02069N58398L33762l73349o5150M90414
$$ 1089037 866025 1689854 2177704 1648486 1346417 1904815 2238577 1865228 1800078 2290492
10953B290492j39323r90727n70451k6044r90756k006759q15542J313616J434586
$$ 2290492 2151169 1160442 589991 563947 -426809 -2433568 -3249110 -1935494 -500908
10944e00908j10448n01865O71213J217111M94147N6752L85118L34844k44880l32229
$$ -500908 -611356 -1113221 -442008 775103 1269250 1326002 1711120 2045964 1801084 1468855
10934A468855k518j77890m91450l026N45458j37552j189124q07348M82758O50482
$$ 1468855 1466337 1288447 796997 793971 1339429 1201877 12753 -794595 -311837 338645
10924C38645l04541n42246K81169P07296K85840M4096K97809L74913K70040L90336
$$ 338645 34104 -508142 -226973 480323 766163 810259 1108068 1482981 1753021 2143357
10914B143357J53109r70679j717980o81724J044204J322703L50272J8923N63642
$$ 2143357 2296466 1325787 -392193 -1073917 -29713 1292990 1643262 1662185 2225827
10905B225827N27477l54257q46166n73814l51445l57321o9639L08002K60192K49970
$$ 2225827 2753304 2399047 1552881 979067 627622 270301 200662 508664 768856 1018826
10895A018826P86260J032455K28937n44018p5105O75389K24081o89731m53210
$$ 1018826 1805086 2837541 3066478 2522460 2447355 3122744 3346825 2657094 2203884
10886B203884M53828M21418l47951m42925R9177K38698J21538L76824K77110q73725
$$ 2203884 2657712 3079130 2731179 2288254 2387431 2626129 2747667 3124491 3401601 2527876
10876B527876j673057o56610P58198L00509j229636j187784N77772J795027J598800
$$ 2527876 854819 198209 956407 1256916 27280 -1160504 -582732 1212295 2811095
10867B811095J153210Q28803j53156j382787j441905m58485L4443k81871l57616
$$ 2811095 3964305 4793108 4639952 3257165 1815260 1356775 1391218 1109347 751731
10858G51731K704N6967k7213N17613J202378Q54826k94606j035520j161696j195550
$$ 751731 754435 811402 784189 1301802 2504180 3359006 3064400 2028880 867184 -328366
10848c28366q91306R3232Q83647O06037m9153j92782l40402q65111n67652J062504
$$ -328366 -1219672 -1126440 -242793 363244 314091 121309 -219093 -1084204 -1651856 -589352
10838e89352K010919O69243j183676j045299L79554P71513P1981k26562j25769
$$ -589352 1421567 2090810 907134 -138165 241389 1012902 1084883 858321 732552
10829G32552m11872l51599Q65463J788895Q00221q78365j146458l91570l9581
$$ 732552 320680 -30919 834544 2623439 3423660 2545295 1398837 1007267 967686
10820I67686L30806J347904J478666k84293j612116m44295R51482k94693k236333
$$ 967686 1298492 2646396 4125062 3840769 2228653 1784358 2735840 2441147 204814
10811B04814j241443J464139J715183m92881j310249K67072J349974O18756j70696
$$ 204814 -1036629 427510 2142693 1649812 339563 606635 1956609 2575365 2404669
10802B404669k31287o82469j303750o45522N70261K46597j058552r60134K79126
$$ 2404669 2173382 1490913 187163 -458359 111902 358499 -700053 -1660187 -1381061
10793a381061L36375n67496j40941J262744J112127k68841r114J787933J772742
$$ -1381061 -1044686 -1612182 -1753123 -490379 621748 352907 343793 2131726 3904468
10784C904468p49249k368169j076032J004207J538094Q99641J79697l97670l74282
$$ 3904468 3155219 787050 -288982 715225 2253319 3152960 3332657 2934987 2560705
10775B560705O07114J167056j50099j922519j751117l59735j88515q67726k27327
$$ 2560705 3167819 4334875 4184776 2262257 511140 151405 -37110 -904836 -1132163
10766a132163J119550Q03690m26490K05487K003037J588970q89893j689077O9650
$$ -1132163 -12613 791077 364587 570074 2573111 4162081 3272188 1583111 1652761
10757A652761J157265J45999o14782O7146K72649p78610j117780k9761N23792
$$ 1652761 2810026 2956025 2341243 2408389 2681038 1902428 784648 754887 1278679
10748A278679k73172p34719j46234J21213k90199j32478N13020L17853k32071
$$ 1278679 1005507 270788 124554 245767 -44432 -176910 336110 653963 421892
10739D21892L69100J129757Q564j661934q76877J422496J559445l95277q75066
$$ 421892 790992 1920749 1929313 267379 -609498 812998 2372443 1977166 1102100
10730A102100N40434O38887r31509q23019J452902K219373K66588j070278j24454
$$ 1102100 1642534 2281421 1349912 526893 1979795 4199168 4465756 3395478 3271024
10721C271024M61482q01550j547374l96177N34894J2556j65003P22282O98795
$$ 3271024 3732506 2930956 1383582 987405 1522299 1534855 1369852 2092134 2790929
10712B790929o65169r80221L60545Q78489j88130m33065R00128J378215J43746
$$ 2790929 2125760 1145539 1506084 2384573 2196443 1763378 2663506 4041721 4185467
10703D185467n14623J89296R9745j245822j395944J52411P41752l93631p97269
$$ 4185467 3670844 3860140 3959885 2714063 1318119 1470530 2212282 1818651 1021382
10694A021382J82573J88741r84868m55089J947583K479975k1989j902285r82123
$$ 1021382 1203955 1392696 407828 -47261 1900322 4380297 4358308 2456023 1473900
10685A473900K50832j31875m04636M36635M26262r14860r55275R15104J566941
$$ 1473900 1724732 1592857 1188221 1624856 2051118 1136258 180983 1096087 2663028
10676B663028j65438j122810M45976J781151P47562p23395q13329q09147j508476
$$ 2663028 2497590 1374780 1820756 3601907 4349469 3626074 2812745 2003598 495122
10667D95122j138234P82653J790540Q17109K9580N47662N79897n39724p99783
$$ 495122 -643112 139541 1930081 2747190 2776770 3324432 3904329 3364605 2564822
10658B564822M09231Q65617m11244j596457j532005j031184n14864j00106j148184
$$ 2564822 2974053 3839670 3428426 1831969 299964 -731220 -1246084 -1346190 -2494374
10649b494374l377314k485016L584225Q542329N393638k054166m144027j95496
$$ -2494374 -5871688 -8356704 -4772479 3769850 9163488 7109322 2965295 2769799
10641B769799J727318q12254j744607J063131K040779q40504k073534O45646K066488
$$ 2769799 4497117 3684863 1940256 3003387 5044166 4203662 2130128 2775774 4842262
10632D842262l17689j599231P11185J878748n62550j943086K76992J589882m95200
$$ 4842262 4524573 2925342 3636527 5515275 4952725 3009639 3286631 4876513 4381313
10623D381313j593775N43363J301799j509490k754941L90570K856710J090982
$$ 4381313 2787538 3330901 4632700 3123210 368269 758839 3615549 4706531
10615D706531p76445M64589J213313q11822j513707R80525J715005j439503k756860
$$ 4706531 3930086 4394675 5607988 4796166 3282459 4262984 5977989 4538486 1781626
10606A781626Q05662L395216Q51853j837644k61906J499600m22272k115199q2597
$$ 1781626 2587288 5982504 6834357 4996713 4734807 6234407 5812135 3696936 3614339
10597C614339J740383J30460r27344J336140K377657n94297k483156O740J788618
$$ 3614339 5354722 5485182 4557838 5893978 8271635 7677338 5194182 5200922 6989540
10588F989540o98870k542075k26310J413760p78879j565893J939212L419126q13303
$$ 6989540 6290670 3748595 3522285 4936045 4157166 2591273 4530485 7949611 7136308
10579G136308l889641o81463K782989R01521j430210O13335K190524p82096k655184
$$ 7136308 3246667 2565204 5348193 6249714 4819504 5432839 7623363 6841267 4186083
10570D186083P75663L203479k01921l056951j13240K347314j003610l662889J5993
$$ 4186083 4961746 8165225 7963304 4906353 4793113 7140427 6136817 2473928 2489921
10561B489921L413758M81300k342766R41634L643630l49192l829982k1322L832920
$$ 2489921 5903679 6384979 4042213 4983847 8627477 8278285 4448303 4426981 8259901
10552H259901M20206l178060N43323M304049R3239m708514j262833L621595Q20867
$$ 8259901 8680107 5502047 6045370 10349419 10442658 5734144 4471311 8092906 8913773
10543H913773l518697o52464L356614K18544l540609K35250M327642L51822l764747
$$ 8913773 5395076 4742612 8099226 8317770 4777161 5012411 9340053 9691875 5927128
10534E927128Q63317N586816N77569n183988p76587N094686R37187m841804p13612
$$ 5927128 6790445 12377261 12954830 7770842 6994255 12088941 13026128 8184324 7470712
10525G470712M709963J5103n167407J150446Q062520J896687o203627j057267
$$ 7470712 12180675 12195778 7028371 8178817 16241337 18138024 11934397 10877130
10517A0877130O672195J347776o204404j97296P383939L7943q434751L26426J0924774
$$ 10877130 17549325 18897101 12692697 12495401 19879340 19917283 11482532 11808958 22733732
10508B2733732K288834r327371j56621J2818211L122427j1187490m19034J6022966
$$ 22733732 25022566 15695195 15538574 28356785 31479212 20291722 19872688 35895654
10500C5895654M537620j3694543j00824K1678990O296361j9050505J457946L6614534
$$ 35895654 40433274 26738731 26637907 48316897 54613258 35562753 37020699 73635233
10492G3635233J4569608k8435662Q140711Q4111932L0626558j68978111k84842028
$$ 73635233 88204841 59769179 67909890 152021822 182648380 13670269 -271171759
10485b71171759j47953415R1581198J69886775O6863390k0393792M745000M4138334
$$ -271171759 -419125174 -327543976 -157657201 -90793811 -111187603 -106442603 -62304269
10478f2304269J7650199j7435843j394409K3588387Q866587j2643929m96006J7460306
$$ -62304269 -44654070 -62089913 -63484322 -39895935 -31029348 -43673277 -44169283 -26708977
10470b6708977N870636j1045254j208566J4281835N527890r711845l788926Q736276
$$ -26708977 -20838341 -31883595 -33092161 -18810326 -13282436 -22994281 -26783207 -18046931
10462a8046931L182118p714513j754511R245110M457199n651265j732974O941071
$$ -18046931 -14864813 -22579326 -24333837 -15088727 -10631528 -16282793 -18015767 -11074696
10454a1074696K641900n997188k450058N232525J659117n371275j240865O291963
$$ -11074696 -8432796 -14429984 -16880042 -11647517 -9988400 -15359675 -16600540 -10308577
10446a0308577K621609n243217k813148M259658K526568l183904q24351M598386
$$ -10308577 -7686968 -12930185 -15743333 -11483675 -8957107 -12141011 -12965362 -8366976
10438h366976J650991m421381k044149M093913K577009k760299j282039L531693
$$ -8366976 -6715985 -11137366 -13181515 -9087602 -6510593 -9270892 -10552931 -7021238
10430g021238J751255l222827j878262K580037J130147l002155r85704M021569
$$ -7021238 -5269983 -8492810 -10371072 -7791035 -6660888 -9663043 -10648747 -6627178
10422f627178K985653j842194k011902J118930P04905j445102L81211L047682
$$ -6627178 -3641525 -5483719 -7495621 -6376691 -5671786 -7116888 -6735677 -3687995
10414c687995N82272l151624j270035K787899J768605j807630j330939R95908
$$ -3687995 -3105723 -6257347 -7527382 -4739483 -2970878 -4778508 -6109447 -5113539
10406e113539m25797k661356l00786K873594P66376k757137r45733K745486J290701
$$ -5113539 -5539336 -8200692 -8501478 -5627884 -4861508 -7618645 -8564378 -5818892 -4528191
10397d528191k238810n85622L640879K855333j384348j933166N38041J25276k172293
$$ -4528191 -6767001 -7352623 -3711744 -856411 -2240759 -4173925 -3635884 -3510608 -5682901
10388e682901r80151K187111J742813j017607p24858J461494O17905j806924r52538
$$ -5682901 -6663052 -4475941 -2733128 -3750735 -4475593 -3014099 -2396194 -4203118 -5155656
10379e155656J585061R46099j218913j42922K230632Q13255k457902j984415R88415
$$ -5155656 -3570595 -2624496 -3843409 -3986331 -1755699 -942444 -3400346 -5384761 -4396346
10370d396346J065993j012744n38767J498059O02510j902232j269596J312528
$$ -4396346 -3330353 -4343097 -4881864 -3383805 -2781295 -4683527 -5953123 -4640595
10362d640595J063427j008379k98232K023854J084950k116202k275267N87547
$$ -4640595 -3577168 -4585547 -4883779 -2859925 -1774975 -3891177 -6166444 -5578897
10354e578897J708819M03341O7664P98323l3040j305840K8920K209539J249993
$$ -5578897 -3870078 -3466737 -3399073 -2600750 -2633790 -3939630 -3910710 -1701171 -451178
10345d51178j422891j315992R32436J067035q39131j217481p5774k15430j144919
$$ -451178 -1874069 -3190061 -2257625 -1190590 -2029721 -3247202 -3322976 -3538406 -4683325
10336d683325m95002N24982l89109j204405P88452K842106J232829j379581n14154
$$ -4683325 -5178327 -4653345 -5042454 -6246859 -5458407 -2616301 -1383472 -2763053 -3277207
10327c277207J605283J86508k707059j658785J853752J911132j111462j554392
$$ -3277207 -1671924 -1485416 -4192475 -5851260 -3997508 -2086376 -3197838 -4752230
10319d752230J053696J715340m64788j248193L53010R54064M3652M72304J749108
$$ -4752230 -3698534 -1983194 -2447982 -3696175 -3343165 -2389101 -2345449 -1873145 -124037
10310a24037N24033k270058k262865M10432J368147L1118k0092J387555P31951
$$ -124037 399996 -1870062 -4132927 -3722495 -2354348 -2323230 -2343322 -955767 -223816
10301b23816j707754j687520J055755K063391J87191p85860M59549P19914j079896
$$ -223816 -1931570 -3619090 -2563335 -499944 -312753 -1098613 -639064 80850 -999046
10292i99046j845966m37410L36222o48898r40741L52753R49815J36692q714Q96062
$$ -999046 -2845012 -3282422 -2946200 -3595098 -4535839 -4183086 -3233271 -3096579 -3105293 -2209231
10282b209231P98771l40723l06363O92092J17450j720048j696746M66283J625245
$$ -2209231 -1410460 -1751183 -2057546 -1365454 -1248004 -2968052 -4664798 -4198515 -2573270
10273b573270P34361J11J82740l03308j286862p63076P89003Q13100m85007n06269
$$ -2573270 -1838909 -1838798 -1656058 -1959366 -3246228 -4009304 -3220301 -2407201 -2892208 -3398477
10263c398477O45516M40867q78831o13711R93382J052273l07903j17956J485207
$$ -3398477 -2752961 -2312094 -3190925 -3804636 -2811254 -1758981 -2066884 -2184840 -699633
10254f99633J238302r41952j464081L94372J212531k48920j049907K44122J190505
$$ -699633 538669 -403283 -1867364 -1472992 -260461 -509381 -1559288 -1315166 -124661
10245a24661L53245l59253J45127J85874r30492j368872l68408M25361K42880
$$ -124661 228584 -130669 14458 200332 -730160 -2099032 -2467440 -2042079 -1799199
10236a799199J85531M03118o3163n23962L95310J332588K5365j965033j255974
$$ -1799199 -1613668 -1210550 -1273713 -1797675 -1402365 -69777 -44412 -2009445 -3265419
10227c265419J111562R51260j632719k081053P46534K612083J141503p41282m33413
$$ -3265419 -2153857 -1202597 -2835316 -4916369 -4169835 -1557752 -416249 -1157531 -1590944
10218a590944N60412M63894J17663J36233m79626j314911l82742J713370J837283
$$ -1590944 -1030532 -566638 -448975 -312742 -792368 -2107279 -2490021 -776651 1060632
10209A060632k97240j366437k11083M36401o63971j114116K07664R68799M2807
$$ 1060632 763392 -603045 -814128 -377727 -1041698 -2155814 -1948150 -979351 -936544
10200i36544l43441Q64438J439118L46307j89812P56141P07801j382566k599428
$$ -936544 -1279985 -415547 1023571 1369878 1180066 1936207 2644008 1261442 -1337986
10191a337986j002343R71176P60835l98243m72430n7720k45854k93568K35908
$$ -1337986 -2340329 -1369153 -608318 -1006561 -1478991 -1536711 -1782565 -2076133 -1840225
10182a840225Q9207r01211q29668P03938J413493M17078j60392N94107N75276
$$ -1840225 -1751018 -2652229 -3481897 -2777959 -1364466 -947388 -1107780 -513673 61603
10173F1603r22328j250022O62696J748633J57167j083021O43551K508751P77323
$$ 61603 -860725 -2110747 -1448051 300582 457749 -625272 18279 2527030 3304353
10164C304353k767598l528839j059580J101529J171329O17548O31787O71741L81028
$$ 3304353 536755 -2992084 -4051664 -2950135 -1778806 -1161258 -529471 142270 523298
10155E23298K03279O3957n39537j248825j179639l11968N35613P18387J04539
$$ 523298 726577 790534 250997 -997828 -2177467 -2489435 -1953822 -1235435 -1130896
10146a130896q98202j295293m67336O88424Q18840J83736M7387L21311p3882p72026
$$ -1130896 -2029098 -3324391 -3791727 -3103303 -2284463 -2100727 -2053340 -1732029 -1805911 -2577937
10136b577937m07267O25301O21081k54050k42901N44750L29052n58318O5627J706201
$$ -2577937 -2985204 -2359903 -1738822 -1992872 -2235773 -1691023 -1361971 -1920289 -1854662 -148461
10126a48461J187681j702916k975915o60657J969978J750732K15116J0925L87760
$$ -148461 1039220 -663696 -3639611 -4300268 -2330290 -579558 -364442 -353517 34243
10117C4243m02523j257862l79848J044771Q08122m37535n13259M57833O01282
$$ 34243 -368280 -1626142 -2005990 -961219 -153097 -590632 -1103891 -646058 -44776
10108d4776l15889p75175j74423O11872Q68368N71469j36906p77170o30419R2344
$$ -44776 -360665 -1135840 -1310263 -698391 169977 741446 604540 -172630 -803049 -710705
10098g10705K87224j65811j02237O77015P91350j87023p25006q509N60859p8397
$$ -710705 -423481 -589292 -691529 -14514 776836 589813 -135193 -143702 417157 338760
10088C38760p63971l34961L42224K33812J4244L35990K03306j000417j703961
$$ 338760 -425211 -760172 -417948 -184136 -169892 166098 369404 -631013 -2334974
10079b334974m86875J302827J417561J2279r36575o05278R9684L00633J3541l06312
$$ -2334974 -2821849 -1519022 -101461 -89182 -1025757 -1631035 -1531351 -1230718 -1217177 -1523489
10069a523489j68134M48359O25514m09873j595924j057294Q92906J797778O90346
$$ -1523489 -1691623 -1243264 -617750 -1027623 -2623547 -3680841 -2787935 -990157 -299811
10060b99811n34165k80517M83880L54638k55919m09680k96432k34323J88609P50773
$$ -299811 -833976 -1114493 -630613 -275975 -531894 -941574 -1238006 -1472329 -1283720 -532947
10050e32947K94879r83526j062070O57872J839330P19199r93580q45856N73090
$$ -532947 -238068 -1221594 -2283664 -1625792 213538 932737 -60843 -906699 -333609
10041c33609R51582j4490o54397k64555J99562K6880l84103m31556O0673Q63201
$$ -333609 617973 603483 -50914 -315469 -115907 -89027 -473130 -904686 -844013 19188
10031A9188J273036N79258q47031j678172j282633l60702L28331P10443O61493
$$ 19188 1292224 1871482 1024451 -653721 -1936354 -2297056 -1968725 -1258282 -596789
10022e96789k9656o55192j19889J146090J456553M24317n30757o05042n67183
$$ -596789 -626445 -1281637 -1401526 -255436 1201117 1625434 1094677 489635 -77548
10013g7548p94244m75633N03855R71501N62223L70677P40363N39288n23151j083266
$$ -77548 -871792 -1347425 -843570 127931 690154 1060831 1801194 2340482 1817331 734065
10003G34065n71213k13232n71948m30386O97381J316315N67308k01047Q3380M14760
$$ 734065 162852 -50380 -622328 -1052714 -355333 960982 1528290 1327243 1410623 1825383
9993A825383j02209n21180j28019M533p14086q12510N90090J691035P52478r52623
$$ 1825383 1723174 1201994 1073975 1078508 364422 -448088 142002 1833037 2585515 1632892
9983A632892j235126l81519j15352n69820o56442l69175m59828o04601N9295J135944
$$ 1632892 397766 16247 -99105 -668925 -1325367 -1694542 -2154370 -2758971 -2699676 -1563732
9973a563732J451138Q55456J39024l12745n83308n68146k95798k46305n21441
$$ -1563732 -112594 742862 881886 569141 -14167 -582313 -878111 -1124416 -1645857
9964a645857m91028O2676M26450J90404j01764o3268J3033J58220P84770J356853
$$ -1645857 -2136885 -2074209 -1647759 -1457355 -1559119 -1622387 -1609354 -1451134 -666364 690489
9954F90489P52017n66179p22106N56241J242466K50343q47692n45954K95805L32799
$$ 690489 1442506 876327 154221 710462 1952928 2203271 1355579 809625 1105430 1438229
9944A438229m3041L9043J56536l04889p32514m54853k1858k2028O8951O50338
$$ 1438229 1395188 1434231 1590767 1285878 553364 98511 76653 54625 123576 773914
9934G73914R26713K83809m59205k94099M85208Q98780N00905m69979j206855o10970
$$ 773914 1700627 1984436 1525231 1231132 1716340 2615120 3116025 2646046 1439191 828221
9924H28221J257530K332171R13141j514025k029238m86678N92115J02322n20548
$$ 828221 2085751 4417922 5331063 3817038 1787800 1301122 1893237 1995559 1475011
9915A475011k60198K88119P46885J197015Q69705m77072p40021J413699K983478
$$ 1475011 1214813 1502932 2249817 3446832 4316537 3839465 3099444 4513143 7496621
9906G496621Q42068k060326q01405K547321J970105r70926J093861O039864P12369
$$ 7496621 8338689 6278363 5476958 8024279 9994384 9023458 10117319 16157183 16869552
9897A6869552j8655553l4985790k9646980o627486J3193345J7627548J2299705
$$ 16869552 -1786001 -36771791 -66418771 -73046257 -59852912 -42225364 -29925659
9890b9925659O829204L621588J633359J463796K870753L241588J604618J51875
$$ -29925659 -23096455 -19474867 -17841508 -16377712 -13506959 -10265371 -8660753 -8508878
9882h508878K41179O17112M51554M94421O76689O4053o40674L454J008650L22542
$$ -8508878 -8267699 -7650587 -7199033 -6704612 -6027923 -5963870 -6604544 -6601090 -5592440 -5269898
9872e269898j114979o46192J253436J681070N10558L10909J176004N37991j487688
$$ -5269898 -6384877 -7031069 -5777633 -4096563 -3586005 -3275096 -2099092 -1561101 -3048789
9863c048789j635643O26981J682744j77895j881012q29752J089852J203333K09451
$$ -3048789 -4684432 -4057451 -2374707 -2552602 -4433614 -5263366 -4173514 -2970181 -2760730
9854b760730K8284L83826J36352k37898J36609N97954J90774o04072q90208p43294
$$ -2760730 -2732446 -2348620 -2212268 -2450166 -2313557 -1715603 -1524829 -2128901 -3019109 -3762403
9844c762403m69845P5963N71863J96940p31833p64088L48731J072212N43759j81074
$$ -3762403 -4232248 -4156285 -3584422 -3387482 -4119315 -4883403 -4534672 -3462460 -2918701 -3099775
9834c099775r6347K89031K66251Q0367j5560l55211q15356o15225K35297O74919
$$ -3099775 -3196122 -2907091 -2640840 -2560473 -2576033 -2931244 -3746600 -4361825 -4126528 -3451609
9824c451609K98557k4014L17377Q19592R11313O38663J06800n77102q05402j66063
$$ -3451609 -3153052 -3177066 -2859689 -2040097 -1128784 -490121 -383321 -960423 -1765825 -1931888
9814a931888N33392K93631l53405j86973N53146O32216O5977m0873L57025K69088
$$ -1931888 -1398496 -1104865 -1458270 -1645243 -1092097 -459881 -393904 -434777 -77752 191336
9804A91336l28583n24255l38140n17596o82897J34328J277911J135388l5492l82268
$$ 191336 -137247 -661502 -999642 -1517238 -2200135 -2065807 -787896 347492 312000 -70268
9794g0268L74921N89289k43600o61828j6443M23779r6921n70917k49496J51504
$$ -70268 304653 893942 650342 -11486 -27929 395850 298929 -271988 -521484 -369980
9784c69980P3820K1432J33195k53631r47497p25419M81983J110072M19486l72607
$$ -369980 -296160 -274728 -141533 -395164 -1342661 -2068080 -1586097 -476025 -56539 -429146
9774d29146k02371L19333L01941p5037l51168n20106m37215J30592N65182K7542
$$ -429146 -631517 -312184 -10243 -85280 -436448 -956554 -1393769 -1263177 -697995 -670453
9764f70453q26733n34500O21312P83768m17999j173348m59169M90901N41340L72977
$$ -670453 -1497186 -2031686 -1410374 -626606 -1044605 -2217953 -2677122 -2186221 -1644881 -1271904
9754a271904P60181J036050N16743j57274l07660m16273r02765j040946k58042
$$ -1271904 -511723 524327 1041070 883796 576136 159863 -742902 -1783848 -2041890
9745b041890O26273N78848j39265n77883m15396P2817N96568P77342K19040q07740
$$ -2041890 -1415617 -836769 -976034 -1553917 -1969313 -1896496 -1299928 -522586 -303546 -1111286
9735a111286j360335q83640J91117R84468Q56997j75551j146525q08705O56848
$$ -1111286 -2471621 -3355261 -3164144 -2179676 -1322679 -1498230 -2644755 -3453460 -2796612
9726b796612J421262M75152p77226p37643j27303l94960q88510p3881J371888
$$ -2796612 -1375350 -900198 -1677424 -2415067 -2542370 -2937330 -3825840 -3899721 -2527833
9717b527833J483407M55087K32333R37687P76708m50733r03795j62397j0988j031259
$$ -2527833 -1044426 -589339 -357006 580681 1357389 906656 2861 -159536 -170524 -1201783
9707a201783j413129j96800J051194R64734K80704j04247n60905j094515o84463
$$ -1201783 -2614912 -2811712 -1760518 -795784 -515080 -619327 -1180232 -2274747 -2959210
9698b959210N54872Q79987k14449r47470k83813L87788k1795l43757M35477J112885
$$ -2959210 -2404338 -1524351 -1738800 -2686270 -2970083 -2582295 -2604090 -2947847 -2512370 -1399485
9688a399485N06880k89682J12108R31798P34708r4809l38614j31211l38109q04728
$$ -1399485 -892605 -1182287 -1070179 -138381 596327 501518 162904 31693 -306416 -1111144
9678a111144q30730m70964q1379M23130Q19923L55735p16669q74788K81590J029302
$$ -1111144 -1941874 -2412838 -2494217 -2071087 -1251164 -895429 -1612098 -2486886 -2205296 -1175994
9668a175994K28705p05053j52716J025318J054103J39571k30632J19374J59096
$$ -1175994 -947289 -1652342 -1805058 -779740 274363 413934 183302 302676 461772
9659D61772l00576m73415j38841J38365L1307l78164r79922j318225o28347Q92876
$$ 461772 161196 -312219 -451060 -312695 -281388 -659552 -1639474 -2957699 -3586046 -2693170
9649b693170J683458O88256j107109j916482j191244L07309J566698J758429O59136
$$ -2693170 -1009712 -321456 -1428565 -3345047 -4536291 -4228982 -2662284 -903855 -244719
9640b44719o55340o67650M04062O85149m11125j090131j22973J005512N19462
$$ -244719 -900059 -1567709 -1163647 -478498 -889623 -1979754 -2102727 -1097215 -577753
9631e77753p43267q26120K39892R40755R39962J062058J213814M77605q98163
$$ -577753 -1321020 -2147140 -1907248 -966493 -26531 1035527 2249341 2726946 1828783
9622A828783j517200r30111j38152J01578N9904k9263m73632j186616j328279
$$ 1828783 311583 -618528 -756680 -655102 -595198 -624461 -1098093 -2284709 -3612988
9613c612988m12918Q93166J515688J124730K71822l46321m89434l02726O3759
$$ -3612988 -4025906 -3132740 -1617052 -492322 -220500 -566821 -1056255 -1358981 -1295222
9604a295222M35533L32292n59110j377693o05958J600890K771882J248535j070794
$$ -1295222 -859689 -527397 -1086507 -2464200 -3070158 -1469268 1302614 2551149 1480355
9595A480355j134696Q06441J654725K10810j333738j162193l17092k93272o24634
$$ 1480355 345659 1152100 2806825 3017635 1683897 521704 204612 -88660 -713294
9586g13294l96015r1070k74893j90006O67885J149102L19799o94151m79772L00081
$$ -713294 -1109309 -1200379 -1475272 -1665278 -997393 151709 471508 -222643 -702415 -402334
9576d02334J05082r50305j499691j037506p0418J038727J892320J556585j87887
$$ -402334 -297252 -1247557 -2747248 -3784754 -3855172 -2816445 -924125 632460 444573
9567D44573j766828j519768K0501R36154N28170k02799k63542L66763J151987
$$ 444573 -1322255 -2842023 -2821522 -1885368 -1357198 -1559997 -1823539 -1456776 -304789
9558c04789J359374M03299j251843k020261r43140R53582J856705J202097j94322
$$ -304789 1054585 1457884 206041 -1814220 -2757360 -1803778 52927 1255024 1060702
9549A060702j361656j730963j130409n9681N46844M29713K52559L43243J60371
$$ 1060702 -300954 -2031917 -3162326 -3222007 -2675163 -2245450 -1992891 -1649648 -1489277
9540a489277m48549o22160Q4567P55852N34301j0970R4552P10861R99899O13291
$$ -1489277 -1937826 -2559986 -2475419 -1719567 -1185266 -1196236 -1101684 -390823 609076 1222367
9530A222367k40400j110730j206380n4814J293479J091032n11885j323042l50413
$$ 1222367 981967 -128763 -1335143 -1389957 -96478 994554 482669 -840373 -1190786
9521a190786O50159O1684j018788p57620M42216R10543M96485L53727O78744N91332
$$ -1190786 -540627 -478943 -1497731 -2255351 -1813135 -902592 -406107 -52380 626364 1217696
9511A217696p6835m94908k14292L30765N37792P5333r62234j751870j322006J2034
$$ 1217696 1140861 645953 431661 762426 1300218 1375551 413317 -1338553 -2660559 -2648525
9501b648525P65275L92843K7115M18243O63694K4173n40606o585Q79966Q51283
$$ -2648525 -1883250 -1490407 -1463292 -1045049 -381355 -357182 -897788 -904373 -24407 826876
9491H26876Q2377m42848m74060j93985M71390J084413N57794r83551j664122n63341
$$ 826876 909253 466405 -7655 -201640 269750 1354163 1911957 928406 -735716 -1299057
9481a299057O02156J08079j049087r49876J58497O79767L92636J92042Q2094m08020
$$ -1299057 -696901 -588822 -1637909 -2587785 -2429288 -1749521 -1356885 -1164843 -1082749 -1490769
9471a490769o11210L04995J362678Q90597p64666j601351q18719M14598R04950
$$ -1490769 -2101979 -1796984 -434306 456291 -308375 -1909726 -2728445 -2313847 -1408897
9462a408897O53023K12033n484J06134J65354k57918o64109j45832P55304L80746
$$ -1408897 -755874 -543841 -549325 -443191 -277837 -535755 -1199864 -1345696 -590392 -209646
9452b09646j194455j713313k17719J287585J098190L31076L61780K70228q36375
$$ -209646 -1404101 -3117414 -3335133 -2047548 -949358 -618282 -256502 13726 -822649
9443h22649j407349j26466J213725N59046p04668j67718J325115J323611J09522
$$ -822649 -2229998 -2356464 -1142739 -583693 -1288361 -1456079 -130964 1192647 1302169
9434A302169k75294K9219n03056j238998n14333P24014L78933o45326O0390J613075
$$ 1302169 1026875 1056094 553038 -685960 -1200293 -476279 -97346 -742672 -682282 930793
9424I30793J087369r82814j234654M75722P73211j005121j523993M20236J616899
$$ 930793 2018162 1035348 -199306 276416 1049627 44506 -1479487 -1059251 557648
9415E57648J68348j270552m00184Q57485K01827j041656p51701K49814K27709
$$ 557648 725996 -544556 -944740 -87255 114572 -927084 -1678785 -1428971 -1201262
9406a201262l06607j88376j8916m86193m87157O92452J481845O21199m67592j85302
$$ -1201262 -1507869 -1696245 -1715161 -2201354 -2688511 -1996059 -514214 106985 -360607 -545909
9396e45909N03228J76735l13168K71936R10187J72877j022463j094549n88539
$$ -545909 -42681 134054 -179114 92822 1003009 1175886 153423 -941126 -1529665
9387a529665p08131o96845N64185J828637J279729j55243k59847O74000N58369
$$ -1529665 -2237796 -2934641 -2370456 -541819 737910 582667 322820 996820 1555189
9378A555189o54432r86888p4349K51600p02035j288703l32354J054386J286395
$$ 1555189 900757 -86131 -160480 91120 -610915 -1899618 -2231972 -1177586 108809
9369A08809L27839p58888j065417k90382R89627J431252L87022q66404n74483
$$ 108809 436648 -322240 -1387657 -1678039 -688412 742840 1129862 263458 -311025
9360c11025R81672J779111Q34543o93754j338149r53830j99026M76059Q22401
$$ -311025 670647 2449758 3284301 2590547 1252398 298568 99542 575601 1398002
9351A398002N78999k11700j043551j341111q84763O295N64131K48798m60187n48657
$$ 1398002 1977001 1765301 721750 -619361 -1504124 -1497829 -933698 -684900 -1145087 -1693744
9341a693744K5653K07781l44771m78969N76267J659798J236181l02707j228156
$$ -1693744 -1668091 -1460310 -1805081 -2284050 -1707783 -47985 1188196 885489 -342667
9332c42667q39142L2316N08666M68156R4318l34918l81735J3261K35862o1637
$$ -342667 -1181809 -1149493 -640827 -172671 -78353 -413271 -795006 -781745 -545883 -607520
9322f07520k81835O2277L42454j05670o26764k22242P04907R50274M27438P0336
$$ -607520 -889355 -827078 -484624 -590294 -1217058 -1439300 -734393 215881 643319 713655
9312G13655Q8407k26622r88462j356202q43443O8410P15631P90693K31558n40770
$$ 713655 802062 575440 -413022 -1769224 -2612667 -2544257 -1828626 -1037933 -806375 -1347145
9302a347145n82772L46629R35003m2481j623445j760112l34562P12473M22723
$$ -1347145 -1929917 -1583288 -648285 -690766 -2314211 -4074323 -4408885 -3696412 -3273689
9293c273689Q5633Q16248J637332J131219k71413r68025l93214O06408J143368
$$ -3273689 -3188056 -2371808 -734476 396743 125330 -842695 -1235909 -629501 513867
9284E13867J059272N94656O8482k39724l57991n50071p15975l81988L44344N16587
$$ 513867 1573139 2167795 2236277 1996553 1638562 1088491 372516 -9472 334872 851459
9274H51459k90927j026636n12222O96562R49216j19076j079755q42973j00953
$$ 851459 560532 -466104 -978326 -281764 667452 548376 -531379 -1374352 -1475305
9265a475305K4149k49756j3177N81418N46698j59951m79123p0060J00278m56586
$$ -1475305 -1451156 -1700912 -1714089 -1132671 -585973 -745924 -1225047 -1295107 -1194829 -1651415
9255a651415p59624j26251L71964l22380j092187j92590J656967K014024N13173
$$ -1651415 -2411039 -2537290 -2165326 -2487706 -3579893 -3772483 -2115516 -101492 411681
9246D11681n21724J53057P92221k01751j482032j031469M92656R87460L04932
$$ 411681 -110043 43014 835235 633484 -848548 -1880017 -1387361 -399901 -94969
9237i4969k6995K46179L0002n00235Q4221J493895J434921p16620k349351j302924
$$ -94969 -121964 124215 154217 -346018 -261797 1232098 2667019 1950399 -398952 -1701876
9227a701876Q00123R48865p94855j554904L8551J990963J847780j61664j770727
$$ -1701876 -901753 47112 -747743 -2302647 -2264096 -273133 1574647 1412983 -357744
9218c57744j561125k59309N68512L58043j51129j46767J97781J66790l01824n00426
$$ -357744 -1918869 -2178178 -1609666 -1251623 -1402752 -1549519 -1351738 -1184948 -1486772 -1987198
9208a987198p4493M54475N98119O29893Q79403R51057L93606l51058n38767l02131
$$ -1987198 -2061691 -1607216 -1009097 -379204 500199 1451256 1844862 1493804 955037 652906
9198F52906k85608l76787O1421P56690O29219l75764q60893n5352Q39468L98105
$$ 652906 367298 -9489 51932 808622 1437841 1062077 201184 145832 985300 1383405
9188A383405q17006j068890j6430Q59288M01495p69231j240071m82331P59679
$$ 1383405 566399 -502491 -518921 340367 741862 -27369 -1267440 -1749771 -990092
9179i90092J285587N34816p64046j178361k67241O68198K82502p95038q27562
$$ -990092 295495 830311 66265 -1112096 -1379337 -711139 -428637 -1223675 -2051237
9170b051237L38038R93516K81267m57568Q5783J050431Q41326l05663p77953j09768
$$ -2051237 -1713199 -719683 -438416 -895984 -810201 240230 1081556 775893 -2060 -111828
9160a11828N30611L28455j38214j75505j17981n53077j131467r11038K91463J426352
$$ -111828 418783 747238 609024 433519 315538 -237539 -1369006 -2280044 -1988581 -562229
9150e62229J295482M715r90493n98686M32359M70879o35206j227730k66042J078461
$$ -562229 733253 737968 -252525 -851211 -418852 52027 -583179 -1810909 -2076951 -998490
9140i98490J145778J40027m52289j34914K73253K53415J59673K02388N2929m01647
$$ -998490 147288 287315 -164974 -299888 -26635 226780 386453 588841 641770 240123
9130B40123q29800j002773p82983J60238J607481K146757P00909j431093j709821
$$ 240123 -589677 -1592450 -2375433 -2215195 -607714 1539043 2239952 808859 -900962
9121i00962K13786J853480J250355n87365j482440r14867J16631R24099J418849
$$ -900962 -687176 1166304 2416659 1829294 346854 -568013 -451382 472717 1891566
9112A891566J261378J43582j268147j752799r08871N43378J634267J735158O61829
$$ 1891566 3152944 3296526 2028379 275580 -633291 -89913 1544354 3279512 3941341
9103C941341j013419j978324j348581J82655J033852N82905l10417o76959o12166
$$ 3941341 2927922 949598 -398983 -216328 817524 1400429 1090012 413053 -199113
9094a99113p26386r71254o81310K60283R29066M67076o28059j014614l51789K11236
$$ -199113 -925499 -1896753 -2578063 -2317780 -1388714 -921638 -1549697 -2564311 -2916100 -2704864
9084b704864j59986o03207L5380J133132J109408N7374k08460R24262J696340
$$ -2704864 -2864850 -3468057 -3432677 -2299545 -1190137 -1132763 -1341223 -416961 1279379
9075A279379O90609q60770r63687R4456M18552m04612r02393l57464J58150p5763
$$ 1279379 1969988 1109218 145531 239987 658539 253927 -648466 -1005930 -847780 -923543
9065i23543j08500P60962J278021P4202j757142j870643j44658J078953N41579
$$ -923543 -1032043 -271081 1006940 1081142 -676000 -2546643 -2691301 -1612348 -1070769
9056a070769j69474N68162J633095R82550q92430j557990l41723Q09540M94272
$$ -1070769 -1240243 -672081 961014 1943564 1051134 -506856 -848579 -39039 455233
9047D55233k38457k5068O11245N20255l1437j29502j7817m95480j139494p58002
$$ 455233 216776 191708 802953 1323208 1291771 1162269 1144452 648972 -490522 -1248524
9037a248524O31008J678920J499640M72790n99992j140950q60220j81602k45338
$$ -1248524 -617516 1061404 2561044 3033834 2433842 1292892 432672 251070 5732
9028E732j410730k233622j239588P33042J522510P17622Q758M30803J046354P96005
$$ 5732 -1404998 -3638620 -4878208 -4145166 -2622656 -1905034 -1896276 -1465473 -419119 376886
9018C76886N9061l03763k17234m6666O2910N4230m0974J40423O52827N97322o02148
$$ 376886 435947 132184 -85050 -131716 -68806 -14576 -55550 84873 737700 1335022 732874
9007G32874j606921o54936J414720J804422j64076j908590j408837Q4208N07458
$$ 732874 -874047 -1528983 -114263 1690159 1526083 -382507 -1791344 -1707136 -1199678
8998a199678P6832J13890M54358J28193m77499k09719P29431J086831O02421J62130
$$ -1199678 -1122846 -1008956 -554598 -426405 -903904 -1113623 -384192 702639 1305060 1467190
8988A467190J68742J53915j42918m68720o82000p80655n89396j56678L9362m0601
$$ 1467190 1635932 1789847 1646929 1178209 496209 -284446 -873842 -1030520 -991158 -1031759
8978a031759K86900J054732J054841k54917j384173q38884M97181P74192J00432
$$ -1031759 -744859 309873 1364714 1109797 -274376 -1113260 -616079 158113 258545
8969B58545k2909M07455k4463j250771j385297J48291J398433Q03438n47786q46486
$$ 258545 235636 643091 618628 -632143 -2017440 -1869149 -470716 332722 -215064 -1061550
8959a061550k23023M2730j44083J33196Q19281P63448l16411j098661m48610Q95826
$$ -1061550 -1284573 -1241843 -1385926 -1252730 -433449 329999 13588 -1085073 -1533683 -637857
8949f37857J201196O732j245245j046684K80635J121150P47287R6739J50176M38534
$$ -637857 563339 570071 -675174 -1721858 -1441223 -320073 427214 523953 674129 1112663
8939A112663q9765j281248j824608r75693N46209J448146J109890k9973q49283
$$ 1112663 1022898 -258350 -2082958 -3058651 -2512442 -1064296 45594 15621 -833662
8930h33662m33623Q71357J501694M51983j185377j379719J17554J297446N66433
$$ -833662 -1267285 -395928 1105766 1557749 372372 -1007347 -889793 407653 974086
8921I74086j108571j577461l67237R46428J048913L96896N6052K7753l76838j021683
$$ 974086 -134485 -1711946 -2079183 -1132755 -83842 313054 369106 396859 20021 -1001662
8911a001662r60227j7264P30956N25922O0674L06367R57396J024505M44236l1417
$$ -1001662 -1961889 -1979153 -1248197 -722275 -661601 -355234 602162 1626667 2070903 2039486
8901B039486k24535n81123r62888o94840Q2124L85620m7849m30456m26688o19936
$$ 2039486 1814951 1233828 270940 -423900 -341776 43844 -4005 -434461 -861149 -1481085
8891a481085j048852p75635L63094J056554N60005L3622O02005J356245Q19955
$$ -1481085 -2529937 -3305572 -2942478 -1885924 -1325919 -1292297 -690292 665953 1485908
8882A485908n95324j282904q93714l95594j53809K95550P47525L60743o38739
$$ 1485908 890584 -392320 -1286034 -1681628 -1835437 -1539887 -792362 -431619 -1070358
8873a070358q49122K64844J470485J454360M50665l74272m62911k53571m02650
$$ -1070358 -1919480 -1654636 -184151 1270209 1720874 1346602 883691 630120 227470
8864B27470r59536j216633m82917Q23250J307896L18554r78486j000215J63633
$$ 227470 -732066 -1948699 -2431616 -1608366 -300470 18084 -960402 -1960617 -1796984
8855a796984R77022N73235k98220m69963K62468J078834R82771k19010j451651
$$ -1796984 -819962 -246727 -544947 -1014910 -752442 326392 1309163 1090153 -361498
8846c61498j266952L48587J643768J235298j14039p49017m40337k14375l86030
$$ -361498 -1628450 -1279863 363905 1599203 1485164 736147 295810 81435 -304595
8837c04595k46035M05274Q19413N56317L6692l22829n34517n27185j79480J11876
$$ -304595 -550630 -145356 674057 1230374 1267066 944237 409720 -117465 -296945 -185069
8827a85069j34830n28323k99076L46285N00215R1566j15144j3841k42280p03360
$$ -185069 -319899 -848222 -1147298 -801013 -300798 -209232 -324376 -338217 -580497 -1283857
8817a283857n40220J63729K81039l27156l82432N05600Q70334j70111j138171
$$ -1283857 -1824077 -1660348 -1379309 -1706465 -2088897 -1583297 -712963 -883074 -2021245
8808b021245l89976J196327J524454M56492k31858K15430N14875m30203j776572
$$ -2021245 -2411221 -1214894 309560 766052 534194 749624 1264499 834296 -942276
8799i42276j950954p34062O38584J086227P62247N12243O55554O59230N4815p41719
$$ -942276 -2893230 -3627292 -2988708 -1902481 -1140234 -627991 27563 686793 741608 -111
8789a11r53328n14169n321L08103N98997P26304L41381j67646L0788O83235M86111
$$ -111 -953439 -1467608 -1472929 -1164826 -565829 160475 501856 334210 364998 1048233 1534344
8778A534344p82239j526886o80163N39290N53432n2710K85155J201151Q31821
$$ 1534344 752105 -774781 -1454944 -915654 -362222 -414932 -129777 1071374 1903195
8769A903195r78205k072843j096609O31174J216509O54978J11060n8694k62869
$$ 1903195 924990 -1147853 -2244462 -1613288 -396779 258199 369259 310565 47696
8760D7696m29080j12956M91533P23471M62412J20252j70347n59196q63157p49001
$$ 47696 -381384 -494340 -2807 720664 1183076 1303328 1132981 573785 -289372 -1038373
8750a038373l88945j70813N2625N58786Q03794P773j245334j257954M44597K129759
$$ -1038373 -1427318 -1598131 -1545506 -986720 -182926 -175153 -1420487 -2678441 -2233844 -104085
8740a04085J977193L50788r15756q72248j32636L93994M47632J91275j02725o8274
$$ -104085 1873108 2223896 1308140 435892 303256 697250 1144882 1336157 1233432 1165158
8730A165158M07161P86243L89335o32892j334696j085323k37561M03463M41068
$$ 1165158 1572319 2358562 2747897 2115005 780309 -305014 -542575 -139112 301956
8721C01956J24478l8558J64295M18156L00470r2939k88762k31672l73392p86448
$$ 301956 426434 387876 552171 970327 1270797 1177858 889096 657424 284032 -502416
8711e02416q84283l73419K61561O48599J008155J184757L40722j431514k365283
$$ -502416 -1386699 -1760118 -1498557 -849958 158197 1342954 1683676 252162 -2113121
8702b113121j255798N58121J053383M60313M30765J021821Q30714j71937m44096
$$ -2113121 -3368919 -2810798 -1757415 -1297102 -866337 155484 986198 814261 370165
8693C70165L16024N82753k70800r52211o42396j90946j06758L98106J339015J213600
$$ 370165 686189 1268942 998142 45931 -596465 -787411 -894169 -496063 842952 2056552
8683B056552l53519j399244o16994M82936J60496p46940n96431K16317L43824
$$ 2056552 1703033 303789 -313205 169731 330227 -416713 -1013144 -796827 -453003
8674d53003n9642j39834k38661q03737p72208N94441J596061M58921j364587j211011
$$ -453003 -512645 -652479 -891140 -1694877 -2467085 -1872644 -276583 182338 -1182249 -2393260
8664b393260L93744O27826p90876j188304M20637J731226J096655k3320N8891
$$ -2393260 -1999516 -1371690 -2162566 -3350870 -2930233 -1199007 -102352 -125672 -66781
8655f6781N69654J72523n38004l14643M52131N05013j87290o30503m66502k00451
$$ -66781 502873 675396 137392 -177251 274880 779893 592603 -37900 -504402 -704853
8645g04853j62957j72756p389L53130P50999Q88812O25655K17617j00621m89483
$$ -704853 -867810 -1040566 -1047955 -694825 56174 944986 1570641 1788258 1687637 1198154
8635A198154r37380q60581q3353M36428m1986o61083k92131M81860L86188k09472
$$ 1198154 260774 -599807 -683160 -246732 -288718 -949801 -1241932 -760072 -373884 -583356
8625e83356R649P53082N70090l82770n15369K10021J32266r17954j098883K7910
$$ -583356 -573707 179375 749465 366695 -148674 61347 193613 -724341 -1823224 -1795314
8615a795314M59503o58162j242134J96666J812444J366495k46174p82149k04983
$$ -1795314 -1335811 -1993973 -3236107 -3039441 -1226997 139498 -106676 -888825 -1093808
8606a093808L1167j38440J95211N90664r2165j258502j184302J63390J054623
$$ -1093808 -1062641 -1201081 -1005870 -415206 -507371 -1765873 -2950175 -2786785 -1732162
8597a732162P14976J69455K30586M04651J55369j89920k40533j70146j95198k28117
$$ -1732162 -1017186 -847731 -617145 -212494 -57125 -247045 -487578 -657724 -852922 -1081039
8587a081039k11723j44670J72435P59399J005969L32036q33947j405870q82226
$$ -1081039 -1292762 -1437432 -1264997 -505598 500371 832407 -1540 -1407410 -2289636
8578b289636K31575J033009R26137J11220l89853J80305J035561O43815r03890
$$ -2289636 -2058061 -1025052 -98915 12305 -377548 -197243 838318 1482133 578243
8569E78243j680355p21514N03057M64761j63283q3980K80197j01033o38806j63388
$$ 578243 -1102112 -1823626 -1320569 -855808 -1019091 -1103071 -822874 -923907 -1562713 -1726101
8559a726101P12709N54960k06351L8782J056539R58400n46901j580791j157320
$$ -1726101 -1013392 -458432 -664783 -626001 430538 1388938 842037 -738754 -1896074
8550a896074m59227m21087k85730N14073J066255O76503J05552J3979j85320p97937
$$ -1896074 -2355301 -2776388 -3062118 -2548045 -1481790 -805287 -699735 -685756 -871076 -1669013
8540a669013q26359J99694R20990K17787p64232l67810Q86428J200011L11098
$$ -1669013 -2495372 -2295678 -1374688 -1156901 -1921133 -2288943 -1402515 -202504 108594
8531A08594m55489m93069m50488o09043l89887L74085J019252J095662P76678
$$ 108594 -346895 -839964 -1290452 -1899495 -2289382 -1915297 -896045 199617 976295
8522I76295K20445m33656n43081L65056J421828J190324k67063j358440j207310
$$ 976295 1196740 763084 220003 585059 2006887 3197211 2930148 1571708 364398
8513C64398o26612n07940n85061l80624j26795r44M08854J040224Q80678m15409
$$ 364398 -262214 -770154 -1355215 -1735839 -1862634 -1863578 -1454724 -414500 466178 50769
8503E0769j450076q69665N58910J024399K64999l62915j20842K80612J41078k35224
$$ 50769 -1399307 -2268972 -1710062 -685663 -420664 -783579 -904421 -623809 -482731 -717955
8493g17955k90105K4228M89620Q66783Q06151K39434k11727j7015K86571j02787
$$ -717955 -1008060 -983832 -494212 372571 1178722 1418156 1206429 1189414 1475985 1373198
8483A373198p40498n29146L02797L77412n15622r63134k74787M08498J47014k80084
$$ 1373198 632700 103554 406351 783763 268141 -694993 -969780 -561282 -414268 -694352
8473f94352K2073M10539j035o00325l12102N21319P41361J76445m56332q13247
$$ -694352 -672279 -261740 -262775 -863100 -1175202 -653883 87478 263923 -192409 -1005656
8463a005656q75832l40222O94871J146980L73431n36226k71110O34258P49947
$$ -1005656 -1881488 -2221710 -1526839 -379859 -6428 -542654 -813764 -179506 570441
8454E70441M0306m66647o34163r91949j101350j78637R72889P79485m46120p94250
$$ 570441 610747 144100 -490063 -1482012 -2583362 -2761999 -1789110 -1009625 -1455745 -2249995
8444b249995K12866J016638O91695Q2682j42254m51471q72065n13822N91818J126180
$$ -2249995 -2037129 -1020491 -328796 -246114 -388368 -839839 -1711904 -2225726 -1633908 -507728
8434e07728P01731M73965P86659M05954q65999j157154L80686J641274O64802
$$ -507728 194003 667968 1454627 1860581 994582 -162572 218114 1859388 2524190
8425B524190j189644j368157N4757R93584O92262J00605l32924r18653j183018
$$ 2524190 1334546 -33611 21146 1014730 1706992 1807597 1474673 556020 -626998
8416f26998k83168J116149J352880K48544o54765m71809M0599J02437l2460m2450
$$ -626998 -910166 205983 1558863 1807407 1152642 680833 721432 823869 791409 748959
8406G48959k12343o12884o82207j61131L71577L40568p3083l21118j44647K80818
$$ 748959 536616 -76268 -758475 -919606 -548029 -207461 -280544 -601662 -746309 -465491
8396d65491M50883j03136j090593j415265n00411P16638R45718L26820K5682L44673
$$ -465491 -14608 -117744 -1208337 -2623602 -3124013 -2407375 -1461657 -1134837 -1109155 -764482
8386g64482M95288K04030J58874N48060M80160m82345j294812q24326M54263J086305
$$ -764482 -269194 -65164 93710 641770 1121930 639585 -655227 -1479553 -1025290 61015
8376F1015N59846k52612m24694k4303K39560p0269p11053j030290n91406L36575
$$ 61015 620861 368249 -56445 -80748 158812 88543 -622510 -1652800 -2244206 -1907631
8366a907631R73742Q45502K58588k27939n57217r69298j201142o07536O87927
$$ -1907631 -933889 -88387 170201 -57738 -614955 -1584253 -2785395 -3392931 -2705004
8357b705004J483776R57896p9250k11967O27433J227034R65931M25856M0885m88110
$$ -2705004 -1221228 -263332 -342582 -554549 72884 1299918 2265849 2691705 2732590 2244480
8347B244480r98088n71066P04450J114982k77658j867471j671782k07798N65443
$$ 2244480 1246392 675326 1379776 2494758 2217100 349629 -1322153 -1529951 -964508
8338i64508K95030J79452M66248K75649k60858N062R10821Q61924m72475j383258
$$ -964508 -669478 -490026 -23778 251871 -8987 -3925 906896 1768820 1296345 -86913
8328h6913p27458M98328R18517M83314k41831r20823j015877j15474Q28066L27457
$$ -86913 -814371 -316043 602474 1085788 843957 -76866 -1092743 -1208217 -380151 -52694
8318e2694j135311j415814m6812R90911O16802K61914R14462J141927j50888j335479
$$ -52694 -1188005 -2603819 -2650631 -1659720 -1042918 -781004 133458 1275385 1124497 -210982
8308b10982o39109Q02177Q25072l52847r59708o63167m18956l04450K70800R08369
$$ -210982 -850091 -47914 777158 424311 -535397 -1198564 -1617520 -1921970 -1651170 -742801
8298g42801P54981Q0488l27265n54236q39298n26343O59404J492418J105328O11848
$$ -742801 12180 92668 -234597 -788833 -1628131 -2154474 -1495070 -2652 1102676 1714524
8288A714524J028992J157760k20724j622751j029967N52651O58133n86234j081363
$$ 1714524 2743516 3901276 3680552 2057801 1027834 1580485 2238618 1652384 571021
8279E71021n95242o49625j084529k35756J509660J792611K56860q20423m11253
$$ 571021 -24221 -673846 -1758375 -1994131 -484471 1308140 1565000 744577 333324
8270C33324o6886o08837o42243M86006J138481K16316r39652r01987k29529J36342
$$ 333324 266438 -342399 -984642 -498636 639845 856161 -83491 -985478 -1215007 -1078665
8260a078665M85746J038926R61702r279o96006l92694L7931k7517J06954P16047
$$ -1078665 -592919 446007 1407709 1398430 702424 309730 347661 320144 427098 1143145
8250A143145P58526j32980o72976j53115K40514l70548r36300m63765K30412K29446
$$ 1143145 1901671 1768691 1095715 942600 1183114 812566 -123734 -587499 -357087 -127641
8240a27641J39388M63088K66419p94883j069143M14765J701778P14619j282073
$$ -127641 11747 474835 741254 -53629 -1122772 -708007 993771 1708390 426317
8231D26317j627277l75830L39190Q5947K58165R08337N67685o56254p69731O61679
$$ 426317 -1200960 -1576790 -1237600 -1151653 -893488 14849 582534 -73720 -843451 -181772
8221a81772J416572P0522j692902j657806k24481O45274M17385J88589N03759
$$ -181772 1234800 1305322 -387580 -2045386 -2269867 -1624593 -1207208 -1018619 -514860
8212e14860O14762l0577p82561p22428O0488O38268M60029m5105j56964J71736
$$ -514860 99902 69325 -713236 -1435664 -1375176 -736908 -276879 -321984 -478948 -307212
8202c07212L69399J38359j65081j47491O9990J79875J97813K79227K77266j03743
$$ -307212 62187 200546 35465 -112026 -42036 137839 335652 614879 892145 788402
8192G88402p75172j193808q91217K9475R57269J334005J119687O06151q5213q94207
$$ 788402 13230 -1180578 -2071795 -2042320 -1085051 248954 1368641 1974792 1889579 995372
8182I95372j275892n92607O24822Q10276m81612j560810r08603M54725N41174
$$ 995372 -280520 -873127 -248305 561971 80359 -1480451 -2389054 -1934329 -1393155
8173a393155m04322l99815Q14343J227946p2968j310060p99121O37466J324289
$$ -1393155 -1797477 -2197292 -1382949 -155003 -227971 -1538031 -2337152 -1699686 -375397
8164c75397J120135P26296Q8086q91092j233335k27178R68930P76201l60312o53992
$$ -375397 744738 1471034 1559120 668028 -565307 -792485 176445 952646 592334 -61658
8154f1658K76883R95037N17303m56721q04685l79211J42553J23127m55498r11043
$$ -61658 215225 1210262 1727565 1270844 466159 86948 229501 352628 -102870 -1013913
8144a013913n69701K00399L09231l17144l55159P64756J534907N59481r75065
$$ -1013913 -1583614 -1383215 -1073984 -1391128 -1746287 -981531 553376 1112857 137792
8135A37792q67253O71436J272539L0670j276684j066860q6906K56603O4925J88886
$$ 137792 -729461 -58025 1214514 1245184 -31500 -1098360 -1185266 -928663 -863738 -674852
8125f74852N11455L94761O9722J87544M39149j0115q82535r46585K9347P68468
$$ -674852 -163397 231364 301086 488630 927779 917664 35129 -911456 -882109 -113641
8115a13641M29185r5438L06529J051751P17076o13274j285665n01545N25432M02406
$$ -113641 315544 220106 526635 1578386 2295462 1682188 396523 -105022 420410 822816
8105H22816n62012j139084r35341l45679M96053J456156J607012K02394j653824
$$ 822816 260804 -878280 -1813621 -2159300 -1663247 -207091 1399921 1602315 -51509
8096e1509j857839j29682J417821J107409j83224n99612N5694M76972P5669k59738
$$ -51509 -1909348 -2039030 -621209 486200 302976 -296636 -240942 236030 311699 51961
8086E1961K99953J202637J232149J46528r64688j065480m76164k60057n14657
$$ 51961 351914 1554551 2786700 2933228 1968540 903060 426896 166839 -347818
8077c47818k34976Q31138J354241L57159j032111j113225j58653K16420k49922
$$ -347818 -582794 248344 1602585 1959744 927633 -185592 -344245 -127825 -377747
8068c77747l25723K62285L41583l67728n21015M20551R56858l9399j297102j014727
$$ -377747 -703470 -441185 -99602 -467330 -988345 -567794 389064 349665 -947437 -1962164
8058a962164M39754J233390O89062k05756m39904K5661O11388O54467j01798j053362
$$ -1962164 -1522410 -289020 400042 194286 -245618 -219957 391431 1045898 944100 -109262
8048a09262j256227o76300j32467J63890P72079J419590R10187o10012j139575
$$ -109262 -1365489 -2041789 -2174256 -2010366 -1238287 181303 1091490 481478 -658097
8039f58097J59504J236613K04545j492140j208126P59305J700924O14831p34285
$$ -658097 -498593 738020 942565 -549575 -1757701 -998396 702528 1317359 583074
8030E83074q35856j87166K88511N14326M16909l81164j362998j199853K15899
$$ 583074 -252782 -439948 -151437 362889 779798 398634 -964364 -2164217 -1948318
8021a948318J211146O15551o24619r93788m81658r5805j31857m5867L77474P11629
$$ -1948318 -737172 -121621 -746240 -1740028 -2221686 -2317491 -2449348 -2495215 -2117741 -1406112
8011a406112O25609K50116j49766l88021l02305J05130M71719L54191k11605o50505
$$ -1406112 -780503 -530387 -680153 -1068174 -1370479 -1265349 -793630 -439439 -651044 -1301549
8001a301549m84861Q6545M35082K98955N8440J08767L16379L99014M55069N98384
$$ -1301549 -1786410 -1699865 -1264783 -965828 -907388 -798621 -482242 -83228 371841 970225
7991I70225M38364l29529j085408r52809j50984L49050M04675O84922J068112
$$ 970225 1408589 1079060 -6348 -959157 -1110141 -761091 -356416 328506 1396618
7982A396618O04064n71842r53424k4470P10987Q2737q95329q17778j08944J07293
$$ 1396618 2000682 1428840 475416 450946 1161933 1244670 349341 -468437 -577381 -470088
7972d70088J18713P78193J471513R24274m54243r46255q6995Q18411P13710j21234
$$ -470088 -351375 426818 1898331 2822605 2368362 1422107 1335112 2153523 2867233 2745999
7962B745999r80058j421622j113751j99519L15282k79512j090124p19772N93761
$$ 2745999 1765941 344319 -769432 -968951 -653669 -933181 -2023305 -2743077 -2149316
7953b149316J300273P84734j09406o43608q36694o58073j3489N04884K32794l15206
$$ -2149316 -849043 -64309 -173715 -817323 -1654017 -2312090 -2325579 -1820695 -1587901 -1903107
7943a903107j94712K57499P5181l30791K04545J187676J003710o4667N484J298950
$$ -1903107 -2097819 -1840320 -1765139 -2095930 -1891385 -703709 300001 235334 240818 1539768
7933A539768J341921o81012k030196o79865J162012M83239j641896j831172J73370
$$ 1539768 2881689 2200677 170481 -509384 652628 1135867 -506029 -2337201 -2163831
7924b163831J364647M47153n08456N6131Q04780L01973m48037r6578M56363k30431
$$ -2163831 -799184 -352031 -860487 -804356 424 302397 -145640 -242218 214145 -16286
7914a6286j268835p52343Q12273R91631o50246j635791l35202J531952J508664
$$ -16286 -1285121 -2037464 -1225191 -233560 -883806 -2519597 -2854799 -1322847 185817
7905A85817j23443j167097p29689J75870O40023O81242L00295n79592j172344
$$ 185817 62374 -1104723 -1834412 -1658542 -1018519 -337277 -36982 -616574 -1788918
7896a788918m19597J206296J912398R51826n16650j242517j200962p51811M1695
$$ -1788918 -2208515 -1002219 910179 1862005 1345355 102838 -1098124 -1849935 -1808240
7887a808240P31793N83978n2592M1195P94665O46352p08646j372243k95263P52861
$$ -1808240 -1076447 -492469 -545061 -503866 290799 937151 228505 -1143738 -1439001 -686140
7877f86140K1655j248463q76695P05824J392535Q33087M06718M62988J18275n43818
$$ -686140 -664485 -1912948 -2789643 -2083819 -691284 141803 548521 1011509 1129784 585966
7867E85966m85866J74135K90579j17786M2411O63483M49732o28199j049445k64075
$$ 585966 100100 274235 564814 447028 489439 1152922 1602654 974455 -74990 -339065
7857c39065N00421L65971j13946l70449n27546l92133M42351J219730O65818p13393
$$ -339065 161356 527327 413381 42932 -484614 -876747 -434396 785334 1451152 737759
7847G37759j023744j8676M78248k75879p37141R5870R64300O72933K8840O4535
$$ 737759 -285985 -304661 173587 -102292 -839433 -743563 220737 893670 922510 987045
7837I87045J99536l33019q73416o58556l12232n61559p79192j97512O26193Q41434
$$ 987045 1186581 853562 -19854 -678410 -990642 -1552201 -2331393 -2528905 -1902712 -1061278
7827a061278O49592M97095J74737k30789Q2814R92759R90801l59279j227344l30669
$$ -1061278 -411686 85409 260146 29357 112171 1104930 2095731 1736452 509108 178439
7817A78439Q02136K78549j028337r94577L47554J188624Q08813q7443j073998
$$ 178439 980575 1259124 230787 -763790 -416236 772388 1581201 1493758 419760
7808D19760j914768j586553L53851K082073J510507n02517j278507k46567P25024
$$ 419760 -1495008 -3081561 -2727710 -645637 864870 362353 -916154 -1162721 -437697
7799d37697O86468O06484Q38126L07269j077212j662667p13424K88915J33518
$$ -437697 248771 855255 1693381 2000650 923438 -739229 -1452653 -1163738 -1030220
7790a030220k62631J99567P26712J18373r47956q61436L87611J194278O36601
$$ -1030220 -1292851 -1093284 -366572 -248199 -1196155 -2057591 -1669980 -475702 160899
7781A60899m42263p26756p589P38883N33569m58064j058695n33589M09928O04838
$$ 160899 -281364 -1008120 -1015709 -276826 256743 -201321 -1260016 -1793605 -1383677 -778839
7771g78839M1777l43377k15945o5998k25L89363Q44238N48022k41530j88566Q41940
$$ -778839 -737062 -1080439 -1296384 -1362382 -1362607 -973244 -129006 419016 177486 -11080 830860
7760H30860J074353m91808k068121j333033J161405K584915J549076l79493j054557
$$ 830860 1905213 1413405 -654716 -1987749 -826344 1758571 3307647 2928154 1873597
7751A873597l02785M23393P0002r75968j519650q57311M67008J190634P49604
$$ 1873597 1570812 1994205 2064207 1088239 -431411 -1288722 -821714 368920 1118524
7742A118524o4554j90495K71795L12813m40314j157943r65321q2541N49944M57194
$$ 1118524 1053970 863475 1135270 1448083 1007769 -150174 -1115495 -1198036 -648092 -190898
7732a90898Q0972J34787P21961J151378O82650n15930j373618j114582k31136
$$ -190898 -109926 24861 746822 1898200 2580850 2064920 691302 -423280 -654416
7723f54416J39970l29164q67533p71162k30205K23845M81991O43062N44002R5666
$$ -654416 -514446 -843610 -1711143 -2482305 -2712510 -2488665 -2006674 -1363612 -819610 -723944
7713g23944k40859K5123N63198N39328k28464j023163j178043o99632J13747J015637
$$ -723944 -964803 -939680 -376482 162846 -65618 -1088781 -2266824 -2966456 -2852709 -1837072
7703a837072J567889J214329J0241j161756j458792q35601J94287J013968R83292
$$ -1837072 -269183 945146 955387 -206369 -1665161 -2500762 -2306475 -1292507 -309215
7694c09215j26395j381072j254561L76412J653087J054765m83267r39919o2814
$$ -309215 -435610 -1816682 -3071243 -2694831 -1041744 13021 -470246 -1410165 -1472979
7685a472979O04231K40897l19669l04994r2327q5707J56097R12238J437051R35180
$$ -1472979 -868748 -627851 -947520 -1252514 -1344841 -1430548 -1274451 -362213 1074838 2010018
$$ [...]
##END NTUPLES=NMR SPECTRUM
##END=
