##TITLE=31Pdec_SR-157-K3-TFAA4''
 CDCl3, 24 sc
 10.7.2023
##JCAMPDX= 6.0         $$ Bruker NMR JCAMP-DX V2.0
##DATA TYPE= NMR SPECTRUM
##DATA CLASS= NTUPLES
##ORIGIN= UXNMR, Bruker Analytische Messtechnik GmbH
##OWNER= root
$$ XWIN-NMR		Version 3.5
$$ Mon Jul 10 14:17:00 2023 Russian Standard Time (UT+4h)  she@DPX200
##.OBSERVE FREQUENCY= 81.013821
##.OBSERVE NUCLEUS= ^31P
##.ACQUISITION MODE= SIMULTANEOUS
##.ACQUISITION SCHEME= undefined
##.AVERAGES= 24
##.DIGITISER RES= 16
##SPECTROMETER/DATA SYSTEM= spect
##.PULSE SEQUENCE= zgpg30
##.SOLVENT NAME= CDCl3
##.SHIFT REFERENCE= (INTERNAL, CDCl3, 0, 248.564)
##AUDIT TRAIL= $$ (NUMBER, WHEN, WHO, WHERE, WHAT)
$$ ##TITLE= Audit trail, XWIN-NMR		Version 3.5
$$ ##JCAMPDX= 5.01
$$ ##ORIGIN= Bruker BioSpin GmbH
$$ ##OWNER= she
$$ F:/spectra/data/she/nmr/P31/1/pdata/1/auditp.txt
$$ ##AUDIT TRAIL=  $$ (NUMBER, WHEN, WHO, WHERE, WHAT)
(   1,<2023-07-10 14:15:22.64 +0400>,<she>,<DPX200>,
      <created by zg, POWCHK disabled, PULCHK disabled
       configuration hash MD5:
       00 E9 B6 7A A2 85 ED C7 34 08 36 98 17 FE 4E 26
       data hash MD5: 32K
       DC 7B FC 89 C4 05 98 E2 A5 16 1E E0 EA AA 5E 2B>)
(   2,<2023-07-10 14:15:25.10 +0400>,<she>,<DPX200>,
      <Start of raw data processing
       efp BC_mod = 2 LB = 1 FT_mod = 6 PKNL = 1 PHC0 = -10475.48 PHC1 = -393.1151 SI = 64K 
       data hash MD5: 64K
       4B 65 D3 1C DE 7B 4A C6 20 B4 EC 46 0E FE DA 8F>)
(   3,<2023-07-10 14:15:54.95 +0400>,<she>,<DPX200>,
      <pk PHC0 = -156.3466 PHC1 = 316.5998 
       data hash MD5: 64K
       2C B3 5B 11 78 F0 67 2A 98 E8 64 53 21 F2 3F 66>)
(   4,<2023-07-10 14:16:01.04 +0400>,<she>,<DPX200>,
      <abs ABSG = 5 
       data hash MD5: 64K
       7D DA 1F 06 64 D6 94 B6 9D D9 95 26 50 1C F4 7A>)
(   5,<2023-07-10 14:16:26.34 +0400>,<she>,<DPX200>,
      <pk PHC0 = 0.4490049 PHC1 = 0 
       data hash MD5: 64K
       CD 11 A3 DC D6 EB 89 BF 55 0E A0 7A 1E 67 66 4D>)
(   6,<2023-07-10 14:16:29.89 +0400>,<she>,<DPX200>,
      <abs ABSG = 5 
       data hash MD5: 64K
       DF 1E BF F2 FC 7D 85 44 5B F9 FF F1 37 B9 05 5D>)
$$ ##END=
$$ 
$$ hash MD5
$$ 62 54 30 13 5E D8 BB 33 9B F4 C1 F5 DF E3 57 FB
##$RELAX= 
##$RELAX= 
##$RELAX= 
##$RELAX= 
##$RELAX= 
##$RELAX= 
##$RELAX= 
##$RELAX= 
##$RELAX= 
$$ Bruker specific parameters
$$ --------------------------
##$DU= <F:/spectra>
##$EXPNO= 1
##$NAME= <P31>
##$PROCNO= 1
##$TYPE= <nmr>
##$USER= <she>
##$AMP= (0..31)
100 100 100 100 100 100 100 100 100 100 100 100 100 100 100 100 100 100 
100 100 100 100 100 100 100 100 100 100 100 100 100 100 
##$AQSEQ= 0
##$AQ_mod= 1
##$AUNM= <au_zg>
##$AUTOPOS= <>
##$BF1= 81.014009
##$BF2= 200.13
##$BF3= 200.13
##$BF4= 200.13
##$BF5= 200.13
##$BF6= 200.13
##$BF7= 200.13
##$BF8= 200.13
##$BYTORDA= 1
##$CFDGTYP= 0
##$CFRGTYP= 5
##$CHEMSTR= <none>
##$CNST= (0..31)
1 1 145 1 1 1 1 1 1 1 1 1 1 1 1 1 1 1 1 1 1 1 1 1 1 1 1 1 1 1 1 1 
##$CPDPRG= <waltz16>
##$CPDPRG1= <>
##$CPDPRG2= <waltz16>
##$CPDPRG3= <>
##$CPDPRG4= <mlev>
$$ [...]
##$SUBNAM3= <"">
##$SUBNAM4= <"">
##$SUBNAM5= <"">
##$SUBNAM6= <"">
##$SUBNAM7= <"">
##$SUBNAM8= <"">
##$SUBNAM9= <"">
##$SW= 501.771253377433
##$SWIBOX= (0..15)
0 1 3 0 0 0 0 0 0 0 0 0 0 0 0 0 
##$SW_h= 40650.406504065
##$TD= 32768
##$TD0= 1
##$TE= 0
##$TE2= 300
##$TE3= 300
##$TEG= 300
##$TL= (0..7)
0 120 53 12 22 120 120 120 
##$TP= (0..7)
150 150 150 150 150 150 150 150 
##$TP07= 0
##$TPNAME0= <>
##$TPNAME1= <>
##$TPNAME2= <>
##$TPNAME3= <>
##$TPNAME4= <>
##$TPNAME5= <>
##$TPNAME6= <>
##$TPNAME7= <>
##$TPOAL= (0..7)
0.5 0.5 0.5 0.5 0.5 0.5 0.5 0.5 
##$TPOFFS= (0..7)
0 0 0 0 0 0 0 0 
##$TUNHIN= 0
##$TUNHOUT= 0
##$TUNXOUT= 0
##$USERA1= <user>
##$USERA2= <user>
##$USERA3= <user>
##$USERA4= <user>
##$USERA5= <user>
##$V9= 5
##$VALIST= <valist>
##$VCLIST= <CCCCCCCCCCCCCCC>
##$VD= 0
##$VDLIST= <DDDDDDDDDDDDDDD>
##$VPLIST= <PPPPPPPPPPPPPPP>
##$VTLIST= <TTTTTTTTTTTTTTT>
##$WBST= 1024
##$WBSW= 4
##$XGAIN= (0..3)
0 0 0 0 
##$XL= 0
##$YL= 0
##$YMAX_a= 7332
##$YMIN_a= -8203
##$ZGOPTNS= <>
##$ZL1= 120
##$ZL2= 120
##$ZL3= 120
##$ZL4= 120
##$ABSF1= 248.5645
##$ABSF2= -253.2056
##$ABSG= 5
##$ABSL= 3
##$ALPHA= 0
##$AQORDER= 0
##$ASSFAC= 0
##$ASSFACI= 0
##$ASSFACX= 0
##$ASSWID= 0
##$AUNMP= <proc_1d>
##$AZFE= 0.1
##$AZFW= 0.5
##$BCFW= 0
##$BC_mod= 2
##$BYTORDP= 0
##$COROFFS= 0
##$CY= -3
##$DATMOD= 1
##$DC= 0
##$DFILT= <>
##$DTYPP= 0
##$F1P= 0
##$F2P= 0
##$FCOR= 1
##$FTSIZE= 65536
##$FT_mod= 6
##$GAMMA= 0
##$GB= 0
##$INTBC= 1
##$INTSCL= 6.047779e-11
##$ISEN= 30
##$LB= 1
##$LEV0= 0
##$LPBIN= 0
##$MAXI= 10000
##$MC2= 0
##$MEAN= 0
##$ME_mod= 0
##$MI= 50
##$NCOEF= 0
##$NC_proc= -7
##$NLEV= 6
##$NOISF1= 182.463
##$NOISF2= 159.3651
##$NSP= 0
##$NTH_PI= 0
##$NZP= 0
##$OFFSET= 248.5645
##$PC= 4
##$PHC0= -10631.38
##$PHC1= -76.51532
##$PH_mod= 1
##$PKNL= yes
##$PPARMOD= 0
##$PSCAL= 0
##$PSIGN= 0
##$REVERSE= no
##$SF= 81.0140089999694
##$SI= 65536
##$SIGF1= 159.3651
##$SIGF2= -187.1042
##$SINO= 113.3802
##$SIOLD= 16384
##$SREGLST= <1H.CDCl3>
##$SSB= 0
##$STSI= 65536
##$STSR= 0
##$SW_p= 40650.406504065
##$SYMM= 0
##$S_DEV= 0
##$TDeff= 32768
##$TDoff= 0
##$TI= <>
##$TILT= no
##$TM1= 0
##$TM2= 0
##$TOPLEV= 0
##$USERP1= <user>
##$USERP2= <user>
##$USERP3= <user>
##$USERP4= <user>
##$USERP5= <user>
##$WDW= 1
##$XDIM= 65536
##$YMAX_p= 349433499
##$YMIN_p= -20914010
$$ End of Bruker specific parameters
$$ ---------------------------------
##NTUPLES= NMR SPECTRUM
##VAR_NAME=  FREQUENCY,     SPECTRUM/REAL,   SPECTRUM/IMAG
##SYMBOL=    X,             R,               I
##VAR_TYPE=  INDEPENDENT,   DEPENDENT,       DEPENDENT
##VAR_FORM=  AFFN,          ASDF,            ASDF
##VAR_DIM=   65536,         65536,           65536
##UNITS=     HZ,            ARBITRARY UNITS, ARBITRARY UNITS
##FACTOR=    0.620285442955139, 1,           1
##FIRST=     20137.2065510682, 0,            0
##LAST=      -20513.1999529968, 0,           0
##MIN=       -20513.1999529968, -20914010,   0
##MAX=       20137.2065510682, 349433499,    0
$$ Real data points
##PAGE= N=1
##DATA TABLE= (X++(R..R)), XYDATA
$$ [...]
46810 620528 -2897752 -3749152 -2787896 -1789626 -301278 2143680 3619331 2623416 1101476
46801 1101476 1549511 2825167 2117192 -188973 -1130965 -37167 784789 319991 357572
46792 357572 1845872 2771004 1291414 -1213634 -2082607 -938037 434173 865198 775978
46783 775978 709726 378751 -523011 -1414092 -1271178 152499 1828875 2395711 1652607
46774 1652607 827684 1112704 2252375 2961145 2426007 954352 -530498 -1103119 -264033
46765 -264033 1628830 3501213 4497085 4478924 3497230 1643182 -194907 -705865 -140253
46756 -140253 -487085 -2372210 -3408423 -1623896 1056082 1519387 349234 407446 1308730
46747 1308730 -133841 -3510614 -3960166 195746 3745387 2042336 -1790341 -1712994 2002590
46738 2002590 3700975 1072428 -2399036 -3484691 -2709851 -1265954 903748 2740505
46730 2740505 2053301 -495203 -1262615 657326 1440880 -1369938 -4562350 -4285301 -2137509
46721 -2137509 -2177693 -4112376 -3982024 -737975 2109922 1668040 -835206 -2377906 -1535808
46712 -1535808 1026722 3560299 4361859 3386218 2647483 3592456 4644405 3224550 -356147
46703 -356147 -3264649 -4093043 -4043018 -4193352 -4091258 -3514760 -3384764 -4185436 -5202111
46694 -5202111 -5775732 -5723196 -4511297 -2027106 -140414 -966383 -3209392 -3059433 339883
46685 339883 3199353 2443669 101596 43705 2336094 3593489 1987402 -659179 -1691675
46676 -1691675 -671602 738016 904322 -130025 -946833 -715663 -358966 -940294 -1636452
46667 -1636452 -1060246 -79230 -779831 -2623722 -2802783 -1220191 -1536652 -5303279 -8455274
46658 -8455274 -6712625 -1881398 798406 -203498 -1946726 -2231820 -1696990 -1109517 -271878
46649 -271878 123940 -1154010 -3110807 -3058182 -672713 1149585 404402 -1448878 -2000307
46640 -2000307 -816768 1100656 2752167 3073356 1408831 -935891 -1508257 -65051
46632 -65051 851480 -235578 -1488090 -843086 796160 1469872 1435655 2100136 2972665
46623 2972665 2349385 426831 -784404 -505803 106448 345400 826093 1622487 1671103
46614 1671103 784241 366321 1124772 1772274 1256441 698573 1437704 2412893 1635209
46605 1635209 -367321 -915202 899815 2810061 2531188 482702 -1552444 -2778611
46597 -2778611 -3159743 -2383914 -699667 355525 -175960 -984435 -505369 309254 -482854
46588 -482854 -2159211 -1987511 397900 2115759 1241364 -712966 -1558375 -1215162 -438483
46579 -438483 849234 2311466 2522656 1440283 1406156 3486227 4954052 3195818 260871
46570 260871 87416 2335780 2794368 -219680 -3534889 -3927388 -2133209 -779864 -734129
46561 -734129 -1086173 -1177365 -1177709 -1446914 -2155041 -3016346 -3262366 -2612467 -2039386 -2540801
46551 -2540801 -3530342 -3713586 -3086619 -2563434 -2148069 -1246478 -307861 -190941 -372812
46542 -372812 58672 222485 -1136436 -2586588 -1618446 774065 872891 -1777365 -3173117
46533 -3173117 -1121700 1303474 1014280 -34355 1587705 4951497 6401199 5288846
46525 5288846 4180776 4194068 3807244 2249372 890507 757595 1073590 825613 12564
46516 12564 -944729 -1577694 -1274844 -295099 -426140 -2775640 -5312794 -4876627 -1663118
46507 -1663118 648696 -253945 -2585723 -3481365 -2678830 -1778621 -1425712 -1031835 -487527
46498 -487527 -417280 -875474 -1122283 -854154 -649212 -903775 -1215228 -1361493 -2101330 -3977261
46488 -3977261 -5709646 -5225320 -2605075 -500422 -662446 -1522889 -828381 708336 886920
46479 886920 258718 1488059 4253736 4586875 921645 -2637016 -1807043 1796773 3451466
46470 3451466 2294311 1626923 3110806 4651725 4376256 3252462 2761158 2718464 2610717
46461 2610717 2848426 3456909 3401974 2409895 1769666 2110969 1943405 -208693 -3444563
46452 -3444563 -5628410 -5965452 -5223745 -4200973 -3173669 -2284206 -1407258 -41388 1866014
46443 1866014 3444888 3881082 3252238 1822744 -557597 -3435161 -5077085 -4187712 -1834788
46434 -1834788 -333189 -432659 -879167 -639513 -140843 -57314 -223902 -385377 -945270 -2140586
46424 -2140586 -3252282 -3499347 -3104375 -2601797 -1750853 -343893 392853 -1115286 -4143131
46415 -4143131 -5800918 -4566536 -2236026 -1316429 -1861249 -2348982 -2402922 -2529576 -1983210
46406 -1983210 453086 3530618 4088223 1366678 -1599323 -2117296 -1161337 -924112 -1144572
46397 -1144572 -271346 1145934 1072297 -465836 -1118944 236826 1895905 1889586 393161
46388 393161 -1202385 -2201011 -2696098 -2807102 -2719794 -2836871 -3219695 -3373712 -3042243 -2674117
46378 -2674117 -2646539 -2544263 -1780757 -605950 111484 35463 -260427 -277979 -499116 -1702724
46368 -1702724 -3516621 -4597102 -4631483 -5014305 -6470763 -7156630 -5056102 -1622255 -472689
46359 -472689 -2330384 -4014358 -3224003 -1431696 -587671 69570 1617910 2570961 1461276
46350 1461276 200862 1321134 3324424 2638119 -549394 -2301893 -663742 2314548
46342 2314548 4470765 5763849 6016567 4114682 696829 -1550136 -1660124 -1610942 -2588038
46333 -2588038 -3088706 -2245569 -1865902 -3082459 -3841676 -2192378 356090 1358769 1177622
46324 1177622 1429845 1531851 -118950 -2650776 -3410269 -1740691 304711 805569 -250782
46315 -250782 -1637903 -1896117 -343133 1691386 1719263 -565000 -2312414 -1450965 227288
46306 227288 -17601 -1749016 -2791328 -3072542 -3786962 -3993902 -1792243 1610395 2809260
46297 2809260 1379504 523457 1847463 2978840 1749938 -315236 -677160 290857 214847
46288 214847 -1726466 -4001272 -4913548 -4405473 -3862100 -4478162 -5579249 -5038493 -2189919
46279 -2189919 552147 558890 -1347917 -2205739 -1197915 10073 788338 2134641 3518679
46270 3518679 2732482 22010 -1067720 1184222 3723182 3165417 629001 -444422
46262 -444422 786949 2512343 3511643 3752536 2939799 1020871 -704287 -1167816 -1334691
46253 -1334691 -2387754 -3247542 -2236169 -229052 409364 -576915 -1241348 -479864 1141434
46244 1141434 3116043 5138327 5872605 4085695 947570 -1066954 -1455229 -1686466 -2299090
46235 -2299090 -2494440 -2298949 -2340890 -1692146 887730 3505518 2575561 -1610694 -4538730
46226 -4538730 -3954365 -2759648 -3408530 -3450797 -13001 4494786 5405936 2710153 725718
46217 725718 1654360 3342928 3404803 2081104 443227 -1334533 -2936950 -3318820 -2202265
46208 -2202265 -815524 -575545 -1967122 -4524260 -6697616 -6333874 -3050182 372954
46200 372954 1009054 -260108 -184293 1840559 3193918 2680380 2375392 3652883 4576420
46191 4576420 3285707 1380727 1413224 2899272 3465394 2598624 1557966 474544 -1605780
46182 -1605780 -4019540 -4567650 -2850985 -1385751 -2435927 -5139870 -6719177 -5662646
46174 -5662646 -2939330 -574963 327107 222303 100692 186865 100585 25933 569230 1231754
46164 1231754 544796 -1418282 -2258750 -473509 1930478 2055735 333894 -256447 1339604
46155 1339604 3133849 3415859 2605054 1402733 -300644 -1813123 -1434579 779386 2184697
46146 2184697 1053262 -970452 -1596325 -1195235 -1285838 -1416142 -258122 1218217 645160
46137 645160 -1856082 -3451858 -2637981 -1068179 -614118 -790340 -246399 930347 1742411
46128 1742411 1824658 1189753 -464136 -2814372 -4131232 -2981097 -396387 981015 -79965
46119 -79965 -2226242 -3375863 -2852860 -1532729 -620387 -639754 -1296989 -2096096 -3019975
46110 -3019975 -4308631 -5510266 -5465202 -3802376 -1847332 -1184474 -1707852 -2062812 -1727492
46101 -1727492 -1445980 -1579829 -1378579 -403360 445895 144197 -954041 -1630252 -1295767
46092 -1295767 -232261 1176912 2616686 3547552 3611177 3259687 3256884 3559921 3372120
46083 3372120 2394753 1393465 1248269 1853434 2298034 2010632 1461161 1538912 2210488
46074 2210488 2200789 537448 -1884718 -3233528 -3204384 -3266638 -4104446 -4417260 -3235138
46065 -3235138 -1783958 -1461842 -1472493 -642429 -260981 -2135692 -4494613 -3392226 1442609
46056 1442609 5701864 6480893 5612997 5302930 4170549 678695 -2622856 -2377367 -19072
46047 -19072 296511 -1621822 -1942095 593230 2582889 1527857 -670490 -1612717 -2166704
46038 -2166704 -3801574 -5118311 -4142121 -2072822 -1536857 -2280888 -1704407 831215 3104663
46029 3104663 3496178 2821833 2255891 1615342 575155 -103916 342951 1432900 2166007
46020 2166007 2249117 1876427 984875 -473037 -1929371 -2612158 -2418369 -1874636 -1359825
46011 -1359825 -868205 -527520 -782803 -1729251 -2609174 -2517993 -1562309 -730346 -489437 -238618
46001 -238618 449232 906907 552211 215079 966264 2068245 1706680 -280146 -2122000
45992 -2122000 -2818871 -3236034 -3816263 -3217201 -656849 1991183 2325930 706153 -389121
45983 -389121 266641 1536751 1818048 602281 -1524544 -3088909 -2346807 828474 3985013
45974 3985013 4523428 2828231 1423369 1344653 1305019 486875 -41345 595315 1451103
45965 1451103 1268400 220458 -878999 -1908951 -2902587 -3167583 -2121199 -424921 633208
45956 633208 469719 -650186 -2157768 -3263790 -3208672 -2181526 -1446493 -1868769 -2776303
45947 -2776303 -2857926 -1726612 -119757 920814 670324 -785969 -2206665 -2088421 -457135
45938 -457135 970082 914333 -77180 -949673 -1674667 -2476278 -2669991 -1720402 -688226
45929 -688226 -1026068 -2343447 -2941939 -2380618 -1898247 -2172583 -2230324 -1105906 631192
45920 631192 1653046 1325997 -109534 -1991147 -3266779 -2755347 -214494 2938472 4504296
45911 4504296 3414891 901973 -403356 920419 3239872 3376986 354361 -3311410
45903 -3311410 -4742254 -3925487 -2580487 -1123953 1073698 3132556 3090678 1118753 -262342
45894 -262342 68623 298679 -955476 -2180687 -1673488 -627484 -1156068 -2719202 -3132879
45885 -3132879 -2206711 -1623993 -1590408 -477193 1844682 2987026 1427031 -1142561 -2186863
45876 -2186863 -1565397 -1009280 -1429750 -2160564 -2297125 -1573333 -177628 1352034 2178197
45867 2178197 1855373 953522 467281 591009 438471 -944681 -3386334 -5419128 -5488260
45858 -5488260 -3581326 -1439580 -771250 -1567747 -2712295 -3693771 -4634214 -4981774 -3760856
45849 -3760856 -1392927 256361 310248 24623 693014 1770538 2223349 2439127 3165817
45840 3165817 3493694 1908369 -954862 -2643444 -2223816 -1407287 -1637282 -1790719 -169789
45831 -169789 2340964 2924001 499347 -2774362 -4124462 -3213921 -1865295 -1562537 -2284463
45822 -2284463 -3413090 -4455679 -4659120 -3238189 -753135 823401 503985 -140623 813452
45813 813452 2624506 2931241 1479646 572300 1456594 2525682 2103453 991414 775208
45804 775208 1259695 1350381 1214053 1651138 2206508 1826871 827405 366188 331468 -463318
45794 -463318 -2125472 -3350334 -3243639 -2134273 -695082 479629 674530 -271692 -1386361
45785 -1386361 -1825579 -2060855 -2476551 -1936582 164910 1557486 -273589 -3685568 -4528846
45776 -4528846 -2300756 -939228 -2615001 -4618178 -4271201 -3235323 -4014949 -5159095
45768 -5159095 -3628910 -97506 1904933 1260499 180421 159505 295558 -106061 -227606
45759 -227606 229818 231231 -388690 -75086 1823096 3314418 2191915 -854990 -2981616
45750 -2981616 -2513604 -413916 1291471 1599519 1002422 538275 683696 1044435 959261
45741 959261 277318 -549255 -1113105 -1693386 -3059063 -5313747 -7012351 -6268012 -3248835
45732 -3248835 -587349 -220682 -839935 -194162 1092258 712621 -783303 -294028 2254097
45723 2254097 2635386 -1222046 -5177902 -4556596 -935029 763370 -240783 -635853 682801
45714 682801 1348303 447563 -48838 551304 480479 -417427 253150 2682746 3378524 778812
45704 778812 -1529311 -195085 2647609 3046192 1433240 1168115 2695845 3334103 2102286
45695 2102286 907661 932021 1103753 523266 -316501 -1191545 -2662886 -4375558 -4843062
45686 -4843062 -3513857 -1485023 127503 1049274 1060198 10343 -1302377 -1909239 -2295285
45677 -2295285 -3457703 -4448853 -3119743 305834 2719808 2081870 -133746 -1486324
45669 -1486324 -1641287 -1558109 -1324629 -526133 329689 369031 -345832 -1276396 -2414797 -3710092
45659 -3710092 -4343482 -3842761 -3177365 -3429463 -4041586 -3781889 -2855006 -2462311 -2628909
45650 -2628909 -2222447 -1159729 -823884 -1764879 -2510456 -1607109 195718 903515 -81405
45641 -81405 -1280475 -1061899 457125 1647893 1166833 -768092 -2830888 -3987078 -4164783
45632 -4164783 -3764120 -3132000 -2663086 -2754332 -3243787 -3430822 -3087472 -2844667 -3043184 -2953756
45622 -2953756 -1972407 -861480 -639045 -760912 206261 2327885 4119039 4556778 3874147
45613 3874147 2389374 191919 -1780838 -2147874 -1155844 -625836 -1092850 -873739 916672
45604 916672 2442718 1987769 923419 1508716 3042045 2971915 1172078 141601 922413
45595 922413 1776241 1603119 1813454 3336613 4193996 2228366 -1283827 -3094085 -2354325
45586 -2354325 -1371538 -2100262 -3785273 -4531148 -3725345 -2071804 -210213 1560420 2489917
45577 2489917 1523114 -1173392 -3500637 -3303172 -998193 720766 272149 -803668 -187592
45568 -187592 1799963 2596428 777546 -2482367 -5181126 -6232359 -5488722 -3611975 -2105170
45559 -2105170 -2013047 -2455384 -1904277 -727195 -446177 -611260 772800 3164165 3134711
45550 3134711 -294870 -3176649 -2074803 710711 626355 -2499340 -5096483 -5787644 -6413715
45541 -6413715 -7390621 -6383735 -2694721 559979 433484 -2114572 -4089485 -4186450 -3194496
45532 -3194496 -2234937 -1953145 -2334142 -2398683 -1183021 464737 546768 -1098812 -2301354
45523 -2301354 -1871064 -1381372 -2298504 -3267601 -2208828 260875 1683491 1304611 697768
45514 697768 1069501 1745573 1558536 414420 -922802 -1806845 -2147504 -2251947 -2345521
45505 -2345521 -2247951 -1799904 -1393222 -1267768 -504286 1797379 4141954 3486401 -417256
45496 -417256 -3481025 -2012591 2436026 5270881 4903642 3795203 3762616 3492688 1758972
45487 1758972 285525 1204589 3290603 3281883 552129 -1806763 -1046727 1801923 3595775
45478 3595775 3126082 2132433 2525568 3911433 4376648 2940970 470576 -1550875 -2475879
45469 -2475879 -2715212 -2964834 -3305049 -2953887 -1193127 1245561 2332360 983876 -1329841
45460 -1329841 -2233784 -1406681 -610660 -795899 -809781 351085 1552641 1169696 -228234
45451 -228234 -550846 665217 1474810 396101 -1321644 -1469131 -180748 127393 -1669106
45442 -1669106 -3463553 -2747596 -322392 761703 -252948 -711469 1228116 3589989
45434 3589989 3634816 2051850 1484611 2005322 1190427 -1466165 -3419494 -3106216 -2286393
45425 -2286393 -3000222 -4506987 -4957246 -4322964 -3831128 -3742482 -3385705 -2503661 -1218899
45416 -1218899 419506 1679783 1070344 -1628339 -4337791 -5130328 -4647083 -4515579 -4473403
45407 -4473403 -3072771 -553282 1143363 1074523 130719 -840027 -1933341 -2936710 -2878033
45398 -2878033 -1551566 -316550 -547040 -1916763 -2844168 -2323798 -895103 161423 384416
45389 384416 583544 1461831 2262281 1743976 323176 -129442 1130265 2810355 3695103
45380 3695103 3977608 3762665 2243523 -274910 -1475639 -90745 1725147 1325125 -411054
45371 -411054 -510517 1549045 3485445 4029154 4314253 5210197 5708269 4645319 2258056
45362 2258056 -465236 -2520593 -2886672 -1443726 -3283 -725601 -3359287 -5655926
45354 -5655926 -6416550 -6188864 -5081634 -2461589 624882 1388933 -962575 -3473812 -3037485
45345 -3037485 -228359 2023564 2324235 1681119 1320513 1394858 1669958 2076759 2263106
45336 2263106 1395705 -1078112 -4507987 -7086310 -7208679 -5044662 -2411361 -848219
45328 -848219 -416960 -663342 -1585415 -2822460 -3237831 -2676797 -2790937 -4308593 -4931483
45319 -4931483 -2522423 748268 763398 -2383311 -4211486 -2346091 384634 654073 -773639
45310 -773639 -1147423 53257 1206852 1199492 163729 -1165710 -1593031 -362050 1231049
45301 1231049 983582 -669585 -750248 1410917 2406028 -26149 -2901412 -2187354 1143450
45292 1143450 2864510 1849110 796556 1140700 1079946 -778838 -2998714 -3696255 -3087060
45283 -3087060 -2462828 -2245852 -2153785 -2186019 -2479469 -2759465 -2559576 -1819247 -1121697 -1285774
45273 -1285774 -2340215 -3051148 -2445648 -1719493 -2936509 -5488379 -6137575 -3686523 -1076078
45264 -1076078 -923144 -1526677 -170140 1837442 1280663 -1092641 -1203205 1891796 4340961
45255 4340961 3235624 390097 -1081825 -921942 -654742 -820325 -1229219 -2106460 -3129953
45246 -3129953 -2808052 -539927 1862005 2228233 662549 -1132152 -2166791 -2564326 -2561812
45237 -2561812 -2396075 -2530591 -2932971 -2740508 -1554733 -389159 -393030 -1229734 -1627426
45228 -1627426 -1062684 -111348 473593 418235 49877 141832 1090704 2017138 1528538 -290313
45218 -290313 -1672905 -1462411 -486766 75687 507275 1583740 2697802 2360770 289475
45209 289475 -2105507 -3276106 -2900508 -1835965 -1209548 -1343800 -1297533 90805 2479085
45200 2479085 4052429 3656868 2082240 702561 -214825 -1038893 -1508295 -1083999 -110519
45191 -110519 421981 84078 -762481 -1638136 -2147648 -1860205 -753080 442156 968603
45182 968603 913746 887322 1175576 1633119 1942427 1603859 363864 -898475 -684169 998514
45172 998514 2140276 1456763 420095 952731 2125464 1405943 -1205300 -2828758 -1864581
45163 -1864581 -68306 505696 394618 952301 1538779 737607 -692351 -616451 925766
45154 925766 1433206 -200215 -1691793 -529779 2419752 4142408 3375735 1429199 -455160
45145 -455160 -2427636 -4325506 -4689317 -2798137 -358968 449921 -125797 -144940 834713
45136 834713 1217214 190637 -878475 -746669 -349189 -1158758 -2612247 -2862732 -1576825
45127 -1576825 -261414 200464 691963 2002477 3216450 3036908 1922675 1614931 2641622
45118 2641622 3435928 2386074 21880 -1576286 -1276287 -40120 520372 46255 -525323
45109 -525323 -356133 449858 1241633 1514697 1151304 326866 -681813 -1642355 -2236026
45100 -2236026 -1898389 -324300 1743444 2961162 2984085 2780787 2846311 2276543 622978
45091 622978 -654916 -293200 308449 -1003837 -3420443 -4042249 -2311271 -609286 -122063
45082 -122063 585849 1878735 1525230 -1121686 -2796006 -1095266 1265040 561198 -1859215
45073 -1859215 -1844061 682761 1811888 243762 -928468 285780 1812126 1495399 328307
45064 328307 -193332 -801323 -2399305 -3834210 -3863540 -3236092 -2861691 -1918335 256293
45055 256293 2283763 2765109 2457868 2514598 2318554 1086292 -171453 -478109 -920304
45046 -920304 -2514282 -3821055 -3273858 -2113201 -2098022 -2084281 -343752 1331633 53730
45037 53730 -2619516 -2307112 1103045 2934019 1191635 -372286 1331964 3760837 3219659
45028 3219659 771666 69878 1709734 3303414 3568776 3013894 1655716 -744296 -2711875
45019 -2711875 -2200382 382298 2552558 3005724 2485412 1699380 488304 -951840 -1919318
45010 -1919318 -2352016 -2550027 -1975754 -63937 1996884 2211734 507163 -1321383 -2368612
45001 -2368612 -3361290 -4578076 -5226479 -5292402 -5750222 -6216066 -4760500 -1326255 902341
44992 902341 -543984 -3765303 -5003600 -3689394 -2570306 -3282153 -4294550 -3656725 -1689552
44983 -1689552 43545 952401 1355146 1175995 187747 -748316 -139731 2028372 3659921
44974 3659921 2795068 -26162 -2424907 -2910804 -2085162 -1216805 -669264 -120800 527104
44965 527104 1129622 1667544 2050565 1931496 1156382 9917 -1236618 -2366204 -2578462
44956 -2578462 -922615 1966260 3774892 3244097 1869345 1520784 1573759 364979 -1419353
44947 -1419353 -1374147 752520 2414361 1993737 818920 571952 806610 284609 -955667
44938 -955667 -2175451 -3113731 -3388702 -2240049 -194787 597266 -659075 -1624743 -116246
44929 -116246 2112633 1529893 -1824724 -4038181 -2687500 126153 1107552 -76420 -1531314
44920 -1531314 -2366888 -3104235 -3613211 -2895737 -1199726 -422517 -1318336 -1683648 910798
44911 910798 5144627 6857896 4360303 697595 -674590 -466868 -1504745 -3612153
44903 -3612153 -3894683 -1836697 -415983 -1181702 -1741454 -109100 1588089 623399 -1542294
44894 -1542294 -1484378 722528 1978985 1267653 450107 154035 -1112820 -3079589 -2927778
44885 -2927778 -29234 2037714 576522 -1989764 -1824650 591455 1702576 435990
44877 435990 -945805 -1026760 -898482 -1326857 -1238723 36224 1437855 2251051 3396255
44868 3396255 5185746 5607174 2777441 -1974041 -5335334 -5706932 -4070767 -1836326
44860 -1836326 240304 1227047 258145 -1860984 -2985305 -2304636 -1296444 -1302935 -1644681
44851 -1644681 -1173455 -301155 -100625 -498163 -863403 -1418806 -2374629 -2548827 -899548
44842 -899548 1108654 932525 -1375909 -3172738 -2988863 -1910097 -854055 842041 3115985
44833 3115985 4063226 2742494 982066 656325 1082304 929250 723418 1280166 1583698
44824 1583698 863897 1001174 3605860 6024636 4147605 -1157091 -4373758 -2643021
44816 -2643021 931985 2417021 2016982 2010481 2621304 2526037 1653801 999783 683164 180242
44806 180242 -312972 -447644 -906905 -2402675 -4048319 -4231495 -2762561 -934285 199379
44797 199379 548018 415419 200946 250561 180790 -999571 -3187897 -4479942 -3463483
44788 -3463483 -1516331 -1237144 -2909293 -4148755 -3157987 -893973 408269 -178490 -1636600
44779 -1636600 -2307339 -1531230 -313167 -232452 -1385925 -2041936 -1069066 128111 -533896
44770 -533896 -2600663 -3562800 -2521029 -1321741 -1420129 -1613452 -254391 1805798 2333320
44761 2333320 996066 -307350 -180623 873266 1894750 2718124 3241312 2773568 1018170
44752 1018170 -1102865 -2433278 -2818997 -2686603 -2048786 -820408 362984 662032 169519
44743 169519 -324817 -449805 -222369 734613 2666448 4502024 4706609 3548634 2925737
44734 2925737 3413865 3252844 1299151 -779147 -936800 42230 -43552 -1095949 -985940
44725 -985940 588656 1147237 -926468 -3950609 -5389714 -5107666 -4719239 -4818072 -4470568
44716 -4470568 -3035070 -1130452 237013 671335 460706 194091 301725 630887 557458
44707 557458 -253519 -1356534 -1968958 -1730739 -921992 -104228 450993 1120029 2443954
44698 2443954 3954823 4016589 1706983 -1428311 -2643841 -1150512 989727 1344629 -468439
44689 -468439 -3092017 -5077757 -5673245 -4863987 -3410835 -2453803 -2637760 -3826804 -5505796
44680 -5505796 -6788511 -6348583 -3617904 -147525 1587393 1089470 246419 519448 1287918
44671 1287918 1538630 1375667 831471 -932101 -3611460 -4596521 -2023133 1986756 3461052
44662 3461052 1588566 -546007 -213558 1999809 3839575 4175218 3368469 2137647 965865
44653 965865 39992 -716138 -1254595 -1196525 -571992 -272309 -713272 -560862 1598010 4459143
44643 4459143 4869492 2005814 -1272835 -2289523 -1888293 -2211369 -2720450 -1045419 2628388
44634 2628388 4809534 3246092 232299 -119669 3165440 7092070 8146563 5293470
44626 5293470 98336 -4559568 -6021000 -3781432 -397991 778835 -720804 -2219040
44618 -2219040 -1633516 120482 1257711 1759663 2263400 1966742 29295 -1884490 -1170068
44609 -1170068 1802079 3930129 3747602 2958149 3011171 2836546 1311691 -355038 -558314
44600 -558314 85754 -11126 -735261 -668091 670790 2509680 3974184 4211860 2344001
44591 2344001 -1150612 -3842269 -3769633 -1803906 -151001 582515 1045120 850583 -878901
44582 -878901 -2966192 -2842563 -312901 1624028 739137 -1498090 -2275005 -1267249 -437821
44573 -437821 -782725 -1080726 -17405 1803067 2673845 1948953 584052 -317252 -683787
44564 -683787 -951325 -1119915 -1024738 -1040668 -1602706 -2286885 -2353766 -2043015 -2211467 -2741953
44554 -2741953 -2593894 -1594190 -898205 -1406675 -2920571 -4939784 -6831627 -7182155 -4933689
44545 -4933689 -1568454 -73575 -1073883 -2147830 -1716906 -1082349 -1472936 -1868631 -1452256
44536 -1452256 -1392903 -1997675 -958240 2703379 5576226 4211697 401169 -1606113 -1295934
44527 -1295934 -1222844 -1734163 -1023711 392240 163776 -1002962 150344 3410781 4367462
44518 4367462 1110548 -2681446 -3258049 -1582017 -384707 237275 1756770 4251745
44510 4251745 6752982 8584525 8768759 6291727 2422788 374886 1095701 1826253 412274
44501 412274 -1613544 -2120931 -1806599 -2154867 -2393774 -1180535 544393 997843 376626
44492 376626 -15081 27235 348848 1684080 3925506 4856209 3047796 434237 -527332
44483 -527332 -638691 -2031440 -3895188 -3513507 -922046 741436 -400666 -2936095 -4694996
44474 -4694996 -5011105 -4181920 -2672456 -1284270 -694507 -651778 -626356 -858291 -1673766
44465 -1673766 -2459517 -2536037 -2202534 -1712701 -453438 1368098 1762986 -273948 -2492211
44456 -2492211 -2297703 -610386 -44473 -459232 294454 1859729 1446085 -1242374 -2766491
44447 -2766491 -846388 2364477 3376564 1576032 -1026486 -2512573 -2281369 -955809
44439 -955809 -84259 -792139 -2072067 -1643919 916904 3179283 2593946 -839922 -5017995
44430 -5017995 -7692779 -7708699 -5567613 -3245921 -2448490 -2787693 -2616094 -1520102 -647687
44421 -647687 -606418 -630252 -131338 395117 494422 563895 1055038 1761495 2159320 1790800
44411 1790800 514624 -885886 -995279 269930 936062 -270712 -1534250 -421030
44403 -421030 2209053 3396605 2605662 2090133 2883140 3557862 3301797 3060750 2922615
44394 2922615 1513932 -928600 -1962012 -808597 141563 -612574 -1054149 734589 2972813
44385 2972813 2897846 1077691 159658 658078 732785 -560975 -2140015 -2679544 -1861126
44376 -1861126 -261333 815528 200880 -1387091 -1646868 109487 1604134 912099 -604983
44367 -604983 -705677 -8785 -712157 -2570752 -3019486 -1154348 951262 1318264 485913
44358 485913 218506 1146532 2367644 2692476 1902074 944938 723710 768423 -53319 -1509826
44348 -1509826 -2093292 -1436334 -873629 -974555 -627714 359103 143087 -1952736 -3461971
44339 -3461971 -2307221 -274167 -286975 -1944325 -2697807 -2042847 -1407928 -1006851 -72533
44330 -72533 600384 -346702 -1901757 -2010410 -1229005 -1590467 -2435829 -1349213 991322
44321 991322 1300239 -629416 -1354025 154281 746112 -813598 -1002868 2204449 4803741
44312 4803741 2651564 -1602922 -2292257 847050 3029717 2064564 714937 1374167 2804677
44303 2804677 3208022 2988406 2922525 2263828 430499 -1251582 -1193384 153075 1009413
44294 1009413 673692 127440 451590 1399891 1818075 1357031 1275172 2778223 4715642
44285 4715642 4355358 1040968 -2465742 -3463714 -2632071 -2199873 -2261237 -1369207 82470
44276 82470 39083 -1618848 -2513771 -1472536 -194539 -171880 -429721 96626 224483 -1186173
44266 -1186173 -2314370 -526221 3331021 5581076 4696043 3028180 2887497 3268716 2001635
44257 2001635 -525113 -1853984 -1036417 197668 -29480 -1513852 -2729453 -2725607 -1651390
44248 -1651390 -167187 1008393 1471312 1562888 1958761 2489259 2156548 908070 384677
44239 384677 1763616 3672984 3826251 2275388 1146980 1136729 429850 -2114114 -4669891
44230 -4669891 -4750160 -2394501 506776 2970999 5180342 6626761 6023668 3259176 -23451
44221 -23451 -2209154 -3178833 -3836445 -4941380 -6442275 -7293721 -6103425 -2732282 994096
44212 994096 3032965 3302298 3203142 3438814 3579874 3419868 3150943 2285132 222920
44203 222920 -1863196 -1705984 754502 2658122 1970103 163175 -405421 -150360 -1073299
44194 -1073299 -2981775 -3574457 -2195234 -891093 -1007664 -1021722 746757 2901169 2490269
44185 2490269 -831023 -4095351 -4685170 -3206285 -2076703 -2373141 -3105993 -3092458 -2428288
44176 -2428288 -1994830 -2239513 -2715963 -2455155 -757964 1893265 3722352 3186606 825177
44167 825177 -1189509 -1626688 -1293339 -1002483 92379 2588109 4381400 2626712 -1789786
44158 -1789786 -4259516 -2060180 1984255 3102082 502198 -2237229 -2050094 331323
44150 331323 2034533 1379171 -946167 -2989289 -3266243 -1918463 -389378 322036 786511
44141 786511 1949101 3317687 3439908 2011958 325288 -448713 -281150 484727 1617764
44132 1617764 2436960 2189907 1534022 2151333 4049039 4835405 3053418 791319 1012529
44123 1012529 3227454 4133509 2260988 -385826 -1542680 -1172431 915 2079749
44115 2079749 4592529 5421654 3283667 251373 -313970 2088570 4815137 5572036 4343490
44106 4343490 2072894 -420384 -1916256 -1358556 195366 86568 -2302577 -4126465
44098 -4126465 -2840507 95171 1274734 71597 -1085997 -791369 -382627 -1016540 -1436143
44089 -1436143 -216256 1359528 743987 -2047691 -3984375 -2759725 403511 2467146
44081 2467146 2158113 750509 -239900 -668380 -719139 295701 2748664 5025242 4822739
44072 4822739 2283529 184922 336397 1320563 957575 -385386 -723909 150039 353321
44063 353321 -1024196 -2512626 -2498868 -1331309 -342618 108815 659395 1656114 2665778
44054 2665778 2982759 2238542 847433 3936 696938 2508496 3878769 3690065 2149240
44045 2149240 276857 -718532 212628 3035462 5883861 6437181 4486532 2174389 1379845
44036 1379845 1948262 2816438 3505651 3773831 3075090 1430750 -49521 -497995 -454181
44027 -454181 -917576 -1949141 -2918123 -3381955 -3093511 -2017936 -953989 -1066456 -2096480
44018 -2096480 -2291666 -993803 149807 -256769 -1166804 -1120394 -951310 -2187282 -3790565
44009 -3790565 -3190960 -320000 1939159 1601480 -364340 -2296273 -3930966 -5256471
44001 -5256471 -5207147 -3121085 -526010 52619 -2061525 -4882754 -5839780 -4267828 -1752053
43992 -1752053 -152061 350623 793981 1415233 1348814 525423 170274 476040 -429727
43983 -429727 -3508193 -6358251 -6050209 -3344494 -1432836 -1073118 28459 2849795 5071579
43974 5071579 4458115 1870844 -343377 -1221041 -1292032 -1224259 -1372690 -1654489 -1331543
43965 -1331543 8359 1132152 341866 -1868733 -3159853 -2677437 -2034983 -2455529 -3144372
43956 -3144372 -3371867 -3906884 -5085862 -5543755 -4459083 -3262169 -3379543 -3812018 -2754282
43947 -2754282 -371256 1778736 3025662 3644551 3578734 2702113 1596766 711547 -438896
43938 -438896 -2015672 -2831305 -1989300 -572901 -194061 -716981 -958120 -863532 -1319184
43929 -1319184 -2282407 -2712365 -2243781 -1690866 -1830302 -2398221 -2264682 -484942 2306550
43920 2306550 3808764 2622989 654711 932665 2999404 3258563 660532 -1252487
43912 -1252487 189268 2447814 1705665 -1410185 -3301204 -2705905 -1141297 524798
43904 524798 2424692 3527551 2540142 505337 -492463 -645079 -1494262 -2445013 -1571506
43895 -1571506 490558 944135 -836542 -2630173 -3139941 -3233160 -3269296 -2543988 -1772855
43886 -1772855 -2709220 -4614432 -4477398 -1666667 925663 1490956 1782802 3552582 5574267
43877 5574267 5955727 4784432 2845808 204654 -2367682 -3018619 -1479207 189928
43869 189928 850174 1687142 3030989 2938296 952070 20718 1857847 3299566 808030
43860 808030 -3562443 -4591262 -1070767 3167373 4886353 4629000 4125768 3560818 2264465
43851 2264465 118848 -2472656 -4747920 -5485478 -3937755 -1060041 1079437 1202088
43843 1202088 -281456 -1813351 -1738782 333834 2700115 3096327 1523783 178814 88452
43834 88452 -236444 -1788988 -2912608 -1896879 146282 1052154 726919 422666 294064
43825 294064 -111155 -150692 823075 1682028 1071669 -194885 -511988 -295147 -1062006 -2531372
43815 -2531372 -3084717 -2501922 -1898194 -1538375 -994096 -745541 -1203610 -946603 1354071
43806 1354071 3972957 4103651 2275827 1528987 2412188 2402175 613377 -651334 -89345
43797 -89345 348255 -970117 -2480887 -2087758 -400276 606212 345646 -635086 -2017325
43788 -2017325 -3258977 -3272273 -1988190 -892167 -803561 -629802 430818 1101691 20093
43779 20093 -1877819 -2667114 -2074150 -1171596 -260728 1283665 3360318 4583161 3476228
43770 3476228 -60412 -4118792 -5872285 -4451941 -2519052 -3239893 -5801967 -6370844
43762 -6370844 -3848468 -1560569 -1885552 -2530013 -719903 1713536 979174 -2683939 -5447067
43753 -5447067 -5506434 -4572665 -3920957 -2613726 -349825 1109381 666849 -351962 -448828
43744 -448828 15531 210978 392016 770961 517861 -695953 -1606844 -1279034 -781589
43735 -781589 -1313394 -1851952 -663397 1579495 2361416 921877 -660037 -322080 1648681
43726 1648681 3649664 4698018 4603498 3416582 1659281 313351 -244955 -639052 -1174371
43717 -1174371 -1026716 315069 1678206 1565721 250171 -942771 -1922210 -3585716 -5442283
43708 -5442283 -5631565 -3852808 -2228706 -2198702 -2401733 -1157286 512320 311859 -1819829
43699 -1819829 -3625560 -3494603 -1782699 424390 2121934 2273138 745559 -691582
43691 -691582 -87334 1961065 3131648 2961853 3396438 5198140 6102295 3898857 -291378
43682 -291378 -3332265 -3607003 -1972218 -67834 1096115 1442956 1702340 2603733 3715307
43673 3715307 3770875 2486702 1004493 91195 -756495 -1731632 -1863704 -981496 -1005376
43664 -1005376 -3467537 -6728316 -7652488 -5637538 -3128907 -2198049 -2327666 -1961694 -886995
43655 -886995 -287443 -956954 -2022244 -1652540 706739 3097352 3038837 771065 -1008657
43646 -1008657 -1076743 -1297917 -3060050 -4343455 -2725308 390504 1622444 735853 500338
43637 500338 1708439 2112205 994178 927648 3119425 4364517 1509202 -3388933 -5605728
43628 -5605728 -4111190 -2210015 -2491646 -4245838 -5876193 -6902160 -6923970 -5237752 -2646253
43619 -2646253 -1521875 -2673957 -3889523 -3067533 -1194305 -404052 -514161 126873 1161914
43610 1161914 405994 -2297472 -4018234 -2579711 542659 2480741 2478293 1570010 206708
43601 206708 -1691460 -3094689 -2592769 -791835 16801 -974192 -1932354 -1081337 859547
43592 859547 1833595 1040856 -486253 -1215369 -399259 1367451 2490162 1955833 746027
43583 746027 711655 1938266 2631632 1946579 1119313 965339 299080 -1588968 -2768217
43574 -2768217 -1270197 1416406 2009075 -96604 -2509661 -3526641 -3486155 -2652539 -706667
43565 -706667 1241707 1039684 -1241447 -3137359 -3818171 -5152531 -7215697 -6382611 -1016481
43556 -1016481 3939436 2488670 -3788701 -7397746 -5051234 -1364033 -1318109 -3542262
43548 -3542262 -3691769 -1109145 1314392 1893890 1320936 106191 -1965205 -4147512 -5262247
43539 -5262247 -5859832 -7332641 -8889063 -8186126 -5400734 -3698343 -4469411 -4929253 -2406642
43530 -2406642 1371831 2859487 1800228 756549 563645 -362180 -2190233 -2541918 -366140
43521 -366140 1737763 945679 -1819609 -3404461 -2853702 -2170385 -2919465 -4070945 -3803507
43512 -3803507 -2117496 -660271 -500083 -1047533 -1280083 -1270313 -1808533 -2724496 -2554124
43503 -2554124 -403870 2505307 3986097 3282048 1508099 -95753 -1399291 -2799061
43495 -2799061 -4256319 -5212948 -5014601 -3433236 -1209913 245799 377106 250507 903376
43486 903376 1562197 909097 -438775 -690336 -12244 -597731 -3083258 -5184204 -4970881
43477 -4970881 -3435291 -2369180 -1537173 236248 2571266 4027838 4157671 3446161 2127353
43468 2127353 591081 -42362 543475 665669 -1197472 -3772349 -4350536 -2283557 491742
43459 491742 1845275 898364 -2006429 -4994576 -5266655 -2117853 1404072 1992053 377799
43450 377799 -276840 634195 822293 -678114 -2248959 -2775235 -2790383 -2181668 -45847
43441 -45847 2504547 2768491 682590 -787788 -679407 -1656477 -4693995 -6096452 -2894612
43432 -2894612 2057688 4023266 2844497 1584113 875798 -892593 -3031842 -2957849 -1034999
43423 -1034999 -598484 -2450099 -3288257 -959658 2095304 2448092 123415 -2458208 -3964217
43414 -3964217 -4676473 -4961126 -4924126 -4689347 -3833473 -1473727 2090135 4809333 4954879
43405 4954879 2918694 221091 -2194788 -3822310 -3989165 -2724856 -1444597 -1473948 -2367566
43396 -2367566 -2777528 -2531263 -2709693 -3871045 -5188717 -5356275 -3730843 -755903 2207080
43387 2207080 3774089 3841524 3646957 3987417 3967679 2421812 86303 -937001 66983
43378 66983 1398367 1088922 -813941 -2662663 -3226375 -2609230 -1557543 -572434 320426
43369 320426 1347730 2522149 3185198 2293162 -396291 -3615625 -5603725 -5748004 -4721890
43360 -4721890 -3288941 -1932806 -1574319 -3147159 -5768275 -6760315 -4808202 -1976822
43352 -1976822 -911417 -1011936 254460 2671414 2910959 -390559 -3992314 -4168240 -1358792
43343 -1358792 1227280 1912820 1280934 76143 -1107562 -1019005 782900 2281272 1410016
43334 1410016 -384202 137250 2877317 4211505 2434151 112925 -247330 236090 -352666
43325 -352666 -979691 479116 3241092 4372223 2926219 887922 59422 -23437 -736654
43316 -736654 -2235634 -3115435 -1781561 1639730 4636096 4533533 1812295 -206008 210339
43307 210339 870231 -744526 -3390001 -3972628 -2323569 -1177524 -1781082 -2405450 -1542296
43298 -1542296 15827 1049672 1647472 2044945 1581487 -6345 -1665483 -2470362 -2798395
43289 -2798395 -3170815 -3151774 -2380950 -1544948 -1237986 -853200 296810 1652344 2319399
43280 2319399 2486746 2729608 2623454 1440165 -176981 -638381 501398 2004346 2610733
43271 2610733 2303533 1743059 1298662 1037278 1098864 1545296 1934234 1409091 -468449
43262 -468449 -2856182 -3976983 -2913878 -923586 -181081 -1196546 -2460102 -2826602 -2894810
43253 -2894810 -3285021 -3007290 -1094657 1056345 963291 -1424823 -3315565 -2592339 -210216
43244 -210216 1601356 2145831 2201751 2190270 1808154 1115459 703277 699786 587519 224010
43234 224010 193217 748738 1123929 509196 -721951 -1439972 -1221849 -751088 -799003 -1418512
43224 -1418512 -2235763 -2953146 -3353139 -3320599 -3096294 -2990640 -2642714 -1310659 641952
43215 641952 1411986 -181779 -2915303 -4551133 -4604793 -4401508 -4547182 -4010653 -2241418
43206 -2241418 -661785 -839302 -2046774 -2040314 -97081 1897479 1727207 -513244 -2612834
43197 -2612834 -2839009 -1729626 -1032270 -1351813 -1678678 -1224410 -571952 -393110 -161136
43188 -161136 698740 1329893 750279 -211 924013 2913245 3098321 320999 -3161812
43179 -3161812 -4793264 -4602719 -3886995 -2922065 -1544116 -459538 -212326 37388 1105346
43170 1105346 2217791 2414820 2367150 3031777 3631843 3036266 2164556 2608623 3482108
43161 3482108 2299506 -1057097 -3815539 -4133235 -3103962 -2340830 -1802479 -1021797 -516234
43152 -516234 -603712 -274554 1300588 3089834 3362941 1999349 534436 114937 212307
43143 212307 -537416 -2525343 -4395975 -4393355 -2558054 -833765 -481753 -416336 792356
43134 792356 2263667 1839624 -789050 -3767643 -5529619 -5744325 -4204064 -1016163 2016281
43125 2016281 2507298 546469 -1221161 -961823 756916 2877562 4998772 6160240
43117 6160240 5109781 2773787 1974731 3428039 4404631 2816518 214766 -1070609
43109 -1070609 -1443274 -2467093 -3753320 -3916096 -3201672 -2763816 -2416038 -1312574 54147
43100 54147 520822 51060 -795069 -2031449 -3276050 -3174535 -1712104 -1317637 -3289821
43091 -3289821 -4955190 -3311138 141064 1609117 721847 165945 499727 -299334 -2144537
43082 -2144537 -2202858 101579 1515448 -51930 -2440799 -2903924 -1773277 -620270 345509
43073 345509 973949 -30262 -2645892 -4200042 -3016158 -1391785 -2277207 -4709458 -5478321
43064 -5478321 -4100170 -3038034 -3540962 -4266198 -4157827 -4080943 -4927043 -6045318 -6383775
43055 -6383775 -5861843 -4935680 -3799217 -2611035 -1833800 -1845734 -2479619 -3075543 -2901790
43046 -2901790 -1829450 -774173 -888196 -1972010 -2460956 -1547710 -433801 -616712 -1750471
43037 -1750471 -2322274 -1884175 -1441062 -1935204 -3342314 -4967896 -5766752 -4846460 -2672590
43028 -2672590 -1273629 -2053675 -3811484 -4218981 -2856973 -1247831 -203920 847022
43020 847022 1700708 821464 -1972356 -4196311 -3755368 -1917972 -1222819 -1409284 -26333
43011 -26333 3019350 4448025 2355510 -434286 22911 3306753 5409376 4386950 2350641
43002 2350641 1552337 1423033 723097 -12927 -176243 -1053276 -3534482 -5514245 -4622102
42993 -4622102 -2471848 -2716782 -5237686 -6076487 -3693883 -1366107 -1742227 -2688618 -1286162
42984 -1286162 920922 252863 -3122098 -5216001 -3875319 -1271616 -401543 -1571549
42976 -1571549 -3038885 -3315482 -2099191 -165833 1142479 1166441 766022 1156223 2253494
42967 2253494 3181200 3848100 4609762 4845223 3632943 1701689 900406 1612212 2413591
42958 2413591 2428868 2119244 1406369 -802232 -4231873 -6303187 -5057643 -1780105 644824
42949 644824 1045838 460719 233898 880032 2189833 3285853 2989765 1068886 -1226751
42940 -1226751 -2459401 -2256545 -910360 1094357 2406399 1162498 -2540663 -5771594
42932 -5771594 -6131958 -4913140 -4754805 -5166138 -3375032 492416 2492990 291347 -3404288
42923 -3404288 -4747293 -3783544 -3197653 -3826968 -4351147 -4516050 -5535693 -7246047 -7674846
42914 -7674846 -6082307 -4030468 -2580100 -784630 1721833 2925079 1289774 -1227376
42906 -1227376 -1469003 543471 1991108 1548387 663274 398555 -306566 -2210163 -3907907
42897 -3907907 -4039217 -3642365 -4292818 -5014192 -3425654 245762 2607578 1259920 -2159722
42888 -2159722 -4155504 -3446842 -1607760 -386141 47330 179888 -37385 -742466 -1418360
42879 -1418360 -1522868 -1425453 -1817833 -2401905 -2126004 -802236 444343 685190 369870
42870 369870 531701 1458647 2664832 3581832 3681984 2472470 130086 -2154460 -3127110
42861 -3127110 -2650938 -1638002 -1175851 -1932537 -3720822 -5265131 -5252286 -4088282 -3522217
42852 -3522217 -3924114 -3487852 -1306181 547129 2301 -1478179 -1023723 1057321 1964911
42843 1964911 1143062 718478 1008275 -444222 -4030488 -6011554 -3627145 647763 2616456
42834 2616456 1808928 635209 77445 -654445 -1508797 -1743940 -1876112 -2626075 -2634134 -174212
42824 -174212 3288648 4326934 2382878 452941 589099 1536588 1552288 880887 293161
42815 293161 -516065 -1702858 -2346589 -2104853 -2135962 -3004619 -3212360 -1391194 1237543
42806 1237543 2235602 1011291 -900288 -2001261 -1977187 -1191625 -324547 -252867 -1192118
42797 -1192118 -2126787 -2028659 -1402598 -1569900 -2502519 -2596884 -1045212 570477 20778
42788 20778 -2569647 -4530647 -3807204 -1465169 -156583 -586263 -915272 140646 1244194
42779 1244194 508030 -1633617 -3178584 -3419352 -3301321 -3273651 -2685299 -1513751 -937598
42770 -937598 -1570351 -2484937 -2668074 -2334262 -2182097 -2360192 -2763845 -3419526 -4016686 -3931643
42760 -3931643 -3158182 -2274460 -1172132 903439 3501119 4651122 3446374 1623699
42752 1623699 1226313 1778839 1387681 -175869 -1401567 -1698170 -2011386 -2386019 -914111
42743 -914111 3513075 8526558 10132621 7293029 3294848 1862664 2819652 2847788 278756
42734 278756 -2558217 -2596726 -286697 1070889 -292690 -2738975 -3851746 -3178203 -1750320
42725 -1750320 -488714 -113542 -1320098 -3676592 -5189991 -4333829 -2007415 -301827
42717 -301827 170324 434612 1086259 1604542 1696401 1778348 1794682 1027826 -242756 -269417
42707 -269417 1836279 4322740 4807022 3472393 2565371 2878285 2812989 1583771 1112695
42698 1112695 2896237 4681668 3128659 -799062 -2407934 140642 3126346 2906772
42690 2906772 1198468 1712873 3748092 3190637 -795678 -4204124 -3902854 -1371549 502934
42681 502934 1211231 1421114 754638 -815099 -1325019 774076 3746733 4545429 2937057
42672 2937057 1430351 1534666 2272660 2403221 2185001 2521101 3682308 5182771 5969732
42663 5969732 4814772 1624372 -1709153 -2949149 -2084749 -1201987 -1765556 -3177630 -4168802
42654 -4168802 -4340652 -3829005 -2585201 -904731 4941 -928527 -3028518 -4096349 -2680578
42645 -2680578 205080 2142450 2003100 888084 179434 -309868 -1327145 -2299500 -2144323
42636 -2144323 -1498965 -2021152 -3343205 -3140733 -1072087 -132237 -2354316 -5289609 -5141539
42627 -5141539 -1928147 1089027 2150860 2355390 2637800 2288515 945056 -306569 -617217
42618 -617217 -365723 200301 1643056 3896056 5608522 5750153 4731936 3348658 1810068
42609 1810068 422088 -17567 665827 1441192 1317059 444270 -446306 -863349 -483187
42600 -483187 744373 2012095 2178189 1284818 541241 442722 99430 -1078803 -2313265
42591 -2313265 -2743594 -2531998 -1900881 -361560 2055689 3929772 3978767 2585040 806963
42582 806963 -1047317 -2662872 -2764387 -726036 1589511 1583836 -669619 -2604032 -2808526
42573 -2808526 -2603602 -3407592 -4315418 -3600645 -1581160 -412733 -1138881 -2202603 -1464160
42564 -1464160 910234 2445434 1412055 -821608 -1286087 930256 3531800 3850718
42556 3850718 1868871 -325400 -1325021 -1563749 -2031555 -2958757 -3878442 -4196628 -3576292
42547 -3576292 -2378393 -1707094 -2274614 -3155804 -2531120 -33519 2353538 2334152 -105290
42538 -105290 -2658828 -3162946 -1735950 -394375 -705296 -2062736 -2575844 -1586857 -591902
42529 -591902 -1126345 -2375387 -2010866 676478 3719020 4974127 4553602 3867647 3147117
42520 3147117 1401627 -1244493 -2722774 -1428503 1295741 2257717 82641 -3063925
42512 -3063925 -3900248 -1667154 1361612 2803537 2619714 2233506 2111498 1370832 -378665
42503 -378665 -2045846 -2435248 -1786183 -1199608 -1038895 -721779 130596 1145241 1780995
42494 1780995 1762091 881201 -914051 -3015025 -4335749 -4314616 -3334754 -2057418 -922388
42485 -922388 -379772 -695038 -1110285 -229005 1911152 3058674 1315624 -2054398 -3868297
42476 -3868297 -2940015 -1234040 -908665 -1772715 -2321067 -1868786 -621755 1226091 3139981
42467 3139981 3760599 2262192 -87966 -1080786 -266796 688033 442108 -462897 -878280
42458 -878280 -722707 -583724 -446015 164599 1072753 1440788 951378 282588 122388 258671
42448 258671 97562 -314971 -464533 -416169 -808420 -1525918 -1318835 450604 2383538
42439 2383538 2531607 970065 -416470 -602222 -342169 -217316 449756 1870723 2604598
42430 2604598 1440665 -696694 -2066506 -2276018 -1793626 -598217 874072 729910 -1917818
42421 -1917818 -4304013 -2846414 1470354 3767041 1959795 -521989 -208091 1361284
42413 1361284 610705 -2377570 -4341075 -3804090 -2392745 -1500447 -530550 1123998 2671360
42404 2671360 3258148 3052740 2385749 1280784 385998 879560 2667710 3947701 3447768
42395 3447768 2054151 1318007 1309645 1032941 267087 -223495 -80007 68800 -496254 -1702058
42385 -1702058 -2723438 -2548878 -733816 1893831 3464578 2680167 316791 -1405073
42377 -1405073 -1202837 -93544 -8321 -1333717 -2492635 -2123891 -938430 -632663 -1369322
42368 -1369322 -1606907 -649220 105018 -556252 -1426005 -655439 977189 798138 -1675468
42359 -1675468 -3644779 -2864460 -592790 613533 377082 38963 29466 -188174 -288547
42350 -288547 566809 1737846 1584502 108165 -904481 -820981 -1203556 -2990392 -4507228
42341 -4507228 -3779840 -1569209 -460996 -1545813 -3375323 -3939597 -2687645 -805445
42333 -805445 -114427 -1244180 -2489295 -1463572 1424916 2570391 -307962 -4511351
42325 -4511351 -5390423 -2327489 873810 1555914 1281105 2267684 3383730 2007235 -1471810
42316 -1471810 -3582332 -2164929 1091766 2998344 2367929 414169 -1343958 -2381942
42308 -2381942 -2615113 -1790737 -96388 1294181 1335587 712014 1221017 3175137 4515335
42299 4515335 3346094 460431 -1727718 -2018648 -981432 522505 1702432 1296485
42291 1296485 -1197117 -3715238 -3256517 112603 2869077 2471937 288787 -988019
42283 -988019 -975953 -1107060 -1958772 -2815839 -2984227 -2121298 -115434 2122361 2746480
42274 2746480 1142848 -1041035 -2269656 -3119994 -4312522 -4421453 -2005745 1190328
42266 1190328 2112429 909237 491434 1627838 1769974 -446932 -2631921 -2178626 33015
42257 33015 1436507 1533883 1776067 2822716 3958965 4723790 5361261 5732107 5134131
42248 5134131 3378498 1168184 -713994 -1973343 -2521656 -2201701 -1052414 341048
42240 341048 1022504 478163 -590766 -682710 888704 3063012 4181066 3766232 2694621
42231 2694621 2055808 2426802 3633171 4430032 3217843 204748 -1984919 -1337531 727271
42222 727271 1402429 584294 495804 1624928 1986960 801900 -111217 323959 516287
42213 516287 -792395 -2099092 -1698599 -590295 -627487 -1455869 -1608478 -1302694 -1757200
42204 -1757200 -2688744 -2815736 -2222256 -2106840 -2668502 -3145521 -3414313 -3693999 -3317124
42195 -3317124 -1828029 -679514 -1526670 -3185509 -2754513 203379 3017926 3775007 3464514
42186 3464514 3591676 3844266 3251158 1987513 879768 318917 488423 1482050 2478729
42177 2478729 2062956 212956 -1136853 -356304 2001804 4246049 5421606 5438345 4477089
42168 4477089 3274009 3126212 4547953 6420708 7242560 6741628 5690687 4737609 4015334
42159 4015334 3371817 2511766 1404673 707001 986652 1524750 1173318 542076 1489781
42150 1489781 3776013 4450024 2150550 -89243 1162657 4374838 4779347 986671
42142 986671 -3273209 -4355121 -2683633 -599358 985962 2110490 2206622 1200921 657073
42133 657073 1656416 2681367 1848778 341993 1025370 3947017 5935630 5098611 3239119
42124 3239119 2836862 3769761 4396684 4164456 3554383 2787998 2250505 3065434 5371322
42115 5371322 6841605 5021424 881015 -1943232 -1582441 156033 649984 -417008
42107 -417008 -1450939 -1154360 429556 2185013 2707912 1612576 326483 647470 2359730
42098 2359730 3513883 3308351 3079055 3737225 3984576 2470027 336647 -239205 708004
42089 708004 1135592 339966 214738 2479216 5875144 7203334 4916664 1008463 -914714
42080 -914714 708914 3958661 5728938 4952717 3042198 1763728 1828106 3265562 5569315
42071 5569315 7163685 6348161 3516422 1072264 375507 237784 -600288 -1178652 -31414
42062 -31414 2191947 3639563 3797068 3323177 2292256 638198 -370104 586627 2350179
42053 2350179 2354628 480721 -250394 2471321 7239061 10474689 9934667 6344962 2539570
42044 2539570 1152707 2299156 3632374 3429041 2802724 3511115 4706011 4255565 2706997
42035 2706997 2963749 5764975 8438678 8965776 8424171 8149497 7347725 5476843 4487621
42026 4487621 6170139 9073905 10637037 10964118 11827417 13023054 12662932 10662348 9162554
42017 9162554 9450918 10912206 13137606 16517623 20280325 22576462 23626072 26467986
42009 26467986 32986920 41070281 47700376 53567472 62367647 76142890 93670542 113770976
42001 113770976 138289317 170703074 212310010 259743945 304976318 337616976 349433499
41994 349433499 338945304 311805645 275979685 236977419 198244890 164190327 139490202
41987 139490202 124837496 116150024 109780278 106749806 109929848 118850211 130534294 145097735
41979 145097735 166854117 198024583 233105788 261161094 272977198 265526557 241656925
41972 241656925 207979756 172493944 141408198 116554630 96171815 78544003 64343109
41965 64343109 55152690 50477189 47210012 42303225 35509438 29053678 24789456 22352641
41957 22352641 20332254 18436678 17577271 18093240 18949929 18921753 17819221 16274698 14960055
41948 14960055 14313156 14416282 14715618 14298422 12869904 11220580 10488334 11139521 12673882
41939 12673882 13962081 13895717 12241145 9999619 8496368 7998755 7591226 6386782 4423969
41930 4423969 2461693 1432284 1991992 3951034 6142463 7416150 7655522 7278626 6188394
41921 6188394 4226217 2346710 1980639 3100759 4140150 4075897 3476177 3276669 3696391
41912 3696391 4573347 5488608 5355467 3454925 1305295 1656173 4649772 6739659 4934798
41903 4934798 798555 -1509570 -316859 2199352 3303630 2690104 2119914 3314113
41895 3314113 6445644 9952563 11711622 10877950 8545526 6374244 4964297 3918124
41887 3918124 2963191 2449715 2977187 4749132 6997386 8265756 8096521 8161193 10285954
41878 10285954 13329822 13945691 11115229 7934772 7593127 9331004 10172047 9307559 8579452
41869 8579452 9167840 9813424 8552993 5151185 1707029 1119530 4223280 8168573 9023593
41860 9023593 6600915 4885195 6564177 9281858 9256224 6689218 4986224 5915454 8277260
41851 8277260 10501625 11846765 11606689 9787039 8189158 8356888 8988254 8029277 6672995
41842 6672995 8060313 12229812 15846359 17286967 18517314 21124948 23911532 25737839
41834 25737839 27698356 30958381 35166919 40386707 47643385 55874953 61402269 62694389
41826 62694389 62901945 65106974 67663931 67278330 64445791 62268316 61345467 59466037
41818 59466037 55592792 50769105 45490130 39473228 34034444 31504558 31731152 31859691
41810 31859691 30303899 28587431 28504089 29675901 30926475 32219373 34157892 36986464
41802 36986464 40935311 46286713 52486236 58521528 64708755 72629750 82691595 93285458
41794 93285458 103038865 112217765 121044647 128564124 134583899 140849578 148157639 153644427
41786 153644427 153575957 148411588 142565286 138885604 135669283 129968335 121832617 113708591
41778 113708591 106804607 99881470 91555890 82476819 74666917 69145733 64682246 59138443
41770 59138443 52075322 45550850 41749728 40248163 38760613 36445735 34718520 34150783
41762 34150783 32608267 28324071 23387946 21536568 22933392 23994194 22767406 21562998
41754 21562998 22930137 25689257 27187343 27535078 28809359 31104293 32318464 31713488
41746 31713488 31062091 31878389 33695529 35645394 37784554 40143359 42220980 44204846
41738 44204846 47018008 50273809 51865850 50799770 49040964 49242332 51755717 55069967
41730 55069967 57961261 59750223 59599124 57479721 55259738 54930623 55875289 55554451 52967734
41721 52967734 49831935 47956775 46940003 45302102 42901344 41137768 41027574 41845987
41713 41845987 41816407 39854646 36512920 33291662 31180055 30000291 29059781 28109884 27543036
41704 27543036 27788953 28514740 28418288 26276844 22555181 19318527 17807768 16905994 15310535
41695 15310535 14366212 16454427 20654904 22785750 20753320 17348021 16160898 17123479
41687 17123479 18326709 20040933 23686153 28056646 30247129 30315897 31715908 36383319
41679 36383319 42188091 46255527 48285328 49256095 49190067 48100866 47435315 48448690 50168112
41670 50168112 50900196 51051265 52558037 55934906 59852157 63706265 68674827 75492135
41662 75492135 82684870 88216005 92009893 95495850 98963428 100822645 99880813 97140868
41654 97140868 94397834 91877094 88608422 84751663 81797787 80059208 77611715 72718622
41646 72718622 65958791 58682110 50658309 41178873 31745831 25345480 22841717 21958683
41638 21958683 20306662 17783058 15381391 13277916 11220792 9674136 9297383 9783386
41630 9783386 10104218 9602529 8317566 6672355 5305903 4755121 4856700 4857801 4445599
41621 4445599 4244255 4998005 6600400 8047984 8044748 5915611 2626451 621295 1600090
41612 1600090 4505741 6741635 7183221 6632337 5546732 3386047 652117 -607180
41604 -607180 529020 2477551 3726656 5010461 7284988 9260843 9217031 8140988 8545568
41595 8545568 10590728 11766557 10561314 8463563 7953663 10053392 14128262 18688551
41587 18688551 22129663 24017825 25940112 29985052 36409881 44088331 52960984 63939518
41579 63939518 75841148 84443798 85966129 80503105 71184088 61040058 51590483 43316598
41571 43316598 36090373 29513095 23725845 19531374 17171793 15665115 14025566 12394131
41563 12394131 11158651 9765287 7526614 5047404 3590899 3289932 3211636 3086793 3594194
41554 3594194 4611683 4560060 2481122 -20250 -192227 2522472 5607008 6355541 4852289
41545 4852289 3324321 3098280 3435346 3405941 3457430 4284424 5264829 5312176 4618832 4142835
41535 4142835 3798882 2783710 1561546 1666614 3148161 4011432 3005924 1375213 782777
41526 782777 973076 883979 885698 2213699 4786668 7089606 7920450 7163648 5363549
41517 5363549 3639188 3334117 4452831 5139396 4136017 2920697 3556811 5216775 5313568
41508 5313568 3769085 3223781 4553665 5301029 3979464 3046530 5184972 8722746 9697749
41499 9697749 7344157 4537172 3210985 2369845 1069063 553354 2061100 4429238
41491 4429238 5517363 4936922 4024582 3884471 4636160 5961026 7217333 7437972 6292171
41482 6292171 4757185 3935735 3677088 3434796 3861909 5872485 8291334 8493624 6007211
41473 6007211 3620246 3813169 5762004 7350678 8493584 10224004 11680555 10976829
41465 10976829 8913922 8768387 11595831 14461534 14684377 13404135 13101822 13732441 13713547
41456 13713547 13151612 13378567 14273875 14785576 15538591 18159288 22233914 25795606 29072167
41447 29072167 34915780 44722202 56430350 67718614 79266010 93904048 114067397
41440 114067397 140000532 167565956 187151747 188592051 170170815 141156921 113537576
41433 113537576 92878519 78360617 68178726 61263290 55790979 50263054 45817829
41426 45817829 44619084 46510741 49823451 54442630 61042370 68302265 74483728 81234995
41418 81234995 92124142 107749296 126222059 147792265 173191463 196090273 203527250
41411 203527250 188361930 158014522 126938680 102956166 84625787 69143008 57106397
41404 57106397 49478123 44554859 39832891 34670284 29940888 26433334 24221901 22647275
41396 22647275 20699328 18107112 15791192 14590431 14189665 13994586 13976293 13666152 11739232
41387 11739232 8168664 5493674 5946700 8231301 9175791 7813609 5740130 4177703
41379 4177703 3095975 2838873 4064789 5938357 6634276 5932036 5328346 5377983 4985289
41370 4985289 3718259 2846932 3484448 5305843 7465869 9175037 9234132 6974186 4056561
41361 4056561 3298042 5011848 6387152 5291512 2911871 1715595 2417858 3967384
41353 3967384 5182455 5512320 5270386 5578429 6902210 7681543 6214802 3795278 3367807
41344 3367807 4681163 4006416 55327 -3114120 -1578988 2736222 4970188 4078545
41336 4078545 3163883 3981591 4713692 3507070 1366996 563555 1907423 4368112 6246146
41327 6246146 6299697 4612570 2639168 1897179 2718294 4499435 6380680 7192409 5976969
41318 5976969 3586923 2577709 4212070 6605961 7158218 5694884 3773142 2174679
41310 2174679 933011 686773 1865190 3319884 3747419 3635892 3882298 3706241 2365213
41301 2365213 1647459 3518372 6176759 6087300 3619961 2707338 4534775 5745494 4167205
41292 4167205 2270366 2751245 4173517 3864510 2467694 2452753 3916440 4958843 5115398
41283 5115398 5594441 6690777 7330980 6873208 5549364 3625577 1739255 1312789 2864725
41274 2864725 4634085 4709902 3792823 3846310 4714914 4494147 3035731 2540368 4207699
41265 4207699 6456883 7247248 6428743 4999756 3628706 2888479 3581171 5599223 7343661
41256 7343661 7385792 6104857 4762996 3619067 2120067 571428 202614 1295967 2417479
41247 2417479 2237884 1319982 1086400 1501625 1179180 -111718 -643497 704738 2462355
41238 2462355 2610339 1624330 1597794 2829288 3427856 2405564 1061408 791513 1488543
41229 1488543 2819698 5104751 7867277 9338902 8688976 7200614 6129006 5220703
41221 5220703 4665487 6278213 10545987 14314961 14090951 10516549 7069131 5369659
41213 5369659 4456455 3745454 3578077 3253364 1753343 469965 1950982 5448985 7000166
41204 7000166 4970612 2389590 2198103 3102872 2387973 463035 -199841 760769 1350583
41195 1350583 680871 205582 1235063 2972660 3620882 2476264 485101 -773718 -401034
41186 -401034 1324431 3576856 5757832 7298233 7310431 5563350 3538187 3045782 3707822
41177 3707822 3463201 1957407 1502692 3641817 6511224 7187968 5415349 3302006 2197464
41168 2197464 1665083 1124490 758886 702560 667277 646174 1067272 2061236 3277833 4484630
41158 4484630 5672517 6497821 6306635 5043237 3763845 3794681 5218903 6407091 5610380
41149 5610380 3266455 1990129 3517442 6355128 7695075 7175093 7139499 9351227 13306395
41140 13306395 17966142 23073621 28088648 31838844 34267942 36692694 39132039 39222440
41132 39222440 35310498 28990496 22900352 17539718 12183677 7547624 5210854 5093700
41124 5093700 5497161 5178503 3916596 1940293 395996 1166022 4213222 6309593 4775255
41115 4775255 1402272 -12234 986889 1847010 1970216 3393310 6184293 7206779 4970552
41106 4970552 2329338 2310815 4009662 4902844 4915271 5511155 6381484 5899708 4169708
41097 4169708 3156188 3929969 5690746 7513490 9424602 11501885 13182110 13996765
41089 13996765 14475023 16053533 20041497 26205287 32257663 35506149 35305971 33089667
41081 33089667 29894751 25342402 19688640 15078228 13127964 12416650 10284396 6556248
41073 6556248 3582427 2748492 2885206 2567952 2283083 3237860 5001871 5614358 3973834
41064 3973834 1332106 84361 1289625 3667829 5093748 4795835 3774917 3306774
41056 3306774 3675250 4434046 5177616 5608139 5283149 3819244 1336140 -1354317 -2914788
41047 -2914788 -2226761 393774 2965530 3690015 2921286 2330398 2311117 1663960 -13259
41038 -13259 -1403365 -1620540 -1493958 -1552521 -489007 2590858 5793876 6591855 5562734
41029 5562734 5526985 7165512 8054761 6540229 4146204 2940764 2485601 1194455 -485621
41020 -485621 -293520 2639979 6326339 7896168 6150606 2121712 -1957658 -4004422
41012 -4004422 -3277910 -853023 1353940 2327104 2540330 2806778 3083680 2748585 1623702
41003 1623702 237525 -684964 -561445 908618 3315773 5396139 5994136 5174975 3813689
40994 3813689 2302339 617672 -462110 277135 2339496 3242583 1568999 -887208
40986 -887208 -1540345 -636945 -506439 -1648719 -1896240 94797 2646351 3509539 2966101
40977 2966101 2941102 3892616 4265700 2966685 975478 -63746 -5417 -22654 -438557
40968 -438557 136001 2730103 5845168 6875203 5685402 4959192 6222539 7403255 5942740
40959 5942740 2773384 927132 1142235 1495161 1158404 1786091 4533510 7863103 9289370
40950 9289370 7958182 5019395 2644607 2632667 4472019 5077032 2395939 -1132580 -1293387
40941 -1293387 1975200 4595253 4539407 4147002 5086406 5163333 2611152 -97245 -40535
40932 -40535 1455097 1622620 1379656 3356614 6274709 5957400 1850197 -1629137 -1091034
40923 -1091034 1731702 3064912 1803333 -136180 -495787 1350065 4073829 5454932
40915 5454932 4392373 1887564 -359838 -1533368 -1244717 946535 4072275 5380664
40907 5380664 3520323 813643 50236 355104 -893167 -3153975 -3290937 -784598 1224353
40898 1224353 637086 -1065661 -1899709 -2089661 -2404171 -2197648 -687853 1443583 2987582
40889 2987582 3591158 3514356 3144136 3081768 3528709 3608182 2675556 1948294 2977171 4808869
40879 4808869 4890297 2745635 489182 -317995 60564 1394391 3927444 6669142 7933587
40870 7933587 8021933 8704779 9674651 8531754 4974739 1835635 871233 608633 -341166
40861 -341166 -937464 -294851 328425 -27577 -266119 278979 264006 -887379 -1353070 -118559
40851 -118559 914786 307571 -163688 1245826 2821555 2166594 187360 -734498 -553375
40842 -553375 -444932 188329 2183577 3678751 2350294 -441602 -1276831 205128 1182469
40833 1182469 306092 -738424 -369180 987187 2315534 3019094 2502872 859249 -183839
40824 -183839 1016283 3630847 5491970 5955728 5712515 4727315 2776953 1196877 1405272
40815 1405272 2248472 1525946 -302402 -780822 443322 1193259 583489 342930 1701149
40806 1701149 3424196 3766292 2552193 830598 -85856 667984 2223974 2009029 -997603
40797 -997603 -3842585 -2875294 1241869 4530389 5089511 4403316 3684480 2467071 1040311
40788 1040311 742799 1160580 313741 -1600205 -1942703 -64531 1354726 707869 -73350
40779 -73350 839763 2094282 1808685 796568 988328 2589805 4602994 6329628 6862237
40770 6862237 5136244 2075939 623925 1967416 3753211 3718400 2919801 3350129 4385001
40761 4385001 3992487 2024744 82403 -807215 -559395 737524 2243549 2235195 289743
40752 289743 -1466067 -861996 1568904 3635686 4075204 2936414 891631 -564696 108169
40743 108169 2160085 2819088 1360348 739700 3213534 6521395 6960559 4457858 1827566
40734 1827566 458800 -334984 -747227 -228628 742396 1193989 1514879 2591968 3799756
40725 3799756 4044328 3959384 4725412 5605324 5199516 4299063 4701040 5846102 5605546
40716 5605546 4044763 3369128 4168483 4657373 3841188 2658485 1696610 470874 -662079
40707 -662079 -505333 636935 1132356 848882 1180290 1978026 1431923 -423560 -1247988
40698 -1247988 -382851 -52847 -1210364 -1506474 535226 2396869 1368550 -944436 -1044832
40689 -1044832 1135208 2488281 1449810 -437759 -1397384 -1354849 -895049 -300722 59471
40680 59471 -113456 -275506 401332 1632877 2253361 1864989 1285199 1290042 1710847 1842827
40670 1842827 1199013 -55353 -1030299 -784864 568043 1915609 2616388 3140338 3785607
40661 3785607 3817580 2773615 1652125 1615225 2229714 2246183 1527102 870009 424446 -202261
40651 -202261 -540255 392110 2213721 3179352 2446002 1041412 104065 -579253 -1592388
40642 -1592388 -2582656 -2880615 -2631556 -2369198 -2083026 -1645635 -1585629 -2314004 -2994739 -2511044
40632 -2511044 -1420715 -1443863 -2772351 -3577317 -2983935 -2766875 -4451537 -6139876 -4707623
40623 -4707623 -697719 1760798 479004 -1921971 -1996524 -132107 770186 -279637 -1597824
40614 -1597824 -1705834 -732657 776644 2427626 3314022 2561408 800457 -249743 217217
40605 217217 1621074 3223625 4485698 4631809 3501405 2458246 2678170 3059562 2017027
40596 2017027 734427 1647441 3825612 3541165 290579 -1593227 743783 4260181
40588 4260181 4657815 2489391 1293899 1910632 2414618 2242408 2478748 2728138 1463705
40579 1463705 -607331 -1019868 352311 938229 -337511 -1729799 -2240406 -3134396 -4618644
40570 -4618644 -4374694 -1523193 818073 -305757 -3056189 -3353209 -708893 1619383
40562 1619383 1666685 774273 378736 -174152 -1402874 -1646447 733848 4245326 5400521
40553 5400521 2910823 -729202 -2237212 -1028529 1045718 2679533 4501956 7291035
40545 7291035 9972285 10434129 8033206 4402927 1765170 1120491 2046713 3361852 3697918
40536 3697918 2313811 26417 -1166809 -80199 2296800 3986783 4313637 4293840 4792972
40527 4792972 5175347 4330599 2528809 1362950 1710619 2489223 1983073 -24994 -2141640
40518 -2141640 -3138941 -3003867 -2247946 -1140985 74763 1049788 1776230 2440447 2708910
40509 2708910 2307880 2488242 5060355 9029154 10310685 6815301 2110861 1230360 3858783
40500 3858783 5038496 2499570 -421639 -262423 1565752 1478170 -936130 -2861067 -2258250
40491 -2258250 325308 3140117 4524047 3487297 788359 -1044712 -298626 1802803
40483 1802803 2911661 2722132 2650803 3036829 2716010 1252028 -325006 -1208308 -1640439
40474 -1640439 -1826577 -1479511 -708678 -70281 443828 1245167 1990705 1987378 1719641 2321585
40464 2321585 3400805 3258445 1720318 789679 1630978 2758645 2450534 1379603 1370202
40455 1370202 2733815 4349041 5540225 6509084 7499536 8533129 9234938 8229796 4139656
40446 4139656 -1598948 -4603146 -2309569 2321025 4245478 2602823 803465 921912
40438 921912 1428736 1028940 1224395 3234759 5184422 4954076 3963476 5189539 8352592
40429 8352592 10016503 8424652 5581413 3912661 3152106 1819720 159757 -119887
40421 -119887 1542317 3582995 3975018 2192068 -383248 -1556939 -123989 2844563
40413 2844563 4718104 3925423 1775453 1077087 2979748 5854812 7431465 7265339 6599202
40404 6599202 6410449 6469069 6188448 5567501 5064224 5119128 6041685 7795279 9568162
40395 9568162 10180401 9469079 8734719 9102717 9916231 9692449 8360143 7398677 7791677
40386 7791677 9053456 10434907 11750274 12586089 12146044 10685518 9700147 9639916 8947853
40377 8947853 6888086 5729998 7701663 10814724 10823079 7284317 4433325 5142045 7100378
40368 7100378 6792984 4660396 3750102 4985249 6600444 7367083 7656579 7617357 6816447
40359 6816447 5854541 6151080 7643662 8414002 7062002 4111531 954674 -1150530 -1113526
40350 -1113526 1144583 3733718 4537194 4107916 4807756 6841450 7648715 5966747 3795469
40341 3795469 3021888 2837216 2418290 3396202 6753883 9444855 7778121 3112609 475849
40332 475849 1743790 3759863 3673102 2697428 3248451 5192132 6863905 7881553 8943675
40323 8943675 9951698 10027614 8826775 6713180 4209554 2144004 1665562 3150151 5454837
40314 5454837 6937537 6969431 6159478 5571205 5936902 7074405 7935211 7828897 7533503
40305 7533503 8363833 10292495 12104267 13284599 14343989 15236404 15124625 14069686 13260652
40296 13260652 13022407 12318002 10901292 10073504 10295880 9971453 8023534 5965215 5674728
40287 5674728 6499830 6419310 5020492 3517934 2653823 2291860 2408429 2906693 3035194
40278 3035194 2331640 1438625 835165 -159766 -1838611 -2961733 -2787202 -2693245 -3734360
40269 -3734360 -4196479 -2216291 549927 1025258 -434265 -735077 786912 1520449 180421
40260 180421 -1222330 -837922 635061 1953847 2931725 3128291 1723060 -294243 -541874
40251 -541874 1122890 2200936 1783952 1985131 3750036 4743592 3509782 2287422 2909562
40242 2909562 3128952 545426 -2485955 -2007858 1222119 2799812 1178199 -861886
40234 -861886 -913576 531535 2294947 3898101 4430082 3050920 1066995 787216 1939531
40225 1939531 1912641 -27190 -1547381 -974889 433750 877317 294209 -651041 -1574355
40216 -1574355 -1455036 905110 4368749 5754786 4037798 2065762 2556640 4574348
40208 4574348 5845190 6413656 7488025 8301150 7159645 4972801 4763001 7302841 9558267
40199 9558267 8386083 4311419 684467 -84036 1335820 2424100 1622100 -122539
40191 -122539 -552082 1227706 3593030 4139674 2303158 -51215 -541057 1364020 3793404
40182 3793404 4354595 2693235 880779 981685 2794748 4568614 5175401 4516781 2549703
40173 2549703 -425055 -2823465 -2997171 -1513671 -465569 -333240 512914 2785326 4918028
40164 4918028 5546837 5202414 4387846 2179120 -1520420 -4207627 -3454484 -209809 2513589
40155 2513589 3315951 3027616 2667438 2706089 3552096 4838132 4894407 2849818 618956
40146 618956 728307 2610143 3253235 1442729 -782623 -1153345 231629 1830479 2735717
40137 2735717 3259012 4242539 5849864 6590316 4460879 81013 -2689034 -1128776 2566937
40128 2566937 4264208 3503762 3073738 3727639 3188173 748037 -1052047 -636076 190936
40119 190936 -212520 -577546 264166 591602 -1131836 -2760671 -1338160 2035387 3509275
40110 3509275 1946820 92088 409116 2243839 3335264 2340036 -201272 -2059696
40102 -2059696 -902926 2923594 5944843 5500618 3195057 2394896 3289712 3150943 1068002
40093 1068002 -635563 -146476 1423852 2310347 2502257 2710924 2747261 2149308 1109853
40084 1109853 -108523 -1456756 -2201090 -1200103 1225240 3175870 3675857 3795420 4517043
40075 4517043 5146864 4870489 4230163 3780411 2848563 1144091 145231 1059557 2524760
40066 2524760 2317555 644781 -187286 987633 3003173 4203507 3994194 2744506 1485233
40057 1485233 1467197 2786517 3867295 3603096 3303585 4734061 6866210 7000626 5103031
40048 5103031 4311331 6249366 8301928 7219242 3667554 1166983 1463621 2952712
40040 2952712 3446632 2801445 2442014 3351721 5088629 6422393 6637753 6155168 5758150
40031 5758150 5425903 4522712 3100798 2133017 2181458 2741608 3343626 4320404 5804736
40022 5804736 6962848 7221132 7423094 8557696 9975511 10271082 9569139 9399071 10336159
40013 10336159 11352283 11843534 12746074 14819420 17053815 17911312 17405724 16860311 17065690
40004 17065690 17690778 18172743 18109949 16923716 14300420 11152437 9046147 8225053 7211621
39995 7211621 5135366 3587056 4920732 8972731 12718768 13478250 11551486 9275162
39987 9275162 8312439 8630663 9648562 11374207 14138905 17624614 20512610 21284422 19548992
39978 19548992 16472633 13545193 11043911 8323242 5524259 3908900 4058405 4814659
39970 4814659 4818694 4143886 3397114 2249272 413197 -689475 706954 3768410 5522307
39961 5522307 4694590 3256898 3412924 4709421 5219172 4310360 3080271 2907457 4425898
39952 4425898 7050415 8866850 8145790 5733324 4643076 6385644 9232447 11312328
39944 11312328 13603815 17835156 22857479 25727353 25781183 25069006 24813363 23836985 20912160
39935 20912160 16692726 12747631 10193166 9560422 10445372 11037570 9638759 6997816
39927 6997816 5554766 6088646 6869638 6538321 5892157 6042387 6591371 6639526 6079362
39918 6079362 4935001 2876378 367581 -1085734 -798184 268554 1250253 2331919
39910 2331919 3130923 2118497 -919876 -3569086 -3549011 -1385830 1046862 2944617 3968174
39901 3968174 3228890 1031619 -188512 847775 1743190 7383 -2505425 -2197482 510561
39892 510561 2056762 1748311 2392657 4601662 5098649 2163895 -1370918 -2680434 -2864641
39883 -2864641 -3790494 -4336700 -2963450 -1391281 -2138845 -4182593 -4625245 -3452619 -3044781
39874 -3044781 -3636977 -2905828 -160365 2359036 3004735 2748839 2821308 2786941 2133211
39865 2133211 1746363 2448500 3490748 3676747 2923117 1849685 845011 256288 481434
39856 481434 1198737 1483985 1248742 1467186 2382716 2717131 1498234 -430205 -1651719
39847 -1651719 -1947995 -1884264 -1580827 -967698 -452696 -225004 427537 2013419 3671846
39838 3671846 4230376 3892114 3759963 4177631 4662710 4981679 5076232 4391756 2618788
39829 2618788 739989 -48843 -114949 -570427 -1065054 -318683 1247577 1703923 882053
39820 882053 1016476 3007992 4421398 3098712 829723 887936 3093308 4163548 2628673
39811 2628673 570481 45987 370594 108814 -304916 388101 1877434 2647230 2148608
39802 2148608 1243290 801768 936538 1340736 1449989 622590 -868515 -1450153 -78245
39793 -78245 1828280 1768874 -454924 -2347149 -2168531 -1072554 -773364 -741629 451506
39784 451506 2092213 2034201 294883 -520228 910011 2545388 2188192 930305 1299185
39775 1299185 3066815 3423058 1214224 -1337641 -1769953 -355291 1020280 1485177 1522218
39766 1522218 1686464 2063273 2329209 1685542 -315259 -2277880 -1789864 1115533 2989446
39757 2989446 1343796 -1475554 -1397947 1382518 2809853 1214868 -543644 -169353 561239
39748 561239 -378335 -1138619 918190 4127454 4524792 2062001 722862 2236433 3706280
39739 3706280 2817080 1704308 3115337 5474680 5109990 1965862 -344630 86938 1197031
39730 1197031 681229 -671295 -740535 698598 2181358 2897357 3240460 3539728 3590261
39721 3590261 3308799 2913516 2555892 2380832 2548991 2566207 1332532 -1077848 -2461197
39712 -2461197 -947805 1960836 2808916 790578 -1206830 -865130 499331 594911 -124807
39703 -124807 350444 1958651 2730742 2136951 1776628 2607317 3712821 4242399 4516333
39694 4516333 4565660 3540984 1513812 135072 414536 1354716 1830839 2197826 2724162
39685 2724162 2119438 -484914 -3276996 -3568259 -1261072 1264679 2237991 1821892 884579
39676 884579 189257 399744 1191685 872428 -1220867 -2614308 -530904 3449380 4657684
39667 4657684 1769751 -1332022 -1525703 -942516 -2863171 -5839488 -5726027 -2342959 -15719
39658 -15719 -1201335 -3240851 -2851779 -893787 -355913 -1479897 -1684330 176895 2036338
39649 2036338 1666110 -289989 -1462452 -939798 -8825 25360 -476457 -444449 65060
39640 65060 -44775 -1033157 -1466426 83275 2852708 4268325 2749063 -435282 -2502055
39631 -2502055 -1980196 229263 2252407 3019372 2728498 2282575 2513137 3468301 4257372
39622 4257372 4035774 3183108 2772819 2742558 1739929 -555819 -2204481 -1396407 870225
39613 870225 2194040 2199479 2456572 3192057 2628425 247643 -1748063 -1601421 -579087
39604 -579087 -693761 -1637247 -2008318 -2039432 -2638880 -2859569 -1178343 1188781 1230842 -1370689
39594 -1370689 -3467986 -2895892 -1200709 -770990 -1396004 -1235783 323262 2343785 3831967
39585 3831967 4282997 3600868 2529270 2307865 2967386 2915339 1198809 -829121 -1277266
39576 -1277266 -281951 488369 253299 -273160 -354329 -170362 -404582 -1582150 -3451444
39567 -3451444 -4512101 -3019266 608342 3244945 2256587 -1231277 -3571577 -2803713
39559 -2803713 -330988 1443795 1747257 1403394 1288222 1457999 1423734 967791 648394
39550 648394 1142989 1954136 1546240 -646232 -3132685 -4121655 -3595431 -2593113 -1249517
39541 -1249517 927354 3270931 4199893 3366762 2078799 1303377 639407 -285954 -728741
39532 -728741 88187 1735540 3189825 4029125 4356642 4070254 2913502 1055262 -832559
39523 -832559 -2038168 -2271343 -1870309 -1570923 -1861288 -2630461 -3551713 -4377216 -4557256
39514 -4557256 -3305680 -813075 1274347 1672832 1245479 1695035 2917927 3282558 2391920
39505 2391920 1682405 1960851 2269083 1931758 1851777 2584264 2844221 1611913 402186
39496 402186 1374733 3881545 5036947 3653335 1659550 1211222 2046038 2445842 1553218
39487 1553218 -171769 -1894065 -2874111 -2634713 -1576931 -1005565 -1643744 -2411690 -1659762
39478 -1659762 463835 1953304 1532225 293311 122404 1286633 2475596 2690987 2048446
39469 2048446 1018824 54391 -110233 911166 2052152 1753572 504348 788544 3413412
39460 3413412 5450843 3686874 -785597 -3564761 -2349877 676037 2199416 1650231
39452 1650231 851907 1165730 2155446 2504499 1449248 -451853 -1680498 -1246031 186096
39443 186096 1235775 1699548 2512436 3851902 4576409 3938271 2643170 1626556 914641
39434 914641 411738 667432 1826175 2698108 2067607 416020 -743582 -918686 -982034
39425 -982034 -1549483 -1947225 -1102546 931516 2623596 2306556 93330 -1819252 -1413760
39416 -1413760 714631 2076091 1392935 -203023 -1265217 -1813143 -2281506 -2161010 -1021245
39407 -1021245 59963 -430160 -2330498 -3959522 -4169276 -3314747 -2350556 -1749728 -1289053
39398 -1289053 -519638 414469 565911 -443011 -1118272 199302 2150102 1198197 -3200377
39389 -3200377 -6674865 -5311697 -1005371 1280436 164125 -1442833 -1482248 -1009575 -1083833
39380 -1083833 -785358 564304 1820893 1883718 1088465 -171344 -2073092 -3711957 -3216179
39371 -3216179 -833034 450845 -919421 -2496516 -1564117 548666 564804 -1707116 -3405077
39362 -3405077 -3099704 -2393967 -2925946 -4226037 -5124667 -5372475 -5135651 -4305195 -2979508
39353 -2979508 -1647845 -580007 65311 -380378 -2286484 -4271878 -4206344 -2161125 -814167
39344 -814167 -2061821 -4518335 -5422973 -3971780 -1579964 289662 1132506 737588 -874403
39335 -874403 -2680364 -3125206 -1918100 -495648 -113479 -220097 472723 1869274 2607119
39326 2607119 2240261 1998567 2779635 3538786 2861925 1369134 904023 1543484 1357907
39317 1357907 -356882 -1595904 -648619 1115031 1344777 371340 422351 1804861 2521561
39308 2521561 1779179 1135676 1347538 769986 -1480583 -3102520 -1703943 1279916 2431327
39299 2431327 1151411 -201895 -512337 -1090245 -2272147 -2052372 382006 2332630 970646
39290 970646 -2688397 -5395761 -5922538 -5312829 -3919028 -1119254 2080820 3060348 1098519
39281 1098519 -1292947 -1657679 -459932 473112 685856 775594 695513 132029 -275213
39272 -275213 223437 1001497 1004300 680746 1225391 2139497 1466351 -1235245 -3839811 -4253966
39262 -4253966 -2798867 -1244241 -434872 280074 1739291 3658988 4512518 2892105 -507699
39253 -507699 -2784870 -1849836 790533 1802665 460244 -671537 134941 1285115 797136
39244 797136 -383427 -149781 1013949 578677 -2071874 -4522904 -4540474 -2676583 -1023163
39235 -1023163 -593614 -698616 -230847 1042188 2215453 2085390 425627 -1681389 -2948829
39226 -2948829 -2947233 -1905538 -264871 1050746 911989 -513065 -1422625 -697998 370531
39217 370531 131505 -640191 -67005 1356490 1197605 -926248 -2504415 -2074483 -1416050
39208 -1416050 -2316525 -3383761 -2242770 566204 2284607 1876747 1070026 1520663 2786719
39199 2786719 3450318 2868063 1350629 -377683 -1418321 -1120627 235807 1497090 1638570
39190 1638570 647464 -496133 -633158 442134 1493577 981779 -1054531 -2897281 -3277469
39181 -3277469 -2756473 -2390042 -2027255 -1005840 274379 835784 696855 580754 411681
39172 411681 -377950 -1230554 -898318 303999 463698 -1087709 -2557449 -2304937 -1188790
39163 -1188790 -919749 -1236379 -530886 1219589 2060870 876511 -918207 -1230453 140754
39154 140754 1655498 2171787 1944077 1568171 886235 -527805 -2284705 -3360538 -3366092
39145 -3366092 -2893384 -2305104 -1022788 1150044 2663859 1622054 -1419190 -3556008
39137 -3556008 -3071549 -1516950 -1197785 -1815719 -1341829 435384 1424172 541798 -578339
39128 -578339 -245697 592628 -15264 -1697137 -2057571 -154851 2169554 2900809 2276783
39119 2276783 1742431 1626558 1066449 -301656 -1736572 -2401241 -2180163 -1523781 -1093777
39110 -1093777 -1419368 -2207712 -2119570 -111665 2856160 4324107 2975748 139093 -1847406
39101 -1847406 -2211178 -2014830 -2212710 -2368018 -1567280 12120 1102918 910993 145733
39092 145733 100042 967068 1657715 1273315 43789 -1425221 -2998732 -4524554 -5299057
39083 -5299057 -4925263 -4086688 -3440328 -2387745 -322687 1456216 987762 -1202464 -2250221
39074 -2250221 -782232 1381868 2272815 2563092 3835304 5624990 6024004 4321447 1488602
39065 1488602 -1166714 -2465697 -1522826 896178 2136180 664705 -1444857 -1055456
39057 -1055456 1674792 3713109 3444722 2035850 680204 -711408 -1640530 -653469 2009221
39048 2009221 3685002 2588178 59452 -1668269 -2233677 -2511115 -2970151 -3974723 -5989076
39039 -5989076 -8036571 -7711300 -4490821 -1429111 -1485115 -3476770 -3918697 -1862031 461366
39030 461366 1134131 287807 -1296639 -2938529 -3439061 -2013523 -131049 -299147 -2493786
39021 -2493786 -3780307 -2276865 272446 959390 -617549 -2357666 -2479791 -1218077
39013 -1218077 -44369 51744 -491105 -452019 520943 1377190 1281184 959723 1289480 1342234
39003 1342234 -269716 -2397793 -2080671 1172015 4080848 3828595 1730415 1007319 2302849
38994 2302849 3413396 2697247 702778 -1406006 -3142287 -4093307 -3635830 -2028496 -705986
38985 -705986 -589553 -777331 184245 2152025 3537629 3531005 3014212 2810327 2189319 296312
38975 296312 -1691565 -1611981 452339 1863523 1033261 -426222 -344170 831640 1192935
38966 1192935 424364 -311058 -609902 -787850 -309044 1376370 2883714 2345844 633614
38957 633614 418064 1977804 2888141 2202488 1623305 1657147 246296 -3007702 -4745401
38948 -4745401 -2599532 804438 1577730 -25711 -1059300 -712978 -267388 202455 1460460
38939 1460460 2488462 1771991 457735 716100 1571131 163285 -2979564 -3886649 -936982
38930 -936982 2825261 4018854 2466356 -254269 -2575951 -2522862 1012501 5431212 6267613
38921 6267613 3213205 833002 1729044 2884822 1190409 -1318283 -1232686 413095 281015
38912 281015 -1490880 -2006901 -875222 -510834 -1599312 -2145402 -1273646 -606884 -1194840
38903 -1194840 -1816130 -1202250 103491 839808 497950 -638881 -1778835 -2102034 -1959891
38894 -1959891 -2791277 -4636738 -5185345 -3161567 -896716 -779830 -839845 2354405 7348029
38885 7348029 8793530 5026001 420321 -802599 687538 2091369 2352214 1539219
38877 1539219 -398500 -2327952 -2211604 -459061 -154068 -2218981 -3533063 -1970871
38869 -1970871 89524 41854 -542782 681369 2050042 825569 -1367433 -889488 1464023
38860 1464023 1397519 -1825382 -4136346 -3072082 -1036490 -923618 -2271084 -3370282 -3987302
38851 -3987302 -4222559 -3403329 -1898648 -1626501 -2975086 -3474939 -1479864 879730 634008
38842 634008 -1777743 -3560742 -3672543 -3374911 -3279864 -2388689 -374258 1190194 818894
38833 818894 -746646 -1329571 105841 2361788 3579417 3420294 3125240 3515954 3892681
38824 3892681 3411931 2535440 2058668 1587922 472477 -425569 206907 1588047 1493018
38815 1493018 -349555 -1634992 -815246 969514 2081488 2499904 2636354 1956202 327630
38806 327630 -759094 -32433 1534385 2110887 1621568 1479081 2255936 2984751 2585349
38797 2585349 1116093 -202361 117082 2250785 4180238 3487634 380928 -2384655
38789 -2384655 -2950560 -2010117 -518410 1945764 5217562 7185004 6376094 4219213 2765905
38780 2765905 1829275 534510 -63488 1303527 3106605 2821015 983112 331875 1243192
38771 1243192 1199029 -947130 -3116998 -3172710 -1614031 -338649 -499144 -2009954 -3561672
38762 -3561672 -3138721 -321974 2259877 1996952 350523 972572 3941044 5324317 3073959
38753 3073959 -208150 -1626398 -1659880 -1677762 -1085116 557297 1300459 -413811 -2738040
38744 -2738040 -2969906 -1508947 -600628 -579251 -139850 749883 987981 691821 920255
38735 920255 1599195 1930782 2170485 2796348 2756987 979704 -1158160 -1473246 -377295
38726 -377295 182513 481046 2353620 5029525 5410600 3071145 1242233 1613650 1794641
38717 1794641 -189401 -2336483 -2279216 -1546329 -2844623 -5117625 -5081928 -2701749 -1354672
38708 -1354672 -2502082 -3617526 -2329498 147110 1179425 309603 -1016479 -2003738
38700 -2003738 -2978855 -3855571 -3803191 -2641677 -1409088 -1000320 -947019 -281180 747441
38691 747441 831038 -314449 -1161602 -601066 -13614 -1427187 -3983015 -4514044 -2213864
38682 -2213864 -321371 -1544182 -3858043 -3370951 -91676 2174576 1352218 -571532
38674 -571532 -1249588 -1092708 -1376600 -1665313 -997384 52611 418499 419242 772940 801748
38664 801748 -433334 -1990048 -2075716 -814665 -69357 -708412 -1877331 -2865339 -3807442
38655 -3807442 -4437631 -4029969 -2929117 -2436109 -2806646 -3027625 -2863438 -3160250 -3588429
38646 -3588429 -2340859 753844 2915669 1932692 -594011 -1435511 -18007 1440798
38638 1440798 1339657 305739 -348195 -178680 408526 648889 -72618 -1542073 -2853237
38629 -2853237 -3525965 -3619599 -2552928 418374 3756772 3980453 264795 -3370750 -2919467
38620 -2919467 339606 2276899 1963119 1690632 2070068 1380682 -268579 -480676 885971
38611 885971 773135 -1976544 -4203348 -3024732 325589 3240914 5224865 6309664
38603 6309664 4993804 734737 -3752835 -5632398 -5572922 -5622644 -5523149 -4196298 -3000856
38594 -3000856 -3914384 -5725075 -5665635 -4021058 -3499873 -4558065 -5100823 -4711287 -5269452
38585 -5269452 -6849885 -6824234 -4249049 -1743775 -1388339 -1762651 -1015515 -225304 -1292002
38576 -1292002 -3413237 -4176401 -2969111 -1065023 834088 2956418 4719951 4661420 2457236
38567 2457236 -257847 -1596694 -1380762 -1124309 -2214009 -4134457 -4734187 -2693331 590470
38558 590470 2460137 2159715 1333841 1322063 1465294 706227 -491084 -834263 62268
38549 62268 1558442 2964822 3855286 3927730 3233512 2212227 1175693 237660 -156023
38540 -156023 516957 1814309 2474429 1968391 1041334 481185 405572 948785 2226769
38531 2226769 3196206 2253511 -160496 -1291090 293382 2418926 2356521 696345 -8152
38522 -8152 599725 544435 -733115 -1259166 176173 1920114 1961899 939287 1064414 2862725
38512 2862725 4459555 3962557 1500282 -1240554 -2787169 -2856086 -1948920 -563971 867330
38503 867330 1528810 525496 -1845122 -3670494 -3149045 -648603 1749798 2773727 3124157
38494 3124157 3887878 4832181 5057318 4593522 4218872 3973396 3074692 1421602 -72733
38485 -72733 -1131933 -2763499 -5182953 -6316077 -4227779 -465019 1289939 71756
38477 71756 -1239824 -457683 748428 -39256 -1913705 -2267565 -1036619 -359313 -771410
38468 -771410 -879387 -672188 -1908991 -4630531 -6277449 -5307068 -3035609 -807962 1880621
38459 1880621 4984597 6499133 5563141 4459714 5049511 5471340 3303269 91224 -706429
38450 -706429 903163 1685004 272609 -1418556 -1862628 -1711333 -1448094 -292525 1688628
38441 1688628 2982690 3085762 3228303 3781334 3313311 1278770 -720634 -1650369 -2691608
38432 -2691608 -4575843 -5524360 -3948788 -1361426 -201181 -170372 666347 2121598 2121924
38423 2121924 477699 -442691 587838 1706928 914954 -866117 -1304855 -104492 863616
38414 863616 482570 -338218 -661387 -1173408 -2656431 -3878981 -2879638 -217140 1131242
38405 1131242 -124912 -1557946 -637181 1352303 1347695 -705340 -2040559 -1599732 -1076194
38396 -1076194 -1106298 38232 2664085 4000495 2538430 1005594 2074847 3609835
38388 3609835 1836316 -2404330 -4591515 -3039927 -580355 276850 143588 179543 239070
38379 239070 638945 2564587 5310061 6023311 3834379 1537562 1355411 1732161 612829
38370 612829 -671738 204947 2205740 2346405 437618 -884015 -492007 -76051 -941863
38361 -941863 -2153002 -2373753 -1477741 56788 1478939 1336540 -1214744 -4359097 -5000033
38352 -5000033 -2731672 -385480 10620 -366691 250657 1387526 1629332 1061030 706339
38343 706339 722495 674324 622689 592166 -64118 -1445803 -2269962 -1694424 -1009195 -1885291
38333 -1885291 -3702034 -4334174 -3093535 -1248012 -22345 305044 -265359 -1207593 -797406
38324 -797406 2242008 6134906 7072772 3669613 -1072434 -3164145 -1857558 432685
38316 432685 1461584 1249895 1205375 2085500 3076286 2807322 1238796 26425 369066
38307 369066 997965 -403859 -3720504 -5776118 -3941590 568050 3907684 3642042 840483
38298 840483 -1568260 -1832118 -711082 -168781 -1020000 -2121704 -1991464 -773502 -15270
38289 -15270 -664093 -1937513 -2269064 -965447 1107136 2279343 1750823 670067 966410
38280 966410 2807807 4181813 3699004 2609957 2717666 3375189 2470112 -200022 -2610332
38271 -2610332 -3340983 -2688568 -1114684 1075920 2343724 789388 -2797910 -5091982
38263 -5091982 -4383443 -2353615 -763144 938158 3039973 3342136 208817 -3946798
38255 -3946798 -5170302 -3028315 -583029 11692 -622463 -1241377 -1535586 -1463791 -1097171
38246 -1097171 -1298380 -2780946 -4404274 -4162658 -2078227 -457916 -914186 -2528688 -3330290
38237 -3330290 -2432464 -470365 1070049 894409 -791332 -2144424 -1733696 -269913 706276
38228 706276 1019183 1268749 1000778 -451053 -1930507 -1667121 -232347 246280 -274460
38219 -274460 266176 2156319 3148768 2425922 2126557 3432973 4230817 2769475 810267
38210 810267 468277 464467 -1157316 -2609805 -725377 3216850 4367187 1336818 -1627548
38201 -1627548 -824100 1917168 2552832 644269 -783698 129784 2163160 3387232 3409441
38192 3409441 2987867 2790173 2980838 3262378 3072344 2250863 1491631 1519569 1873254 1323251
38182 1323251 -252032 -1224743 -155794 2012415 2594812 229425 -3282014 -4732610
38174 -4732610 -2924730 214151 1974887 1718404 951916 1004076 1478297 1196507 -17684
38165 -17684 -1099580 -1067442 -69749 886385 903087 -83596 -1212166 -1407487 -602288 -100882
38155 -100882 -1019078 -2382501 -1877120 994398 3664915 3514134 1215520 -481200 -713536
38146 -713536 -1168026 -2690555 -3598627 -2491438 -798892 -753819 -2085394 -2711863 -2003738
38137 -2003738 -1271542 -1161832 -613381 1089121 2810036 2973237 1550356 -100393 -887596
38128 -887596 -1020033 -1600744 -3197010 -4648279 -3906210 -740034 2210735 2401695 783031
38119 783031 423693 1985621 2857051 1322044 -752363 -791823 767652 1526023 683608
38110 683608 -485680 -1086611 -1447412 -1578872 -748906 874391 1713059 850837 -359357
38101 -359357 195567 2672222 4949991 5061786 3382556 2105159 2678718 4083752 3971008
38092 3971008 1530639 -1277757 -1871259 -151773 1370860 790415 -759313 -783666 937319
38083 937319 1867147 361869 -1591008 -791091 2605778 4892299 3605050 741834 16894
38074 16894 2185263 4661247 5011043 3090301 81998 -2643792 -3461559 -1200500 3028831
38065 3028831 5954413 5391798 2891869 2101752 4574814 7977781 8675965 5707190 1775437
38056 1775437 176353 1157986 2108173 1297702 46763 297993 1406418 1182480 -528054
38047 -528054 -1522000 -619486 763000 1097360 863535 1037181 1097227 153365 -989915
38038 -989915 -690510 947924 1915275 906705 -1042283 -2012998 -1599495 -1133806 -1601886
38029 -1601886 -2091026 -1044848 1225541 2591000 2131175 1601099 2589540 3631418 2278174
38020 2278174 -870667 -2872853 -2874010 -2848529 -3606872 -3341711 -1346894 -2196 -1015610
38011 -1015610 -2402732 -1745703 -166937 -55746 -634593 716495 3680137 5165557 4173699
38002 4173699 3151041 3881354 4944258 4402389 2708377 1538618 1378701 1590013 1686992
37993 1686992 1388996 307472 -1351266 -2344711 -1549697 618428 2344791 1862425 -1104905
37984 -1104905 -4840644 -6737501 -5612463 -2901286 -982170 -576672 -548204 135505 1373309
37975 1373309 2720029 3969474 4724886 4389245 2983235 1382208 499026 490272 592406
37966 592406 -413210 -2838074 -4838257 -3848395 -211363 2271262 1197484 -643533
37958 -643533 950740 5191447 7253219 5414313 3178186 3292707 3780442 2253302 565511
37949 565511 1587333 3777845 3204235 -76116 -1900706 -397527 1483967 1010965 -297523
37940 -297523 96781 1178323 150862 -2573405 -3526802 -1366007 1077998 955331 -811253
37931 -811253 -1646115 -1424084 -1998524 -3507256 -3959186 -2707887 -1687170 -2178759 -2685390
37922 -2685390 -1646392 -297760 -644682 -2028374 -2248453 -1214277 -742513 -1096852 -635973
37913 -635973 848531 1324028 -105185 -1625970 -1753661 -1542514 -2175071 -2538374 -1241933
37904 -1241933 691629 1398907 1097530 1105691 1045959 -326579 -2083880 -1733137 962419
37895 962419 3299919 3396758 2432872 2250500 2744209 2958870 3120861 3848329 4370634 3376074
37885 3376074 1281968 33242 497871 1324359 809489 -967896 -2389462 -2177229 -644607
37876 -644607 637024 262599 -1543987 -2822232 -1827807 694620 1995137 634756 -1578531
37867 -1578531 -2059724 -1082456 -1158334 -2945156 -4063953 -2873152 -1209141 -1489322 -2756051
37858 -2756051 -2230393 17008 953533 -686063 -2461426 -2016757 -281835 672447 851873
37849 851873 1369845 1835141 1071530 -396727 -822584 186347 1537518 2753958 4113086
37840 4113086 4818023 3387613 379395 -1454565 -721438 725797 673467 -303210 -162613
37831 -162613 1357812 2678190 2874790 2359944 1321410 -586469 -2670968 -3067051 -1091714
37822 -1091714 1421286 2173933 1073753 -117964 -265404 129060 219048 -19080 -239145
37813 -239145 -528198 -1185758 -2101963 -2873304 -3366510 -3737422 -3934618 -3592346 -2591863
37804 -2591863 -1504305 -1163174 -1703074 -2221775 -1691459 -219443 949036 899036 188414
37795 188414 110402 1003262 1817922 1403537 -184678 -1724763 -1883987 -345217 1696634
37786 1696634 2315567 739261 -1602083 -2555041 -1648587 -173703 947501 1967510 2723354
37777 2723354 1995652 -406901 -2340620 -1792821 175201 786751 -530473 -1538171 -685611
37768 -685611 666141 388909 -1366897 -2499135 -1813847 -508031 -614863 -2380421 -3645060
37759 -3645060 -2291862 771563 2101729 -118485 -3399836 -3754589 -560141 3021220
37751 3021220 4192650 3142350 1278274 -995499 -3539236 -5049429 -4053326 -871892
37743 -871892 2503584 4278503 4069078 2825007 2154133 3116398 4996544 5785102 4475531
37734 4475531 2263820 799062 17235 -1215707 -2836181 -3364592 -2087583 -284334
37726 -284334 325214 -338881 -941297 -779208 -762626 -1990131 -3892927 -4598114 -3156516
37717 -3156516 -624668 1385460 2449166 3053865 3403523 3473665 3687708 4363985 4774046
37708 4774046 3931424 2198153 960340 745474 779326 381971 -340212 -1150847 -1810749
37699 -1810749 -1595082 -24187 1921855 2764110 2708696 3210093 4242306 3986646 1787282
37690 1787282 -548949 -1307759 -966546 -718937 -548135 53362 866175 1588147 2427089
37681 2427089 3120446 2771045 1541298 902142 1244766 1056611 -440246 -1878287 -2280511
37672 -2280511 -2686235 -3522913 -2926091 -150037 1773620 2153 -3362904 -4079466 -1994402
37663 -1994402 -633074 -1363583 -2035090 -1362078 -676399 -725926 -376129 537524 385607
37654 385607 -1068993 -1763796 -926198 -554510 -1734291 -2406318 -828943 1340835 1790770
37645 1790770 1213364 1644858 2822877 2925733 1880899 1296810 1575845 1425172 210355
37636 210355 -1063336 -1317613 -661474 4158 -229260 -1644098 -3254429 -3298086 -1276183
37627 -1276183 1079294 1901188 1633959 2113581 3618116 4332504 2905666 318593 -1336955
37618 -1336955 -1257976 -515134 -418962 -818162 -491841 746189 1171510 -739044 -3827193
37609 -3827193 -5239568 -3920448 -1782859 -1135961 -2268764 -3973810 -5059371 -4717692
37601 -4717692 -2748481 -236786 1111358 961713 500609 154114 -1137701 -3533362 -5096467
37592 -5096467 -4421006 -2811301 -2201882 -2388128 -2158112 -1790844 -2260629 -2977378 -2566062
37583 -2566062 -1201903 -57819 885599 2261767 3217548 2436074 936457 1115994 2834636
37574 2834636 3193658 917132 -1557422 -1520978 544577 2347438 3050087 3608026 4729598
37565 4729598 5776891 5483347 3373597 769402 -10428 1560414 2810060 906161
37557 906161 -3153411 -5805430 -5995811 -6125650 -7411914 -7625098 -5193850 -2618648 -3084675
37548 -3084675 -5659400 -6787825 -5314984 -3123304 -1528512 -6626 1544941 1977488
37540 1977488 898371 -471689 -1021842 -793224 29603 1595153 3359482 3937829 2596622
37531 2596622 61770 -2287733 -3187685 -1825018 1148163 3122435 1824450 -1662878
37523 -1662878 -3829848 -2977282 -792133 618140 1127906 1218799 489902 -891209 -1164882
37514 -1164882 547680 2158783 1292144 -914672 -1235124 766918 1966864 282380
37506 282380 -2341474 -2775550 -821192 1060423 1083538 -402666 -2284459 -3881956 -4643575
37497 -4643575 -4061427 -2619468 -1906874 -2774307 -3834933 -2982875 -392351 1311319 417121
37488 417121 -1588286 -2170706 -1119394 -202083 -211136 -436341 -868492 -2454360 -4566988
37479 -4566988 -4726017 -2262260 -140798 -1160002 -3928773 -4846864 -2927115 -296889
37471 -296889 1265336 1759035 1338374 -126708 -1709854 -1930768 -913555 -42261 603624
37462 603624 2106830 3735447 2896046 -867613 -4329413 -4563344 -2445238 -640980 -66505
37453 -66505 -169079 -924773 -2277715 -2779081 -1079157 1801827 3529324 3285826 2049319
37444 2049319 766068 -188806 -492354 -471722 -1456409 -3799971 -5408318 -4298084 -1894560
37435 -1894560 -1383442 -3157870 -4501351 -3835704 -2565421 -2117057 -1788910 -723395 243144
37426 243144 266249 271571 1329981 2531213 2211713 489944 -970068 -1170031 -410222
37417 -410222 773832 1915537 2165012 981562 -634339 -871546 535304 1676190 782640
37408 782640 -1553522 -3234241 -3275391 -2609375 -2309407 -2150632 -1576509 -1142309 -1717461
37399 -1717461 -2663731 -2393319 -899485 -65557 -797020 -1499612 -571211 1071184 1500177
37390 1500177 570295 -625491 -2047242 -4259367 -6312007 -6442960 -4789161 -3232510
37382 -3232510 -2560660 -1967474 -1379456 -1734824 -2489468 -1483425 1673560 4408562 4615359
37373 4615359 3182661 1828457 589742 -920289 -1855277 -1762570 -2080348 -3753084 -4874049
37364 -4874049 -3248325 -161360 1226226 651948 941188 3241253 4889409 3161315
37356 3161315 -822351 -3398276 -2564107 329913 2663517 3371743 3527531 4505377 6154512
37347 6154512 7323104 7791865 8374889 8844847 7441477 3613373 -131862 -880168 891072
37338 891072 1925168 341876 -2385302 -3636312 -2553837 -553362 282928 -664125 -1665782
37329 -1665782 -578968 1882931 2244229 -1149556 -5214173 -5818408 -3162660 -941160
37321 -941160 -972180 -1692785 -1858366 -2439155 -3970957 -4897969 -4051453 -2640358 -2261237
37312 -2261237 -2627486 -2656254 -2283260 -1867232 -1205380 -446612 -644522 -2099929 -3413759
37303 -3413759 -3400092 -2573576 -1535397 371458 3073899 4225416 2124350 -1032745 -1614863
37294 -1614863 304744 1159573 -772652 -3194941 -3701206 -3153768 -3615616 -4910663 -5208877
37285 -5208877 -3944782 -2290566 -1149697 -237184 812250 1570134 1355299 55643 -1729238
37276 -1729238 -2992107 -2854798 -1325639 402309 870754 -156070 -1331194 -1126522 434364
37267 434364 1733591 1468475 391354 582317 2786688 5068579 4779609 1647404 -1835053
37258 -1835053 -3154687 -2216902 -802613 -297615 -605166 -990989 -1199439 -1440370 -1664268
37249 -1664268 -1346477 -119309 1607578 2903361 3150575 2425189 1151157 -213954 -1120842
37240 -1120842 -1144419 -598992 -435939 -1048443 -1648408 -1452037 -993179 -1341001 -2337676 -2790491
37230 -2790491 -2394104 -2121268 -2321192 -1812336 218222 2506256 3173297 2286602 1657871
$$ [...]
##END NTUPLES=NMR SPECTRUM
##END=
