##TITLE=31Pdec_SR-157-K3-TFAA1
 CDCl3, 24 sc
 5.6.2023
##JCAMPDX= 6.0         $$ Bruker NMR JCAMP-DX V2.0
##DATA TYPE= NMR SPECTRUM
##DATA CLASS= NTUPLES
##ORIGIN= UXNMR, Bruker Analytische Messtechnik GmbH
##OWNER= root
$$ XWIN-NMR		Version 3.5
$$ Mon Jun  5 15:47:26 2023 Russian Standard Time (UT+4h)  she@DPX200
##.OBSERVE FREQUENCY= 81.013821
##.OBSERVE NUCLEUS= ^31P
##.ACQUISITION MODE= SIMULTANEOUS
##.ACQUISITION SCHEME= undefined
##.AVERAGES= 24
##.DIGITISER RES= 16
##SPECTROMETER/DATA SYSTEM= spect
##.PULSE SEQUENCE= zgpg30
##.SOLVENT NAME= CDCl3
##.SHIFT REFERENCE= (INTERNAL, CDCl3, 0, 248.564)
##AUDIT TRAIL= $$ (NUMBER, WHEN, WHO, WHERE, WHAT)
$$ ##TITLE= Audit trail, XWIN-NMR		Version 3.5
$$ ##JCAMPDX= 5.01
$$ ##ORIGIN= Bruker BioSpin GmbH
$$ ##OWNER= she
$$ F:/spectra/data/she/nmr/P31/1/pdata/1/auditp.txt
$$ ##AUDIT TRAIL=  $$ (NUMBER, WHEN, WHO, WHERE, WHAT)
(   1,<2023-06-05 15:46:20.32 +0400>,<she>,<DPX200>,
      <created by zg, POWCHK disabled, PULCHK disabled
       configuration hash MD5:
       00 E9 B6 7A A2 85 ED C7 34 08 36 98 17 FE 4E 26
       data hash MD5: 32K
       44 1E 2F 52 6C F3 F0 B1 1A 68 0A B6 3D AF 0E CD>)
(   2,<2023-06-05 15:46:25.35 +0400>,<she>,<DPX200>,
      <Start of raw data processing
       efp BC_mod = 2 LB = 1 FT_mod = 6 PKNL = 1 PHC0 = -10665.51 PHC1 = -22.31514 SI = 64K 
       data hash MD5: 64K
       B4 1C 41 75 95 7B 28 E8 EA EB E1 84 00 B1 C8 32>)
(   3,<2023-06-05 15:46:42.46 +0400>,<she>,<DPX200>,
      <pk PHC0 = 24.43995 PHC1 = 0 
       data hash MD5: 64K
       5B 07 74 A8 56 8F F6 C4 3A E7 F8 FC B2 32 34 79>)
(   4,<2023-06-05 15:46:49.68 +0400>,<she>,<DPX200>,
      <abs ABSG = 5 
       data hash MD5: 64K
       1C 89 3E 2F 8C 78 E9 A1 CC 89 D4 BE BE 03 B5 6D>)
$$ ##END=
$$ 
$$ hash MD5
$$ 32 DC C8 2A B2 C4 22 33 0B 22 F5 9D B9 D0 4F 11
##$RELAX= 
##$RELAX= 
##$RELAX= 
##$RELAX= 
##$RELAX= 
##$RELAX= 
##$RELAX= 
##$RELAX= 
##$RELAX= 
$$ Bruker specific parameters
$$ --------------------------
##$DU= <F:/spectra>
##$EXPNO= 1
##$NAME= <P31>
##$PROCNO= 1
##$TYPE= <nmr>
##$USER= <she>
##$AMP= (0..31)
100 100 100 100 100 100 100 100 100 100 100 100 100 100 100 100 100 100 
100 100 100 100 100 100 100 100 100 100 100 100 100 100 
##$AQSEQ= 0
##$AQ_mod= 1
##$AUNM= <au_zg>
##$AUTOPOS= <>
##$BF1= 81.014009
##$BF2= 200.13
##$BF3= 200.13
##$BF4= 200.13
##$BF5= 200.13
##$BF6= 200.13
##$BF7= 200.13
##$BF8= 200.13
##$BYTORDA= 1
##$CFDGTYP= 0
##$CFRGTYP= 5
##$CHEMSTR= <none>
##$CNST= (0..31)
1 1 145 1 1 1 1 1 1 1 1 1 1 1 1 1 1 1 1 1 1 1 1 1 1 1 1 1 1 1 1 1 
##$CPDPRG= <waltz16>
##$CPDPRG1= <>
##$CPDPRG2= <waltz16>
##$CPDPRG3= <>
##$CPDPRG4= <mlev>
##$CPDPRG5= <mlev>
##$CPDPRG6= <mlev>
##$CPDPRG7= <mlev>
##$CPDPRG8= <mlev>
##$CPDPRGB= <>
##$CPDPRGT= <>
##$D= (0..31)
0 1 0 0 0 0 0 0 0 0 0 0.03 2e-05 3e-06 0 0 0 0 0 0 0 0 0 0 0 0 0 0 0 0 
0 0 
##$DATE= 1685965579
##$DBL= (0..7)
120 120 120 11 120 120 24 19 
##$DBP= (0..7)
150 150 150 150 150 150 150 150 
##$DBP07= 0
##$DBPNAM0= <>
##$DBPNAM1= <>
$$ [...]
##$SUBNAM3= <"">
##$SUBNAM4= <"">
##$SUBNAM5= <"">
##$SUBNAM6= <"">
##$SUBNAM7= <"">
##$SUBNAM8= <"">
##$SUBNAM9= <"">
##$SW= 501.771253377433
##$SWIBOX= (0..15)
0 1 3 0 0 0 0 0 0 0 0 0 0 0 0 0 
##$SW_h= 40650.406504065
##$TD= 32768
##$TD0= 1
##$TE= 0
##$TE2= 300
##$TE3= 300
##$TEG= 300
##$TL= (0..7)
0 120 53 12 22 120 120 120 
##$TP= (0..7)
150 150 150 150 150 150 150 150 
##$TP07= 0
##$TPNAME0= <>
##$TPNAME1= <>
##$TPNAME2= <>
##$TPNAME3= <>
##$TPNAME4= <>
##$TPNAME5= <>
##$TPNAME6= <>
##$TPNAME7= <>
##$TPOAL= (0..7)
0.5 0.5 0.5 0.5 0.5 0.5 0.5 0.5 
##$TPOFFS= (0..7)
0 0 0 0 0 0 0 0 
##$TUNHIN= 0
##$TUNHOUT= 0
##$TUNXOUT= 0
##$USERA1= <user>
##$USERA2= <user>
##$USERA3= <user>
##$USERA4= <user>
##$USERA5= <user>
##$V9= 5
##$VALIST= <valist>
##$VCLIST= <CCCCCCCCCCCCCCC>
##$VD= 0
##$VDLIST= <DDDDDDDDDDDDDDD>
##$VPLIST= <PPPPPPPPPPPPPPP>
##$VTLIST= <TTTTTTTTTTTTTTT>
##$WBST= 1024
##$WBSW= 4
##$XGAIN= (0..3)
0 0 0 0 
##$XL= 0
##$YL= 0
##$YMAX_a= 4986
##$YMIN_a= -5042
##$ZGOPTNS= <>
##$ZL1= 120
##$ZL2= 120
##$ZL3= 120
##$ZL4= 120
##$ABSF1= 248.5645
##$ABSF2= -253.2056
##$ABSG= 5
##$ABSL= 3
##$ALPHA= 0
##$AQORDER= 0
##$ASSFAC= 0
##$ASSFACI= 0
##$ASSFACX= 0
##$ASSWID= 0
##$AUNMP= <proc_1d>
##$AZFE= 0.1
##$AZFW= 0.5
##$BCFW= 0
##$BC_mod= 2
##$BYTORDP= 0
##$COROFFS= 0
##$CY= -3
##$DATMOD= 1
##$DC= 0
##$DFILT= <>
##$DTYPP= 0
##$F1P= 0
##$F2P= 0
##$FCOR= 1
##$FTSIZE= 65536
##$FT_mod= 6
##$GAMMA= 0
##$GB= 0
##$INTBC= 1
##$INTSCL= 6.047779e-11
##$ISEN= 30
##$LB= 1
##$LEV0= 0
##$LPBIN= 0
##$MAXI= 10000
##$MC2= 0
##$MEAN= 0
##$ME_mod= 0
##$MI= 50
##$NCOEF= 0
##$NC_proc= -6
##$NLEV= 6
##$NOISF1= 182.463
##$NOISF2= 159.3651
##$NSP= 0
##$NTH_PI= 0
##$NZP= 0
##$OFFSET= 248.5645
##$PC= 4
##$PHC0= -10641.07
##$PHC1= -22.31514
##$PH_mod= 1
##$PKNL= yes
##$PPARMOD= 0
##$PSCAL= 0
##$PSIGN= 0
##$REVERSE= no
##$SF= 81.0140089999694
##$SI= 65536
##$SIGF1= 159.3651
##$SIGF2= -187.1042
##$SINO= 113.3802
##$SIOLD= 16384
##$SREGLST= <1H.CDCl3>
##$SSB= 0
##$STSI= 65536
##$STSR= 0
##$SW_p= 40650.406504065
##$SYMM= 0
##$S_DEV= 0
##$TDeff= 32768
##$TDoff= 0
##$TI= <>
##$TILT= no
##$TM1= 0
##$TM2= 0
##$TOPLEV= 0
##$USERP1= <user>
##$USERP2= <user>
##$USERP3= <user>
##$USERP4= <user>
##$USERP5= <user>
##$WDW= 1
##$XDIM= 65536
##$YMAX_p= 277402428
##$YMIN_p= -291364393
$$ End of Bruker specific parameters
$$ ---------------------------------
##NTUPLES= NMR SPECTRUM
##VAR_NAME=  FREQUENCY,     SPECTRUM/REAL,   SPECTRUM/IMAG
##SYMBOL=    X,             R,               I
##VAR_TYPE=  INDEPENDENT,   DEPENDENT,       DEPENDENT
##VAR_FORM=  AFFN,          ASDF,            ASDF
##VAR_DIM=   65536,         65536,           65536
##UNITS=     HZ,            ARBITRARY UNITS, ARBITRARY UNITS
##FACTOR=    0.620285442955139, 1,           1
##FIRST=     20137.2065510682, 0,            0
##LAST=      -20513.1999529968, 0,           0
##MIN=       -20513.1999529968, -291364393,  0
##MAX=       20137.2065510682, 277402428,    0
$$ Real data points
##PAGE= N=1
##DATA TABLE= (X++(R..R)), XYDATA
$$ [...]
13247A828232J36346n84932R9417J037725O51988k50498m8518O59556J21999j312891
13237B338424j557821j27170J178147J045835J49933m64497p93297j100112j088824
13228d19382n65340O07J92452K36271L69422K47245m14690j023087o46729O37734
13218a385497J525157R43820n50177j341051p04861L94973P14377K82475l4749
13209a55533L5283O2865o4062q240J74198K5369l56490k53064N09467J097307
13199A067100P34405l02598j049072q80981q5126L76489j49790j053425j012333
13190b355331J38398R59254N33190n9423M12409J143090O86782l85904l99323
13181F73142M37784M07869n57325p49463Q7955J97977q48369j061915M98428J774740
$$ y = [1828232, 1964578, 1379646, 1479063, 2516788, 3168776, 2918278, 2869760, 3529316, 3651315, 2338424, 780603, 653433, 1831580, 2877415, 3027348, 2562851, 1769554, 669442, -419382, -984722, -984115, -791663, -555392, -185970, 61275, -353415, -1376502, -2023231, -1385497, 139660, 1083480, 533303, -807748, -1512609, -1117636, -403259, -120784, -155533, -120250, -57385, -121447, -129687, 44511, 69880, -286610, -539674, -30207, 1067100, 1801505, 1498907, 449835, -431146, -516272, -139783, -289573, -1342998, -2355331, -2216933, -1257679, -724489, -783912, -371503, 771587, 1458369, 1072465, 673142, 1110926, 1518795, 961470, 212007, 299962, 497939, -350430, -1412345, -913917, 860823]
13171H60823Q93808q92771j312559l18897O10834Q67993O20022k44505j332715
13162b47967j272602K64424J437656Q50788k09191n4229M92709j88560j309903
13153b36875r34209N15096Q83877p7285n46142N5460L42594k50915n78739j36687
13143i63825P0979l36553k90945O40059J286740Q37571L8311l60543p01253j151369
13133i30828r52133J31077J037650J004895O14419M27193k1893r37044j388170
13124a014834q40056k51151m15894m40599O89307K056779J963572M70751q10788
13115A407087j069442q85557o55394J6273J109107J658017R68982m09265j349631
13106G90177j291101n22369K16806K90538k72427p25594m71782J24124K75324
$$ y = [860823, 1754631, 861860, -450699, -769596, -158762, 709231, 1329253, 1084748, -247967, -1520569, -1256145, 181511, 1032299, 823108, 768879, 1261588, 1073028, -236875, -1171084, -655988, 227889, 150604, -395538, -340078, 2516, -248399, -827138, -963825, -892846, -1229399, -1520344, -880285, 406455, 1244026, 1282337, 921794, 220541, -930828, -1882961, -1751884, -714234, 290661, 905080, 1332273, 1310380, 373336, -1014834, -1854890, -2106041, -2521935, -2962534, -2273227, -216448, 1747124, 2217875, 1407087, 337645, -547912, -1203306, -1187033, -77926, 1580091, 2549073, 2139808, 790177, -500924, -1023293, -806487, -515949, -788376, -1513970, -1985752, -1861628, -1586304]
13097a586304k1527j6538N39447R73020Q02573N09898O44717P66594Q9217j114220
13087A586877j673842j165136n10691n54292q15687l88933M80196P37249K56834
13078b047425P9130O62138J029298L31154o73806o82554K24847Q34653O31498
13069C88933K14308J2202j86581l14389J09827Q22064P44678k97295r51140l20798
13059B21809M88553L6038j080987j078478J98179J044888N92362M849L48083P86969
13049A562265O2487j298037j671310p32396K35795L35374P4362J46766L05247
13040i79447L5027m06641l44178K78033Q05238P02552R0021m88068n79698j71136
13030a058297L19400M33593J00741l96102p80598q97302o16766j1288M56767L77641
$$ y = [-1586304, -1607831, -1624369, -1084922, -111902, 690671, 1200569, 1845286, 2611880, 2701097, 1586877, -86965, -1252101, -1762792, -2317084, -3132771, -3521704, -3041508, -2304259, -2047425, -1968295, -1306157, -276859, 54295, -619511, -1302065, -1077218, -242565, 388933, 603241, 615443, 428862, 114473, 224300, 1046364, 1791042, 1493747, 542607, 221809, 710362, 746400, -334587, -1413065, -1214886, -169998, 422364, 427213, 775296, 1562265, 1624752, 326715, -1344595, -2076991, -1841196, -1505822, -1431460, -1284694, -979447, -944420, -1351061, -1695239, -1417206, -611968, 90584, 180605, -307463, -887161, -1058297, -738897, -305304, -204563, -600665, -1381263, -2278565, -2895331, -2906619, -2449852, -2072211]
13020b072211k0218k20648k46543m53004n76643M1132J110197J379782M62000
13011e96156m20273k40474L44833L13242N2413M45069R69487M23292q02132j003503
13001e14202J37244Q87479O9962j175518j139264J03060J145573J272814R17181
12992A704329N33525Q5365l94328n55265k40904K19284M18895L21991J51284k5381
12982B218795l79079r07411j140208o32534K38577M90495j95286r43941q47241
12973b097833j30772M03725N81160P40956Q47066O11935K59508K54990M19191
12964A889926J94726l18313m86973k30998q6720k23879k77397j28552k074J30832
12954D60578L83456L78678j87281o78097l64174J70636j24222p61571k93316J091386
$$ y = [-2072211, -2092429, -2313077, -2559620, -3012624, -3589267, -3548135, -2437938, -1058156, -596156, -1016429, -1256903, -912070, -598828, -546415, -101346, 868141, 1291433, 489301, -514202, -376958, 510521, 580483, -595035, -1734299, -1631239, -485666, 787148, 1704329, 2237854, 2323219, 1928891, 1373626, 1132722, 1352006, 1770901, 2092892, 2244176, 2218795, 1839716, 932305, -207903, -840437, -601860, -111365, -306651, -1250592, -2097833, -2228605, -1824880, -1243720, -502764, 344302, 956237, 1215745, 1470735, 1889926, 2084652, 1766339, 1279366, 1048368, 961648, 737769, 460372, 331820, 329746, 460578, 844034, 1222712, 1035431, 357334, -6840, 163796, 39574, -721997, -1015313, 76073]
12944G6073J503545L06136q48354o93242j39869l09287n84655q3620M51106n0784
12934c72951r19465p47919K86376P97825M11121J4834N7947O5078j84108k69651
12924h60913m9520O3082q0888p6362L03158O63859M87354k17562q28069o52448
12914a248309K32709Q08192K95031o32397o63532J80449N66546m119m85674k06792
12904a157896K9903l72868n16950L84348J376517J157431J04704n16420n14398
12895b5629m97605m04692J81356Q31279Q15269L58127P0976k27805p87482q28645
12885e14851K06910J074546L17249j119424j024365N58010J251626J2157j374011
12876f12153j101561K89037J218616J112012K61955q88255j460907n52446J137659
$$ y = [76073, 1579618, 1885754, 1037400, 344158, 204289, -104998, -689653, -773273, -322167, -372951, -1292416, -2040335, -1753959, -956134, -545013, -530179, -472232, -407154, -591262, -860913, -910433, -847351, -928239, -1004601, -701443, -37584, 449770, 232208, -595861, -1248309, -1015600, -207408, 87623, -544774, -1208306, -1027857, -461311, -465430, -951104, -1157896, -1127993, -1500861, -2017811, -1633463, -256946, 900485, 1005189, 488769, -25629, -523234, -927926, -746570, 84709, 899978, 1258105, 1329081, 1101276, 313794, -514851, -307941, 766605, 1083854, -35570, -1059935, -501925, 749701, 761858, -612153, -1713714, -1424677, -206061, 905951, 1167906, 279651, -1181256, -1733702, -596043]
12867e96043J473462k21996j776631j052336R38841J509617J37959j097352p60743
12858a445222J76708L11959n8334J64080Q69796R65584K59840j87779J73538M06625
12848A636795m25743j606028j663764n45814L62851M01053M37382J027946J162945
12839G87623n2243j525340j493742j48003P15845N15965N43803J383914J505840
12830B233662l32439k587130k614648l62002J479489J198468J47396K31325R21561
12821C15682M76184q19636r10042N38059J264872n0217j493752p92087J147884
12812c23053J698900M67002n77440m22563m7290j55924k28321j66131o78237j472997
12802a906054j177204K43018J049879N26640O9739N02482N73561m59928r91394
$$ y = [-596043, 877419, 655423, -1121208, -2173544, -1234703, 274914, 412873, -684479, -1445222, -1268514, -956555, -1014889, -850809, 18987, 984571, 1244411, 1056632, 1230170, 1636795, 1211052, -394976, -2058740, -2604554, -2241703, -1840650, -1403268, -375322, 787623, 735380, -789960, -2283702, -2431705, -1715860, -1199895, -656092, 727822, 2233662, 1901223, -685907, -3300555, -3662557, -2183068, -984600, -837204, -605879, 315682, 791866, -27770, -937812, -399753, 865119, 814902, -678850, -1470937, -323053, 1375847, 1842849, 1265409, 842846, 795556, 639632, 411311, 245180, -433057, -1906054, -3083258, -2840240, -1790361, -1263721, -1193982, -691500, -117939, -577867, -1569261]
12793a569261K83196J770795J278661n05313j148985j40204Q12403N89815j97805
12784A173302o18138m20814J36689L95086k52652j220075j057621K41710P68187
12775h54326l17607j150311j66498J167744Q26293l45048l01959N62250M03904
12766a75558n45330n51315K66847L17841j95557L76675J698174J637824N6187
12757B885788q11166j80858K18492m15691n90826L73081Q20066k59824j315530
12748G23532q72073J28932K25589k14038j12335L88804N26129J97000l90558j124718
12738e23736j365386l83537J006541J006628l30484q11014M93092J670807J009553
12729A772464m56889r65042p36411q95008j173112o08905M81808R66500O63794
$$ y = [-1569261, -1286065, 484730, 1763391, 1258078, 109093, -31111, 781292, 1371107, 1173302, 555164, 134350, 271039, 666125, 413473, -806602, -1864223, -1622513, -854326, -1171933, -2322244, -2488742, -1320998, -494705, -839753, -1141712, -579462, -175558, -720888, -1272203, -1005356, -687515, -883072, -506397, 1191777, 2829601, 2885788, 2074622, 1893764, 2112256, 1696565, 1105739, 1478820, 2298886, 2039062, 723532, -148541, -19609, 205980, -8058, -120393, 268411, 794540, 991540, 600982, -523736, -1889122, -2272659, -1266118, -259490, -589974, -1400988, -907896, 762911, 1772464, 1315575, 350533, -385878, -1280886, -2453998, -3062903, -2581095, -1614595, -950801]
12720i50801K80890J67532K16664M12885O19841M57229J1370j09383J44885J47852
12710A398964j05496J00376O03445K48927j009846j585468o77580M40656N24404
12701f1618J02053N8648J18598q6691m4570L17080l8191j280088j736560m01731
12691c053070J186914J240740L80239K08251O17985M84295j03028k71321j23145
12682E67860k31177k22213L84669P75817M7263r71677q54058J61703P10316M08321
12672G76824j52174p27980j162852p17224O48875J325844K54557r87367m48028
12663a189525Q84008N88784j093556j577319j65777R55862L65064o35757n13820
12654b382036L20189Q39653J008226J017315N03349m63356r28273m79593M1776
$$ y = [-950801, -669911, -502379, -285715, 127170, 747011, 1204240, 1215610, 1106227, 1251112, 1398964, 1293468, 1393844, 1997289, 2246216, 1236370, -349098, -1026678, -586022, -61618, 40435, 99083, 217681, 130990, 86420, 403500, 365309, -914779, -2651339, -3053070, -1866156, -625416, -245177, -36926, 581059, 1065354, 962326, 691005, 567860, 336683, 114470, 499139, 1274956, 1322219, 350542, -503516, -341813, 368503, 776824, 624650, -103330, -1266182, -1983406, -1334531, -8687, 245870, -741497, -1189525, -305517, 283267, -810289, -2387608, -2553385, -1597523, -1232459, -1868216, -2382036, -2061847, -1222194, -213968, 803347, 1306696, 843340, -84933, -564526, -522750]
12645e22750k032o2519L64349O82258K57770m16760n27428j80334l1189k26264
12635f64899l85548k40742J58407N11108L57327l78841q96457l37996Q04076J081526
12625G961J82537m63625K27131J341300J335985K78754m50839l10216j87018p59373
12615A202597j394213j206554m26183M9600K0783L5859K34580J12342l65676m01371
12605b138236L41532R73627P20918K18813L87317P35662K13689p25725o25782
12596A01815N14126J070091L09183o94019j071009j262026j439145p06908J065043
12587b112849K285220J780084M88556j87161l29232n52158n65924j55725k17172
12578D33639j184752j689520n29146J175979J626817J059567Q53538R38728K98075
$$ y = [-522750, -524782, -587301, -222952, 459306, 717076, 300316, -227112, -407446, -438635, -664899, -1050447, -1291189, -1132782, -621674, -264347, -643188, -1539645, -1877641, -1073565, 7961, 190498, -273127, -45996, 1295304, 2631289, 2910043, 2459204, 2148988, 1961970, 1202597, -191616, -1398170, -1824353, -1774753, -1753970, -1718111, -1483531, -1371189, -1736865, -2138236, -1796704, -823077, -102159, 116654, 503971, 1239633, 1453322, 727597, 101815, 615941, 1686032, 1995215, 1301196, 230187, -1031839, -2470984, -3177892, -2112849, 172371, 1952455, 2441011, 2253850, 1924618, 1372460, 806536, 650811, 433639, -751113, -2440633, -2969779, -1793800, -166983, 892584, 1746122, 2684850, 2982925]
12569B982925o78752o57914K01205M53526j81895o14162m80471m68114o08085
12560e1737k07503M71672L52998n04305q57017l19753J98306J75817n611j98241
12550i45374m98913k77538R90072K098201J371209n24210j273271m94235j32321
12541C13620q98670j039853L80668J584044R56795l66503n65718J778p8883o36852
12531c49574l87015P22229J393504Q98023j71445q71058p77339j48904K52073
12522E60494r6830o68465n17574J75881K94165k77742l36592M91324Q80876J9548
12512E25085q29372k79477R01223R89869o9054p97223m76366R9452M1485n40793
12502d35171r12007n46772L44023Q48282K92924o99511p98698J91243J036880
$$ y = [2982925, 2304173, 1646259, 1847464, 2300990, 2119095, 1504933, 1024462, 556348, -51737, -259240, 212432, 565430, 61125, -795892, -1115645, -917339, -741522, -747133, -945374, -1444287, -1721825, -731753, 1366448, 2737657, 2213447, 940176, 445941, 313620, -585050, -1624903, -1244235, 339809, 1296604, 930101, 364383, 366161, 287278, -349574, -736589, -14360, 1379144, 2277167, 2105722, 1234664, 457325, 308421, 560494, 463664, -204801, -722375, -546494, -252329, -530071, -866663, -375339, 505537, 525085, -304287, -583764, 317459, 1307328, 1238274, 441051, -35315, 64137, 105622, -435171, -1347178, -1893950, -1549927, -701645, -408721, -1108232, -1906930, -1715687, -678807]
12493f78807R46584N60241N16087L33188l93953r10139n27994Q9777N1602k91717
12483c05131k13904n0842m27564q40766m64056K68534L76530J10217M49651J178601
12473H1270J083081j1105r16493q82431l59398J44577O50649R48988N25666m00448
12463H64356q68748n56306j67962j57017j16374J59264Q6106o05918j080648m83008
12453b926255P54077J382206P85218m96230j367732j022981L96824J712911J729089
12444I47127N85043m13362n01844k68964l95188m82328M4375N84403J02804j034489
12434h32423j247077O745J298183J162607Q7912l41891K35095O16075k3887r33085
12424B8254r68388j81577M68113N12124L10788J87590n105l72774o45157n74605
$$ y = [-678807, 267777, 828018, 1344105, 1677293, 1283340, 373201, -154793, -65016, -13414, -305131, -519035, -569877, -997441, -1838207, -2302263, -2033729, -1657199, -1546982, -1097331, 81270, 1164351, 1153246, 236753, -645678, -1005076, -860499, -209850, 739138, 1264804, 864356, -4392, -560698, -728660, -885677, -1002051, -842787, -756681, -1362599, -2443247, -2926255, -2172178, -789972, -4754, -500984, -1868716, -2891697, -2494873, -781962, 947127, 1532170, 1118808, 616964, 348000, -47188, -529516, -485141, 99262, 202066, -832423, -2079500, -2072755, -774572, 388035, 475947, 134056, 369151, 985226, 961339, 28254, -940134, -1121711, -653598, -141474, 169314, 356904, 351799, -20975, -666132, -1240737]
12414a240737k63616O0771K57413J86991j67113m03499j8768P81391J076797L67390
12404F37020o68983r18648p7737J116624J647707J018656l57540j346137j087819
12395c6857o8177L26166l40270q45360j08859J030369R50207k65968r05666k58997
12385e23412L50593k10609j028603o74712M20392O87157K3950q2348Q39138J293494
12375A095040K49730r85441o47842P33671J094020r4217j195270r47084l8006
12366g35399L62374K64706K15661J05411l20321n47140k7726O85787O57693O1045
12356G22091j58480J31383J83068j72317k32635K24144M72217J04327l12969l58874
12346F01955m84347r21266q69817K30571J395773J265144J14014n72506l34452
$$ y = [-1240737, -1504353, -1443582, -1186169, -999178, -1166291, -1569790, -1588558, -807167, 269630, 637020, -31963, -950611, -1028348, 88276, 1735983, 2754639, 2397099, 1050962, -36857, -105034, 221132, -119138, -964498, -1073357, -42988, 907219, 641251, -264415, -523412, -172819, -383428, -1412031, -2086743, -1666351, -979194, -955244, -1037592, -198454, 1095040, 1344770, 359329, -288513, 445158, 1539178, 1444961, 249691, -697393, -735399, -373025, -108319, 107342, 212753, -107568, -654708, -682434, 3353, 661046, 722091, 563611, 694994, 878062, 705745, 473110, 697254, 1169471, 1273798, 960829, 601955, 117608, -803658, -1673475, -1442904, -47131, 1218013, 1332027, 759521, 425069]
12337D25069j84325o83966r68608k94325O13346P00056K34737K17772O79631P80955
12327A520342L56113Q2213P9499l46919j234676j522356p32853P2910o4975m55175
12317b245877k213Q74992R82081L83089J23555K91608N5279m70783k13755P70158
12307E48134J013117p230r35544p16759p0337J28823L03760Q40641Q89769l5550
12297A958824o99784p9941O37130n2606j201968q30176O51826R77309k76373j127338
12287d3097n64091M8974l46847p44458j37293O21405M46848m4421K38940Q97864
12277C73824Q62050K83508O5233J36862k44966q46417o73335J86288M18152m63495
12267I7704j174934m81352R30831J340972L54784o11650l22226O44154Q22557
$$ y = [425069, 240744, -443222, -1411830, -1706155, -1092809, -392753, -158016, 59756, 739387, 1520342, 1876455, 1958668, 2038167, 1691248, 456572, -1065784, -1798637, -1725727, -1790702, -2245877, -2248090, -1373098, -391017, -7928, 115627, 407235, 462514, -8269, -222024, 548134, 1561251, 1554021, 618477, -98282, -168619, -39796, 263964, 1104605, 1994374, 1958824, 1259040, 1179099, 1816229, 1763623, 561655, -268521, 383305, 1360614, 1084241, -43097, -607188, -558214, -905061, -1649519, -1786812, -1165407, -718559, -762980, -524040, 373824, 1235874, 1519382, 1584615, 1721477, 1476511, 630094, -43241, 143047, 561199, 97704, -1077230, -1558582, -627751, 713221, 1068005, 456355, 134129, 778283, 1600840]
12258A600840o5918q39490o21095N5976K99248J64331J61750J11852m60657j101376
12248f94539p64631N39117J483480J147621J41296m31844m08624l84043o08810
12239A9023p40545n16847j32891J12072K24653L96714N76647M26492j12926m72502
12229b20110j48688L98984K87236l32143l73332L16844M69122m52212r66115J71026
12219h49388J567216R58129j256614k359681j109639Q68026J732939J475892P70743
12210A797623k58355j185957r31996N18601J427206O20522o63914o01541N33248
12201A255437R85766J57885q51920j021102m39566K76615N66629O0434r64280
12192B5898j441689o86807N10500Q18686J51119m25183l78659k29169l45115l28820
$$ y = [1600840, 1534922, 695432, 74337, 130313, 429561, 593892, 755642, 867494, 406837, -694539, -1459170, -920053, 563427, 1711048, 1852344, 1420500, 1011876, 627833, 19023, -721522, -1238369, -1371260, -1259188, -1034535, -637821, -61174, 365318, 252392, -220110, -368798, 30186, 317422, -14721, -388053, -71209, 397913, -54299, -1020414, -849388, 717828, 1675957, 419343, -1940338, -3049977, -2181951, -449012, 1026880, 1797623, 1539268, 353311, -578685, -60084, 1367122, 1987644, 1323730, 722189, 1255437, 2241203, 2399088, 1547168, 526066, 86500, 363115, 929744, 990178, 25898, -1415791, -2102598, -1592098, -773412, -622293, -1047476, -1426135, -1655304, -2000419, -2329239]
12182b329239P0610L58898J24512k06704p640N94168R16071O28276N7501k65458
12172e9005r0263L57717M82509j12142r31155q60714M14832J630191J306624k37398
12162A901196j169439o00191L12232K99020r0778L27432J092249O83416q42244
12153A912893j636497q16221K92557L62385j19744k57776m04321j001727j109865
12144b778316J29921J503707J139672o06682j570414q25060M83203J211822J307832
12135d315P89761m64813j583293j140338O79707J911153J410695J93009m40881
12126A350685o02467q21947p84833j59253M04514K12790l32637m82929l13098
12117a529175k73683k32893J67749P01111Q30103M08881l56461j136890j347855
$$ y = [-2329239, -2258629, -1899731, -1775219, -1981923, -1989563, -1395395, -479324, 148952, 206453, -59005, -149268, 208449, 690958, 578816, -352339, -1213053, -798221, 831970, 2138594, 1901196, 731757, 131566, 443798, 742818, 652040, 979472, 2071721, 2755137, 1912893, 276396, -539825, -247268, 115117, -4627, -262403, -666724, -1668451, -2778316, -2648395, -1144688, -5016, -611698, -2182112, -3007172, -2523969, -1312147, -4315, 785446, 320633, -1262660, -2402998, -1723291, 187862, 1598557, 1791566, 1350685, 748218, -73729, -858562, -1017815, -613301, -400511, -733148, -1216077, -1529175, -1802858, -2035751, -1868002, -1166891, -336788, 72093, -284368, -1421258, -2769113]
12108b769113n29897P44780J196451N38247q6470Q1588K73821k83968q06060j55545
12098a796166J148304J556966P77216N5988J90490M84971R974j034162j721738
12089c28157j609737j038760n01794j63550J7636N4364K8001K16950P52943J190108
12079a381996R22523J60856j34486L65682P52363K33160o29279q66486o20564
12070a198227o30863p38867k03818P50632J035543L33301n21950q11441n47373
12061b533063O6688P34341Q38437K37564n9354O99169J426762O74614p74893q50163
12051D60102M50377R63046j61363j264770j024062j66708M08675R11499J127978
12042A704774P464j971585k392391m40667J383179R33816l54954j24670J003748
$$ y = [-2769113, -3299010, -2554230, -1357779, -819532, -906002, -824414, -550593, -834561, -1640621, -1796166, -647862, 909104, 1686320, 1742308, 1932798, 2417769, 2427743, 1393581, -328157, -1937894, -2976654, -3478448, -3641998, -3624362, -3569998, -3541997, -3325047, -2572104, -1381996, -459473, -298617, -433103, -67421, 684942, 918102, 288823, -577663, -1198227, -1829090, -2567957, -2771775, -2021143, -985600, -652299, -1174249, -1985690, -2533063, -2466375, -1732034, -893597, -656033, -715387, -16218, 1410544, 2085158, 1310265, 460102, 910479, 1873525, 1712162, 447392, -576670, -743378, -334703, 576796, 1704774, 1712238, -259347, -2651738, -3092405, -1709226, -775410, -1130364, -1255034, -251286]
12033b51286Q70515l38674o07421K89244N64636l59544j008696m75239L11823
12024a004642M21891K38109L38419M53628J61162l54050o81515o54510k73404
12015a354912K55727M52865J11758k64903j54629J65782J28722j50591j31989
12006i42170J94323L14989K812m10526m50632P5159Q21945J044763M72625j05418
11996A017870P0531L45102l57458j365003r21628P97762J502384L00438q69156
11987E20842m62800K88669j52560r29443o22395N8783k27859p76978j97176P32076
11977a768841K59447j072713j097392M08606J437517J002756K61865J57571J32887
11968b78297l04654n69957j78776M12405O16228L63520k12092q54386j042453
$$ y = [-251286, 619229, 280555, -326866, -37622, 527014, 167470, -841226, -1316465, -1004642, -582751, -344642, -6223, 447405, 608567, 254517, -426998, -1081508, -1354912, -1099185, -646320, -534562, -799465, -954094, -788312, -659590, -810181, -942170, -747847, -432858, -430046, -840572, -1291204, -1216045, -394100, 650663, 1123288, 1017870, 1088401, 1433503, 1076045, -288958, -1210586, -412824, 1089560, 1389998, 520842, 58042, 346711, 194151, -735292, -1357687, -1298904, -1526763, -2303741, -2500917, -1768841, -1509394, -2582107, -3679499, -3270893, -1833376, -830620, -568755, -411184, -278297, -582951, -1152908, -1331684, -919279, -303051, 60469, -151623, -1006009, -2048462]
11959b048462n87684n2022J59611M21808P81140L63912q86811j231961L61433
11950b719036K010450J378189p00202j521367o53349k4895k94630q8282R90586
11941a622536J450120O58210K797M30079R59215N85656j76110n41975o29007o06342
11931E10107j95290L19228R8386o00996l71101R99219J679589L02884j931621
11922H10405k716032j362873P32629J750425J058946l34923p89566M9551O60037
11913a41401k33547j577698j387153K66380J379274R59457M5009k94397j92991
11904a177067M1290N15762R30919O64706l321j49716J67083L6868m86405l91982
11894A48137L20414M88866j23222m34797j11796j24473p28037q00028R1981P49225
$$ y = [-2048462, -2636146, -2688168, -2528557, -2106749, -1325609, -961697, -1848508, -3080469, -2719036, -708586, 669603, -30599, -1551966, -2205315, -2230210, -2524840, -2613122, -1622536, -172416, 485794, 488591, 918670, 1877885, 2463541, 2287431, 1745456, 1116449, 510107, 314817, 634045, 732431, 131435, -239666, 759553, 2439142, 2742026, 810405, -1905627, -3268500, -2535871, -785446, 273500, -61423, -850989, -801438, -141401, -374948, -1952646, -3339799, -3073419, -1694145, -734688, -689679, -984076, -1177067, -1135777, -620015, 310904, 975610, 972289, 822573, 989656, 1026524, 540119, 148137, 468551, 957417, 834195, 399398, 287602, 163129, -564908, -1364936, -1272955, -523730]
11884e23730K87483n77649r56657r68615p93211p7883R70561J353610Q23360K94143
11874a68588K36612J51868L528M25155J067043O77415n78228r40902L4940N54876
11864A463719m24351j440046j051692r5420Q6891j41320J33542N72493M79328
11855d16856J34043q9448n26373r87997l99766J074413J432149j15834j436658
11846a332327o53962Q54813Q11767l09890m79015L60014N73012j83683p39119
11837a098390o20360k93530K89495J308542J780102P36022p78713r62079n9388
11828C01701K09651l80909m41295L69236Q51893N21011J80070N2078n62004j441729
11818c40297j323784j06353P40168N07107J40750K34208O0466n99436n98145M91445
$$ y = [-523730, -236247, -813896, -1770553, -2739168, -3532379, -3610262, -2639701, -1286091, -462731, -168588, 68024, 219892, 223420, 648575, 1715618, 2393033, 1814805, 873903, 908843, 1463719, 1039368, -400678, -1452370, -1547790, -1460899, -1602219, -1468677, -896184, -416856, -282813, -372261, -898634, -1886631, -2286397, -1211984, 220165, 104331, -1332327, -1986289, -1131476, -319709, -629599, -1108614, -748600, -175588, -359271, -1098390, -1718750, -2012280, -1722785, -414243, 1365859, 2101881, 1323168, 361089, 301701, 511352, 130443, -310852, 58384, 910277, 1431288, 1611358, 1663436, 1101432, -340297, -1664081, -1770434, -1030266, -523159, -382409, -148201, -87735, -687171, -1285316, -793871]
11808g93871J184750L58860p78176n69969M39918N09181m58663r26041k52826
11799a286837N31762N70543K63505J43424k9553m36593n14113Q6175O01999J61833
11789I2145p61883q81301Q0536J038375J074073M06107l61388r78441j118886
11780a410663k65749J179028J622816K54942j437184j484718k40162K53372n53752
11771b082070j051790k29988Q38779J029442R03106J240314J352041L84133q05364
11762A578603p89597P9717K00039p07594j243814o19619K67205M73432L99778
11753c61850P98915J352250J160876J74035p20453q92365n91686l50997l23074
11744B45651l96074n14221n60691k70076L10749N64349Q8787m82983k39991N37519
$$ y = [-793871, 390879, 749739, -28437, -598406, -158488, 350693, -107970, -1034011, -1286837, -755075, -184532, 78973, 222397, 192844, -243749, -757862, -671687, -69688, 92145, -669738, -1551039, -1470503, -432128, 641945, 1048052, 686664, -291777, -1410663, -1676412, -497384, 1125432, 1380374, -56810, -1541528, -1781690, -1528318, -2082070, -3133860, -3363848, -2525069, -1495627, -592521, 647793, 1999834, 2383967, 1578603, 789006, 868723, 1068762, 361168, -882646, -1502265, -1235060, -761628, -361850, 437065, 1789315, 2950191, 3124226, 2403773, 1511408, 919722, 568725, 245651, -150423, -664644, -1225335, -1495411, -1184662, -620313, -531526, -1014509, -1254500, -716981]
11734g16981P01164J29851J4035P87588J209091M01036o00984n90993j50996l00671
11724H82140m70137K27996Q38708K4452j194482q39679M70922L77967j028625
11715g10738j221172K56869Q78452l11869q95753M65137J305804m28498k528782
11706c190550j964796K71370J172384O86439R84380J962738J377465q13705j889144
11697a403419o25111R36999Q26229k83283q50601p34005n24045k05491L65644
11688b497083P45036N86448K75089K50053L37389J80374k03108n29667m98958
11679a354427K5518O64423O64941n9791n30511n1321O56036N68889n7501l34588
11669A91668k97265m96581o26203p9637N38531J15796r47857j110073q8942P62394
$$ y = [-716981, -15817, 114034, 128069, 915657, 2124748, 2525784, 1924800, 1333807, 1182811, 882140, 412003, 639999, 1478707, 1503159, 308677, -531002, -60080, 317887, -710738, -1931910, -1675041, -796589, -1108458, -2004211, -1539074, -233270, -661768, -3190550, -5155346, -4883976, -3711592, -3025153, -2040773, -78035, 1299430, 485725, -1403419, -2028530, -1091531, -265302, -548585, -1399186, -2133191, -2657236, -2862727, -2497083, -1752047, -1165599, -890510, -640457, -303068, -122694, -325802, -855469, -1354427, -1328909, -664486, 455, -59336, -589847, -641168, 14868, 583757, 526256, 191668, -105597, -602178, -1228381, -1308018, -769487, -653691, -1601548, -2711621, -2800563, -2038169]
11659b038169O68670L98545O21664P93530K90095n24709r51485p66918l5349R82307
11649e61819J513550Q62263m52257j107966p00970o7001J81481K72788K98677
11640B38746p9247o36000n83213K4552J53112m62039p41092o3770O56343N24054
11630i68554Q4163J98908N42718L36798k12262l39027j7811J79109P1224j54265
11620b78999m82736p64775m19950O34931J322351P52301k36636j56131P85771
11611A156127Q88659l71163j387200p65182O45425J075548L25511l12525k15219
11602A039981j57031p10588j116601m53177P94317J233149L87481p86483j227490
11593i96442q96680l75453J8139K82096L41614J40630p3015j1742J89829J58555
$$ y = [-2038169, -1369499, -970954, -349290, 444240, 734335, 209626, -741859, -1508777, -1544126, -561819, 951731, 1813994, 1361737, 253771, -447199, -514200, -332719, -59931, 238746, 159499, -476501, -1059714, -1035162, -882050, -1344089, -2085181, -2148951, -1492608, -968554, -884391, -685483, -142765, 194033, -18229, -357256, -375067, -195958, -124734, -278999, -761735, -1526510, -1946460, -1311529, 10822, 763123, 526487, 370356, 1156127, 2044786, 1673623, 286423, -478759, 166666, 1242214, 1567725, 1255200, 1039981, 882950, 172362, -944239, -1397416, -603099, 630050, 1017531, 231048, -996442, -1893122, -2268575, -2250436, -1968340, -1626726, -1486096, -1559111, -1570853, -1381024, -1222469]
11583a222469j29573l07086j45966K04828N22972P14970O58001J98690n11480
11574a7113r60012q03035k81805J26021L10854M69698N49528K29691m10888o91081
11564a478142j64885O79076J023986P67676M03207J02357l25436o65446m14064
11555g1671K15667L70412q0220k62616K10536N67656K83755k3891R6479l666o44292
11544F58149q17742l6425K45252j004746j937564l39437K259743K176431p66643
11535D37018k537770p37280J995247K088180m2550j389162q09625L04236P13506
11526B1800M60630j61139r22608j160190l74331Q17167J354232J080803N71995
11517A688359Q4505m32062p21245m86308M0999M08818M34800M3943o88842j050380
$$ y = [-1222469, -1352042, -1659128, -1805094, -1600266, -1077294, -362324, 295677, 494367, -17113, -977125, -1780160, -2061965, -1935944, -1625090, -1155392, -605864, -376173, -787061, -1478142, -1643027, -963951, 60035, 827711, 1230918, 1333275, 1007839, 342393, -71671, 143996, 514408, 434188, 171572, 382108, 949764, 1233519, 1209628, 1306107, 1302441, 658149, -159593, -196018, 49234, -955512, -2893076, -3232513, -972770, 1203661, 437018, -2100752, -2838032, -842785, 1245395, 1202845, -186317, -995942, -691706, 21800, 482430, 321291, -601317, -1761507, -2135838, -1318671, 35561, 1116364, 1688359, 1772864, 1340802, 619557, 133249, 174248, 583066, 1017866, 1061809, 372967, -677413]
11507f77413k77922R60275R88969l36255j064304j22657Q20644J0226j392209
11498a090646j031383Q94981J900664Q67943o99854j176683o96662j31315K76462
11489h86493O03111O34238K30899k87601n46291n33300m33245l29412j59312J53341
11479a554065M72298M44899L4467j70443K04132M81212p3125p38024k70359P99604
11469c69404P09116m91589p03566O76433J436694J50887j294007p50524P00043
11460F4083P50150l03797m70379L42237M68010m03523r24419o11694k55976k911
11450a348219O65982J179288M23722r60209j143616j10625K37746o72896j111010
11441b839837k8616J171920R72481L7327j46170L96034N16371j18204o95524n71129
$$ y = [-677413, -955335, 4940, 993909, 657654, -406650, -529307, 291337, 301563, -1090646, -2122029, -1227048, 673616, 1541559, 841705, -334978, -1031640, -1162955, -886493, -283382, 350856, 581755, 294154, -252137, -785437, -1218682, -1548094, -1707406, -1554065, -1081767, -636868, -602401, -772844, -568712, -87500, -160625, -898649, -1169008, -369404, 339712, -151877, -855443, -179010, 1257684, 1408571, 114564, -635960, 64083, 814233, 510436, 40057, 382294, 850304, 446781, -477638, -1089332, -1345308, -1348219, -682237, 497051, 920773, -39436, -1183052, -1293677, -1055931, -1728827, -2839837, -2868453, -1696533, -724052, -686725, -832895, -436861, 79510, -38694, -734218, -1305347]
11431a305347p5213L9930l83373o51004j80422M73357L30416k61995P8302J262111
11421f73238J290108n06585j709853k99126J796459J366098j008638j810617j35238
11412a690630J130686K03432r23473j53230J208630P80281r85757j610572l71764
11403b412397Q93543O39011m15208o29073K02942O62390k01004j339182j054580
11394c653558L97684R34311k02998j047187J43257K047542K239681Q36406o9716
11385A625422O8742j73707j209699j549330m05744R30350J111596M86544O3347
11376I47521J9692p7165m87532j086104j260548k76724J396107J860975K41817
11367A278039j542543j279336J97010N14182k30338K1953J157155P97195j232878
$$ y = [-1305347, -1380560, -1340630, -1724003, -2375007, -2555429, -2082072, -1751656, -2013651, -1935349, -673238, 616870, 110285, -1599568, -1898694, -102235, 1263863, 255225, -1555392, -1690630, -559944, -356512, -1279985, -1433215, -224585, 555696, -430061, -2040633, -2412397, -1518854, -879843, -1295051, -1924124, -1721182, -1058792, -1259796, -2598978, -3653558, -3255874, -2321563, -2524561, -3571748, -3428491, -1380949, 858732, 1695138, 1625422, 1694164, 1520457, 310758, -1238572, -1644316, -713966, 397630, 884174, 947521, 967213, 890048, 402516, -683588, -1944136, -2220860, -824753, 1036222, 1278039, -264504, -1543840, -1346830, -832648, -1062986, -1041033, 116122, 913317, -319561]
11358c19561j966255m7737J919070J547332J72713k7847K47790o85903j928531
11349a088929j329133P52919J832601R53291l83448p48686l08672J62301K42233
11340H4477k01854q82906j004200k24064N97055M84074k55451o04661k98203K20650
11330b085083P56402J232231J084391m9127j288901j299544r8223Q88673O86036
11321a73145j32113m50941p7053K50064K7624l34918j99734K65876L23963n3840
11311e54217R372P59627J038984Q60j245833j084924Q1113M07859n06849j110213
11301b204221m43936N37336P10285L20301J05626J57992K99949M94299L93405
11292C71036l82624j155652p19988O00272R66819k18195j205302n69694N94462
$$ y = [-319561, -2285816, -2333553, -414483, 1132849, 1305562, 1277715, 1525505, 839602, -1088929, -2418062, -1665143, 167458, 1120749, 737301, -11385, -320057, -157756, 84477, -117377, -1000283, -2004483, -2228547, -1631492, -1147418, -1402869, -2007530, -2305733, -2085083, -1328681, -96450, 987941, 938814, -350087, -1649631, -1747854, -859181, -173145, -305258, -756199, -833252, -583188, -555564, -890482, -1090216, -824340, -500377, -554217, -544845, 214782, 1253766, 1254626, 8793, -1076131, -995018, -587159, -1094008, -2204221, -2648157, -2110821, -1400536, -1080235, -974609, -816617, -516668, -22369, 371036, -11588, -1167240, -1887228, -1286956, -320137, -538332, -1743634, -2313328, -1718866]
11283a718866N89084j02616K10515J426563J629451P7722j507370j275677K57887
11274d13307J005484J34568r49429p24889K45718K80121o47506p24612O53842
11265a140010J470378R8533j794390j466997P12269J796939O87687n95880m09022
11256f40493K94898J82394k27731M6134M93549J17808p00503q05790p9011N37569
11246g81176M32457j37590o36959p74469o07106m02215k45514J04798O44651Q04303
11236a598820L14595j31752O9370L38069o8731o43923n54154k19755l83137m00288
11226c278526N93860J562745R41661m39069m77635N07692K80654j096191j017363
11217b422172R95953J978984L54163j302499m77092J251996J095799l62116n24104
$$ y = [-1718866, -1129782, -1232398, -1021883, 404680, 2034131, 2111853, 604483, -671194, -413307, 592177, 726745, -222684, -947573, -701855, -421734, -1069240, -1793852, -1140010, 330368, 428901, -1365489, -2832486, -2120217, -323278, 364409, -231471, -640493, -345595, -163201, -390932, -344798, 148751, 266559, -433944, -1239734, -1318745, -781176, -348719, -486309, -1123268, -1897737, -2504843, -2907058, -3152572, -3047774, -2403123, -1598820, -1284225, -1415977, -1346607, -1008538, -1077269, -1721192, -2275346, -2495101, -2878238, -3278526, -2684666, -1121921, -180260, -619329, -1096964, -589272, -308618, -1404809, -2422172, -1426219, 552765, 906928, -395571, -872663, 379333, 1475132, 1113016, 588912]
11208E88912P86117J314615J30927j276718j531651q83974j00405N17051P82668
11199C27542M83069j61613n66972l92403J95765O41551L36304o30651j165462
11190i32870m55517O38639O68912j24357k02041O42032R38805J20505n87617m59706
11180B46785m44952j175075j661156j014130J52182R60840J361898J247103K10256
11171a16249j052224r77108M00035J177911O19717K38047Q34708R25601m04608
11162A645830j490133p98883M79200N88459K4276N7561J98058n79822j520275
11153a395729j275661k85067J04783j07766n7054K72439M84759Q17235J196417
11144b45644N93011j064612j876008o92362P63386N46541m02826j70142O98314
$$ y = [588912, 1375029, 2689644, 2820571, 1543853, 12202, -871772, -972177, -455126, 327542, 810611, 648998, 82026, -310377, -114612, 526939, 863243, 232592, -932870, -1388387, -749748, -80836, -205193, -407234, 234798, 1173603, 1294108, 706491, 246785, -198167, -1373242, -3034398, -4048528, -3896346, -2935506, -1573608, -326505, -116249, -1168473, -2145581, -1745546, -567635, 52082, 290129, 1124837, 2050438, 1645830, 155697, -643186, -163986, 424473, 448749, 506310, 704368, 124546, -1395729, -2671390, -2956457, -2851674, -2959440, -3016494, -2744055, -2259296, -1442061, -245644, 347367, -717245, -2593253, -3285615, -2522229, -1975688, -2378514, -2548656, -1850342]
11135a850342M24358n78625m78946N74683P80188l6762l18020K32465K98018l37230
11125a290213l49794N15131Q23694l795o95511l64210J71628Q8633r0467K66430
11115i28474O80935M97318m922k60978l74537o62348q51007m71910K54325N77141
11105a544457K48723q6809J96962P17911O06836n058O806P99327Q33301p57133
11095A016409k269802j692271J05442P16240O1748J51961J228504J318260J3581
11086F50072n98044K78234O72875m65380j289544n11483K33910m02215q57247
11077b288822K64054J226516J50281j424992j057620N11984R66686M03657M73084
11068g75172R13611K58473r62843r03878L23868Q96899L13687l40432o01075p59874
$$ y = [-1850342, -1425984, -2004609, -2483555, -1908872, -1128684, -1165446, -1483466, -1251001, -952983, -1290213, -1640007, -1124876, -301182, -304977, -1000488, -1364698, -1193070, -1104437, -1194904, -928474, -247539, 249779, 244857, -16121, -390658, -1053006, -1904013, -2375923, -2121598, -1544457, -1295734, -1382543, -1185581, -467670, 139166, 134108, 140914, 940241, 1773542, 1016409, -1253393, -2945664, -2840222, -2123982, -2062234, -1910273, -681769, 636491, 650072, 52028, 330262, 1003137, 537757, -751787, -1263270, -1029360, -1431575, -2288822, -2024768, -798252, -647971, -2072963, -3130583, -2618599, -1651913, -1248256, -775172, 138439, 396912, -565931, -1469809, -1145941, -249042, 64645, -275787, -876862, -1636736]
11058a636736m89506M10873P60458k47311j106267k47842J014748N83770o19657
11049a577470k09611J253510J076711p10120j148570O36236J872865O50491j159909
11040F84133j050102M64215J081176O0033j237637j370789l46105N90775L71957
11031g52344n52763p04969K84662J016541N08972k59588j43137K48041n3009m36828
11021h44422j8533M29026j02664p09873r5897Q69016N53414m24296k35856Q17296
11011B37211P98514l90562q35056N6021O55382o5660j071658j132840l55873N73382
11001a531139J190438J064787J00358r03336j038708m33115K52503Q06244J012583
10992E20615K70052j124436j517723j73958J250396J075751Q0630j27369K21304
$$ y = [-1636736, -2126242, -1715369, -954911, -1202222, -2308489, -2556331, -1541583, -957813, -1577470, -1787081, -533571, 543140, -166980, -1315550, -679314, 1193551, 1844042, 684133, -365969, 98246, 1179422, 1239455, 1818, -1368971, -1715076, -1124301, -752344, -1305107, -2010076, -1725414, -708873, -199901, -459489, -602626, -354585, -407594, -844422, -862955, -433929, -536593, -1246466, -1342363, -473347, 80067, -344229, -580085, 237211, 1035725, 645163, -189893, -133872, 521510, 455850, -615808, -1748648, -2104521, -1531139, -340701, 724086, 824444, -78892, -1117600, -1550715, -1298212, -491968, 520615, 790667, -333769, -1851492, -2025450, -775054, 300697, 381327, 253958, 475262]
10983D75262o133o02211p51919o95444p14046J1274J510369J837404R9789j356961
10973a92616n07450P63898j28356j783426j216338P84576J065471k76846k86024
10964a777111J351984J799911J92755j054482o20535j3182j80938n5057O11739
10955B55084L43611j061138j668695o21470M84101L99410n0380R6119M80538O11086
10945g31734N82299K57047m74336p16496K22728J089770L42856j076030j089641
10936a593537J16536P56876P07159J084181J342147J30357j544159j502523k53887
10927g56850p2711p41106j44038J259712Q78148j063832j472530K53511J239553
10918f20143K88775l80152L50643N73245n86188j077270J66763J176896N91482
$$ y = [475262, 469129, -133082, -885001, -1580445, -2294491, -2283217, -772848, 1064556, 1164345, -192616, -700066, 63832, -64524, -1847950, -3064288, -2279712, -1214241, -1491087, -1777111, -425127, 1374784, 1567539, 513057, -107478, -120660, -301598, -356655, 255084, 598695, -462443, -2131138, -2752608, -2268507, -1869097, -1919477, -1823358, -1342820, -731734, -149435, 107612, -366724, -1083220, -860492, 229278, 572134, -503896, -1593537, -1477001, -720125, -12966, 1071215, 2413362, 2543719, 999560, -502963, -756850, -829561, -1570667, -1714705, -454993, 423155, -640677, -2113207, -1859696, -620143, -331368, -711520, -360877, 212368, -373820, -1451090, -1284327, -107431, 484051]
10909D84051j36133J00036Q5984p77850q96637L44927J023202J13005o38344r9295
10899c97054J37509r68181j597500k92796J280969J115789j3999m10737k48338
10890a394338m27038o11055l05548j01793k75563L3355R22895J014313j00770
10881a245542q14011j76073N33058J88516l90556l21211j71443l20517M9113J034242
10871a634424J177762j53464j492526j511308o91586J03981P81254J051014M03828
10862a965469l98632j0478R85672P37252n19340o72769M32269O89925k64372l70540
10852a356482P51289Q48959o67717j420134n04882j92759j352166j347077J069539
10843d171430K797759J347829q57584n62569J044982Q51179q48834j344358j45175
$$ y = [484051, 347918, 447954, 533938, -243912, -1140549, -795622, 227580, 340585, -297759, -397054, -259545, -1227726, -2825226, -3118022, -1837053, -721264, -735263, -1146000, -1394338, -1821376, -2432431, -2737979, -2839772, -3115335, -3081980, -2159085, -1144772, -1245542, -2059553, -2235626, -1702568, -1514052, -1904608, -2225819, -2397262, -2717779, -2668666, -1634424, -456662, -610126, -2102652, -3613960, -4305546, -4201565, -3420311, -2369297, -1965469, -2364101, -2374579, -1388907, -651655, -1170995, -1843764, -1411495, -721570, -985942, -1356482, -605193, 243766, -423951, -1844085, -2348967, -2541726, -3893892, -5240969, -4171430, -1373671, -25842, -883426, -1445995, -401013, 450166, -398668, -1743026, -1888201]
10834a888201Q79184Q49437L76416l27345j231270j284383K02632J768232J522500
10825H67202l2950q00136j19909O48041K19586j161797k142396j559316K58724
10816c822951J503545J015787o0439r1811L87551q4427q49620j66486J222191
10807i46660R02786r06835j456437j42705O53527k2054l53871K85171P1555j279002
10797c194525j310357O73350J803112L70857j293436q71924M43067P95993P67962
10788a815901J250941J242439J41728n43953j2834O4113j276951k138485r84678
10779d073581O67486R50784M65817L42821O0199p78514r81854L05P70176N12350
10769b064011L13324O10867J88153r63225r37639N08196J020978k23829j011653
$$ y = [-1888201, -1009017, -159580, 216836, -110509, -1341779, -2626162, -2423530, -655298, 867202, 834252, 34116, -85793, 562248, 781834, -379963, -2522359, -4081675, -3822951, -2319406, -1303619, -1364058, -1455869, -1068318, -1152745, -2002365, -2168851, -946660, -43874, -950709, -2407146, -2549851, -1896324, -1918378, -2272249, -1987078, -1915523, -3194525, -4504882, -3831532, -2028420, -1657563, -2950999, -3822923, -3379856, -2583863, -1815901, -564960, 677479, 819207, 275254, 262420, 326533, -950418, -3088903, -4073581, -3406095, -2455311, -1989494, -1646673, -1586474, -2364988, -3346842, -3346537, -2576361, -2064011, -1750687, -1139820, -951667, -1914892, -2852531, -2344335, -1323357, -1547186, -2558839]
10760b558839k51168J83317n05821k87038J336250J523603q05053k352447q46661
10751d563857J099047P50682j91723N85479J477814K84899j274710n86045J071721
10742a346693Q63706p37355j264799n14182k222J20507N27676O95720O8231m01371
10732a990782k6138K11397j90857p5991P64131O44467o67306q94958O28075J334901
10722b63061n8752j231573o91994m34429j561256j563034Q84217K626737J131282
10713a161863j045522o93158Q00271N83592o18450o08096J11617O7824k7688O72804
10703a918669P33735p03114j560377l94788P97341L04900j94386P13772J119877
10694a101709l57271j429085k68449R98790L94166k29515Q22230J462100k1285
$$ y = [-2558839, -2810007, -2626690, -3132511, -3419549, -2083299, -559696, -1364749, -3717196, -4563857, -3464810, -2714128, -2905851, -2320372, -842558, -557659, -1832369, -2418414, -1346693, -482987, -1220342, -2485141, -2999323, -3001545, -2881038, -2353362, -1657642, -1589411, -1990782, -2016920, -1805523, -1996380, -2072371, -1308240, -663773, -1331079, -2226037, -1597962, -263061, -321813, -1553386, -2245380, -2679809, -4241065, -5804099, -4919882, -2293145, -1161863, -2207385, -2900543, -2100272, -1516680, -2135130, -2743226, -2631609, -2563785, -2591473, -1918669, -1184934, -1888048, -3448425, -3843213, -3045872, -2740972, -2935358, -2221586, -1101709, -1458980, -2888065, -3156514, -2157724, -1763558, -1993073, -1170843, 291257, 269972]
10685B69972j249841j52934R78640j20340j357455m98711M66827n03976j237146
10676c404964K30566J272103m59591k057006l90420J977120J286591q11662o44440
10667c001703R64552J001218q1704k00235p3952r55904j113485P46072J943998
10658g71143L32859j340988k52653J230171j405j979407j342094Q66662J865429
10649a392569J824511J533391k64880k953851k557715J307500K785195q83801
10641f02219l791837j032232K808278J796571j295741r96106R06844m2335j850496
10632d099273m13706J838841M77079k163419j414572Q54784L94791q68963P89002
10623d605436K545321K03678k808359j119880K342839J655914r60891K42796K906041
$$ y = [269972, -979869, -1132803, -154163, -274503, -1631958, -2130669, -1663842, -2167818, -3404964, -3174398, -1902295, -2361886, -4418892, -4809312, -2832192, -1545601, -2357263, -3001703, -2037151, -1035933, -1117637, -1317872, -1391824, -2347728, -3461213, -2715141, -771143, -438284, -1779272, -2031925, -801754, -803159, -2782566, -4124660, -3257998, -1392569, 431942, 1965333, 1700453, -1253398, -3811113, -2503613, 281582, -602219, -4394056, -5426288, -2618010, -821439, -2117180, -3113286, -2206442, -2248777, -4099273, -4512979, -2674138, -2197059, -4360478, -5775050, -4920266, -4525475, -5394438, -4605436, -2060115, -1856437, -4664796, -5784676, -3441837, -1785923, -2746814, -2504018, 402023]
10614D02023O85026m290981m509597k05683J753063J97348j3475J588060J007630
10605c386586j055388k34926K366335J827914j038589j280305N96957Q6609k023107
10596d141086j347654R84379M73035j565014n44942J970395J157886j329931n20495
10587d863427J772773L49400k779988j901147J244863Q02743j740871p64366J983127
10578e896893Q10774k195668j010131K097704P72601k421784n12348L732523K212184
10569b411038k974103l032061J143327J201548k332117j582929K582311J972250
10561e432812k600407k488203K058906K433703j589660j842205J878278J716545
10553e865855k216459k081912J713679J276765k544781j556817K882150J810971
$$ y = [402023, 1087049, -3203932, -7713529, -7919212, -6166149, -5968801, -5982276, -4394216, -3386586, -4441974, -4676900, -2310565, -482651, -1521240, -2801545, -2204588, -2117979, -4141086, -5488740, -4504361, -4031326, -5596340, -6141282, -4170887, -3013001, -4342932, -4863427, -3090654, -2741254, -5521242, -7422389, -6177526, -5374783, -7115654, -7880020, -5896893, -5086119, -7281787, -8291918, -6194214, -5421613, -7843397, -8355745, -4623222, -2411038, -5385141, -8417202, -7273875, -6072327, -8404444, -9987373, -7405062, -5432812, -8033219, -10521422, -8462516, -6028813, -7618473, -9460678, -7582400, -5865855, -8082314, -10164226, -8450547, -7173782, -9718563, -11275380, -8393230, -6582259]
10545f582259l314179k685029K621956K365411k697047k109791L392185K872171
10537f136582l174817l459715J835325J469977m011886k852306M009391L565265
10529h755348l769710m131670L013128L831237k533892k469679M277003L386724
10521g152207m972722n180883K954431L042906n174517m515882M836794M013272
10513a2148808o863104o784775N144316O358567n309027o730668M292030L663799
10505a8377670r514933q053284Q147737O948378j2737973j3438952Q083110Q832161
10497c0111426j7011353j9834686R168946J1070453k7555012l4300804J1011146
10490i7562736R768766q1762043j21808380K3188770K30761728K51961843O2854480
$$ y = [-6582259, -9896438, -12581467, -9959511, -7594100, -10291147, -12400938, -9008753, -6136582, -9311399, -12771114, -10935789, -9465812, -13477698, -16330004, -12320613, -8755348, -12525058, -16656728, -13643600, -9812363, -12346255, -14815934, -10538931, -7152207, -12124929, -17305812, -14351381, -11308475, -16482992, -20998874, -16162080, -12148808, -19011912, -25796687, -20652371, -14293804, -19602831, -26333499, -22041469, -18377670, -27892603, -35945887, -27798150, -20849772, -33587745, -47026697, -38943587, -30111426, -47122779, -66957465, -57788519, -46718066, -74273078, -108573882, -97562736, -87793970, -169556013, -291364393, -268175623, -37413895, 214547948, 277402428]
10483B77402428j02389703q7218941L515248J5473009l0471700l1847410P337869
10476E1800800J2791551j5273894j7959194O362976R238027j1198935j3075610
10469B2685721N984398Q950413p339381j0060304M434551O923663o301435q746422
10461A6531204L548934O592820l804601o317083K610440L557577n903741o798301
10453A0017249L198961N364462l456545n583757K764673N228871k305806m911233
10445A0316875J450875L178681l145550m463930K359696M517167j458966l624965
10437I129883J371084K401154l209430m167774K270013M546630j103235l991338
10429G246987K01899K170996j980339l734073K95991K102500j093379j463256
$$ y = [277402428, 175012725, 87793784, 91309032, 106782041, 76310341, 44462931, 51800800, 64592351, 49318457, 31359263, 37722239, 46960266, 35761331, 22685721, 28670119, 37620532, 30281151, 20220847, 24655398, 31579061, 25277626, 16531204, 20080138, 26672958, 22868357, 16551274, 19161714, 22719291, 16815550, 10017249, 13216210, 18580672, 15124127, 9540370, 12305043, 17533914, 15228108, 10316875, 11767750, 14946431, 11800881, 7336951, 9696647, 14213814, 12754848, 9129883, 10500967, 12902121, 9692691, 5524917, 7794930, 12341560, 11238325, 7246987, 7448886, 9619882, 7639543, 3905470, 4201461, 6303961, 5210582, 3747326]
10421C747326L068594M026967j020141l439298m043J547032j773604k641098J415701
10412D927436K645621j756417l853445N9788K739787k8814k106983N38198K635980
10403E801151O24913r06833P81429J290217j227798j848871J034365J935775j087055
10394F397293k409824L78430J955092l24181j582572P90101K227282O5892j676108
10385E821405n22276K78881p62610m27373J640656J211262j882094k285987J026975
10376D098839K511943K21447j034838O72513J039921j328899j893804O29209J401881
10367F318212j037851j749003Q46398J570024j524048l055205j87210K336895
10359C518212J140865l83389L11956L15376j666162j838288R70533K130707k85608
$$ y = [3747326, 6815920, 10842887, 9822746, 6383448, 6379405, 7926437, 6152833, 3511735, 4927436, 7573057, 5816640, 1963195, 2022983, 4762770, 4733956, 2626973, 3165171, 5801151, 6426064, 5519231, 6300660, 7590877, 6363079, 4514208, 5548573, 7484348, 6397293, 3987469, 4365899, 6320991, 5996810, 4414238, 5204339, 7431621, 7497513, 5821405, 5299129, 5578010, 4815400, 4388027, 6028683, 7239945, 5357851, 3071864, 4098839, 6610782, 6832229, 5797391, 6469904, 7509825, 6180926, 4287122, 4916331, 6318212, 5280361, 3531358, 4377756, 5947780, 4423732, 1368527, 1181317, 3518212, 4659077, 4275688, 4587644, 4903020, 3236858, 1398570, 2369103, 4499810, 4214202]
10350D214202j771279M829R83877q98530j394416J590298L331242Q35384j691654
10341E203953p57434N31720o37345j361913M85839J460514o35580j977215R2283
10332B404822J762195j22287k108868o80663J402502P21314o43695J00036J030709
10323C866065M3284n65323R29561J471102r92232k834700r90066J359941N74254
10314B861886j065076j99590J232817J62386j453648l97669J664928J334857n51401
10305C589490j203635r76567j415658j320978O16215K200600J138097p76309q91724
10296I59531j46379m12056n58340Q33000J893785O51454j068774p97071L20460
10287A675610J58519l14482O05375J605017P63868o67036m91510N86559O08409
$$ y = [4214202, 2442923, 2447752, 3431629, 2533099, 1138683, 2728981, 6060223, 6895607, 5203953, 4446519, 4978239, 4340894, 2978981, 3464820, 4925334, 4289754, 2312539, 2404822, 4167017, 4044730, 1935862, 1255199, 2657701, 3379015, 2735320, 2835356, 3866065, 3909349, 3344026, 4273587, 5744689, 4752457, 1917757, 927691, 2287632, 2861886, 1796810, 1597220, 2830037, 2992423, 1538775, 1141106, 2806034, 4140891, 3589490, 2385855, 1409288, -6370, -1327348, -711133, 1489467, 2627564, 1851255, 959531, 813152, 401096, -157244, 675756, 2569541, 3220995, 2152221, 1355150, 1675610, 1834129, 1519647, 2125022, 3730039, 4493907, 3826871, 3335361, 3921920, 4530329]
10278D530329k21758o59319q43896j070530m44404R73279J252788p8579p06460
10269B731450M30555J054476k78687j433180o21970M41847J1065n25446K81494
10260B091604J040037M55831j11789L17310J43081j353397j890890k64178J077170
10251A504779L54524l36808Q67818K040062J193394p7474J2672J5772j390770
10242D183969k202542p94819O28597q7093j101587j98566R96771K73324q96612
10233H01442l24126O62907j1233r75202n7078J442953J153770l4602N1735P36699
10223C447265J32870j051535r17158J82487P31792P42882O64797j73556j530134
10214B229710j329075P09651J613093K38j148501L66771J891995O64483j177667
$$ y = [4530329, 4308571, 3649252, 2805356, 1734826, 1290422, 2263701, 3516489, 3437910, 2731450, 3162005, 4216481, 3937794, 2504614, 1882644, 2324491, 2335556, 1810110, 2091604, 3131641, 3587472, 3475683, 3792993, 3936074, 2582677, 691787, 427609, 1504779, 1859303, 1522495, 2390313, 4430375, 5623769, 5546295, 5558967, 5574739, 4183969, 1981427, 1186608, 1815205, 1728112, 626525, 427959, 1424730, 1698054, 801442, 477316, 1140223, 1128990, 153788, 96710, 1539663, 2693433, 2658831, 2710566, 3447265, 3580135, 2528600, 1611442, 1793929, 2525721, 3268603, 3933400, 3759844, 2229710, 900635, 1610286, 3223379, 3223617, 2075116, 2441887, 4333882, 4998365, 3820698]
10205C820698n66839J035440P21675n20520k99265K92423q29318k057610r21019
10196F75665Q68873K93447j315873p31727J093406Q39650r28772q52705J000634
10187I42598J403933j80018j061623k92019M31359N12736Q72652J053240o8203
10178C614655j296630p71995L00454l63189j545903m56656J763979J447979j174607
10169A518087k104040k61057R96706k06881j525379q31696O70304J258022J213601
10160G27667J133152N84689l35254n32508J08102M03038J1803j51832J46863J42690
10150B238410k87320n43465n95161n76630J53206J589969J900395N0696j711953
10141B218147q50087J279138J477971j66541q42046L6217K95460p31532j160479
$$ y = [3820698, 3253859, 4289299, 5010974, 4490454, 4191189, 4483612, 3654294, 1596684, 675665, 1544538, 1837985, 522112, -209615, 883791, 1723441, 794669, -58036, 942598, 2346531, 2166513, 1104890, 812871, 1244230, 1756966, 2629618, 3682858, 3614655, 2318025, 1546030, 1846484, 1483295, -62608, -519264, 1244715, 2692694, 1518087, -585953, -847010, 149696, -57185, -1582564, -2414260, -1743956, -485934, 727667, 1860819, 2445508, 2110254, 1577746, 1685848, 2088886, 2100689, 1948857, 2095720, 2238410, 1951090, 1407625, 812464, 235834, 389040, 1979009, 3879404, 3930100, 2218147, 1368060, 2647198, 4125169, 3958628, 3116582, 3152799, 3448259, 2716727, 1556248]
10132A556248j23876R14076R40080O65082N75569J94364m42393p41542r08463
10123B629145j336234j205288J35945J292482P75803k52354P6399Q94020K35225
10114C245143j113335r58979J38730r4020j252451r92127L69831L13685r77074
10105a320597o40455J587752K534900Q69517q90504p70095L1715J35569J04286
10096A642088K68048l37365j553276j586496q9892J047793R47289R12314J486906
10087B737409J336705O7529p86822o29460p62228j504439j342724l0835N23461
10078c91404k87647m93336Q33589J677531N21689j064564j144670k87146J21973
10069e13985K31432N80216N72456j73028o51083j39710N22495N18784L07436L16224
$$ y = [1556248, 1432372, 2346448, 3286528, 3951610, 4527179, 4721543, 4279150, 3537608, 2629145, 1292911, 87623, 223568, 1516050, 2291853, 2039499, 2115898, 3009918, 3245143, 2131808, 1172829, 1311559, 1217539, -34912, -1027039, -657208, -343523, -1320597, -1961052, -373300, 2161600, 3031117, 2140613, 1370518, 1402233, 1537802, 1642088, 1910136, 1572771, 19495, -1567001, -1656893, -609100, 338189, 1250503, 2737409, 4074114, 4141643, 3354821, 2725361, 1963133, 458694, -884030, -914865, -391404, -679051, -1172387, -338798, 1338733, 1860422, 795858, -348812, -635958, -513985, -282553, 297663, 870119, 697091, 46008, -93702, 428793, 947577, 1255013, 1571237]
10059A571237J10810k72547k0699O37630L26651r47129j332291j51893Q24463
10050G46232K32224q93680j140801p01367j80809N81109J339202J036736k65172
10041G53674r02884j45697O00404J39450p81534j056734p55638k01068P05172
10032a644855J482563J201524K04408j66107J14645j50594q04030m34050O89416
10023D92920P04119l89249n49229M37485M22364r00088j081696M78288J033965
10014F48879n93350j654286l30069J053403M62438j04548J323623K523162Q95678
10005D224930j613842j635557P9193N10235k87214n0897J036485Q93748k90350
9996B866731m91596K58550J60234p63349q87942k73642l52067q40412k78236Q37526
$$ y = [1571237, 1682047, 1409500, 1388801, 2026431, 2353082, 1405953, 73662, -78231, 746232, 978456, 84776, -1056025, -1757392, -1938201, -1357092, -17890, 1018846, 753674, -149210, -294907, 305497, 444947, -336587, -1393321, -2148959, -2350027, -1644855, -162292, 1039232, 1243640, 1077533, 1192178, 1041584, 237554, -196496, 492920, 1197039, 807790, 258561, 696046, 1118410, 218322, -863374, -385086, 648879, 55529, -1598757, -1928826, -875423, -412985, -517533, 806090, 3329252, 4224930, 2611088, 975531, 1054724, 1564959, 1277745, 1226848, 2263333, 3157081, 2866731, 2375135, 2633685, 2793919, 2030570, 1142628, 868986, 516919, -323493, -601729, 235797]
9986B35797P54135j41051L5956R86175O43425q60955j158712K02700R48102k5110
9976A620462j025806o20392L99927Q87960Q05933J80827j179648k353815j795700
9967c080252K65048J767256J567302N45414j90843m69204l32619J67169M39239
9958F78510Q6752j36101M59022J013208M77635m94485q14833r03757j328843j040458
9948b003350N45768J431089L1398j466179l53248J666213J064502j308586j475123
9939a867516R04580K144437Q88413k51182J13286K65743m85714n24143K91989
9930A479893P6487j020051p06602Q48999J045303p8275N6051J066620M1539k119183
9920F90781j407066J482869J432821j744644k431817M09453J082622j779831k025690
$$ y = [235797, 989932, 848881, 884837, 1871012, 2514437, 1653482, 494770, 697470, 1645572, 1620462, 594656, -25736, 374191, 1262151, 2068084, 2248911, 1069263, -1284552, -3080252, -2815204, -1047948, 519354, 1064768, 873925, 404721, 72102, 239271, 678510, 765262, 629161, 1088183, 2101391, 2579026, 2084541, 1269708, 365951, -962892, -2003350, -1457582, -26493, 4905, -1461274, -1814522, -148309, 916193, -392393, -1867516, -962936, 1181501, 2069914, 1818732, 1932018, 2197761, 1712047, 1187904, 1479893, 1556380, 536329, -170273, 678726, 1724029, 1645754, 1701805, 2768425, 2809964, 690781, -716285, 766584, 2199405, 454761, -1977056, -1567603, -484981, -2264812, -4290502]
9911d290502K021698L177936j321079l548046P28364L359133j091082m139955
9903e103533P62710M295930j404979m934668M173063R524814r910604l7710949
9895d0308216l3510069P229959M0028281L1283902J972350q688982J688298O980713
9887F676236j110555o252504p29592L611341m87156m235782j011354K646943R78168
9878H5745j114570Q81313K577062J70267j999376r9545J924649J59517k024313
9869E60749p62594J182275K29323j195842K50418K182246R77465j454696j233369
9860G35975P21858R62991l23586n27852K90110J62224o96894o32778O9282L8251
9850G99581l03473K42981J068147Q49904m0902m66151m62923l99888J36065R25946
$$ y = [-4290502, -2268804, 909132, -411947, -3959993, -3231629, 127504, -963578, -5103533, -4340823, -44893, -1449872, -6384540, -2211477, 7313337, -2597267, -40308216, -73818285, -66588326, -26560045, 4723857, 6696207, -1992775, -304477, 6676236, 5565681, -686823, -1416415, 2194926, 1707770, -2528012, -3539366, -892423, 85745, -1028825, -147512, 2429550, 2599817, 600441, 500896, 2425545, 2585062, 560749, -201845, 980430, 1209753, 13911, 264329, 2446575, 3424040, 1969344, 735975, 1457833, 2420824, 2097238, 1569386, 1859496, 2021720, 1324826, 692048, 761330, 799581, 496108, 739089, 1807236, 2657140, 2616238, 2150087, 1687164, 1287276, 1423341, 2349287]
9840B349287N64825j006938j627592l10266Q81541K36009q60127o66043k725j02417
9830e44446p5177R25436J407236J35982j195906p14925L14627j34870j107967
9821i90010m47784J281658J852022J114050O18142M92328l30168j476004j490252
9812F23982l93733M61851O49445P62248Q45068N63783K46022J48806l47975j312111
9802B247386j367674P3565J223519N00848q60538r00192n0487J30690j94547l5728
9792G66842J32329m67267q35468Q1253R76573K70953p91606j76928J137746P84222
9782A878649o47507n86914Q15257Q42222r65563j920428o46995R66234J108431
9773H43386L74956j59644n66696q39159l67962N36634O91886J77961K93910R67891
$$ y = [2349287, 2914112, 1907174, 279582, -30684, 850857, 1086866, 226739, -439304, -442029, -544446, -619623, 305813, 1713049, 1849031, 653125, -61800, 252827, 117957, -990010, -1437794, -156136, 1695886, 2809936, 3428078, 3920406, 3590238, 2114234, 623982, 230249, 692100, 1341545, 2103793, 2948861, 3512644, 3758666, 3907472, 3559497, 2247386, 879712, 953277, 2176796, 2677644, 1817106, 916914, 866427, 997117, 802570, 766842, 899171, 431904, -403564, -322311, 654262, 925215, 133609, -43319, 1094427, 1878649, 1231142, 644228, 1459485, 2301707, 1336144, -584284, -1231279, -265045, 843386, 1218342, 1058698, 492002, -347157, -715119, -178485, 513401, 691362, 985272, 1953163]
9763A953163O08254q56098j322611J02142J448687R41873l45949m48324N04186
9754B585323Q73960L8465j090296j457551p98078L85226J188660J039476K91541
9745C056726l06295n75322p50188p73031n71584n05533n79697J1466J332188J719771
9735B058501Q5958j772291j388453N69680J302795K94919k15003O61131R79435
9726B576672m89675k007502j622436k1056R38770Q84380O47617O17940O58444
9717B183154O85783M36468l82957j166825q50851K56057N60542l28765q60817
9708E31789p0903Q62528O43572j53077l53986m5026J21219K05876K94398k34941
9698A801449j399033j779377n30367Q76806O29666o11625p86606K85242Q00520
$$ y = [1953163, 2561417, 1705319, 382708, 484850, 1933537, 2875410, 2529461, 2081137, 2585323, 3459283, 3497748, 2407452, 949901, 151823, 537049, 1725709, 2765185, 3056726, 2750431, 2175109, 1424921, 651890, 80306, -425227, -1004924, -993458, 338730, 2058501, 2144459, 372168, -1016285, -446605, 856190, 1151109, 936106, 1597237, 2576672, 2086997, 79495, -1542941, -1563997, -625227, 259153, 906770, 1524710, 2183154, 2868937, 3305405, 2922448, 1755623, 904772, 1160829, 1721371, 1392606, 531789, 460886, 1323414, 1966986, 1813909, 1459923, 1414897, 1536116, 1741992, 2036390, 1801449, 402416, -1376961, -1907328, -1030522, -400856, -1012481, -1799087, -1513845, -713325]
9689g13325M8158n05604K90601J459954J508847N83554r8331j59070k17473n16657
9679A680654n65985j97539M3897q6912k1432N12533O57708l13248j450585j167936
9669i08845L03507J017319J86281o32589m1815J008650Q63799j77401n22038R1031
9659A187899L97595j87311q08729p09257j52615L75152O97273N04622m65320j542488
9649g03179j481644q8882J358044J654379R23388P7690l03686k89833k81843n43465
9639C20969p62759k93434P67425J251173M24722o86568n66217N29459Q84830q6065
9629A783535r26638k72760J182310J599711K94199j528075k131820r87741P98848
9620a88431J655087J090613k0039o03247m28444M2536K83148j463o50364r61681
$$ y = [-713325, -665167, -1170771, -880170, 579784, 2088631, 2672185, 2573854, 2414784, 2197311, 1680654, 1114669, 917130, 961027, 874115, 852683, 1365216, 2022924, 1709676, 259091, -908845, -605338, 411981, 598262, -34327, -76142, 932508, 1796307, 1618906, 1096868, 1187899, 1585494, 1398183, 589454, -119803, -272418, 102734, 800007, 1304629, 839309, -703179, -2184823, -2273705, -915661, 738718, 1662106, 1739796, 1436110, 1146277, 864434, 320969, -441790, -735224, 32201, 1283374, 1708096, 1021528, 455311, 984770, 1869600, 1783535, 856897, 584137, 1766447, 3366158, 3660357, 2132282, 462, -987279, -188431, 1466656, 2557269, 2537230, 1933983, 1505539, 1548075, 1831223, 1829760, 1179396, 217715]
9610B17715m33999L72642N21483J88604L14513P61352L78836p95578j236328m90709
9600b01469o6356p32399j001399K23565J487603J142798P2646o5888L05851m0840
9590A124112m77453K30356J159929N35855j000305j261887j49123L94233k20768
9581C34949o28356k57187m2120k67798j61092K04439o6064o50298l18662O53237
9571a198952P77650J15763J81636R24192N88139r20488j374898J46841J619277
9562H59160J275983J25937j27196L24660L83058L3383r4695r919o0313k15810
9552B494248l66796n36897m88743k1795L58929J64175k278N21101Q67136p7052
9542B912028j317267r40756O49034J203848K62854l79754l580P5244o55471r27556
$$ y = [217715, -216284, 156358, 677841, 866445, 1180958, 1942310, 2321146, 1525568, 289240, -201469, -267825, -1000224, -2001623, -1778058, -290455, 852343, 924989, 859101, 1164952, 1124112, 646659, 877015, 2036944, 2572799, 1572494, 310607, 161484, 555717, 334949, -293407, -550594, -592714, -860512, -1021604, -817165, -883229, -1533527, -1852189, -1198952, -421302, -305539, -123903, 800289, 1388428, 467940, -906958, -760117, 859160, 2135143, 2261080, 2133884, 2458544, 2841602, 2874985, 2780290, 2770371, 2710058, 2494248, 2127452, 1590555, 1101812, 1080017, 1438946, 1603121, 1600843, 2121944, 2989080, 2912028, 1594761, 654005, 1303039, 2506887, 2769741, 2389987, 2386407, 2461651, 1806180, 878624]
9532H78624k91037O553m49598m73772J57221J23996n79248j61211J459896J749354
9522B420778k91746k043035j246217O27401J073791J90472n29561q32556r97854
9513a628527n07778N69124Q27787j9720j49174J045238J221909r29836k659094
9504b230071j160248J694692K142715K67775p98466j56641K94592o4873J51105
9495A40580R61375O03731r19886j224221M91099J781714P10665j155196j271887
9486A17974J27330P53704k43363j339813r93080M22877J338085R14811j91059
9477I07466p94001m93052J69805N85457O41441M66607J49368j83202m21565o17696
9467D10628o91168k38455P61635J406404Q88249k71671r72344j082800j078020
$$ y = [878624, 587587, 594140, 144542, -329230, -172009, -48013, -627261, -788472, 671424, 2420778, 2129032, 85997, -1160220, -532819, 540972, 731444, 201883, -630673, -1628527, -2136305, -1567181, -739394, -759114, -908288, 136950, 1358859, 429023, -2230071, -3390319, -1695627, 447088, 714863, -83603, -240244, 54348, -10525, 140580, 1101955, 1705686, 785800, -438421, 52678, 1834392, 2545057, 1389861, 117974, 245304, 999008, 755645, -584168, -1577248, -1154371, 183714, 1098525, 907466, 113465, -379587, -209782, 375675, 1017116, 1483723, 1633091, 1449889, 1028324, 410628, -280540, -518995, 242640, 1649044, 2537293, 2265622, 1293278, 210478, -867542]
9458h67542p02654M25143J358813Q85776k42799k55520O52073O72888k93603m51004
9448A181571M25259L89203r39670j214123N81349J926504O66094j488366j712208
9439a84387j96717Q95562Q61708M63004p9329q35319j057035k94871M36583K55935
9429B65134q1064K00416L23920l32629o83622K8073M27690o07453j512782m46295
9419b418612J406301J597662K40714o44918n82134o74359r56007m54094N28189
9410a957258P18626K11805K39879Q76161J070803O77903M50033L66138j06567
9401B547523n24995j77584K42099l20297j107713n78391Q38952J277169M69050
9392B665813j8154M39046P06679Q5687o50761q03669p00724p16093o48014l49801
$$ y = [-867542, -1570196, -1145053, 213760, 1099536, 856737, 601217, 1253290, 1926178, 1632575, 1181571, 1606830, 1996033, 1056363, -157760, 423589, 2350093, 3016187, 1527821, -184387, -381104, 514458, 1376166, 1839170, 1759841, 924522, -132513, -427384, 9199, 265134, 184070, 384486, 708406, 375777, -307845, -279772, 147918, -459535, -1972317, -2418612, -1012311, 585351, 826065, 181147, -400987, -1075346, -2031353, -2485447, -1957258, -1238632, -1026827, -786948, 89213, 1160016, 1837919, 2287952, 2654090, 2547523, 2022528, 1844944, 2087043, 1766746, 659033, 80642, 919594, 2196763, 2665813, 2647659, 3086705, 3793384, 3879071, 3228310, 2424641, 1723917, 1007824, 359810, 10009]
9382A0009J7525L74294N70537K13391n62164q36326k95871P5694k87249l70044
9372a090204N61938J325257P04795l45230k81654M69267N68287K17807L80211
9363B510474O08216m5871q92142p05238q7054l75382j080466q65368k01773m31358
9353a565962r83727l09548J060216J249039L28989O242M40710L17592k61269p869
9343B74413O74626K07620q76390m69125J172617J436974k52899j445528p80265
9334e7957J84989J98011J65588O21242L99777p78950j229720k57794M68680l4084
9324c20218k95184P11410J482463O73815m83511m75238q8790n70211j079111k70753
9314g15328J075645J280473M89372O3817J44647j61225p93210q13726j48485L18217
$$ y = [10009, 27534, 401828, 972365, 1185756, 623592, -212734, -508605, -432911, -720160, -1090204, -528266, 796991, 1501786, 1156556, 874902, 1344169, 1912456, 2130263, 2510474, 3118690, 3072819, 2180677, 1475439, 1388385, 1013003, -67463, -932831, -1134604, -1565962, -2549689, -2859237, -1799021, -549982, -220993, -214751, 225959, 543551, 282282, 274413, 949039, 1156659, 280269, -188856, 983761, 2420735, 2167836, 722308, -57957, 127032, 325043, 490631, 1111873, 1511650, 732700, -497020, -754814, -286134, -320218, -615402, 96008, 1578471, 2252286, 1768775, 1293537, 1204747, 634536, -444575, -715328, 360317, 1640790, 2130162, 2193979, 2338626, 2177401, 1384191, 570465, 421980, 740197]
9304G40197K15659n996r6772k74804n37506n35957j59763K72851M20699K91920
9294C30528K47982N45447P55918J50567r36158j020165L24778J218063j707j888987
9284b73734j663225N83808J916249R00060n98617o33162J22176M7980q45253j327688
9274a771406p61652M77694J528664J494387K86827q24683n95535L75851N71565
9265G81712j6860j80200P1201l92929j286750r82071N09701J186751L35358l90501
9255c64588j1959K45106m18168p55275J11400R91661Q24536L72368K67269l35357
9245I26993j538062j532222L78706J840690Q02105j183063j419521p0346Q50890
9236i43830R29199J076582J049988M0448j094163q64977J60740K24697n70176
$$ y = [740197, 955856, 949860, 853088, 578284, 40778, -495179, -654942, -382091, 38608, 330528, 578510, 1123957, 1879875, 2030442, 1094284, 74119, 398897, 1616960, 1615253, -273734, -1936959, -1353151, 563098, 1463158, 864541, 231379, 353555, 401535, -443718, -1771406, -2533058, -2055364, -526700, 967687, 1254514, 429831, -165704, 210147, 781712, 764852, 584652, 655853, 262924, -1023826, -2005897, -1496196, -309445, 25913, -364588, -376547, -131441, -549609, -1304884, -1193484, -201823, 622713, 995081, 1262350, 926993, -611069, -2143291, -1764585, 76105, 878210, -304853, -1724374, -1794720, -943830, -14631, 1061951, 2111939, 2152387, 1058224, 193247, 353987, 578684, 8508]
9227H508o06124J84609K22592p20856r75771J31785J101074P17560j77375k68164
9217c82162L33952O67224L55566k68866p40230o88563j17957L23805J2661o26573
9207a131143n24415M82638J293998R78439r1164q12390n76116L07487J044932
9198I72266J053985M37362j78835l54133k31649j63536k63220m75471p07417p09289
9188f19937k49836M01075O34489L34056L0696N2200J08094p7614l49565n39090
9178b75432o39393m20127L40041J082480Q89499o0364n28477j00150J65374l92122
9168F1329p53667J57288J549823J716881L81457j049036j336496o07987J97845
9159C17437L74549o3499n10507l98923J69015O07772O27726M14509J05497l23972
$$ y = [8508, -597616, -413007, -190415, -911271, -1887042, -1755257, -654183, 63377, -113998, -382162, -48210, 619014, 974580, 705714, -34516, -723079, -841036, -517231, -504570, -1131143, -1655558, -1172920, 121078, 1099517, 1008353, 195963, -380153, -72666, 972266, 2026251, 2463613, 2284778, 1930645, 1698996, 1535460, 1272240, 796769, 89352, -619937, -869773, -468698, 165791, 499847, 530543, 582743, 690837, 613223, 263658, -275432, -914825, -1334952, -994911, 87569, 977068, 916704, 388227, 288077, 453451, 61329, -692338, -535050, 1014773, 2731654, 3113111, 2064075, 727579, 119592, 317437, 691986, 628487, 117980, -280943, -111928, 495844, 1123570, 1538079, 1643576, 1319604]
9149A319604o87498p48331o87872p29729n05487L28795J113909R43496J85407
9140E32294l4894L05130K47679k86290m46665k55966n65879j067061m75213Q92381
9130a154484J055487l61652j221239l47531N57865L2865n38255M61049J775314
9121B59419J340530j44154m57010M12645N59951l96114q77694k30386M18827L69234
9111A255248K17368J54684n67183j811925j973919k10785J971807K408740Q64201
9102B308236q86758j208585k25188O53610M72987k64271m89174j42606j41972
9093G6279p59245j021721j95563J015559J432209Q64183n5054q47560j291549
9084g82462j099808k35286P73122J300235J119345L32303o02067q10617Q7046
$$ y = [1319604, 632106, -116225, -804097, -1533826, -2039313, -1710518, -596609, 346887, 532294, 497400, 802530, 1050209, 763919, 317254, 61288, -504591, -1571652, -2046865, -1154484, -98997, -460649, -1681888, -2029419, -1471554, -1438689, -1976944, -1515895, 259419, 1599949, 1455795, 998785, 1411430, 1971381, 1575267, 697573, 467187, 886014, 1255248, 1472616, 1627300, 1060117, -751808, -2725727, -2936512, -964705, 1444035, 2308236, 1421478, 212893, -12295, 641315, 1114302, 850031, 360857, 218251, 76279, -682966, -1704687, -1900250, -884691, 547518, 1411701, 1356647, 509087, -782462, -1882270, -2117556, -1344434, -44199, 1075146, 1407449, 805382, -5235, 81811]
9075H1811J012919N64753q15444j258414k46834P28878O86481L87992L90047k1454
9065A510735q95446p75263P70700J837471J098356L5585K93343P68952k55459
9056D388974j786247j689953l44904J53622m01902l99228M01827N61153k71216
9047F12126q51408o78529n14785n03801L326O63216L89733m63650l47581Q29769
9037h61584J432949P93114Q0150J02066K81165K64570N22787Q23925J38342j291857
9027B285627j752691o68819M46715M05517j44014m07707p26308j183628q26086
9018b571394N08132J281864N02865o36953o74775K5529M35365O50349R90458P17344
9008A228784n66361j420714m47269J212978J319006j16929j025343n43688Q1288
$$ y = [81811, 1094730, 1659483, 844039, -414375, -661209, 67669, 754150, 1142142, 1532189, 1510735, 615289, -159974, 610726, 2448197, 3546553, 3582138, 3875481, 4644433, 4388974, 2602727, 912774, 567870, 721492, 319590, -79638, 322189, 883342, 612126, -239282, -917811, -1432596, -1936397, -1933071, -1269855, -880122, -1343772, -1691353, -861584, 571365, 1364479, 1444629, 1546695, 1827860, 2092430, 2615217, 3439142, 3577484, 2285627, 532936, -135883, 310832, 716349, 572335, 164628, -561680, -1745308, -2571394, -2063262, -781398, -278533, -915486, -1590261, -1564732, -1129367, -479018, 511440, 1228784, 662423, -758291, -1205560, 7418, 1326424, 1209495, 184152, -359536, -278248]
8999b78248l6490j73081K21608L83917j88144n72656M530O56658K23695p05847
8989d64058o32518M54251J010005K51691q14432j007505m79634n0062O4130J25176
8979a542956J17543j09462l22946k06703J04237L42463N82674Q05014M90160n20914
8969b60890j228147o06205P44888J280215P12078K03819L19264K93102k57771
8960A200353m46595K49500Q19408K67947p19844q49107j40980M18102N27174O31054
8950A957012P35623L79541l55973q34731q19749o12081l27570J67253O41577N85071
8940A515973r399n31913n27126j75701L4850j63674o01425q11171m86856J52219
8930a604223O53670Q85108R11908N50204k69011q80962n90940P4568q847o31428
$$ y = [-278248, -314738, -487819, -266211, 117706, -70438, -643094, -638564, 18094, 241789, -464058, -1096576, -642325, 367680, 619371, -195061, -1202566, -1682200, -1732262, -1668132, -1542956, -1425413, -1534875, -1857821, -2064524, -1960287, -1617824, -1035150, -230136, 260024, -260890, -1489037, -2095242, -1350354, -70139, 641939, 845758, 1165022, 1458124, 1200353, 753758, 1003258, 1822666, 2090613, 1370769, 521662, 380682, 798784, 1325958, 1957012, 2692635, 3072176, 2716203, 1881472, 1061723, 449642, 122072, 289325, 930902, 1515973, 1506574, 974661, 447535, 271834, 306684, 143010, -458415, -1269586, -1756442, -1604223, -950553, -65445, 846463, 1396667, 1127656, 246694, -344246, -269678, -278525, -909953]
8920i09953l73515R87188J770839Q42180p13229j323120r66188l84480L62659
8911g07619J202293J160501k08335j446995r10769Q27584J838022J464081N50918
8902C769681l23690j150310j472672q28136J8174n7124n95100j89614R93073J194540
8892A358822j16613j210257o26332P42481J118951L32623l06124n7467M29126
8883A665210L04460k92250n78603k87892J0169k00929o41140p33445m45287q3640
8873a283347L36712P48249N22256n76495j345264n53774Q58899Q68876l69707
8864g93595o18212O94827J426065M34358l89304M71978J320098K02641j476318
8855A272538j205174L95599P39957l57150p26877K02557O80168m4604n71999m2631
$$ y = [-909953, -1283468, -296280, 1474559, 2316739, 1603510, 280390, -685798, -1070278, -707619, 494674, 1655175, 1446840, -155, -910924, -83340, 1754682, 3218763, 3769681, 3445991, 2295681, 823009, -5127, 13047, -44077, -639177, -828791, 164282, 1358822, 1242209, 31952, -594380, 148101, 1267052, 1599675, 1293551, 1236084, 1665210, 1969670, 1677420, 1098817, 810925, 821094, 620165, -20975, -754420, -1199707, -1283347, -946635, -198386, 323870, -252625, -1597889, -2151663, -1292764, -423888, -793595, -1411807, -716980, 709085, 1143443, 754139, 1226117, 2546215, 2748856, 1272538, 67364, 462963, 1202920, 845770, 118893, 321450, 1001618, 957014, 385015, 342384]
8845C42384N07007K09536k72623k23387k3005j26997k80185k78734l40168m06137
8835h92309j53808K20651K98815L58818Q12129J050849K70612q75726j035628
8826E4403l41155j47396o96913q04969L1950Q96195J054366Q11514N28059J19659
8816A505713k87076l75836l26267m17155k49458M58425Q51733J56507p16571m77039
8806A22976K81260P4626p95714p95369J3959J32925n29250n14680L39322M97807
8796a172138l90380p17223K55928J109958P19230o3312j44555J80515K63861J98922
8786B40806J03755k76600p09083n88603j74298k11725l16209M55198J492068J267489
8776A282798J11169j37351N51452K28285j338371j835240l46965Q76496J49112
$$ y = [342384, 849391, 1058927, 786304, 562917, 539912, 412915, 132730, -146004, -486172, -892309, -1046117, -825466, -526651, -167833, 644296, 1695145, 1965757, 1090031, 54403, -286752, -434148, -1131061, -1936030, -1904080, -1007885, 46481, 857995, 1386054, 1505713, 1218637, 842801, 516534, 99379, -150079, 308346, 1160079, 1316586, 600015, 122976, 404236, 478862, -316852, -1112221, -1098262, -965337, -1494587, -2009267, -1669945, -1172138, -1562518, -2279741, -2023813, -913855, -194625, -257937, -402492, -221977, 41884, 240806, 344561, 67961, -641122, -1229725, -1404023, -1615748, -1931957, -1476759, 15309, 1282798, 1393967, 1256616, 1808068, 2036353, 697982, -1137258, -1484223, -607727, -458615]
8767d58615r45182m98073N73909N48851l6651K72842J094245J126340N53568L68694
8757B599928L63048j89516p76527m98973J07808q7722q19340r53814m48720j89969
8747h93797l03242q0156O62496J309402J325378O23210n27678j360877j051290
8738b96554J21754Q43971N04413j22227l85201o39827r77215n88195O25169J266812
8728C52900M72484o05420o05801J9443J63929K8144L63659P68024L93110l51768
8718I98704l77185K81199O17168K55146k93695o64201q97002r25875o24417j21749
8708a751907M29591R58001J062343K98419p87728r41501J7420Q05750N85008K6856
8698G02252j17864j39174k93523k7432P69196J060403K47708p50355r59263o65632
$$ y = [-458615, -1403797, -1901870, -1327961, -779110, -815761, -542919, 551326, 1677666, 2231234, 2599928, 2962976, 2773460, 1996933, 1497960, 1605768, 1518046, 698706, -255108, -703828, -893797, -1197039, -1277195, -614699, 694703, 2020081, 2643291, 2115613, 754736, -296554, -174800, 669171, 1173584, 1051357, 666156, 26329, -950886, -1539081, -913912, 352900, 825384, 219964, -385837, -366394, -202465, -174321, 189338, 957362, 1350472, 998704, 621519, 902718, 1519886, 1775032, 1481337, 817136, -79866, -1005741, -1630158, -1751907, -1322316, -364315, 698028, 996447, 208719, -732782, -715362, 90388, 675396, 702252, 584388, 445214, 151691, 124259, 893455, 1953858, 2201566, 1451211, 491948, -173684]
8688a73684l98322K7675N16537K57074o56452p74894L34726R85849P3171r08085
8678g16405l28979P71025M94381o93552r35005j67335J31156k09255R2901J187041
8668c74027J590710N68135p41213j011156k86087N05489O97863L22079o6288p316
8658A198189K12606p256m27579k33310L52141J47996p94214q30298N18644J316736
8648A453655J34708j517628j449517l087R29689Q59488O28097L90333k56747q55729
8638C13262p16716l28739m04492k85446Q55142J983550J425170l82156j360298
8629A099277p61665J53613K74479j51971m32103k51715K97750O09788j4627j067903
8619b45077r83103M63240J314872L52046p61644p2673J467983J627554L98596
$$ y = [-173684, -572006, -544331, -27794, 229280, -427172, -1202066, -867340, 118509, 191680, -716405, -1045384, -274359, 220022, -473530, -1408535, -1575870, -1444714, -1653969, -1561068, -374027, 1216683, 1784818, 1043605, 32449, -253638, 251851, 949714, 1271793, 1205505, 1198189, 1410795, 1403539, 975960, 742650, 1094791, 1242787, 448573, -381725, 136919, 1453655, 1588363, 70735, -1378782, -1381869, -452180, 407308, 1035405, 1425738, 1168991, 313262, -403454, -732193, -1136685, -1422131, -566989, 1416561, 2841731, 2459575, 1099277, 337612, 491225, 765704, 613733, 181630, -70085, 227665, 837453, 822826, -245077, -1228180, -764940, 549932, 901978, 140334, 67661, 1535644, 3163198, 3561794]
8610C561794n48866q29358j192612j310833l89207O64039L26767p86124q43529
8601a347929N6086L39228M6675N57595J532116J209005k24356o42728L43824P48182
8591B617698k39954r94018m90293J69896J56687K02397N59590K27714p64882q30477
8581F14358L05455P23780l96231j126754n4740J171712N48539j004116j264182
8572d82179j57719N92731L18186p6246P7056M62656N87683K66929l88771q22209
8562C78117m38077L76008M86385k73034o93258p4895O50006M42534l06053o41581
8552i3848m88579l21423j82399J31497M86682O27629M81420M490o07218n77470
8542e39219N43782J659637J175589n88685j580926r24267M3800J68704J02842
$$ y = [3561794, 3012928, 2183570, 990958, -319875, -709082, -45043, 281724, -504400, -1347929, -1291843, -952615, -905940, -348345, 1183771, 2392776, 2168420, 1525692, 1869516, 2617698, 2377744, 1383726, 893433, 1063329, 1220016, 1422413, 1982003, 2209717, 1444835, 614358, 919813, 1643593, 1247362, 120608, 65868, 1237580, 1786119, 782003, -482179, -639898, -47167, 271019, 194773, 271829, 734485, 1322168, 1589097, 1200326, 378117, -59960, 316048, 802433, 529399, -163859, -238754, 411252, 853786, 547733, -93848, -582427, -903850, -1086249, -954752, -468070, 159559, 640979, 645469, 38251, -539219, 4563, 1664200, 2839789, 2251104, 670178, -254089, -210289, -41585, 61257]
8533F1257O44608J164061Q77670K86092J17065M6617l58276n77848k04848K0405
8523B076803n39517j132528q14478k7097K45914O9752R3620K60328J77885Q1716
8513D92398K76092L07530j78438n14972j69254j0347r41369j929972j181281R53553
8503b896060K068204R73214p27468r78381J01344Q94245P20806L81636M82573
8494A020113M18530m55898j410583j094752M10376J397786Q26317k33978l24763
8485E53148J75362o8758q76997p84569L22184P65905j95340j046678m44494O14800
8475i85437M87558m29641m46830N72576R29563k42252j554768j260023M00463
8466b528791J602285J281238K06730l44220j93660O898J02945N01169J002697
$$ y = [61257, 705865, 1869926, 2747596, 3033688, 3150753, 3197370, 2839094, 2261246, 2056398, 2076803, 1537286, 404758, -409720, -436817, -190903, -121151, -27531, 232797, 410682, 492398, 768490, 1076020, 897582, 382610, 213356, 203009, -738360, -2668332, -3849613, -2896060, -827856, 145358, -582110, -1560491, -1459147, -564902, 155904, 537540, 1020113, 1438643, 982745, -427838, -1522590, -1112214, 285572, 1111889, 877911, 553148, 728510, 659752, -217245, -1001814, -679630, 86275, -109065, -1155743, -1600237, -985437, -497879, -927520, -1374350, -801774, 127789, -114463, -1669231, -2929254, -2528791, -926506, 354732, 561462, 217242, 23582, 30480, 133425, 634594, 1637291]
8457A637291P67377j86680o52420j07843K93496l53083r93901k85804J053114
8448A171547J340240O01632J58638J04758n57334j485538j135149M30731J209251
8439A838776L11324q03218q51311m14333k55772J2990N43603M49602m17921o88101
8429b74361K57843R60322K54995o58056j68360J081288J245383K3050j242668
8420A479436j508896q05108K48187P18120J6821r56897n44242J046588J501986
8411A195995j10385j556299p83802Q55362R17361k53723n79514M2754k983p53135
8401a028369o10361N04520P81687l13765j035292k13380J027275J244873N84458
8392I41646j03353m88161l74846M51634J303871R26408n38482j311499m77188
$$ y = [1637291, 2404668, 2217988, 1565568, 1457725, 1751221, 1398138, 404237, 118433, 1171547, 2511787, 3113419, 3272057, 3376815, 2819481, 1333943, 198794, 629525, 1838776, 2150100, 1346882, 495571, 81238, -174534, -161544, 382059, 831661, 413740, -274361, -16518, 943804, 1198799, 540743, 372383, 1453671, 2699054, 2722104, 1479436, -29460, -834568, -586381, 131739, 148560, -808337, -1352579, -305991, 1195995, 1085610, -470689, -1254491, -399129, 518232, 264509, -315005, -272251, -275234, -1028369, -1638730, -1134210, -352523, -666288, -1701580, -1914960, -887685, 357188, 941646, 838293, 350132, -24714, 426920, 1730791, 2657199, 2118717, 807218, 330030]
8383C30030O66297O84967P6206M8211L74804l3677j066672j413615m88273Q07073
8373a4649J317071Q08413j63596q98526r46842l62907K96061M92153K11384k37842
8363E00720o68106q71715l60225J026478K285612J915876j50400j993114j819688
8354a34562j73970Q84741N26813j44368k18007k96374r31146j172954j11602J147918
8344f23511Q77535m39228p17802L48720P52355m63626j515863p27313Q26452J141054
8334e41227L32666R159N21474P41020J30768o59702j070650j059087m56780O93340
8324a359019J357760N68948p94999q56407M86245J249300K92864j002849q39932
8315h98089M77942J217022N74299o97175j510813j366365l89207P46220J170344
$$ y = [330030, 996327, 1681294, 1757500, 1805711, 2180515, 2146838, 1080166, -333449, -821722, -14649, 1302422, 2110835, 1947239, 1048713, 101871, -261036, 35025, 527178, 738562, 500720, -167386, -1039101, -1399326, -372848, 1912764, 3828640, 3678240, 1685126, -134562, -308532, 576209, 1103022, 958654, 740647, 444273, -486873, -1659827, -1771429, -623511, 254024, -185204, -903006, -554286, 198069, -265557, -1781420, -2508733, -1682281, -541227, -208561, -199402, 322072, 1063092, 1193860, 534158, -536492, -1595579, -2052359, -1359019, -1259, 567689, -227310, -1083717, -597472, 651828, 944692, -58157, -898089, -420147, 796875, 1371174, 673999, -836814, -2203179, -2592386, -1846166, -675822]
8306f75822P51031L79900O86864R10055O3j443171j631680j79435J107581P38531
8296F43917l36257k74240Q34889J255498L77567n27974n11320j84635j38237K19050
8286A358258J151441J416675J19751j382948j200483K46251R66738M59670Q14
8277C136167R8325j70343j061547j482368r53279l99684l35870m0496P04145Q39844
8267C34894m3746p15619l37629J43917j12092j86337Q30302J851533J365107r7063
8257C033267q44721n49145j65291n5291R2035L2236o47242j299445r46805Q3045
8247a267357O77619O90323P29923O82418M5365o54068m79215J38499j2931p24537
8237a73961n96472M97665J058633L68662n12289o07207k60346j2452K22737L18039
$$ y = [-675822, 75209, 455109, 1141973, 2052028, 2052091, 608920, -1022760, -1202195, -94614, 643917, 307660, 33420, 868309, 2123807, 2501374, 1973400, 1462080, 1277445, 1139208, 1358258, 2509699, 3926374, 4046125, 2663177, 1462694, 1708945, 2675683, 3135353, 3136167, 3234492, 3064149, 2002602, 520234, -433045, -832729, -1168599, -1209095, -504950, 334894, 291148, -424471, -762100, -618183, -730275, -916612, -86310, 1765223, 3130330, 3033267, 2188546, 1639401, 1474110, 1418819, 1510854, 1543090, 895848, -403597, -1350402, -1267357, -589738, 100585, 830508, 1512926, 1558291, 904223, 425008, 563507, 550576, -173961, -770433, -272768, 785865, 1154527, 642238, 35031, -225315, -237767, -15030, 303009]
8227C03009k21429r87931p75096L75800Q19497j51253j028568m89981M82869L69910
8217a303173l39740j74197O88789Q05971J9623l64960P4559K37582m16850q27471
8207a599867j13379R34092J086790M40819m8084j03593k01521n25633p77641p96496
8197a704513n91130n019Q67999J224336M68592n90442n86596L64909P54970M4513
8187B47619n02324J7598O15554J41708p33335p31770j70612k31397p03265l66618
8177b416842O55480Q95927k687o80763k66546M94706P90638Q42633R00847O21410
8167A834803K5472l20089n24456j218856j814481q89641J032318J412996l88518
8158h50452j558076n0580J914201J186725j252804j766608L08674J870642R49229
$$ y = [303009, 81580, -906351, -1681447, -1305647, -486150, -637403, -1665971, -2155952, -1673083, -1303173, -1642913, -1817110, -1128321, -322350, -302727, -667687, -593128, -355546, -772396, -1599867, -1713246, -779154, 307636, 748455, 700371, 596778, 395257, -130376, -908017, -1704513, -2295643, -2300662, -1432663, -208327, 260265, -330177, -916773, -551864, 203106, 247619, -254705, -237107, 378447, 520155, -213180, -944950, -1115562, -1346959, -2050224, -2416842, -1761362, -865435, -868122, -1548885, -1815431, -1320725, -530087, 312546, 1213393, 1834803, 1860275, 1540186, 1015730, -203126, -2017607, -2907248, -1874930, -461934, -850452, -2408528, -2459108, -544907, 641818, -610986, -2377594, -2068920, -198278, 750951]
8149G50951p01166p76006K93353O26122j52892p39440k03483Q90169J286901N11036
8139A785545n34007o10309J77725M61900k87519q30366j72555O86171L69702n70851
8129D75436o78951p9986L826l73111j31167N30758L46504n18020m87037O14015
8119b97733J062456J36800p07908m12891O0231j97709l40989M09424R65545J28086
8109H05312j146504j055062L21072J306520J107224M01440k21115q61809j332678
8100f75600r43698L23644J349758J114248m7118q41218n36924K16868K65181m72333
8090b47192q04500K7882J077372R54616p8825n05073O7336L67739l39124r85586
8080d65355m62576N59071P12378J8134l58935J0296L94849K55219m2499n6315
$$ y = [750951, 49785, -726221, -432868, 193254, 40362, -699078, -902561, -12392, 1274509, 1785545, 1251538, 641229, 818954, 1280854, 993335, 162969, -9586, 676585, 1046287, 475436, -203515, -283501, -279675, -652786, -783953, -253195, 93309, -424711, -911748, -297733, 764723, 901523, 193615, -219276, -159045, -356754, -697743, -288319, 677226, 805312, -341192, -1396254, -1075182, 231338, 1338562, 1740002, 1518887, 657078, -675600, -1619298, -1295654, 54104, 1168352, 1121234, 280016, -256908, -40040, 225141, -247192, -1051692, -1023810, 53562, 1008178, 929353, 424280, 491616, 859355, 520231, -465355, -927931, -368860, 343518, 361652, 2717, 13013, 407862, 663081, 620582, 564267]
8070E64267j7441l59837r27837j066180m50342M02959O31895O5982m66733j15802
8060a739069Q94571J524759J172914K35129n51497q63001q18669o48155m69884
8051a262902k36149Q2949K45846K0254k01336K56603J080406R72658l74759j366534
8041g82964p15656M37060K41447q20237p05374P23623J399245M63478m27477J804
8031a85051P06041M91132R0102M77922Q37256Q9378q84398o02409L85441L47274
8021A752688p22915j180787n15381K7287k14505l08900L66091Q95573L88189n18546
8011c1206p06883k17192J31562R4970K5686k2614k95958o42283o25300l00276
8001b589494j62980k45149O3584J018545J893688J791699P59332l41537q55368
$$ y = [564267, 546826, 186989, -740848, -1807028, -2257370, -1854411, -1222516, -1156534, -1623267, -1739069, -844498, 680261, 1853175, 2088304, 1536807, 673806, -144863, -793018, -1262902, -1499051, -1416102, -1170256, -1150002, -1351338, -1094735, -14329, 958329, 583570, -782964, -1498620, -1061560, -820113, -1640350, -2345724, -1622101, -222856, 240622, -186855, -185051, 520990, 1012122, 1102224, 1580146, 2417402, 2506780, 1622382, 1019973, 1405414, 1752688, 1029773, -151014, -666395, -639108, -853613, -1162513, -796422, 99151, 487340, -31206, -738089, -955281, -823719, -728749, -703063, -725677, -1021635, -1663918, -2289218, -2589494, -2752474, -2997623, -2934039, -1915494, -21806, 1769893, 2529225, 2187688, 1332320]
7992A332320p71827l28088K43069N79535M10121L8490L9090L13079J11413p14014
7982A253188j234517p44226J54681M61354J77737r084O2013N9424K2364K00095
7972D03029K80932k11336r04895r57580l47697J86481L81402N82878P50155M78707
7962F42076Q137N77K69286K8129n00177k39167O70785O53702p29852j657057o55799
7951a509360J046931J266148k8709r32432m00576O76863J041227M62551m66430
7942A156213r99048o58879K92653Q76038M85233k49887l35735J54076L29121o6832
7932I82953m15397m22486n52308r71562r50578P6979J414539J790275R64278j3239
7922A903454k33287r948j40901n56728m62869K51391O47591J33457o02669p07587
$$ y = [1332320, 560493, 232405, 475474, 1055009, 1465130, 1503620, 1542710, 1855789, 1967202, 1253188, 18671, -725555, -570874, -109520, 68217, 59133, 121146, 180570, 202934, 403029, 683961, 472625, -432270, -1389850, -1737547, -1551066, -1169664, -586786, 163369, 642076, 650213, 650790, 920076, 948205, 448028, 208861, 879646, 1533348, 803496, -853561, -1509360, -462429, 803719, 775010, -157422, -557998, 118865, 1160092, 1622643, 1156213, 157165, -501714, -209061, 666977, 1152210, 902323, 566588, 720664, 1049785, 982953, 567556, 145070, -407238, -1378800, -2329378, -2252399, -837860, 952415, 1916693, 1903454, 1670167, 1660219, 1519318, 962590, 499721, 751112, 1398703, 1532160, 929491, 221904]
7912B21904m86094o61390q70185j52328J220049J726901O71691q26505j333838
7903d89795p28698R7950M36537K26030j13652j9767N85435R70872M96057k91958
7893A169011l29082K88908M10066l05927q61511n78023m3129R8227J33427M27955
7883D09922O29522M22854J75690J86938J24816k34931n49247o20358o41151m23875
7873e19820M31962J275183Q12488o55356j121201J19411J168841M94951o44349
7864A362110m45762M68801M57757j50444O5183P12551K15816j120920j360577
7855B04515k32806L93620k89313p98796q7904P05590L58545m04345l09742L88089
7845g2547N88901J70064j14754L1096K31186J79748j25957n68512q26363m98704
$$ y = [221904, -264190, -925580, -1795765, -1948093, -728044, 998857, 1670548, 844043, -489795, -1218493, -1120543, -684006, -457976, -571628, -591395, -5960, 964912, 1460969, 1169011, 839929, 1128837, 1538903, 1232976, 371465, -206558, -249687, -151460, -18033, 409922, 1039444, 1462298, 1637988, 1824926, 1949742, 1714811, 1165564, 545206, -95945, -519820, -87858, 1187325, 1999813, 1344457, 223256, 342667, 1511508, 2006459, 1362110, 916348, 1385149, 1842906, 1692462, 1757645, 2470196, 2686012, 1565092, 204515, -28291, 365329, 76016, -722780, -810684, -105094, 253451, -150894, -460636, -72547, 516354, 686418, 571664, 602760, 833946, 1013694, 887737, 319225, -507138, -1005842]
7835a005842K85438Q00771N89872l0075n25796p01086n49635j73001J7377k81837
7825a573814n33267Q5288J205797J420679L40621o40038l67742L73902K37922
7816E49348n41035p18685j46586K22541J85108M97818J068347O39897r72329j851604
7806a067180m92501J727131K235175Q36037l14245k37023m36868j878109k773706
7797b401289j198640J491753K187370M26815j116555o69140M75308N70871M3053
7788a90454J28601N61498L27641l55650n27110k61831l58067o97755m56787K96358
7778a533556O57211M46541L76902O47924O28237O2846n09503o86282n75481k04893
7768f90054M40523P96041K36008p09916p96527J25022Q78471P46287K69079n1503
$$ y = [-1005842, -720404, 80367, 670239, 640164, 114368, -586718, -1136353, -1309354, -1291977, -1573814, -2107081, -2021793, -815996, 604683, 945304, 305266, -62476, 311426, 549348, 8313, -710372, -856958, -634417, -449309, 48509, 1116856, 1756753, 784424, -1067180, -1559681, 167450, 2402625, 3238662, 2924417, 2687394, 2250526, 372417, -2401289, -3599929, -2108176, 79194, 506009, -610546, -1279686, -804378, -233507, -190454, -61853, 499645, 827286, 471636, -55474, -317305, -675372, -1373127, -1829914, -1533556, -876345, -429804, -52902, 595022, 1223259, 1286105, 776602, 90320, -485161, -690054, -249531, 546510, 782518, 72602, -723925, -598903, 279568, 1025855, 1294934, 1243431]
7758A243431n49068j320495j570521q26002J56512M88115L10084J23674j39775
7749b084045n02327k79234Q44973J762175J238149j34596n99210K73877J064450
7740A584212O40929l97129q77541o28907k01611K04728O68742Q74719M52575j62182
7730B158535j14951N12005N82570m73674j654223j641447n82527J80144n2127
7721a085695n86519m74920L33890J179516J441566R06248q1519o68242k73675
7712F90650N13885M89550n14603j311834j024703j92717K85943M01080M98861
7703a63888L88323p9272k86897K17476O71105J27187r46714j293957p00177K8206
7693b038608N50504J090615J307043N91412n09149o94601Q2078M89196l0439n02184
$$ y = [1243431, 694363, -626132, -2196653, -3022655, -2866143, -2378028, -2067944, -1944270, -2084045, -2586372, -2865606, -2020633, -258458, 979691, 845095, 245885, 519762, 1584212, 2225141, 1828012, 950471, 321564, 119953, 324681, 993423, 1868142, 2320717, 2158535, 2043584, 2555589, 3138159, 2664485, 1010262, -631185, -1213712, -1033568, -1085695, -1672214, -2147134, -1813244, -633728, 807838, 1714086, 1632567, 964325, 690650, 1204535, 1694085, 1179482, -132352, -1157055, -1349772, -1063829, -662749, -163888, 224435, 145163, -141734, 75742, 746847, 874034, -72680, -1366637, -2066814, -2038608, -1488104, -397489, 909554, 1500966, 991817, 297216, 379294, 868490, 838051, 335867]
7683C35867k52506M9476j47900k49127K05453N80205M22254L95858Q58870Q15392
7673C013842l62169j367669p76557N03399M83249p77757j321012m23952M55707
$$ y = [335867, 83361, 132837, -15063, -264190, -58737, 521468, 943722, 1339580, 2198450, 3013842, 2651673, 1284004, 507447, 1010846, 1494095, 716338, -604674, -1028626, -572919]
$$ [...]
##END NTUPLES=NMR SPECTRUM
##END=
