##TITLE=31Pdec_SR-157-K3-TFAA1
 CDCl3, 24 sc
 5.6.2023
##JCAMPDX= 6.0         $$ Bruker NMR JCAMP-DX V2.0
##DATA TYPE= NMR SPECTRUM
##DATA CLASS= NTUPLES
##ORIGIN= UXNMR, Bruker Analytische Messtechnik GmbH
##OWNER= root
$$ XWIN-NMR		Version 3.5
$$ Tue Jun  6 15:19:47 2023 Russian Standard Time (UT+4h)  she@DPX200
##.OBSERVE FREQUENCY= 81.013821
##.OBSERVE NUCLEUS= ^31P
##.ACQUISITION MODE= SIMULTANEOUS
##.ACQUISITION SCHEME= undefined
##.AVERAGES= 24
##.DIGITISER RES= 16
##SPECTROMETER/DATA SYSTEM= spect
##.PULSE SEQUENCE= zgpg30
##.SOLVENT NAME= CDCl3
##.SHIFT REFERENCE= (INTERNAL, CDCl3, 0, 248.564)
##AUDIT TRAIL= $$ (NUMBER, WHEN, WHO, WHERE, WHAT)
$$ ##TITLE= Audit trail, XWIN-NMR		Version 3.5
$$ ##JCAMPDX= 5.01
$$ ##ORIGIN= Bruker BioSpin GmbH
$$ ##OWNER= she
$$ F:/spectra/data/she/nmr/P31/1/pdata/1/auditp.txt
$$ ##AUDIT TRAIL=  $$ (NUMBER, WHEN, WHO, WHERE, WHAT)
(   1,<2023-06-06 15:18:34.60 +0400>,<she>,<DPX200>,
      <created by zg, POWCHK disabled, PULCHK disabled
       configuration hash MD5:
       00 E9 B6 7A A2 85 ED C7 34 08 36 98 17 FE 4E 26
       data hash MD5: 32K
       C5 FB 02 AE 81 19 D4 ED 07 F4 55 1F 41 6E 6A 23>)
(   2,<2023-06-06 15:18:49.00 +0400>,<she>,<DPX200>,
      <Start of raw data processing
       efp BC_mod = 2 LB = 1 FT_mod = 6 PKNL = 1 PHC0 = -10641.07 PHC1 = -22.31514 SI = 64K 
       data hash MD5: 64K
       91 48 3D 6B F1 62 9B BF D4 15 FF 37 DB A7 DB 4C>)
(   3,<2023-06-06 15:19:02.50 +0400>,<she>,<DPX200>,
      <pk PHC0 = -4.737752 PHC1 = 0 
       data hash MD5: 64K
       25 B3 ED D6 FF 9B D2 9A 8E C1 CF BE B3 82 9E AF>)
(   4,<2023-06-06 15:19:08.18 +0400>,<she>,<DPX200>,
      <abs ABSG = 5 
       data hash MD5: 64K
       D6 FF 9D C4 73 52 5F C5 C7 15 B5 F8 38 57 B2 0F>)
$$ ##END=
$$ 
$$ hash MD5
$$ A9 0E 06 0C 20 6F 83 C5 83 D9 26 FE C2 15 B8 06
##$RELAX= 
##$RELAX= 
##$RELAX= 
##$RELAX= 
##$RELAX= 
##$RELAX= 
##$RELAX= 
##$RELAX= 
##$RELAX= 
$$ Bruker specific parameters
$$ --------------------------
##$DU= <F:/spectra>
##$EXPNO= 1
##$NAME= <P31>
##$PROCNO= 1
##$TYPE= <nmr>
##$USER= <she>
##$AMP= (0..31)
100 100 100 100 100 100 100 100 100 100 100 100 100 100 100 100 100 100 
100 100 100 100 100 100 100 100 100 100 100 100 100 100 
##$AQSEQ= 0
##$AQ_mod= 1
##$AUNM= <au_zg>
##$AUTOPOS= <>
##$BF1= 81.014009
##$BF2= 200.13
##$BF3= 200.13
##$BF4= 200.13
##$BF5= 200.13
##$BF6= 200.13
##$BF7= 200.13
##$BF8= 200.13
##$BYTORDA= 1
##$CFDGTYP= 0
##$CFRGTYP= 5
##$CHEMSTR= <none>
##$CNST= (0..31)
1 1 145 1 1 1 1 1 1 1 1 1 1 1 1 1 1 1 1 1 1 1 1 1 1 1 1 1 1 1 1 1 
##$CPDPRG= <waltz16>
##$CPDPRG1= <>
##$CPDPRG2= <waltz16>
##$CPDPRG3= <>
##$CPDPRG4= <mlev>
##$CPDPRG5= <mlev>
##$CPDPRG6= <mlev>
##$CPDPRG7= <mlev>
##$CPDPRG8= <mlev>
##$CPDPRGB= <>
##$CPDPRGT= <>
##$D= (0..31)
0 1 0 0 0 0 0 0 0 0 0 0.03 2e-05 3e-06 0 0 0 0 0 0 0 0 0 0 0 0 0 0 0 0 
0 0 
##$DATE= 1686050313
##$DBL= (0..7)
120 120 120 11 120 120 24 19 
##$DBP= (0..7)
150 150 150 150 150 150 150 150 
##$DBP07= 0
##$DBPNAM0= <>
##$DBPNAM1= <>
$$ [...]
##$SUBNAM3= <"">
##$SUBNAM4= <"">
##$SUBNAM5= <"">
##$SUBNAM6= <"">
##$SUBNAM7= <"">
##$SUBNAM8= <"">
##$SUBNAM9= <"">
##$SW= 501.771253377433
##$SWIBOX= (0..15)
0 1 3 0 0 0 0 0 0 0 0 0 0 0 0 0 
##$SW_h= 40650.406504065
##$TD= 32768
##$TD0= 1
##$TE= 0
##$TE2= 300
##$TE3= 300
##$TEG= 300
##$TL= (0..7)
0 120 53 12 22 120 120 120 
##$TP= (0..7)
150 150 150 150 150 150 150 150 
##$TP07= 0
##$TPNAME0= <>
##$TPNAME1= <>
##$TPNAME2= <>
##$TPNAME3= <>
##$TPNAME4= <>
##$TPNAME5= <>
##$TPNAME6= <>
##$TPNAME7= <>
##$TPOAL= (0..7)
0.5 0.5 0.5 0.5 0.5 0.5 0.5 0.5 
##$TPOFFS= (0..7)
0 0 0 0 0 0 0 0 
##$TUNHIN= 0
##$TUNHOUT= 0
##$TUNXOUT= 0
##$USERA1= <user>
##$USERA2= <user>
##$USERA3= <user>
##$USERA4= <user>
##$USERA5= <user>
##$V9= 5
##$VALIST= <valist>
##$VCLIST= <CCCCCCCCCCCCCCC>
##$VD= 0
##$VDLIST= <DDDDDDDDDDDDDDD>
##$VPLIST= <PPPPPPPPPPPPPPP>
##$VTLIST= <TTTTTTTTTTTTTTT>
##$WBST= 1024
##$WBSW= 4
##$XGAIN= (0..3)
0 0 0 0 
##$XL= 0
##$YL= 0
##$YMAX_a= 5213
##$YMIN_a= -5105
##$ZGOPTNS= <>
##$ZL1= 120
##$ZL2= 120
##$ZL3= 120
##$ZL4= 120
##$ABSF1= 248.5645
##$ABSF2= -253.2056
##$ABSG= 5
##$ABSL= 3
##$ALPHA= 0
##$AQORDER= 0
##$ASSFAC= 0
##$ASSFACI= 0
##$ASSFACX= 0
##$ASSWID= 0
##$AUNMP= <proc_1d>
##$AZFE= 0.1
##$AZFW= 0.5
##$BCFW= 0
##$BC_mod= 2
##$BYTORDP= 0
##$COROFFS= 0
##$CY= -3
##$DATMOD= 1
##$DC= 0
##$DFILT= <>
##$DTYPP= 0
##$F1P= 0
##$F2P= 0
##$FCOR= 1
##$FTSIZE= 65536
##$FT_mod= 6
##$GAMMA= 0
##$GB= 0
##$INTBC= 1
##$INTSCL= 6.047779e-11
##$ISEN= 30
##$LB= 1
##$LEV0= 0
##$LPBIN= 0
##$MAXI= 10000
##$MC2= 0
##$MEAN= 0
##$ME_mod= 0
##$MI= 50
##$NCOEF= 0
##$NC_proc= -6
##$NLEV= 6
##$NOISF1= 182.463
##$NOISF2= 159.3651
##$NSP= 0
##$NTH_PI= 0
##$NZP= 0
##$OFFSET= 248.5645
##$PC= 4
##$PHC0= -10645.81
##$PHC1= -22.31514
##$PH_mod= 1
##$PKNL= yes
##$PPARMOD= 0
##$PSCAL= 0
##$PSIGN= 0
##$REVERSE= no
##$SF= 81.0140089999694
##$SI= 65536
##$SIGF1= 159.3651
##$SIGF2= -187.1042
##$SINO= 113.3802
##$SIOLD= 16384
##$SREGLST= <1H.CDCl3>
##$SSB= 0
##$STSI= 65536
##$STSR= 0
##$SW_p= 40650.406504065
##$SYMM= 0
##$S_DEV= 0
##$TDeff= 32768
##$TDoff= 0
##$TI= <>
##$TILT= no
##$TM1= 0
##$TM2= 0
##$TOPLEV= 0
##$USERP1= <user>
##$USERP2= <user>
##$USERP3= <user>
##$USERP4= <user>
##$USERP5= <user>
##$WDW= 1
##$XDIM= 65536
##$YMAX_p= 237432370
##$YMIN_p= -437551189
$$ End of Bruker specific parameters
$$ ---------------------------------
##NTUPLES= NMR SPECTRUM
##VAR_NAME=  FREQUENCY,     SPECTRUM/REAL,   SPECTRUM/IMAG
##SYMBOL=    X,             R,               I
##VAR_TYPE=  INDEPENDENT,   DEPENDENT,       DEPENDENT
##VAR_FORM=  AFFN,          ASDF,            ASDF
##VAR_DIM=   65536,         65536,           65536
##UNITS=     HZ,            ARBITRARY UNITS, ARBITRARY UNITS
##FACTOR=    0.620285442955139, 1,           1
##FIRST=     20137.2065510682, 0,            0
##LAST=      -20513.1999529968, 0,           0
##MIN=       -20513.1999529968, -437551189,  0
##MAX=       20137.2065510682, 237432370,    0
$$ Real data points
##PAGE= N=1
##DATA TABLE= (X++(R..R)), XYDATA
$$ [...]
$$ plain form
13245 1934277 1503001 778644 396111 505387 889973 1270594 1349111 909299 -7062 -1197850
13235 -1197850 -2416318 -3140481 -2652280 -983903 512284 406417 -1007720 -1988800 -1562304
13226 -1562304 -644102 -634925 -1615159 -2470606 -2399393 -1756964 -1459360 -1808943 -2050729 -1293799
13216 -1293799 119680 733949 -124196 -1225197 -1019758 227710 1039926 1075825 1370439
13207 1370439 2191312 2338543 1205904 63245 260350 1243477 1504601 725890 -162953
13198 -162953 -492865 -305424 261478 895445 716346 -812215 -2593207 -2700216 -771107
13189 -771107 1352768 1824017 870903 128112 461603 1192300 1291870 643055 -99747 -474343
13179 -474343 -616755 -772739 -802633 -412952 281504 704873 350867 -734320 -1911796
$$ packed form
13245A934277m31276p24357l82533J09276L84586L80621P8517m39812r16361j190788
13235a197850j218468p24163M88201J668377J496187j05867j414137r81080M26496
13226a562304R18202R177r80234q55447P1213O42429K97604l49583k41786P56930
13216a293799J413479O14269q58145j101001K05439J247468Q12216L5899K94614
13207A370439Q20873J47231j132639j142659J97105R83127K61124p78711q88843
13198a62953l29912J87441N66902O33967j79099j528561j780992j07009J929109
13189g71107K123875M71249r53114p42791L33491P30697R9570o48815p42802l74596
13179d74343j42412j55984k9894L89681O94456M23369l54006j085187j177476
$$ plain form
13170 -1911796 -2320020 -1563606 -287683 245101 -432820 -1302542 -1147741 -234610 141253
13161 141253 -338249 -575746 71341 618399 -49010 -1326288 -1641202 -721267 7621
13152 7621 -580592 -1818963 -2207338 -1301434 -39493 597718 594086 410314 86404 -584321
13142 -584321 -1242006 -1098810 -32604 1132476 1696277 1748707 1468650 679729 -284957
13133 -284957 -315356 826794 1525029 383785 -1480387 -1972091 -1276064 -1398985 -2573767
13124 -2573767 -2666569 -803189 915446 630989 -519623 -621809 -95444 -398866 -999021
13115 -999021 -165660 1875755 3050522 2557334 1650141 1160034 399113 -931477 -1720125
13106 -1720125 -1271916 -587768 -720983 -1094473 -655451 241428 427885 -163023 -490362
$$ packed form
13170a911796m08224P56414J275923N32784o77921q69722J54801R13131L75863
13161A41253m79502k37497O47087N47058o67409j277278l14914R19935P28888
13152G621n88213j238371l88375R05904J261941O37211l632j83772l23910o70725
13142e84321o57685J43196J066206J165080N63801N2430k80057p88921r64686
13133b84957l0399J142150O98235j141244j864172m91704O96027j22921j174782
13124b573767r2802J863380J718635k84457j150612j02186N26365l03422o00155
13115i99021Q33361K041415J174767m93188r07193m90107p60921j330590p88648
13106a720125M48209O84148j33215l73490M39022Q96879J86457n90908l27339
$$ plain form
13097 -490362 -123140 256002 202233 259126 840611 1204640 403216 -1138521 -1971518 -1563243
13087 -1563243 -892846 -750869 -513164 509531 1444258 1046547 38874 444693 2481107
13078 2481107 4002790 3640288 2606599 2306151 1993614 505164 -1168800 -1189953 164726
13069 164726 1064855 1081665 1252975 1466901 384706 -1655677 -2236496 -430001 1378939
13060 1378939 713575 -1597532 -2874857 -2217147 -965431 -338654 -303684 -457214 -552735
13051 -552735 -181917 920401 2184994 2655579 2109347 1086967 34697 -858958 -1258825
13042 -1258825 -995847 -644470 -930248 -1629198 -1891313 -1611125 -1563054 -2077761 -2500891 -2239566
13032 -2239566 -1535265 -855989 -289904 29824 -320647 -1214732 -1516001 -334817 1557361
$$ packed form
13097d90362L67222L79142n3769N6893N81485L64029q01424j541737q32997M08275
13087a563243O70397J41977K37705J022695R34727l97711j007673M05819K036414
13078B481107J521683l62502j033689l00448l12537j488450j673964k1153J354679
13069A64726R00129J6810J71310K13926j082195k040383n80819J806495J808940
13060A378939o65364k311107j277325O57710J251716O26777L4970j53530r5521
13051e52735L70818J102318J264593M70585n46232j022380j052270q93655l99867
13042a258825K62978L51377k85778o98950k62115K80188M8071n14707m23130K61325
13032b239566P04301O79276N66085L19728l50471q94085l01269J181184J892178
$$ plain form
13023 1557361 2460990 1879286 1096148 1395800 2416109 2788748 1992771 902567 519869
13014 519869 740111 674721 -108592 -1089242 -1519789 -1263694 -689502 8695 953867 2019086
13004 2019086 2559657 2066866 925293 133492 228885 768644 956961 527151 -142992
12995 -142992 -561278 -534806 -181618 222051 403284 253609 -119957 -505899 -703703 -590438
12985 -590438 -264087 -102820 -392178 -846677 -880378 -488050 -370917 -865033 -1266001 -799004
12975 -799004 130860 423392 -136782 -597983 -237438 477967 620349 7242 -632509 -478547
12965 -478547 489821 1286578 823622 -667398 -1537520 -669636 905109 1271797 187199
12956 187199 -845632 -936298 -750809 -839887 -626670 206439 765605 429528 99294 780439
$$ packed form
13023A557361R03629n81704p83138K99652J020309L72639p95977j090204l82698
13014E19869K20242o5390p83313r80650m30547K56095N74192O98197R45172J065219
13004B019086N40571m92791j141573p91801R5393N39759J88317m29810o70143
12995a42992m18286K6472L53188M03669J81233j49675l73566l85942j97804J13265
12985e90438L26351J61267k89358m54499l3701L92328J17133m94116m00968M66997
12975g99004R29864K92532n60174m61201L60545P15405J42382o13107o39751J53962
12965d78547R68368P96757m62956j491020q70122Q67884J574745L66688j084598
12956A87199j032831r0666J85489q9078K13217Q33109N59166l36077l30234O81145
$$ plain form
12946 780439 1898337 2271781 1917260 1597503 1366248 954578 864643 1505493 1861125 808000
12936 808000 -631303 -325417 1697090 2993597 2038566 -43754 -1573514 -2292775 -2467595
12927 -2467595 -1821546 -595335 -229803 -1526378 -3084813 -2964657 -1247476 296423 577066
12918 577066 57004 -360288 -227725 442065 1184178 1285846 662269 169325 393978 699727
12908 699727 318238 -233162 54518 936444 1251982 776495 385834 381869 42115 -878537
12898 -878537 -1490708 -1154097 -460171 -220981 -378746 -565639 -912913 -1533846 -1880794 -1464304
12888 -1464304 -739370 -473974 -612336 -558025 -262908 -153667 -146397 313035 1138099 1422023
12878 1422023 716118 -195240 -281641 416578 964874 768464 119711 -424331 -736704 -1013120
$$ packed form
12946G80439J117898L73444l54521l19757k31255m11670q9935O40850L55632j053125
12936H08000j439303L05886K022507J296507r55031k082320j529760p19261j74820
12927b467595O46049J226211L65532j296575j558435J20156J717181J543899K80643
12918E77066n20062m17292J32563O69790P42113J01668o23577m92944K24653L05749
12908F99727l81489n51400K87680Q81926L15538m75487l90661l965l39754r20652
12898h78537o12171L36611O93926K39190j57765j86893l47274o20933l46948M16490
12888a464304P24934K65396j38362N4311K95117J09241P270M59432Q25064K83924
12878A422023p05905r11358q6401O98219N48296j96410o48753n44042l12373k76416
$$ plain form
12868 -1013120 -1249707 -1147506 -559411 190861 615392 612713 513503 578903 659637 399429
12858 399429 -402318 -1613233 -2677162 -2767199 -1569184 -49991 237141 -946562 -1970017
12849 -1970017 -1355258 240347 1012924 521045 -47787 28060 97030 -365234 -748904 -515821
12839 -515821 -261488 -680431 -1397710 -1760767 -1944563 -2253914 -2161950 -1266990 -486109 -855759
12829 -855759 -1659969 -1367358 -168640 197287 -744303 -1381793 -547771 778157 1174435
12820 1174435 791883 548482 411879 -197301 -956337 -912686 2578 750388 468337 -674699
12810 -674699 -1821299 -2129555 -1330216 -37362 729503 719813 781507 1551708 2277003 1680539
12800 1680539 -191454 -1757488 -1660885 -243848 939473 816201 -211692 -934941 -801705
$$ packed form
12868a013120k36587J02201N88095P50272M24531k679r9210O5400Q0734k60208
12858C99429q01747j210915j063929r0037J198015J519193K87132j183703j023455
12849a970017O14759J595605P72577m91879n68832P5847O8970m62264l83670K33083
12839e15821K54333m18943p17279l63057j83796l09351R1964Q94960P80881l69650
12829h55759q04210K92611J198718L65927r41590o37490Q34022J325928L96278
12820A174435l82552k43401j36603o09180p59036M3651R15264P47810k82051j143036
12810f74699j146600l08256P99339J292854P66865r690O1694P70201P25295n96464
12800A680539j871993j566034R6603J417037J183321j23272j027893p23249J33236
$$ plain form
12791 -801705 -384617 -307172 -291201 154971 611374 275326 -623304 -1061051 -847049 -782453
12781 -782453 -1061283 -892301 -118987 208920 -447058 -1190286 -1316823 -1507513 -2340356 -2903713
12771 -2903713 -2170544 -662628 536243 1328175 1811296 1192858 -764077 -2302387 -1736936
12762 -1736936 -177619 -37235 -1440306 -2463653 -2529620 -2880670 -3613216 -3082791 -1004960
12753 -1004960 470074 6585 -859488 -447196 243030 -655856 -2638560 -3484341 -2437753
12744 -2437753 -873119 -44707 254226 693152 1257648 1466058 1132080 629569 499109
12735 499109 726697 555219 -511944 -1669506 -1591873 -270808 909734 1064044 632816
12726 632816 82223 -839521 -1958974 -2215928 -1303281 -523582 -860356 -1307029 -480586
$$ packed form
12791h01705M17088P7445J5971M46172M56403l36048q98630m37747K14002O4596
12781g82453k78830J68982P73314L27907o55978p43228j26537j90690q32843n63357
12771b903713P33169J507916J198871P91932M83121o18438j956935j538310N65451
12762a736936J559317J40384j403071j023347o5967l51050p32546N30425K077831
12753a004960J475034m63489q66073M12292O90226q98886j982704q45781J046588
12744b437753J564634Q28412K98933M38926N64496K08410l33978n02511j30460
12735D99109K27588j71478j067163j157562P7633J321065J180542J54310m31228
12726F32816n50593r21744j119453k56954R12647P79699l36774m46673Q26443
$$ plain form
12717 -480586 1010626 1389390 366469 -601352 -533807 7463 147093 -190294 -603466
12708 -603466 -755232 -407156 390872 1053004 967660 231082 -618073 -1372140 -2035985 -2191509
12698 -2191509 -1305976 311831 1541181 1564899 573950 -565174 -989708 -389251 716992
12689 716992 1420753 1378556 953339 270515 -1030106 -2605912 -3005372 -1484446 527067
12680 527067 995386 -202591 -1560171 -2199876 -2350873 -1912716 -366185 1652162 2367429
12671 2367429 1093626 -826469 -1882488 -1991019 -1650535 -847920 246826 664712 -40353
12662 -40353 -663215 130176 1648163 1913541 424648 -1111651 -1013350 476509 1925446
12653 1925446 2466313 2193992 1414363 325847 -647884 -887240 -214802 786135 1361466
$$ packed form
12717d80586J491212L78764j022921r67821O7545N41270J39630l37387m13172
12708f03466j51766L48076P98028O62132q5344p36578q49155p54067o63845j55524
12698b191509Q85533J617807J229350K3718r90949j139124m24534O00457J106243
12689G16992P03761m2197m25217o82824j300621j575806l99460J520926K011513
12680E27067M68319j197977j357580o39705j50997M38157J546531K018347P15267
12671B367429j273803j920095j056019j08531L40484Q02615J094746M17886p05065
12662d0353o22862P93391J517987K65378j488893j536299R8301J489859J448937
12653A925446N40867k72321p79629j088516r73731k39356O72438J000937N75331
$$ plain form
12644 1361466 1388025 1348839 1546180 1663368 1296355 668398 426622 743512 1027321 735278
12634 735278 176982 125749 705311 1097805 554615 -621937 -1467413 -1535694 -1183437 -713003
12624 -713003 56952 1051449 1511922 1032212 483493 911841 1787363 1532705 -149551
12615 -149551 -1716672 -1916930 -1278283 -846037 -606977 -132637 192939 -153705 -545370
12606 -545370 100345 1589697 2581255 2376493 1604023 1146119 1244477 1664314 2014804 1953099
12596 1953099 1628020 1636032 2000737 1845778 905978 483260 1574580 2867762 2405591
12587 2405591 696865 -11953 601589 500107 -1102367 -2314602 -1790853 -915108 -1201512
12578 -1201512 -1717716 -1121178 -402181 -1149204 -2421627 -2043907 -272091 533418 -345164
$$ packed form
12644A361466K6559l9186J97341J17188l67013o27957k41776L16890K83809k92043
12634G35278n58296n1233N79562L92494n43190j176552q45476o8281L52257M70434
12624g13003P69955R94497M60473m79710n48719M28348Q75522k54658j682256
12615a49551j567121k00258O38647M32246K39060M74340L25576l46644l91665
12606e45370O45715J489352R91558k04762p72470m57904R8358M19837L50490o1705
12596A953099l25079Q012L64705j54959r39800m22718J091320J293182m62171
12587B405591j708726p08818O13542j01482j602474j212235N23749Q75745k86404
12578a201512n16204N96538P18997p47023j272423L77720J771816Q05509q78582
$$ plain form
12569 -345164 -1171988 -889199 -608375 -1346096 -2396537 -2837939 -2878643 -2771337 -1997043 -578766
12559 -578766 216237 -352905 -1214252 -1122276 -510805 -479106 -880878 -809231 -294772 -85877
12549 -85877 -157055 162511 760812 792420 213147 34271 749736 1533827 1456559 714016
12539 714016 136398 48086 166129 270440 425917 660274 869940 1086936 1487298 1943561
12529 1943561 1826278 653085 -1079058 -2198622 -2221171 -1885458 -1881503 -1650170 -337696
12520 -337696 1464268 2187196 1511874 801803 963131 1217834 702836 9657 79607 600908
12510 600908 737247 644294 936922 1291657 1023636 613535 1115282 2213331 2413135 1267642
12500 1267642 -5995 -388926 -240444 -253731 -419556 -486738 -426145 -8664 1090347 2329923
$$ packed form
12569c45164q26824K82789K80824p37721j050441m41402m0704J07306P74294J418277
12559e78766P95003n69142q61347R1976O11471L1699m01772P1647N14459K08895
12549h5877p1178L19566N98301L1608n79273j78876P15465P84091p7268p42543
12539G14016n77618q8312J18043J04311J55477K34357K09666K16996M00362M56263
12529A943561j17283j173193j732143j119564k2549L35713L955K31333J312474
12520c37696J801964P22928o75322p10071J61328K54703n14998o93179O9950N21301
12510F00908J36339r2953K92628L54735k68021m10101N01747J098049J99804j145493
12500A267642j273637l82931J48482j3287j65825o7182O0593M17481J099011J239576
$$ plain form
12490 2329923 2442662 1090303 -468952 -909112 -288661 477789 839458 832670 770087 1092457
12480 1092457 1878097 2304915 1443975 -254010 -1337389 -1459247 -1813119 -3021075 -4044686
12471 -4044686 -3978006 -3481123 -3371427 -3157774 -2285173 -1573542 -1832850 -2094002 -1006889
12462 -1006889 780550 1537392 1179190 1033349 1157516 161208 -1996322 -3211025 -2147488
12453 -2147488 -256786 268562 -693420 -1669934 -1985853 -2280560 -2932487 -3219628 -2364819
12444 -2364819 -755897 331902 99613 -980642 -1836794 -2028613 -1928905 -1788712 -1328724
12435 -1328724 -521928 -32399 -306108 -849662 -1077471 -1251233 -1758951 -2075152 -1497572
12426 -1497572 -495990 -181756 -673720 -1118336 -1160504 -1189259 -1144687 -347370 1211168 2472175
$$ packed form
12490B329923J12739j352359j559255m40160O20451P66450L61669o788o2583L22370
12480A092457P85640M26818q60940j697985j083379j21858l53872j207956j023611
12471d044686O6680M96883J09696K13653Q72601P11631k59308k61152J087113
12462a006889J787439P56842l58202j45841J24167r96308k157530j214703J063537
12453b147488J890702N25348r61982r76514l15919k94707o51927k87141Q54809
12444b364819J608922J087799k32289j080255q56152j91819R9708J40193M59988
12435a328724Q06796M89529k73709n43554k27809j73762n07718l16201N77580
12426a497572J001582L14234m91964m44616m2168k8755M4572P97317J558538J261007
$$ plain form
12416 2472175 2607071 1943993 1302571 1027697 876475 390460 -604102 -1489232 -1250899
12407 -1250899 33192 757749 -223112 -1878566 -2503610 -2204316 -2254228 -2572691 -1898003
12398 -1898003 -282230 781946 880292 1102812 1581778 988371 -722071 -1454771 -143520
12389 -143520 1354866 1082020 -187038 -662037 -408869 -544418 -927724 -732906 -324561
12380 -324561 -555581 -986932 -727717 -333147 -904533 -1901431 -1906070 -1159591 -1203481 -2137784
12370 -2137784 -2398266 -1455548 -654335 -818710 -893426 144642 1490079 1675346 589478
12361 589478 -583642 -893738 -468730 -154512 -561116 -1209244 -834331 924804 2576405
12352 2576405 2450312 956630 -33731 170483 525346 368798 428576 1180296 1691616
$$ packed form
12416B472175J34896o63078o41422k74874j51222m86015r94562q85130K38333
12407a250899J284091P24557r80861j655454o25044K99294m9912l18463O74688
12398a898003J615773J064176R8346K22520M78966n93407j710442p32700J311251
12389a43520J498386k72846j269058m74999K53168j35549l83306J94818M08345
12380c24561k31020m31351K59215L94570n71386r96898m639P46479m3890r34303
12370b137784k60482R42718Q01213j64375p4716J038068J345437J85267j085868
12361E89478j173120l10096M25008L14218m06604o48128L74913J759135J651601
12352B576405j26093j493682r90361K04214L54863j56548N9778P51720N11320
$$ plain form
12343 1691616 1009501 -371214 -1313365 -1464698 -1078290 -214645 971010 1745538 1505556
12334 1505556 628357 -49012 -250106 -218781 -120058 -88125 -428163 -1105202 -1414360 -861506
12324 -861506 -51677 57485 -437541 -564701 -33061 250856 -492274 -1734151 -2260126
12315 -2260126 -1601868 -350623 785549 1656680 2259249 2208736 1221511 -46515 -407595
12306 -407595 352942 1066934 807802 286920 748850 1904335 2186682 1101389 30434
12297 30434 181292 845155 560386 -790157 -2064865 -2528888 -2353188 -1747460 -784487
12288 -784487 -119410 -674400 -2144294 -2778309 -1380693 1073314 2561861 2355244 1465401
12279 1465401 1003560 974639 836775 526349 511625 1163968 2357625 3497523 3861897
$$ packed form
12343A691616o82115j380715r42151j51333L86408Q63645J185655P74528k39982
12334A505556q77199o77369k01094L1325R8723L1933l40038o77039l09158N52854
12324h61506Q09829J09162m95026j27160N31640K83917p43130j241877n25975
12315b260126O58258J251245J136172Q71131O02569n0513r87225j268026l61080
12306d07595P60537P13992k59132n20882M61930J155485K82347j085293j070955
12297C0434J50858O63863k84769j350543j274708m64023J75700O05728R62973
12288g84487O65077n54990j469894o34015J397616K454007J488547k06617q89843
12279A465401m61841k8921j37864l10426j4724O52343J193657J139898L64374
$$ plain form
12270 3861897 3224774 2208367 1635107 1474863 980923 15027 -532296 -127214 363706
12261 363706 -138007 -1216411 -1485965 -573827 528599 1074399 1373528 1770593 1944704
12252 1944704 1736285 1688376 2077914 2207557 1431280 243008 -447733 -576283 -647276 -731222
12242 -731222 -694345 -1013066 -2215888 -3637894 -3894166 -2755921 -1496055 -1034955 -784930
12233 -784930 36420 879524 692493 -214539 -381213 611081 1276714 205565 -1833074
12224 -1833074 -2762750 -1958344 -1025550 -1481479 -2628694 -2600543 -984954 667528 883500
12215 883500 -188222 -1477248 -2305027 -2515626 -2069953 -1254057 -862167 -1405929 -2270953
12206 -2270953 -2286967 -1152081 215681 853814 861899 1076134 1867893 2640392 2622786 1888562
$$ packed form
12270C861897o37123j016407n73260j60244m93940r65896n47323M05082M90920
12261C63706n01713j078404k69554R12138J102426N45800K99129L97065J74111
12252A944704k08419m7909L89538J29643p76277j188272o90741j28550p0993q3946
12242g31222L6877l18721j202822j422006k56272J138245J259866M61100K50025
12233g84930Q21350Q43104j87031r07032j66674R92294O65633j071149k038639
12224a833074r29676Q04406R32794m55929j147215K8151J615589J652482K15972
12215H83500j071722j289026q27779k10599M45673Q15896L91890n43762q65024
12206b270953j6014J134886J367762O38133Q085K14235P91759P72499j7606p34224
$$ plain form
12196 1888562 1227841 1080448 1094382 877578 582502 359375 -122946 -938491 -1278591 -515801
12186 -515801 528104 521458 -396956 -861931 -479365 -339806 -1035578 -1613673 -1154859 -134667
12176 -134667 607057 1148780 1796663 2048399 1306187 -4496 -929277 -1080720 -585681
12167 -585681 332779 997245 361295 -1581716 -3202848 -3081077 -1831898 -1095248 -1331740
12158 -1331740 -1733370 -1762271 -1548486 -1121327 -434848 57679 -98688 -505939 -493796 -228326
12148 -228326 -272393 -449135 -238914 82877 -88885 -428466 -195483 258360 -58338 -948583
12138 -948583 -1215026 -758892 -842886 -1863380 -2479614 -1725148 -572546 -324739 -526866
12129 -526866 211178 1869988 2814931 1991668 399014 -61483 1147711 2528427 2269029
$$ packed form
12196A888562o60721j47393J3934k16804k95076k23127m82321q15545l40100P62790
12186e15801J043905o646r18414m64975L82566J39559o95772n78095M58814J020192
12176a34667P41724N41723O47883K51736p42212j310683r24781j51443M95039
12167e85681R18460O64466o35950j943011j621132J21771J249179P36650k36492
12158a331740m01630k8901K13785M27159O86479M92527j56367m07251J2143K65470
12148b28326m4067j76742K10221L21791j71762l39581K32983M53843l16698q90245
12138i48583k66443M56134q3994j020494o16234P54466J152602K47807k02127
12129e26866P38044J658810R44943q23263j592654m60497J209194J380716k59398
$$ plain form
12120 2269029 390950 -1263443 -1202802 160062 1383794 1687548 1200980 292019 -447262
12111 -447262 -151405 1255413 2340568 1713784 41593 -786124 -368187 -190698 -1147494
12102 -1147494 -2201351 -2099771 -1102167 -186617 386339 783387 736155 38170 -631420
12093 -631420 -438100 286142 395661 -404402 -1094978 -810049 -123245 -326447 -1664071
12084 -1664071 -2894365 -2786401 -1579219 -493682 -109539 65476 494655 964296 1258676
12075 1258676 1587445 1880177 1507845 345262 -681509 -873386 -830868 -1356204 -2005511
12066 -2005511 -1828624 -998727 -505936 -555674 -422708 268917 1116313 1629037 1526415 680685
12056 680685 -417091 -680150 108549 546246 -425759 -1540181 -821443 1313636 2452015
$$ packed form
12120B269029j878079j654393O0641J362864J223732L03754m86568r08961p39281
12111d47262K95857J406818J085155o26784j672191q27717M17937J77489r56796
12102a147494j053857J01580R97604R15550N72956L97048m7232o97985o69590
12093f31420J93320P24242J09519q00063o90576K84929O86804k03202j337624
12084a664071j230294J07964J207182J085537L84143J75015M29179M69641K94380
12075A258676L28769K92732l72332j162583j026771j91877M2518n25336o49307
12066b005511J76887Q29897M92791m9738J32966O91625Q47396N12724j02622q45730
12056F80685j097776k63059P88699M37697r72005j114422P18738K135079J138379
$$ plain form
12047 2452015 1558540 104639 -288653 427168 1589539 2663254 2847163 1535724 -324689
12038 -324689 -922293 -123315 277810 -598281 -1363757 -696620 634566 1204258 1003901
12029 1003901 867019 946007 972706 1146405 1633664 1876989 1346516 370271 -491064 -1160281
12019 -1160281 -1511406 -1048977 106808 821151 402666 -340128 -345038 197441 475318 435994
12009 435994 552739 798200 817556 749177 1088771 1985791 3115479 3849168 3379211 1493021
11999 1493021 -505038 -752766 749177 1854231 1136525 -231690 -478430 201887 535108
11990 535108 565850 1338948 2683487 3171954 2344789 1410642 1377154 1736773 1547405 880097
11980 880097 507220 662913 767599 310943 -397706 -576503 -12190 576504 514804 213385
$$ packed form
12047B452015q93475j453901l93292P15821J162371J073715J83909j311439j860413
12038c24689n97604P98978M01125q76091p65476O67137J331186N69692k00357
12029A003901j36882P8988K6699J73699M87259K43325n30473r76245q61335o69217
12019a160281l51125M62429J155785P14343m18485p42794m910N42479K77877l9324
12009D35994J16745K45461J9356o8379L39594Q97020J129688P33689m69957j886190
11999A493021j998059k47728J501943J105054p17706j368215k46740O80317L33221
11990E35108L0742P73098J344539M88467q27165r34147l3488L59619j89368o67308
11980H80097l72877J55693J04686m56656p08649j78797N64313N88694o1700l01419
$$ plain form
11970 213385 621336 1744426 2467726 1962232 550323 -956090 -2001188 -2217146 -1522119
11961 -1522119 -614697 -508193 -1190675 -1566688 -1046918 -238977 317565 957039 1770780
11952 1770780 1805631 364871 -1652539 -2659323 -2126526 -757144 499097 1012532 718935
11943 718935 376463 888257 1901507 1997642 831495 -61048 553482 1761363 1988414
11934 1988414 1333359 1040832 1378951 1519023 1116775 619727 192802 -417204 -1013453
11925 -1013453 -1040547 -564342 -264573 -450660 -817243 -1051500 -974270 -315698 830156 1523020
11915 1523020 857357 -682621 -1565255 -1019376 167131 809116 723580 691226 1303774
11906 1303774 2121537 2065816 666881 -1296672 -2665923 -3115997 -3012508 -2449633 -1322460
$$ packed form
11970B13385M07951J123090P23300n05494j411909j506413j045098k15958O95027
11961a522119R07422J06504o82482l76013N19770Q07941N56542O39474Q13741
11952A770780L4851j440760k017410j006784N32797J369382J256241N13435k93597
11943G18935l42472N11794J013250R6135j166147q92543O14530J207881K27051
11934A988414o55055k92527L38119J40072m02248m97048m26925o10006n96249
11925a013453k7094M76205K99769j86087l66583k34257P7230O58572J145854O92864
11915A523020o65663j539978q82634N45879J186507O41985q5536l2354O12548
11906A303774Q17763n5721j398935j963553j369251m50074J03489N62875J127173
$$ plain form
11897 -1322460 -132991 394213 466147 790506 1020963 142643 -1410326 -1830437 -734769
11888 -734769 -12150 -864956 -1851526 -1321031 -126360 -42266 -757933 -562233 718218
11879 718218 1516010 929651 -434684 -1825670 -2936057 -3237940 -2260740 -632624 378652
11870 378652 403947 32557 -469266 -1322826 -2212076 -2291427 -1369171 -206504 425734 316264
11860 316264 -393588 -1287630 -1768615 -1699587 -1609108 -1727507 -1466427 -560869 87197 -316907
11850 -316907 -1111570 -1219230 -804693 -657716 -616638 -16312 833035 1091013 935135 1219800
11840 1219800 1861227 1953672 1285870 431699 -417175 -1379733 -1927881 -1425596 -452527 -196792
11830 -196792 -673991 -921769 -767318 -906173 -1348185 -1382646 -1120914 -1458611 -2317875 -2521385
$$ packed form
11897a322460J189469N27204P1934L24359K30457q78320j552969m20111J095668
11888g34769P22619q52806r86570N30495J194671Q4094p15667J95700J280451
11879G18218P97792n86359j364335j390986j110387l01883R77200J628116J011276
11870C78652K5295l71390n01823q53560q89250p9351R22256J162667O32238j09470
11860C16264p09852q94042m80985O9028R0479j18399K61080R05558O48066m04104
11850c16907p94663j07660M14537J46977M1078O00326Q49347K57978j55878K84665
11840A219800O41427R2445o67802q54171q48874r62558n48148N02285R73069K55735
11830a96792m77199k47778J54451j38855m42012l4461K61732l37697q59264k03510
$$ plain form
11820 -2521385 -1764204 -1198230 -1569781 -2169876 -2214365 -1980202 -1881441 -1563699 -744213 -65969
11810 -65969 -242650 -908520 -1081623 -493356 123550 32968 -567579 -827238 -496000 -470958
11800 -470958 -1423730 -2216315 -1050711 1604614 2989699 1809854 163138 220474 804778
11791 804778 -449068 -2899344 -3710452 -2264212 -838927 -829106 -1053840 -387913 419050
11782 419050 494972 341604 488926 328618 -629584 -1670075 -1952447 -1536326 -659440 773813
11772 773813 2288855 2648048 1393101 -339257 -1173970 -855225 113076 1205885 1868842
11763 1868842 1709975 1046310 478405 -72046 -921066 -1464502 -856842 292841 551027
11754 551027 -4641 83048 1007491 1244796 258792 -449695 123584 891626 750612 409428
$$ packed form
11820b521385P57181N65974l71551o00095m4489K34163R8761L17742Q19486O78244
11810f5969j76681o65870j73103N88267O16906r0582o00547k59659L31238K5042
11800d70958r52772p92585J165604K655325J385085j179845j646716N7336N84304
11791H04778j253846k450276q11108J446240J425285R821k24734O65927Q06963
11782D19050P5922j53368J47322j60308r58202j040491k82372M16121Q76886J433253
11772G73813J515042L59193j254947j732358q34713L18745R68301J092809O62957
11763A868842j58867o63665n67905n50451q49020n43436O07660J149683K58186
11754E51027n55668Q7689R24443K37305r86004p08487N73279P68042j41014l41184
$$ plain form
11744 409428 760082 1016428 73603 -1462588 -2149580 -1754916 -1108834 -647126 -276262
11735 -276262 -80415 -182808 -417243 -761605 -1385112 -1852679 -1363660 -267208 10719
11726 10719 -786490 -1125588 -225851 501378 -81418 -607450 674264 2824049 3431215
11717 3431215 2163861 908926 654879 368116 -774318 -1860229 -1677826 -509136 292594
11708 292594 -28229 -903003 -1228029 -697868 -213783 -662205 -1497113 -1384697 -280502
11699 -280502 372383 -69407 -407880 257092 796393 -110146 -1548749 -1564485 -100929
11690 -100929 1090438 1158153 932843 999636 816323 203860 119351 1116223 2195330 2146993
11680 2146993 1289313 932839 1530117 2231674 2182993 1519183 879524 473839 76598 -291734
$$ packed form
11744D09428L50654K56346r42825j536191o86992L94664O46082M61708L70864
11735b76262J95847j02393k34435l44362o23507m67567M89019J096452K77927
11726A0719p97209l39098Q99737P27229n82796n26032J281714K149785O07166
11717C431215j267354j254935k54047k86763j142434j085911J82403J168690Q01730
11708B92594l20823q74774l25026N30161M84085m48422q34908J12416J104195
11699b80502O52885m41790l38473O64972N39301r06539j438603j5736J463556
11690a00929J191367O7715k25310O6793j83313o12463q4509R96872J079107m8337
11680B146993q57680l56474N97278P01557m8681o63810o39659m05685l97241l68332
$$ plain form
11670 -291734 -283383 42480 -9239 -810093 -1665849 -1667622 -956090 -378280 -150513 197319
11660 197319 684119 789674 565328 658139 991792 656551 -466922 -1257441 -1175210 -1258338
11650 -1258338 -2369405 -3585755 -3512930 -2335781 -1320728 -938614 -768164 -793934 -1427096
11641 -1427096 -2340712 -2502681 -1566227 -379900 109691 -93330 -227698 297317 1172885
11632 1172885 1338095 231806 -1058480 -701304 1436179 3172551 2591530 432484 -1045279
11623 -1045279 -878971 94223 1040575 1998366 2918579 3106482 2092166 381572 -972023
11614 -972023 -1171874 -117949 1409436 2080921 1181848 -468132 -1250097 -443872 1197557
11605 1197557 2449230 2674322 1989452 1014956 562502 1032926 1914158 2224935 1608926
$$ packed form
11670b91734Q351L25863n1719q00854q55756j773P11532N77810K27767L47832
11660A97319M86800J05555k24346R2811L33653l35241j123473p90519Q2231q3128
11650a258338j111067j216350P2825J177149J015053L82114J70450k5770o33162
11641a427096r13616j61969R36454J186327M89591k03021j34368N25015Q75568
11632A172885J65210j106289j290286L57176K137483J736372n81021k159046j477763
11623a045279J66308R73194R46352R57791R20213J87903j014316j710594j353595
11614i72023j99851J053925J527385O71485q99073j649980p81965Q06225J641429
11605A197557J251673K25092o84870r74496m52454M70424Q81232L10777o16009
$$ plain form
11596 1608926 721851 428744 843264 1272268 989697 -786 -970505 -1285218 -1129503
11587 -1129503 -1133779 -1319143 -935645 406744 1957464 2652240 2382297 1889167 1612385
11578 1612385 1305064 824836 624762 1051293 1550382 1181251 -55089 -954663 -552400
11569 -552400 522904 736269 -399539 -1772580 -2237555 -1947952 -1643845 -1323254 -427030
11560 -427030 1029596 2308183 2800372 2486770 1789273 1456741 2174833 3652839 4541622
11551 4541622 3977798 2721028 1948734 1530248 593307 -717514 -1392286 -1206991 -885649
11542 -885649 -735037 -427573 -76597 -193391 -567328 -501506 -153369 -263818 -571963 -44138
11532 -44138 1201462 1833483 1464284 1248250 1907343 2748124 3140955 3376328 3448008 2603685
$$ packed form
11596A608926q87075k93107M14520M29004k82571r90483r69719l14713J55715
11587a129503m276j85364L83498J342389J550720O94776k69943m93130k76782
11578A612385l07321m80228k00074M26531M99089l69131j236340q99574M02263
11569e52400J075304K13365j135808j373041m64975K89603L04107L20591Q96224
11560d27030J456626J278587M92189l13602o97497l32532P18092J478006Q88783
11551D541622n63824j256770p72294m18486r36941j310821o74772J85295L21342
11542h85649J50612L07464L50976j16794l73937O5822L48137j10449l08145N27825
11532d4138J245600O32021l69199k16034O59093Q40781L92831K35373P1680q44323
$$ plain form
11522 2603685 896351 -301191 -183599 413644 582720 614838 903088 929593 230725
11513 230725 -808676 -1825539 -2895359 -3522475 -2715999 -765192 622827 708253 625189
11504 625189 1184230 1624387 1454314 1514752 2038806 1724830 161664 -879579 -201084
11495 -201084 805334 663888 207647 409178 43527 -1892849 -3441182 -2396721 -153622
11486 -153622 438032 -236313 420053 2336516 2752992 948572 -713797 -871992 -810210
11477 -810210 -1236871 -761414 1082619 2216987 1140617 -633003 -999348 -236007 157255
11468 157255 7016 90123 354786 166935 -374455 -657766 -565710 -349928 -94628 -22392
11458 -22392 -611729 -1691395 -2140521 -1224852 378474 1488124 1724887 1414441 913092
$$ packed form
11522B603685j707334j197542J17592N97243J69076L2118K88250K6505o98868
11513B30725j039401j016863j069820o27116Q06476J950807J388019Q5426q3064
11504F25189N59041M40157j70073O0438N24054l13976j563166j041243O78495
11495b01084J006418j41446m56241K01531l65651j936376j548333J044461K243099
11486a53622N91654o74345O56366J916463M16476j804420j662369j58195O1782
11477h10210m26661M75457J844033J134368j076370j773620l66345P63341L93262
11468A57255j50239Q3107K64663j87851n41390k83311R2056K15782K55300P2236
11458b2392n89337j079666m49126R15669J603326J109650K36763l10446n01349
$$ plain form
11449 913092 583991 732827 991135 453577 -977670 -2071394 -1760123 -554368 257106
11440 257106 332924 422673 1062636 1882204 2213168 1869655 1194056 589631 160282 -196396
11430 -196396 -445124 -414050 -217022 -269467 -574039 -441485 528441 1564488 1553583 565350
11420 565350 -201382 45565 876045 1351827 953439 -191132 -1423899 -1898325 -1307378
11411 -1307378 -251754 479191 745623 763317 468504 -97968 -235519 608509 1731541
11402 1731541 1891788 992878 33079 -512297 -1093201 -1807956 -1975605 -1366722 -776621
11393 -776621 -817829 -1013131 -690104 -62739 222631 97002 -20 119879 209591 -9230
11383 -9230 -578433 -1291086 -1768107 -1731655 -1315127 -914786 -701382 -500069 -143551 296882
$$ packed form
11449I13092l29101J48836K58308n37558j431247j093724L11271J205755Q11474
11440B57106P5818Q9749O39963Q19568L30964l43513o75599o04425m29349l56678
11430a96396k48728L1074J97028n2445l04572J32554R69926J036047j0905r88233
11420E65350p66732K46947Q30480M75782l98388j144571j232767m74426N90947
11411a307378J055624P30945K66432J7694k94813n66472j37551Q44028J123032
11402A731541J60247q98910r59799n45376n80904p14755j67649O08883N90101
11393g76621m1208j95302L23027O27365K85370j25629r7022J19899Q9712k18821
11383i230n69203p12653m77021L6452M16528M00341K13404K01313L56518M40433
$$ plain form
11373 296882 594626 476236 -190894 -1045512 -1325914 -749003 -77649 -282971 -1281222 -2066633
11363 -2066633 -2016905 -1461430 -949920 -604252 -382598 -436265 -854695 -1341148 -1429574 -923365
11353 -923365 -12998 911112 1459872 1350090 483951 -887507 -2027030 -2042398 -763928
11344 -763928 786418 1240369 237738 -1386353 -2624438 -2997993 -2428737 -1230758 -308481
11335 -308481 -521649 -1579651 -2266456 -1983445 -1337455 -1009893 -912139 -778859 -716338 -743428
11325 -743428 -608318 -467308 -906565 -1867456 -2406247 -1967476 -1063071 -305912 318818 848961
11315 848961 999958 799249 576286 125467 -881209 -1560948 -628511 1145059 1412634
11306 1412634 -52146 -520246 1480774 3536215 2955536 893029 281023 1244654 1483574
$$ packed form
11373B96882K97744j18390o67130q54618k80402N76911O71354k05322r98251p85411
11363b066633M9728N55475N11510L45668K21654n3667m18430m86453q8426N06209
11353i23365R10367R24110N48760j09782q66139j371458j139523j5368J278470
11344g63928J550346M53951j002631j624091j238085l73555N69256J197979R22277
11335c08481k13168j058002o86805K83011O45990L27562R7754J33280O2521k7090
11325g43428J35110J41010m39257r60891n38791M38771R04405P57159O24730N30143
11315H48961J50997k00709k22963m50819j006676o79739R32437J773570K67575
11306A412634j464780m68100K001020K055441n80679k062507o12006R63631K38920
$$ plain form
11297 1483574 284485 -777699 -828866 -739942 -1101546 -1377383 -1276504 -1116761 -735869
11288 -735869 250581 1130310 747624 -524334 -1115347 -556182 155787 435184 685687
11279 685687 947871 606111 -339131 -1078670 -1182050 -789148 181316 1672996 2654075
11270 2654075 2174593 1017548 721678 1236077 1238923 503255 55817 147264 99976 183169
11260 183169 1469447 3507620 4267105 3023579 1420066 957915 1152380 915123 148798
11251 148798 -836556 -2008703 -2877377 -2428156 -676028 860997 1062804 598347 711555
11242 711555 1523162 2209056 2151307 1432149 769164 1085128 2403231 3263751 2275392 183543
11232 183543 -839664 -22087 1224898 1537367 1200595 1065852 1149886 1011587 643070
$$ packed form
11297A483574j199089j062184n1167Q8924l61604k75837J00879J59743L80892
11288g35869R86450Q79729l82686j271958n91013N59165P11969K79397K50503
11279F85687K62184l41760r45242p39539j03380L92902R70464J491680R81079
11270B654075m79482j157045k95870N14399K846p35668m47438R1447m7288Q3193
11260A83169J286278K038173P59485j243526j603513m62151J94465k37257p66325
11251A48798r85354j172147q68674M49221J752128J537025K01807m64457J13208
11242G11555Q11607O85894n7749p19158o62985L15964J318103Q60520r88359k091849
11232A83543j023207Q17577J246985L12469l36772j34743Q4034j38299l68517
$$ plain form
11223 643070 384678 497955 1076166 1894491 2388764 2292350 1977292 1592954 576008 -1063856
11213 -1063856 -1890811 -884188 666032 812352 -138910 -288466 750584 1518148 1270337
11204 1270337 724313 252023 -519282 -1166607 -667090 615901 1214954 1035931 1358133
11195 1358133 2136166 1807856 344811 -179895 894989 1348433 -342336 -2265028 -1898849
11186 -1898849 64783 864559 -469961 -2359948 -3137937 -2581232 -1266791 263770 1622797
11177 1622797 2573445 2975554 2675928 1852280 1334744 1789909 2660306 2861330 2412162
11168 2412162 2237975 2484456 2387524 1789486 1321395 1048974 495465 53842 620215 1629412
11158 1629412 1364115 -310078 -1389518 -600485 887829 1411689 957819 572995 950021
$$ packed form
11223F43070k58392J13277N78211Q18325M94273r6414l15058l84338j016946j639864
11213a063856q26955J006623J550220J46320r51262j49556J039050P67564k47811
11204A270337n46024m72290p71305o47325M99517J282991N99053j79023L22202
11195A358133P78033l28310j463045n24706J074884M53444j690769j922692L66179
11186a898849J963632P99776j334520j889987p77989N56705J314441J530561J359027
11177A622797R50648M02109k99626q23648n17536M55165Q70397K01024m49168
11168B412162j74187K46481r6932n98038m68091k72421n53509m41623N66373J009197
11158A629412k65297j674193j079440P89033J488314N23860m53870l84824L77026
$$ plain form
11149 950021 2235874 3996202 4920563 3873213 1574647 -106986 -650318 -1073806 -1636392
11140 -1636392 -1361520 -146035 758611 870698 1050037 1481029 1255085 505278 628824
11131 628824 1678607 1957811 1067597 801384 1903666 2567325 1571116 345747 255617
11122 255617 307743 -538273 -1154369 -471272 259789 -281586 -970436 -368070 514090 165489
11112 165489 -427039 437483 1818080 1591313 249061 99336 1211103 1287942 -391491
11103 -391491 -1813923 -1527510 -619855 -569146 -1104588 -1211206 -808181 -426112 -176854 111666
11093 111666 299415 68848 -598193 -1320094 -1566741 -1097358 -295626 207865 396022 887581
11083 887581 1899392 2780561 2875775 2242453 1231015 48129 -948978 -1269979 -981992
$$ packed form
11149I50021J285853J760328R24361j047350k298566j681633n43332m23488n62586
11140a636392K74872J215485R04646J12087J79339M30992k25944p49807J23546
11131F28824J049783K79204q90214k66213J102282O63659r96209j225369r0130
11122B55617N2126q46016o16096O83097P31061n41375o88850O02366Q82160l48601
11112A65489n92528Q64522J380597k26767j342252j49725J111767P6839j679433
11103c91491j422432K86413R07655N0709n35442j06618M03025L82069K49258K88520
11093A11666J87749k30567o67041p21901k46647M69383Q01732N03491J88157M91559
11083H87581J011811Q81169R5214o33322j011438j182886r97107l21001K87987
$$ plain form
11074 -981992 -722069 -763442 -769231 -591730 -444437 -182660 560076 1378884 1365813 558254
11064 558254 -61620 -212376 -676479 -1733174 -2526300 -2374356 -1556605 -572768 213692
11055 213692 205402 -749288 -1384488 -368043 1452755 2036072 1318025 1190122 2161253 2530630
11045 2530630 1443597 297692 239148 539985 400919 221296 206682 -153058 -488223
11036 -488223 256749 1376500 796836 -1275875 -2042201 -563416 614949 -205103 -1166757
11027 -1166757 -456653 564176 251258 -238480 502559 1158341 254829 -661671 400821
11018 400821 2133265 2050917 744311 695734 2057587 2785194 2139068 1198033 568950
11009 568950 121042 297446 1382417 2232747 1824618 1069155 1084289 1001437 -241301 -1371628
$$ packed form
11074i81992K59923m1373n789J77501J47293K61777P42736Q18808j3071q07559
11064E58254o19874j50756m64103j056695p93126J51944Q17751R83837P86460
11055B13692q290r54690o35200J016445J820798N83317p18047j27903R71131L69377
11045B530630j087033j145905n8544L00837j39066j79623j4614l59740l35165
11036d88223P44972J119751n79664k072711p66326J478785J178365q20052r61654
11027a166757P10104J020829l12918m89738P41039O55782r03512r16500J062492
11018D00821J732444q2348j306606m8577J361853P27607o46126r41035o29083
11009E68950m47908J76404J084971Q50330m08129p55463J5134q2852j242738j130327
$$ plain form
10999 -1371628 -659986 938869 1255640 422330 136680 415150 8717 -699325 -183340
10990 -183340 1288814 2006298 1767037 1808792 2084940 1298442 -415071 -1380769 -1071269
10981 -1071269 -647557 -733051 -739542 -483282 -508681 -694985 -281844 672188 1365250 1641733
10971 1641733 1941067 2225116 2259424 2371006 2638287 2191324 712682 -465218 -354017
10962 -354017 -136178 -1138425 -2303417 -1871586 -398253 291892 146552 398026 899067
10953 899067 516206 -454023 -767671 -612875 -1087337 -1784599 -1318003 131132 1121339
10944 1121339 1447014 2059314 2852094 2782415 1925990 1301962 976019 337699 -221777 45115
10934 45115 492501 69832 -585612 -213572 630026 522384 -129915 180881 1201329 1314788
$$ packed form
10999a371628P11642J598855L16771q33310k85650K78470m06433p08042N15985
10990a83340J472154P17484k39261M1755K76148p86498j713513r65698L09500
10981a071269M23712q5494o491K56260k5399j86304M13141R54032O93062K76483
10971A641733K99334K84049L4308J11582K67281m46963j478642j177900J11201
10962c54017K17839j002247j164992M31831J473333O90145j45340K51474N01041
10953H99067l82861r70229l13648J54796m74462o97262M66596J449135R90207
10944A121339L25675O12300P92780o9679q56425o24028l25943o38320n59476K66892
10934D5115M47386m22669o55444L72040Q43598j07642o52299L10796J020448J13459
$$ plain form
10924 1314788 399415 -168729 -18882 88085 252914 1171862 2236994 2237947 1579908 1549634
10914 1549634 1921481 1621224 1054929 1213285 1208983 -423296 -2538995 -2535783 -406626 1322699
10904 1322699 1496764 1205962 947201 23854 -1170633 -1336455 -904501 -1485110 -2522096
10895 -2522096 -1687452 961104 2483287 1566371 490132 1412287 3340528 4134081 3364448
10886 3364448 1963999 773588 379579 937907 1629602 1608336 1436706 2000320 2471325
10877 2471325 1517983 100308 411320 2132388 2588351 926215 -661905 -481690 511506
10868 511506 867731 587137 116216 -476804 -638567 363772 1744184 1786364 538671
10859 538671 -125379 507317 1114130 889380 754168 1368938 1966867 1871609 1424328 885858
$$ packed form
10924A314788r15373n68144J49847J06967J64829R18948J065132R53o58039l0274
10914A549634L71847l00257n66295J58356m302j632279k115699L212K129157J729325
10904A322699J74065k90802k58761r23347j194487j65822M31954n80609j036986
10895b522096Q34644K648556J522183r16916j076239R22155J928241P93553p69633
10886C364448j400449j190411l94009N58328O91695k1266j71630N63614M71005
10877B471325r53342j417675L11012J721068M55963j662136j588120J80215R93196
10868E11506L56225k80594m70921n93020j61763J002339J380412M2180j247693
10859E38671o64050O32696O06813k24750j35212O14770N97929r5258m47281n38470
$$ plain form
10849 885858 61863 -693153 -765657 -660113 -1314327 -2117664 -1612771 -124838 459750 -395695
10839 -395695 -1327875 -1483740 -1286105 -743035 675225 2244284 2353762 1034148 59132
10830 59132 275688 799966 929228 794940 157156 -1239586 -2139433 -933841 1579761
10821 1579761 2897522 2337337 1554614 1493632 1285870 457189 -112518 111039 570199
10812 570199 747853 382451 -1077179 -3349710 -4361674 -2666345 -53960 722323 -89676
10803 -89676 -332212 71495 -443187 -1480441 -1221570 -93487 -113985 -896192 -276582 1264335
10793 1264335 1124680 -333433 150793 2857819 3981407 1814136 -431993 31333 1456838
10784 1456838 1200772 -10891 -137716 584375 707547 218062 -30784 47233 254646
$$ packed form
10849H85858q23995p55016p2504J05544o54214q03337N04893J487933N84588q55445
10839c95695r32180j55865J97635N43070J418260J569059J09478j319614r75016
10830E9132K16556N24278J29262j34288o37784j396742q99847J205592K513602
10821A579761J317761n60185p82723o0982k07762q28681n69707K23557M59160
10812E70199J77654l65402j459630k272531j011964J695329K612385P76283q11999
10803h9676k42536M03707n14682j037254K58871J128083k0498p82207O19610J540917
10793A264335j39655j458113M84226K707026J123588k167271k246129M63326J425505
10784A456838k56066j211663j26825P22091J23172m89485k48846P8017K07413
$$ plain form
10775 254646 740754 1125847 619399 -318894 -275762 706027 1077359 476349 202950 711272
10765 711272 1058715 1123224 1787332 2643718 2233423 863516 383463 890576 616060 -624486
10755 -624486 -1005456 -105133 473099 352258 937468 2172719 2162393 731288 -67842
10746 -67842 246128 -183231 -1641546 -1874610 -267738 609856 -787903 -2496453 -2422248
10737 -2422248 -1292897 -635816 -431807 -210406 -158295 -87821 494768 779304 -435353
10728 -435353 -2048847 -1731926 225616 1301462 998970 1177018 1991550 1409666 -714034
10719 -714034 -1949816 -1353748 -499245 21189 1184453 2187689 795498 -2234999 -3382415
10710 -3382415 -1859315 -567734 -770641 -428392 1098139 1478805 33075 -647410 679199
$$ packed form
10775B54646M86108L85093n06448r38293M3132R81789L71332o01010k73399N08322
10765G11272L47443O4509O64108Q56386m10295j369907m80053N07113k74516j240546
10755f24486l80970R00323N78232j20841N85210J235251j0326j431105p99130
10746f7842L13970m29359j458315k33064J606872Q77594j397759j708550P4205
10737b422248J129351O57081K04009K21401N2111P0474N82589K84536j214657
10728d35353j613494L16921J957542J075846l02492J78048Q14532n81884k123700
10719g14034j235782N96068Q54503N20434J163264J003236j392191l030497j147416
10710c382415J523100J291581k02907L42249J526531L80666j445730o80485J326609
$$ plain form
10701 679199 1940625 1834034 1579261 1372184 -326607 -2674730 -2436255 452806 2199950
10692 2199950 1518394 1493477 3387697 4082535 1991033 148879 715118 1455896 523814
10683 523814 -147470 853965 1421537 218415 -496702 773108 1896379 1342081 961415
10674 961415 1909701 2157581 680544 -234204 626223 1118448 178729 -70929 1099686
10665 1099686 1223572 -326867 -631770 1147797 1891600 684598 980777 3825505 5082257
10656 5082257 2717667 643993 1606550 2512743 1009199 420762 3273914 5748820 3906853
10647 3906853 348728 -517575 810335 1779385 2713329 4165046 3868809 955955 -1145896
10638 -1145896 -233777 845453 -207555 -918361 461019 831216 -1750513 -3574779 -1762002
$$ packed form
10701F79199J261426j06591k54773k07077j698791k348123K38475K889061J747144
10692B199950o81556k4917J894220O94838k091502j842154N66239P40778r32082
10683E23814o71284J001435N67572j203122p15117J269810J123271n54298l80666
10674I61415R48286K47880j477037r14748Q60427M92225r39719k49658J170615
10665A099686J23886j550439l04903J779567P43803j207002K96179K844728J256752
10656E082257k364590k073674R62557R06193j503544n88437K853152K474906j841967
10647C906853l558125q66303J327910R69050R33944J451717k96237k912854k101851
10638a145896R12119J079230j053008p10806J379380L70197k581729j824266J812777
$$ plain form
10629 -1762002 313805 -720247 -2079772 -382773 2028818 1986288 1501399 3137735 4447739
10620 4447739 2813320 918565 1706785 2803969 1533051 345720 1634252 2501863
10612 2501863 511211 -920300 1066551 2695330 324745 -2437516 -1188393 1342385
10604 1342385 913305 -213899 1675669 3945217 2529365 -173875 112222 1732089
10596 1732089 1229602 506042 2449437 4257827 2612728 653803 2282079 4505953
10588 4505953 3099581 739207 1641191 3316591 1746677 -491550 502832 1988576
10580 1988576 341198 -875253 2476825 6109099 4382570 880553 2043427 5510525
10572 5510525 5062755 2258159 2591309 4549912 3144340 279051 1096558 3784756 3263501
$$ packed form
10629a762002K075807j034052j359525J696999K411591m2530m84889J636336J310004
10620D447739j634419j894755P88220J097184j270918j187331J288532Q67611
10612B501863j990652j431511J986851J628779k370585k762261J249123K530778
10604A342385m29080j127204J889568K269548j415852k703240K86097J619867
10596A732089n02487p23560J943395J808390j645099j958925J628276K223874
10588D505953j406372k360374R01984J675400j569914k238227R94382J485744
10580A988576j647378j216451L352078L632274j726529l502017J162874L467098
10572E510525m47770k804596L33150J958603j405572k865289Q17507K688198n21255
$$ plain form
10563 3263501 1203723 2285207 4420374 2785048 -394288 -8068 2185160 1721903
10555 1721903 689516 3005738 5553048 4007088 1954594 4047409 6304315 3833981
10547 3833981 1245314 3965483 6732698 3168469 -1041282 1942701 6961768 5215683
10539 5215683 947191 3113217 7873717 6030469 1023353 2232452 6761459 5573351
10531 5573351 1573692 3446378 7573197 4764442 -978563 495057 5816161 4983533
10523 4983533 1367392 4500450 9845628 7162485 1786217 5017811 11050820 7483611
10515 7483611 567191 4109921 11825033 8723460 1231210 5535310 14805073 11150144
10507 11150144 1459601 5270034 15658818 11757920 1544788 8267634 22533403 17117717
$$ packed form
10563C263501k059778J081484K135167j635326l179336L86220K193228m63257
10555A721903j032387K316222K547310j545960k052494K092815K256906k470334
10547C833981k588667K720169K767215l564229m209751K983983N019067j746085
10539E215683m268492K166026M760500j843248n007116J209099M529007j188108
10531E573351l999659J872686M126819k808755n743005J473620N321104q32628
10523D983533l616141L133058N345178k683143n376268L231594O033009l567209
10515G483611o916420L542730P715112l101573p492250M304100R269763l654929
10507A1150144r690543L810433J0388784l900898j0213132O722846J4265769n415686
$$ plain form
10499 17117717 2059761 9338836 28734589 22973956 3247682 14451121 43620147
10492 43620147 33450516 -650855 21343419 78936847 20542095 -212254126 -437452615
10485 -437452615 -437551189 -244106439 -80290060 -59198577 -87650634 -64895429 -22903443
10478 -22903443 -24058459 -44903003 -35853108 -12568163 -14349333 -28835877 -23106437 -7296529
10470 -7296529 -9761581 -21782764 -18071554 -5853740 -7688892 -17350858 -14499666 -4846203
10462 -4846203 -7394031 -17137934 -15744002 -6427473 -5808739 -12107067 -11282319 -5227866
10454 -5227866 -6200452 -11555414 -9635603 -3398457 -4450502 -10330758 -9859301 -4779798
10446 -4779798 -5265576 -9800912 -9204143 -5109891 -5817527 -9084156 -6849519 -1968180 -3105626
$$ packed form
10499A7117717j5057956P279075J9395753n760633j9726274J1203439K9169026
10492D3620147j0169631l4101371K1994274N7593428n8394752k32796221k25198489
10485d37452615r8574J93444750J63816379K1091483k8452057K2755205M1991986
10478b2903443j155016k0844544R049895K3284945j781170j4486544N729440J5809908
10470g296529k465052j2021183L711210J2217814j835152r661966K851192R653463
10462d846203k547828r743903J393932R316529O18734o298328Q24748O054453
10454e227866r72586n354962J919811O237146j052045n880256M71457N079503
10446d779798m85778m535336N96769M094252p07636l266629K234637M881339j137446
$$ plain form
10437 -3105626 -7797829 -7066184 -2341228 -1932215 -5020416 -4561817 -1979002 -3931285 -8236543
10428 -8236543 -7558650 -3616115 -3678333 -6346344 -4682963 -330351 -726784 -4853689 -5186501
10419 -5186501 -1792783 -1522137 -4703919 -5071670 -1900310 -601202 -2042986 -2084067 -840233
10410 -840233 -2153673 -4779418 -3877674 -300540 805659 -658796 -686557 294063 -1212560
10401 -1212560 -3622597 -2499152 660505 644233 -2054254 -2644975 -1200497 -1770324 -3908832
10392 -3908832 -3682630 -1752649 -2059819 -3827161 -3156193 -1157208 -2119649 -4927867 -4774096
10383 -4774096 -2296318 -2478135 -5266658 -5806019 -3576481 -2906907 -4417655 -4096836 -1282944
10374 -1282944 103909 -1114095 -1926513 -1482015 -2086273 -3489085 -2820918 -654803 -725323
$$ packed form
10437c105626m692203P31645M724956M09013l088201M58599K582815j952283m305258
10428h236543O77893L942535o2218k668011J663381M352612l96433m126905l32812
10419e186501L393718K70646l181782l67751L171360J299108j441784m1081J243834
10410h40233j313440k625745R01744L577134J106199j464455k7761R80620j506623
10401a212560k410037J123445L159657j6272k698487n90721J444478n69827k138508
10392c908832K26202J929981l07170j767342O70968J998985r62441k808218J53771
10383d774096K477778j81817k788523n39361K229538O69574j510748L20819K813892
10374a282944J386853j218004q12418M44498o04258j402812O68167K166115p0520
$$ plain form
10365 -725323 -3179579 -4278959 -3165462 -2843658 -4048992 -4129644 -2599989 -2150111 -3508966
10356 -3508966 -4490574 -4476087 -4866823 -5110960 -3347975 -868915 -833636 -2735874 -3213323
10347 -3213323 -2018274 -1942552 -3138973 -2987663 -1566558 -1795532 -3856712 -4676199 -3394529
10338 -3394529 -2462917 -2875114 -2976933 -2423238 -2867887 -4308202 -4825091 -4140713 -3669825
10329 -3669825 -3352676 -2251787 -1569215 -2970177 -4783273 -4196384 -2260539 -2138858 -3406747
10320 -3406747 -3019096 -1100953 -627499 -1885374 -2372305 -1812435 -2197425 -3187012 -2567419
10311 -2567419 -987016 -1108850 -2366432 -1847767 -126248 -640647 -3264439 -4231315 -2834422
10302 -2834422 -2414841 -3930699 -4309728 -2413009 -1094110 -1755565 -2072413 -902011 -525921
$$ packed form
10365g25323k454256j099380J113497L21804j205334q0652J529655M49878j358855
10356c508966r81608J4487l90736k44137J762985K479060L5279j902238m77449
10347c213323J195049P5722j196421J51310J421105k28974k061180q19487J281670
10338c394529R31612m12197j01819N53695m44649j440315n16889O84378M70888
10329c669825L17149J100889O82572j400962j813096N86889J935845J21681j267889
10320c406747L87651J918143M73454j257875m86931N59870l84990r89587O19593
10311b567419J580403j21834j257582N18665J721519n14399k623792r66876J396893
10302b834422M19581j515858l79029J896719J318899o61455l16848J170402L76090
$$ plain form
10293 -525921 -2040972 -3096069 -2266906 -1470931 -2034335 -2341151 -1372517 -803720 -1584773
10284 -1584773 -1948476 -757705 411946 284511 -134145 -151836 -839062 -2310629 -2622557
10275 -2622557 -1055035 284239 -304223 -1815560 -2769325 -3216410 -3376795 -2759580 -1674114
10266 -1674114 -1242179 -1171961 -31969 1738937 1943596 375192 -558683 211943 869142
10257 869142 118170 -821972 -868068 -972741 -2027388 -3213061 -3611272 -3388846 -2607117
10248 -2607117 -980507 665600 974514 442256 784243 1763802 1478261 50166 -174525
10239 -174525 1260354 1905087 511472 -1029796 -1173210 -1147243 -2300248 -3635754 -3718729
10230 -3718729 -2925393 -2295981 -1977268 -1972613 -2641278 -3486879 -3239926 -1926356 -1037195 -1074209
$$ packed form
10293e25921j515051j055097Q29163P95975n63404l06816R68634N68797p81053
10284a584773l63703J190771J169651j27435m18656j7691o87226j471567l11928
10275b622557J567522J339274n88462j511337r53765m47085j60385O17215J085466
10266a674114M31935P0218J139992J770906K04659j568404r33875P70626O57199
10257H69142p50972r40142m6096j04673j054647j185673l98211K22426P81729
10248b607117J626610J646107L08914n32258L41987R79559k85541j428095k24691
10239a74525J434879O44733j393615j541268j43414K5967j153005j335506q2975
10230c718729P93336O29412L18713M655o68665q45601K46953J313570Q89161l7014
$$ plain form
10220 -1074209 -937944 -285402 -279256 -1279910 -1977096 -1668805 -1417039 -2124647 -3246519
10211 -3246519 -4017290 -4273092 -3772205 -2510062 -1736590 -2586444 -3784205 -3080143 -875835
10202 -875835 252616 -345109 -722001 13783 529250 291145 541076 1363543 900774
10193 900774 -1348471 -3312029 -3578027 -3089845 -2577839 -1279523 504135 629383 -1453956
10184 -1453956 -3267914 -3037766 -2199407 -2394454 -2653914 -1690682 -548652 -625478 -1119651
10175 -1119651 -781964 -402542 -1204492 -2279692 -1940352 -463473 569623 656180 293393
10166 293393 -413607 -1289949 -1254541 237689 1715594 1373031 -358533 -1438794 -947780
10157 -947780 152416 629813 228132 -484443 -744279 -303342 123673 -381151 -1569473
$$ packed form
10220a074209J36265O52542O146j000654o97186L08291K51766p07608j121872
10211c246519p70771k55802N00887J262143P73472q49854j197761P04062K204308
10202h75835J128451n97725l76892P35784N15467k38105K49931Q22467m62769
10193I00774k249245j963558k65998M88182N12006J298316J783658J25248k083339
10184a453956j813958K30148Q38359j95047k59460R63232J142030p6826m94173
10175a119651L37687L79422q01950j075200L39340J476879J033096Q6557l62787
10166B93393p07000q76342L5408J492230J477905l42563j731564j080261M91014
10157i47780J100196M77397m01681p12575k59836M40937M27015n04824j188322
$$ plain form
10148 -1569473 -2204494 -1746901 -914579 -469791 -535933 -1111439 -1948479 -1987322 -538969 961285
10138 961285 321802 -2046787 -3271484 -2029446 -201828 259983 -168318 -348893 -536522
10129 -536522 -1188681 -1619078 -1411593 -1532087 -2526014 -3206775 -2654525 -1904100 -2029865 -2219360
10119 -2219360 -1619454 -1460404 -3042657 -4883921 -4466286 -2154447 -849051 -1915210 -3724575
10110 -3724575 -4367304 -3781873 -2829435 -2025709 -1746116 -2237059 -2821685 -2301816 -733239
10101 -733239 281856 -298474 -1541184 -1974991 -1579157 -1372086 -1599417 -1495478 -746940
10092 -746940 -96523 -183818 -662756 -996583 -1379277 -2077087 -2433452 -1619956 -145079 579887
10082 579887 224577 -159200 -71390 -392111 -1605954 -2543457 -1993708 -588932 105038
$$ packed form
10148a569473o35021M57593Q32322M44788o6142n75506q37040l8843J448353J500254
10138I61285o39483k368589j224697J242038J827618M61811m28301j80575j87629
10129e36522o52159m30397K07485j20494r93927o80761N52250P50425j25765j89495
10119b219360N99906J59050j582253j841264M17635K311839J305396j066159j809365
10110c724575o42729N85431R52438Q03726K79593m90943n84626N19869J568577
10101g33239J015095n80330j242710m33807L95834K07071k27331J03939P48538
10092g46940O50417q7295m78938l33827l82694o97810l56365Q13496J474877P24966
10082E79887l55310l83777Q7810l20721j213843r37503N49749J404776O93970
$$ plain form
10073 105038 -331356 -1100691 -1577122 -1718948 -1649864 -1750827 -2526919 -3549227 -3455281 -2022420
10063 -2022420 -1111305 -2153872 -3807971 -3850080 -2452293 -1554151 -1700506 -1796814 -1647708
10054 -1647708 -2277004 -3559909 -3856517 -2565017 -1059623 -423691 -47637 742542 1303489
10045 1303489 861065 -244721 -1386262 -2573361 -3715621 -4017692 -3056437 -1728170 -1289558
10036 -1289558 -1896579 -2619174 -2532860 -1547357 -559590 -767623 -2245880 -3386225 -2646598
10027 -2646598 -732183 95707 -1029456 -2560701 -2827820 -2109080 -1695884 -1896795 -2017337
10018 -2017337 -1834520 -2011732 -2937552 -3882007 -3794685 -2735173 -1950700 -2292185 -3051253
10009 -3051253 -2992744 -2193483 -1891711 -2576998 -3382504 -3599311 -3561704 -3537786 -2990285 -1712943
$$ packed form
10073A05038m36394p69335m76431j41826O9084j00963p76092j022308R3946J432861
10063b022420R11115j042567j654099m2109J397787Q98142j46355r6308J49106
10054a647708o29296j282905k96608J291500J505394O35932L76054P90179N60947
10045A303489m42424j105786j141541j187099j142260l02071R61255J328267M38612
10036a289558o07021p22595Q6314R85503R87767k08033j478257j140345P39627
10027b646598J914415Q27890j125163j531245k67119P18740M13196k00911j20542
10018b017337J82817j77212r25820r44455Q7322J059512P84473l41485p59068
10009c051253N8509P99261L01772o85287q05506k16807L7607K3918N47501J277342
$$ plain form
9999 -1712943 -602472 -413919 -692404 -776134 -897308 -1429474 -2029973 -2424317 -3028362 -3880151
9989 -3880151 -4067638 -3249433 -2592759 -3025061 -3670263 -3291116 -2200709 -1396268 -874480
9980 -874480 -286655 -256872 -1417588 -2921878 -3491627 -3277813 -3215884 -3241644 -2681315 -1831037
9970 -1831037 -1640934 -2216402 -2865296 -3183561 -3089373 -2489698 -1920145 -2576575 -4527701 -5888774
9960 -5888774 -5130903 -3316790 -2640426 -3554260 -4728469 -5102877 -4614324 -3574343 -2627217
9951 -2627217 -2712802 -3894163 -4801526 -4261447 -2903198 -2317752 -3223768 -5046366 -6601515
9942 -6601515 -6885260 -6075826 -5752612 -6909531 -8063406 -7106799 -4683646 -3444085 -4211420
9933 -4211420 -5530930 -6716701 -8161362 -8826856 -7206682 -4899204 -5072182 -7068986 -7157927
$$ packed form
9999a712943J110471J88553k78485q3730j21174n32166o00499l94344o04045q51789
9989c880151j87487Q18205O56674m32302o45202L79147J090407Q04441N21788
9980h74480N87825K9783j160716j504290n69749K13814O1929k5760N60329Q50278
9970a831037J90103n75468o48894l18265R4188N99675N69553o56430j951126j361073
9960e888774P57871J814113O76364r13834j174209l74408M88553J039981R47126
9951b627217q5585j181361r07363N40079J358249N85446r06016j822598j555149
9942f601515k83745Q09434L23214j156919j153875R56607K423153J239561p67335
9933d211420j319510j185771j444661o65494J620174K307478j72978j996804q8941
$$ plain form
9924 -7157927 -5136403 -4901364 -7449450 -9108104 -8368257 -8394297 -10548944 -11711336 -10672410
9915 -10672410 -10707992 -12856071 -13475578 -11648733 -11551203 -14015753 -14145894 -11307066 -11864736
9906 -11864736 -17095462 -19470890 -17183873 -19357839 -28438873 -33002301 -30537792 -38887005
9898 -38887005 -63727068 -71097024 -24071269 58518057 113421566 107512366 71155784
9891 71155784 48452676 44396783 38949883 27754887 22491339 24501820 23533345 17815407
9883 17815407 15392338 17519417 17032103 12427423 9836861 11113201 11626561 9963707
9875 9963707 9618413 10927501 10362904 7894218 6996109 7589457 6499753 4444383 5220920
9866 5220920 8288703 9150336 6932941 5093266 4850254 4165953 3004707 3542933 5229588
$$ packed form
9924g157927K021524K35039k548086j658654P39847k6040k154647j162392J038926
9915a0672410l5582k148079o19507J826845R7530k464550j30141K838828n57670
9906a1864736n230726k375428K287017k173966r081034m563428K464509q349213
9898c8887005k4840063p369956M7025755Q2589326N4903509n909200l6356582
9891G1155784k2703108m055893n446900j1194996n263548K010481r68475n717938
9883A7815407k423069K127079m87314m604680k590562J276340N13360j662854
9875I963707l45294J309088n64597k468686q98109N93348j089704k055370P76537
9866E220920L067783Q61633k217395j839675k43012o84301j161246N38226J686655
$$ plain form
9857 5229588 5294452 4025374 4178269 5472187 5029549 3002004 2433595 3649200 3946484
9848 3946484 2887691 2902814 4410655 5011690 3875555 2742294 2403484 2060617 2020747
9839 2020747 3207251 4340570 3432020 1618627 1678024 3286665 3656363 2342400 1502631
9830 1502631 1848035 2133495 2166730 2657954 2748736 1324653 -90671 546619 1916262
9821 1916262 1509422 385896 1339624 3463754 3402011 1318473 602854 1854636 2159118
9812 2159118 600088 -294015 755620 1982567 2202913 2298855 2473763 1775327 854264
9803 854264 1549819 3309952 3612478 2283606 1800782 2994910 4067895 4180925 4358219
9794 4358219 4504925 3287283 1443588 1428324 3093736 3432335 1474418 -120985 604614
$$ packed form
9857E229588O4864j269078J52895J293918m42638k027545n68409J215605K97284
9848C946484j058793J5123J507841O01035j136135j133261l38810l42867l9870
9839B020747J186504J133319r08550j813393N9397J608641L69698j313963q39769
9830A502631L45404K85460L3235M91224R0782j424083j415324O37290J369643
9821A916262m06840j123526R53728K124130o1743k083538p15619J251782L04482
9812B159118j559030q94103J049635J226947K20346R5942J74908o98436r21063
9803H54264O95555J760133L02526j328872m82824J194128J072985J13030J77294
9794D358219J46706j217642j843695j5264J665412L38599j957917j595403P25599
$$ plain form
9785 604614 2301612 3158913 3355265 3528490 3425067 3060339 2966787 2734030 1504305 79389
9775 79389 152669 1445877 2101317 1778367 1745110 2164339 2091655 1881277 2667941 3749653
9765 3749653 3469743 2331533 2161320 2693536 2297519 1481965 1987322 2916407 1839977
9756 1839977 -474996 -748158 1277683 2370707 1340092 596581 1337137 1555675 180523
9747 180523 -856524 -268287 473917 211408 -14899 489042 814271 900127 1968983 3402818
9737 3402818 2661596 -343403 -2274367 -1333921 155761 -106522 -932038 -382045 878431
9728 878431 1191612 629353 159798 -59923 -68406 490395 1267151 1272803 738851 999900
9718 999900 2121144 2790878 2759498 2949631 3113642 2192820 1009774 1406811 2603273
$$ packed form
9785F04614J696998Q57301J96352J73225j03423l64728r3552k32757j229725j424916
9775G9389P3280J293208O55440l22950l3257M19229p2684k10378P86664J081712
9765C749653k79910j138210j70213N32216l96017q15554N05357R29085j076430
9756A839977k314973k73162K025841J093024j030615p43511P40556K18538j375152
9747A80523j037047N88237P42204k62509k26307N03941L25229Q5856J068856J433835
9737C402818p41222l004999j930964R40446J489682k62283q25516N49993J260476
9728H78431L13181n62259m69555k19721q483N58801P76756N652n33952K61049
9718I99900J121244O69734l1380J90133J64011r20822j183046L97037J196462
$$ plain form
9709 2603273 1959706 -346859 -1300326 -274360 -104907 -1880454 -2934732 -1651117 -194183
9700 -194183 -458831 -1056584 -499807 96277 -294919 -478508 243946 367676 -713730 -1044505
9690 -1044505 362842 1500004 982655 445968 1088276 1167574 -555787 -2159274 -2021203
9681 -2021203 -1725608 -2662080 -2958521 -1009259 1000865 644101 -424905 513739 2255385
9672 2255385 1703168 -879139 -2571070 -2490302 -2146426 -2089485 -1618992 -1108014 -1475625 -1884690
9662 -1884690 -789897 1195718 2013442 1230649 113540 -729712 -1540824 -1891360 -1173482
9653 -1173482 -127665 23237 -575440 -1032458 -1341284 -1797827 -1831498 -1087419 -555759 -934092
9643 -934092 -1115349 -100661 933007 476835 -684472 -824883 -102042 153558 -49072
$$ packed form
9709B603273o43567k306565r53467J025966J69453j775547j054278J283615J456934
9700a94183k64648n97753N56777N96084l91196j83589P22454J23730j081406l30775
9690a044505J407347J137162n17349n36687O42308P9298j723361j603487J38071
9681b021203K95595r36472k96441J949262K010124l56764j069006R38644J741646
9672B255385n52217k582307j691931Q0768L43876N6941M70493N10978l67611m09065
9662a884690J094793J985615Q17724p82793j117109q43252q11112l50536P17878
9653a173482J045817J50902n98677m57018l08826m56543l3671P44079N31660l78333
9643i34092j81257J014688J033668m56172j161307j40411P22841K55600k02630
$$ plain form
9634 -49072 237220 841279 938197 826201 1265806 1782559 1499979 898195 947692 1315679
9624 1315679 1178866 891199 1060996 978861 -134459 -1281529 -1041487 113809 735069
9615 735069 689448 660823 397476 -520383 -1173390 -664865 10121 -362945 -752254 435378
9605 435378 2139584 1925082 -8003 -916974 434206 2420749 3394430 3417448 2824434
9596 2824434 1388850 -411886 -1228758 -676230 141892 408552 497763 762025 834234 546779
9586 546779 253043 -159472 -1334714 -3047825 -3840676 -2684786 -314743 1540106 1798982
9577 1798982 739343 -485537 -911606 -576410 -195336 -52294 203700 540050 274637
9568 274637 -690629 -1355953 -1036449 -342437 24523 440180 1355973 2102308 1862352 1087527
$$ packed form
9634d9072K86292O04059R6918j11996M39605N16753k82580o01784M9497L67987
9624A315679j36813k87667J69797q2135j113320j147070K40042J155296O21260
9615G35069m5621k8625k63347r17859o53007N08525O74986l73066l89309J187632
9605D35378J704206k14502j933085r08971J351180J986543R73681K3018n93014
9596B824434j435584j800736q16872N52528Q18122K66660Q9211K64262P2209k87455
9586E46779k93736m12515j175242j713111p92851J155890K370043J854849K58876
9577A798982j059639j224880m26069L35196L81074J43042K55994L36350k65413
9568B74637r65266o65324L19504O94012L66960M15657R15793P46335k39956p74825
$$ plain form
9558 1087527 782346 998069 1138245 1204150 1638135 2312173 2591019 2118094 975895 -428970
9548 -428970 -1248889 -786701 363613 798669 399418 642236 2151095 3453196 3220958
9539 3220958 2300897 2183842 2719535 2820962 2395411 2079170 1888614 1536455 1360388 1645165
9529 1645165 1704621 843366 -391196 -960319 -700638 -116019 373092 246628 -970339
9520 -970339 -2579008 -2945641 -1740500 -594508 -605068 -759972 4826 875486 778998 357198
9510 357198 636967 1114487 905328 557171 978058 1689973 1791158 1519680 1323227 685987
9500 685987 -505259 -879710 342874 1676466 1673896 1318197 1948637 2458331 1202645
9491 1202645 -668254 -744338 671375 1098793 -108921 -1148234 -977391 -504424 -517692
$$ packed form
9558A087527l05181K15723J40176O5905M33985O74038K78846m72925j142199j404865
9548d28970q19919M62188J150314M35056l99251K42818J508859J302101k32238
9539C220958r20061j17055N35693J01427m25551l16241j90556l52159j76067K84777
9529A645165N9456q61255j234562n69123K59681N84619M89111j26464j216967
9520i70339j608669l66633J205141J145992j0560j54904P64798Q70660r6488m21800
9510C57198K79769M77520k09159l48157M20887P11915J01185k71478j96453o37240
9500F85987j191246l74451J222584J333592k570l55699O30440N09694j255686
9491A202645j870899p6084J415713M27418j207714j039313J70843M72967j3268
$$ plain form
9482 -517692 -747080 -1072585 -1654743 -1937268 -1394617 -962161 -1764328 -2845697 -2302398 -310242
9472 -310242 1178460 1445889 1450442 1529602 1065410 387067 613761 1445231 1355527 215426
9462 215426 -409689 168585 925011 1092200 998970 731094 -77329 -876308 -551408 596925
9452 596925 1059622 471483 -92348 -236200 -639861 -1196094 -905909 14614 41133 -1130917
9442 -1130917 -1957736 -1522446 -753606 -583068 -714971 -854085 -1394289 -2200908 -2330008 -1595244
9432 -1595244 -911999 -615830 -7005 1037331 1683299 1791934 2190341 2826623 2507222
9423 2507222 1075497 -4225 65143 384968 350352 704552 1662828 1981247 1149728 645020
9413 645020 1485085 2225011 1209976 -501599 -514855 1341201 2780455 2185471 370197
$$ packed form
9482e17692k29388l25505n82158k82525N42651M32456q02167j081369N43299J992156
9472c10242J488702K67429M553P9160m64192o78343K26694Q31470q9704j140101
9462B15426o25115N78274P56426J67189r3230k67876q08423p98979L24900J148333
9452E96925M62697n88139n63831j43852m03661n56233K90185R20523K6519j172050
9442a130917q26819M35290P68840J70538j31903j39114n40204q06619j29100P34764
9432a595244O83245K96169O08825J044336O45968J08635L98407O36282l19401
9423B507222j431725j079722O9368L19825l4616L54200R58276L18419q31519n04708
9413F45020Q40065P39926j015035j711575j3256J856056J439254n94984j815274
$$ plain form
9404 370197 -897098 -934733 -410936 -309447 -943034 -1717437 -1810011 -1135501 -432421 -359718
9394 -359718 -850320 -1396510 -1566896 -1188352 -412079 367020 943898 1478319 1919029 1700893
9384 1700893 616299 -461842 -513253 314439 1074941 1272992 914286 -134887 -1743112
9375 -1743112 -2892159 -2636832 -1417617 -373471 231981 744352 813519 -163080 -1534519
9366 -1534519 -1785559 -417402 1663203 3333735 3735720 2242993 -503519 -2123326 -890538
9357 -890538 1756223 2934049 2154157 1375525 1557181 1640357 1126919 1114770 2049822 2670041
9347 2670041 2117072 1228690 855281 622884 212819 199526 743626 1011134 713950 709141
9337 709141 1310278 1587545 1142119 935109 1444627 1644788 877564 172187 509956 1200401
$$ packed form
9404C70197j267295l7635N23797J01489o33587p74403r2574O74510P03080P2703
9394c59718m90602n46190j70386L78544P76273P79099N76878N34421M40710k18136
9384A700893j084594j078141n1411Q27692P60502J98051l58706j049173j608225
9375a743112j149047K55327J219215J044146O05452N12371O9167r76599j371439
9366a534519k51040J368157K080605J670532M01985j492727k746512j619807J232788
9357h90538K646761J177826p79892p78632J81656Q3176n13438j2149R35052O20219
9347B670041n52969q88382l73409k32397m10065j3293N44100K67508k97184m809
9337G09141O01137K77267m45426k07010N09518K00161p67224p05377L37769O90445
$$ plain form
9327 1200401 1241372 1007643 1271196 1656069 1411826 849418 757334 1048328 1025612 454609
9317 454609 -380848 -1101382 -1210817 -421218 627371 927286 666278 1014696 2048298
9308 2048298 2405210 1538846 623407 418315 -15131 -1367742 -2543436 -2432832 -1748046
9299 -1748046 -1634895 -1798924 -1510429 -1172014 -1265632 -973106 378154 1602793 1304888
9290 1304888 285802 271352 1030833 978077 91897 -168106 299120 -32485 -1414753 -2051837
9280 -2051837 -1080567 -232058 -1237903 -3193655 -3997946 -3272795 -2285917 -1701818 -1040777
9271 -1040777 -144009 343262 203695 186670 841171 1692725 2148245 2473127 3101104 3508299
9261 3508299 2761147 1042140 -326520 -517301 -27320 360110 607090 970241 1241443
$$ packed form
9327A200401M0971k33729K63553L84873k44243n62408r2084K90994k2716n71003
9317D54609q35457p20534j09435P89599J048589K99915k61008L48418J033602
9308B048298L56912q66364r15439k05092m33446j352611j175694J10604O84786
9299a748046J13151j64029K88495L38415r3618K92526J351260J224639k97905
9290A304888j019086j4450P59481n2756q86180k60003M67226l31605j382268o37084
9280b051837R71270Q48509j005845j955752q04291P25151R86878N84099O61041
9271a040777Q96768M87271j39567j7025O54501Q51554M55520L24882O27977M07195
9261C508299p47152j719007j368660j90781M89981L87430K46980L63151K71202
$$ plain form
9252 1241443 1047311 464264 -107741 -298267 174202 1113505 1382866 -90556 -2443649
9243 -2443649 -3305496 -1836164 44135 477559 159737 496912 862261 -76994 -1424982
9234 -1424982 -1124738 508754 1039114 -263406 -1460718 -1235915 -639479 -753379 -903737
9225 -903737 -333604 258490 90182 -348536 -432497 -482147 -667678 -228563 1105912 2197126
9215 2197126 2122758 1557844 1439600 1400970 737747 -57276 -2809 833117 1611167 1960416
9205 1960416 2010559 1740927 1146381 599935 387297 304644 140845 8049 -90243 -317530
9195 -317530 -429748 -1343 611237 542277 -198110 -764108 -1000192 -1515039 -2055878 -1519407
9185 -1519407 -42369 746421 291816 67663 984292 1720170 975163 -309157 -558562
$$ packed form
9252A241443j94132n83047n72005j90526M72469R39303K69361j473422k353093
9243b443649q61847J469332J880299M33424l17822L37175L65349r39255j347988
9234a424982L00244J633492N30360j302520j197312K24803N96436j13900j50358
9225i03737N70133N92094j68308m38718q3961m9650j85531M39115J334475J091214
9215B197126p4368n64914j18244l8630o63223p95023N4467Q35926P78050L49249
9205A960416N0143k69632n94546n46446k12638q2653j63799j32796r8292k27287
9195c17530j12218M28405O12580o8960p40387n65998k36084n14847n40839N36471
9185a519407J477038P88790m54605k24153R16629P35878p45007j284320k49405
$$ plain form
9176 -558562 14528 236548 47679 144181 512909 774086 1056255 1246017 508160 -1053611
9166 -1053611 -1572469 12887 1792257 1333040 -668960 -1438136 -193189 1192822 1399042
9157 1399042 1163470 1286681 1242244 533868 -138642 29972 692929 904323 311390 -635404
9147 -635404 -1230690 -1101453 -571420 -356531 -634495 -808610 -536177 -321010 -530559 -654525
9137 -654525 -352675 -344155 -1141675 -1732955 -941543 481864 703478 -527051 -1616182 -1525847
9127 -1525847 -950491 -852571 -1133039 -1229116 -1050641 -811889 -573931 -313178 -40398 241659
9117 241659 367186 -17124 -865684 -1454539 -1239110 -569711 86927 1034305 2482681 3347692
9107 3347692 2276362 -203834 -1871194 -1420773 129897 974019 575358 -230656 -509413
$$ packed form
9176e58562N73090K22020j88869R6502L68728K61177K82169J89762p37857j561771
9166a053611n18858J585356J779370m59217k002000p69176J244947J386011K06220
9157A399042k35572J23211m4437p08376o72510J68614O62957K11394n92933r46794
9147f35404n95286J29237N30033K14889k77964j74115K72433K15167k09549j23966
9137f54525L01850Q520p97520n91280P91412J423407K21614j230529j089131R0335
9127a525847N75356R7920k80468r6077J78475K38752K37958K60753K72780K82057
9117B41659J25527l84310q48560n88855K15429O69399O56638R47378J448376Q65011
9107C347692j071330k480196j667360M50421J550670Q44122l98661q06014k78757
$$ plain form
9098 -509413 -85138 535781 738721 379007 -162174 -513347 -618772 -365590 550976 1926569
9088 1926569 2744586 2287482 1199213 677064 855922 815391 75374 -773917 -1043950 -830926
9078 -830926 -674058 -825491 -1133069 -1365172 -1426782 -1334204 -1069546 -539537 198072 773447
9068 773447 862148 635112 499510 517143 539429 694726 1058487 1080238 280880 -646565
9058 -646565 -617295 11145 -165978 -1193207 -1448371 -319031 610542 78727 -832631 -610204
9048 -610204 209468 174760 -584773 -847302 -510584 -450588 -649577 -288852 490604 621708
9038 621708 -60789 -508558 -130771 467597 581140 198499 -370137 -733965 -355047 796799
9028 796799 1612088 878037 -1042788 -2484015 -2440009 -1437163 -482779 24435 276266
$$ packed form
9098e09413M24275O20919K02940l59714n41181l51173j05425K53182R16566J375593
9088A926569Q18017m57104j088269n22149J78858m0531p40017q49291k70033K13024
9078h30926J56868j51433l07578k32103o1610R2578K64658N30009P37609N75375
9068G73447Q8701k27036j35602J7633K2286J55297L63761K1751p99358r27445
9058f46565K9270O28440j77123j027229k55164J129340R29573n31815r11358K22427
9048f10204Q19672l4708p59533k62529L36718N9996j98989L60725P79456J31104
9038F21708o82497m47769L77787N98368J13543l82641n68636l63828L78918J151846
9028G96799Q15289p34051j920825j441227M4006J002846R54384N07214K51831
$$ plain form
9019 276266 599324 1066738 1227844 526307 -701352 -1292034 -810946 -204784 -243631 -357704
9009 -357704 11577 69278 -928579 -1957668 -1636804 -598737 -560066 -1524386 -1914037 -1269267
8999 -1269267 -778989 -1053343 -1337464 -1239439 -1371891 -1791092 -1553722 -497498 106851 -534148
8989 -534148 -1517430 -1711515 -1251574 -812765 -488841 -175766 -126934 -395377 -537610 -452215
8979 -452215 -664547 -1272403 -1581968 -1375698 -1471490 -2217637 -2471144 -1177981 799128 1689297
8969 1689297 1217556 710271 896729 932642 38180 -1007750 -980608 -251750 -429832 -1792001
8959 -1792001 -2374812 -607537 2044241 2615775 560852 -1622738 -1959916 -1303048 -1185517
8950 -1185517 -1226772 -301044 1051498 1354988 595793 -12849 -227401 -870111 -1891436
$$ packed form
9019B76266L23058M67414J61106p01537j227659n90682M81088O06162l8847j14073
9009c57704L69281N7701r97857j029089L20864J038067L8671r64320l89651O44770
8999a269267M90278k74354k84121R8025j32452m19201K37370J056224O04349o40999
8989e34148r83282j94085M59941M38809L23924L13075M8832k68443j42233Q5395
8979d52215k12332o07856l09565K06270r5792p46147k53507J293163J977109Q90169
8969A689297m71741n07285J86458L5913q94462j045930K7142P28858j78082j362169
8959a792001n82811J767275K651778N71534k054923k183590l37178O56868J17531
8950a185517m1255R25728J352542L03490p59195o08642k14552o42710j021325
$$ plain form
8941 -1891436 -2126831 -1139022 159485 860523 795395 -3869 -1248287 -1908489 -1194970
8932 -1194970 63425 439595 131145 552658 1834171 2564701 2131979 1411116 843542
8923 843542 -170269 -1423031 -1479934 -22240 1185655 779173 -289676 -474258 79587
8914 79587 201695 -425408 -1227943 -1754236 -1790254 -1226947 -529443 -506529 -1058598 -1160440
8904 -1160440 -582533 -370800 -987110 -1393623 -841701 -119725 33202 289072 1198225 1684846
8894 1684846 685556 -809432 -1083167 -252717 210425 -91124 -262358 35318 182074
8885 182074 -59035 -259430 -384210 -849726 -1481720 -1567445 -1022704 -502923 -310239 -108196
8875 -108196 265621 563090 694926 763725 619535 145542 -185178 116335 567042 185425
$$ packed form
8941a891436k35395R87809J298507P01038o5128p99264j244418o60202P13519
8932a194970J258395L76170l08450M21513J281513P30530m32722p20863n67574
8923H43542j013811j252762n6903J457694J207895m06482j068849j84582N53845
8914G9587J22108o27103q02535n26293l6018N63307O97504K2914n52069j01842
8904a160440N77907K11733o16310m06513N51922P21976J52927K55870R09153M86621
8894A684846r99290j494988k73735Q30450M63142l01549j71234K97676J46756
8885A82074k41109k00395j24780m65516o31994q5725N44741N19781J92684K02043
8875a08196L73817K97469J31836O8799j44190m73993l30720L01513M50707l81617
$$ plain form
8865 185425 -1102535 -2358445 -2881281 -2767261 -2300331 -1631870 -1080051 -953361 -1001951 -697896
8855 -697896 -37358 555146 958005 1258812 1140839 272885 -765407 -915958 -91669 683238
8845 683238 703748 314545 85384 128795 446268 1107264 1813434 2073926 2069507 2513996
8835 2513996 3359359 3547913 2518953 1090560 241916 -152667 -601017 -745887 117873
8826 117873 1646339 2599506 2362444 1510287 811628 393458 73294 -89682 77158 480592
8816 480592 763994 603581 15109 -488831 -216935 891925 1913946 1849476 839190
8807 839190 -46175 -242061 -249895 -542041 -668203 -72719 737130 714381 -192298 -885291
8797 -885291 -629407 27000 157028 -323076 -773662 -725856 -176980 673452 1470733 1720359
$$ packed form
8865A85425j287960j255910n22836J14020M66930O68461N51819J26690m8590L04055
8855f97896O60538N92504M02859L00807j17973q67954j038292j50551Q24289P74907
8845F83238K0510l89203k29161M3411L17473O60996P06170K60492m419M44489
8835B513996Q45363J88554j028960j428393q48644l94583m48350j44870Q63760
8826A17873J528466R53167k37062q52157o98659m18170l20164j62976J66840M03434
8816D80592K83402j60413n88472n03940K71896J108860J022021o4470j010286
8807H39190q85365j95886p834k92146j26162N95484Q09849k2749r06679o92993
8797h85291K55884O56407J30028m80104m50586M7806N48876Q50432P97281K49626
$$ plain form
8787 1720359 1298950 836721 1054848 1729144 1827764 787129 -780755 -1801402 -1784560
8778 -1784560 -1009132 -75046 424468 84720 -1018313 -2217526 -2690151 -2097225 -795016
8769 -795016 457760 933209 313909 -1049360 -2275214 -2618208 -2126170 -1533017 -1466567
8760 -1466567 -1905453 -2428896 -2711300 -2581379 -1913909 -908822 -314326 -769453 -1861688
8751 -1861688 -2468160 -2231088 -1952076 -2086093 -1710475 78960 2371083 3314002 2600645
8742 2600645 1751941 1769684 1854602 1002712 -317615 -956819 -699254 -133313 506753 1384065
8732 1384065 2236898 2404469 1675571 565695 -228336 -338531 116411 596157 588587 189665
8722 189665 -50037 112314 505613 1154524 2155258 2842207 2185645 434707 -777889
$$ packed form
8787A720359m21409m62229K18127O74296R8620j040635j567884j020647J6842
8778a784560P75428R34086M99514l39748j103033j199213m72625N92926J302209
8769g95016J252776M75449o19300j363269j225854l42994M92038N93153O6450
8760a466567m38886n23443k82404J29921O67470J005087N94496m55127j092235
8751a861688o06472K37072K79012j34017L75618J789435K292123R42919p13357
8742B600645q48704J7743Q4918q51890j320327o39204K57565N65941O40066Q77312
8732A384065Q52833J67571p28898j109876p94031j10195M54942M79746p570l98922
8722A89665k39702J62351L93299O48911J000734O86949o56562j750938j212596
$$ plain form
8713 -777889 -588725 -3623 -88184 -341787 30068 447422 -22266 -954756 -1393263 -1528109
8703 -1528109 -1954579 -2068120 -1027487 314578 440401 -287656 -226528 609897 517322 -797360
8693 -797360 -1406070 -144748 1595349 1967400 910206 -545469 -1654214 -1796829 -472545
8684 -472545 1586134 2638933 2156509 1465710 1403164 994116 -387694 -1288014 -314078
8675 -314078 1323601 1384259 -125170 -1215966 -995298 -523913 -644437 -780880 -340268
8666 -340268 113870 -183462 -937947 -1202069 -654352 35829 73972 -451123 -611228 154589
8656 154589 1142619 1262883 668061 589301 1410021 2014696 1562675 814327 878967 1584461
8646 1584461 2061659 2145229 2120482 1769451 849602 -13467 -121305 49453 -352572 -899880
$$ packed form
8713g77889J89164N85102q4561k53603L71855M17354m69688r32490m38507j34846
8703a528109m26470j13541J040633J342065J25823p28057O1128Q36425r2575j314682
8693g97360o08710J261322J740097L72051j057194j455675j108745j42615J324284
8684d72545K058679J052799m82424o90799o2546m09048j381810r00320R73936
8675c14078J637679O0658j509429j090796K20668M71385j20524j36443M40612
8666c40268M54138k97332p54485k64122N47717O90181L8143n25095j60105P65817
8656A54589R88030J20264n94822p8760Q20720O04675m52021p48348O4640P05494
8646A584461M77198Q3570k4747l51031r19849q63069j07838J70758m02025n47308
$$ plain form
8636 -899880 -479671 619142 794430 -454728 -1679491 -1608195 -846131 -622679 -835504
8627 -835504 -415990 855527 1925272 1816889 721256 -379622 -783781 -630300 -555854
8618 -555854 -874455 -1154206 -765852 180854 797543 502179 -173283 -247155 383758 792332
8608 792332 342538 -330625 -150016 844916 1469037 1037116 335129 498989 1463876 2166109
8598 2166109 1941438 1032195 -57518 -959529 -1328727 -1124067 -974844 -1491536 -2231570
8589 -2231570 -2209406 -1460266 -1085394 -1533592 -1916834 -1482876 -742525 -478218 -525373 -348220
8579 -348220 -134604 -434504 -1119606 -1448920 -945057 225680 1404807 1743734 988551
8570 988551 221807 918375 2823761 3885625 3029688 1736483 1646673 1823113 258277
$$ packed form
8636h99880M20209J098813J75288j249158j224763P1296P62064K23452k12825
8627h35504M19514J271517J069745j08383j095633j100878m04159J53481P4446
8618e55854l18601k79751L88354R46706O16689k95364o75462p3872O30913M08574
8608G92332m49794o73163J80609R94932O24121m31921p01987J63860R64887P02233
8598B166109k24671r09243j089713r02011l69198K04660J49223n16692p40034
8589b231570K2164P49140L74872m48198l83242M33958P40351K64307m7155J77153
8579c48220K13616k99900o85102l29314N03863J170737J179127L38927p55183
8570I88551p66744O96568J905386J061864q55937j293205q9810J76440j564836
$$ plain form
8561 258277 -2566916 -3828198 -2198797 408631 1579025 1260414 910371 1014161 786844
8552 786844 -162249 -1062487 -967750 126132 1304160 1617523 923889 -42468 -468333 -285569
8542 -285569 -35180 -25674 13203 416511 1076745 1551634 1438394 637098 -470572 -1127991
8532 -1127991 -866835 -128054 150558 -304529 -699764 -142105 1248996 2455455 2665535
8523 2665535 2037411 1359993 1119389 1060314 719228 203832 110715 625366 1111395 906523
8513 906523 256863 15526 485982 1025986 935136 363650 13895 111724 135817 -285739
8503 -285739 -688206 -545148 -458815 -1562787 -3443078 -3838237 -1470279 1684857 2532989
8494 2532989 914665 -347701 365167 1371473 780590 -336769 192156 1900529 2214853
$$ packed form
8561B58277k825193j261282J629401K607428J170394l18611l50043J03790k27317
8552G86844r49093r00238R4737J093882J178028L13363o93634r66357m25865J82764
8542b85569K50389R506L8877M03308O60234M74889j13240q01296j107670o57419
8532a127991K61156P38781K78612m55087l95235N57659J391101J206459K10080
8523B665535o28124o77418k40604n9075l41086n15396r3117N14651M86029k04872
8513I06523o49660k41337M70456N40004r0850n71486l49755R7829K4093m21556
8503b85739m02467J43058Q6333j103972j880291l95159K367958L155136Q48132
8494B532989j618324j262366P12868J006306n90883j117359N28925J708373L14324
$$ plain form
8485 2214853 392939 -1414583 -1461247 -747552 -1074436 -2263647 -2689642 -1757142 -471134
8476 -471134 226859 558865 1191716 2185990 3002972 3179670 2694755 1816492 854993 130736
8466 130736 2800 610634 1483372 1743810 1060250 197962 172181 960285 1605663 1605900
8456 1605900 1512603 1877511 2277051 1989062 1211746 826317 1039971 1056470 323168 -571022
8446 -571022 -742800 -310169 -158091 -553175 -740994 -136081 716694 856220 210034 -387106
8436 -387106 -330539 171143 662922 1013784 1194530 972819 268026 -417318 -383307 430120
8426 430120 1318345 1636202 1504211 1482045 1677850 1523785 556422 -845746 -1781278 -1761168
8416 -1761168 -1050610 -211190 297076 139472 -685077 -1512760 -1465613 -534408 307923 438357
$$ packed form
8485B214853j821914j807522m6664P13695l26884j189211m25995R32500J286008
8476d71134O97993L32006O32851R94274Q16982J76698m84915q78263r61499p24257
8466A30736j27936O07834Q72738K60438o83560q62288k5781P88104O45378K37
8456A605900r3297L64908L99540k87989p77316l85429K13654J6499p33302q94190
8446e71022j71778M32631J52078l95084j87819O04913Q52775J39526o46186n97140
8436c87106N6567N01682M91779L50862J80746k21711p04793o85344L4011Q13427
8426D30120Q88225L17857j31991k2166J95805j54065r67363j402168r35532K0110
8416a761168P10558Q39420N08266j57604q24549q27683M7147R31205Q42331J30434
$$ plain form
8406 438357 454209 1134574 2028870 1918253 542220 -922208 -1249529 -496322 285597 370784
8396 370784 132156 410410 1151401 1121731 -428829 -2180628 -2018321 -54510 1065602
8387 1065602 -358015 -2679264 -3226665 -1858804 -573568 -406479 -627375 -644802 -736009
8378 -736009 -804769 -207600 829621 1141345 364495 -565735 -944331 -997179 -836213 -178414
8368 -178414 558560 388377 -572822 -1080787 -884586 -1191082 -2293820 -2524630 -742573
8359 -742573 1652940 2593683 2029738 1320601 956186 447705 -173180 -308053 -21747 -78022
8349 -78022 -759493 -1505810 -1698791 -1241301 -480115 85534 228723 234075 306227 -87249
8339 -87249 -1401272 -2667259 -2263919 -219573 1658488 2267119 2237099 2037158 987050
$$ packed form
8406D38357J5852O80365Q94296j10617j376033j464428l27321P53207P81919Q5187
8396C70784k38628K78254P40991k9670j550560j751799J62307J963811J120112
8387A065602j423617k321249n47401J367861J285236J67089k20896j7427r1207
8378g36009o8760N97169J037221L11724p76850r30230l78596n2848J60966O57799
8368a78414P36974j70183r61199n07965J96201l06496j102738k30810J782057
8359g42573K395513R40743n63945p09137l64415n08481o20885j34873K86306n6275
8349g8022o81471p46317j92981M57490P61186N65649J43189N352P2152l93476
8339h7249j314023j265987M03340K044346J878061O08631l0020j99941j050108
$$ plain form
8330 987050 -865227 -1818481 -960695 76327 -501403 -1879515 -2085957 -1083122 -438892
8321 -438892 -710002 -1095156 -1169526 -1163189 -893917 -77650 631469 450695 -55386 165169
8311 165169 733383 439009 -531903 -723415 237337 1038452 658187 -393175 -1052856 -854108
8301 -854108 43849 1060767 1398729 789951 -101932 -603728 -840706 -999934 -699699 -32933
8291 -32933 -124396 -1323922 -2003756 -873136 588801 129048 -1670544 -2179198 -660018
8282 -660018 1064772 1713062 1702615 1089648 -871755 -3404866 -4051274 -2052092 224998
8273 224998 533912 -427497 -809819 -493727 -484326 -698905 -194803 1009987 1863974 1789534
8263 1789534 1189848 625256 274126 91555 -4424 11624 386894 1212924 1932640 1832598
$$ packed form
8330I87050j852277r53254Q57786J037022n77730j378112k06442J002835O44230
8321d38892k71110l85154p4370O337K69272Q16267P09119j80774n06081K20555
8311A65169N68214k94374r70912j91512R60752Q01115l80265j051362o59681J98748
8301h54108Q97957J016918L37962o08778q91883n01796k36978j59228L00235O66766
8291c2933r1463j199526o79834J130620J461937m59753j799592n08654J519180
8282f60018J724790O48290j0447o12967j961403k533111o46408J999182K277090
8273B24998L08914r61409l82322L16092R401k14579N04102J204790Q53987p4440
8263A789534n99686n64592l51130j82571r5979J6048L75270Q26030P19716j00042
$$ plain form
8253 1832598 1071528 506056 441576 378171 99622 110173 751423 1671575 2342283 2379102
8243 2379102 1414260 -378334 -1699434 -1291708 174666 677932 -390148 -1358301 -670545
8234 -670545 1133039 2518030 2887487 2573445 1851961 926127 296778 327633 741140 974764
8224 974764 680502 -268981 -1631097 -2485946 -1873631 -49165 1620594 2281910 2365990
8215 2365990 2492081 2476821 1912024 1046156 551096 733831 1191257 1031535 -316218 -2054098
8205 -2054098 -2320090 -439951 1666664 1599568 -386490 -1867740 -1649851 -906356 -816454
8196 -816454 -979278 -762418 -517018 -592097 -516586 -16254 320812 145635 37736 448612
8186 448612 1013503 1451233 2009202 2501019 2141006 914216 -121996 -435889 -603385
$$ packed form
8253A832598p61070n65472o4480o3405k78549J0551O41250R20152O70708L6819
8243B379102r64842j792594j321100M07726J466374N03266j068080r68153O87756
8234f70545J803584J384991L69457l14042p21484r25834o29349L0855M13507K33624
8224I74764k94262r49483j362116q54849O12315J824466J669759O61316Q4080
8215B365990J26091j5260n64797q65868m95060J82735M57426j59722j347753j737880
8205b054098k65992J880139K106615o7096j986058j481250K17889P43495Q9902
8196h16454j62824K16860K45400p5079P5511N00332L37066j75177j07899M10876
8186D48612N64891M37730N57969M91817l60013j226790j036212l13893j67496
$$ plain form
8177 -603385 -823351 -444929 348962 154926 -1322584 -2259057 -1330514 205221 548407
8168 548407 98749 461215 1794338 2902948 3224379 3110747 2711615 2029871 1583552
8159 1583552 1689735 1582348 465359 -1076214 -1880684 -1851346 -1642280 -1340775 -698087
8150 -698087 -75860 113197 363737 1200291 1875566 1281553 -269679 -1459013 -1732858
8141 -1732858 -1427477 -660924 481706 1118511 498708 -485616 -266549 1041603 1789061
8132 1789061 1281100 557813 513759 761302 755338 680174 687392 425444 -97506 -206006 289807
8121 289807 538161 -107471 -1042309 -1318407 -1042373 -1118391 -1838998 -2359705 -1662906 196442
8111 196442 1925673 2183704 1012667 -152166 -136949 600535 674169 -383052 -1538815
$$ packed form
8177f03385k19966L78422P93891j94036j477510r36473R28543J535735L43186
8168E48407m49658L62466J333123J108610L21431j13632l99132o81744m46319
8159A583552J06183j07387j116989j541573q04470K9338K09066L01505O42688
8150f98087O22227J89057K50540Q36554O75275n94013j551232j189334k73845
8141a732858L05381P66553J142630O36805o19803r84324K19067J308152P47458
8132A789061n07961p23287m4054K47543n964p5164P218k61948n22950j08500M95813
8121B89807K48354o45632r34838k76098K76034p6018p20607n20707O96799J859348
8111A96442J729231K58031j171037j164833J5217P37484P3634j057221j155763
$$ plain form
8102 -1538815 -1544482 -356741 861754 958403 -68330 -1123714 -1272600 -785868 -595280
8093 -595280 -906949 -1073200 -869726 -962474 -1700698 -2303579 -1889498 -673792 498718 1265202
8083 1265202 1764400 2034352 2001055 1714427 1216121 623053 492504 1273692 2173254 1756623
8073 1756623 209326 -380022 1083281 2903812 2976074 1657038 629142 62951 -990386
8064 -990386 -2109584 -1812542 -309268 332754 -737020 -1853039 -1397278 -61279 466294
8055 466294 -111067 -716579 -588931 25373 550229 752911 773559 760298 520204 -266742
8045 -266742 -1321932 -1767433 -1355957 -1076811 -1683926 -2248618 -1439321 145723 473328
8036 473328 -1055528 -2758886 -3052617 -2263155 -1495626 -1025483 -690637 -816628 -1651596
$$ packed form
8102a538815n667J187741J218495R6649j026733j055384j48886M86732J90588
8093e95280l11669j66251K03474r2748p38224o02881M14081J215706J172510P66484
8083A265202M99198K69952l3297k86628m98306n93068j30549P81188Q99562m16631
8073A756623j547297n89348J463303J820531P2262j319036j027896n66191j053337
8064i90386j119198K97042J503274O42022j069774j116019M55761J335999N27573
8055D66294n77361o05512J27648O14304N24856K02682K0648j3261k40094p86946
8045b66742j055190m45501M11476K79146o07115n64692Q09297J585044L27605
8036D73328j528856j703358k93731P89462P67529M70143L34846j25991q34968
$$ plain form
8027 -1651596 -2484971 -2335031 -1265857 -304354 -193609 -719730 -1138139 -929528 -268323
8018 -268323 90934 -396316 -1349654 -1894910 -1814009 -1737672 -2081816 -2400868 -2116968 -1432515
8008 -1432515 -1141385 -1756777 -3000284 -3951998 -3721793 -2308407 -754608 -83729 -221332
7999 -221332 -426741 -494327 -753360 -1089835 -1025236 -827434 -1376550 -2564664 -2978215 -1820153
7989 -1820153 -140273 667938 699696 864551 1147930 836078 99847 -315 846614 1689172
7979 1689172 1689818 1085110 469518 -8805 -299056 -61167 788051 1691086 2147890 2293202
7969 2293202 2257356 1578317 52482 -1334834 -1385840 -385519 288173 208371 284809 851938
7959 851938 809545 -495800 -1754612 -1346035 251603 1126361 657184 138609 654582
$$ packed form
8027a651596q33375J49940J069174R61503J10745n26121m18409K08611O61205
8018b68323L59257m87250r53338n45256Q0901P6337l44144l19052K83900O84453
8008a432515K91130o15392j243507r51714K30205J413386J553799O70879j37603
7999b21332k05409o7586k59033l36475O4599J97802n49116j188114m13551J158062
7989a820153J679880Q08211L1758J64855K83379l11852p36231j00162Q46929Q42558
7979A689172O46o04708o15592m78323k90251K37889Q49218R03035M56804J45312
7969B293202l5846o79039j525835j387316n1006J000321O73692p9802P6438N67129
7959H51938m2393j305345j258812M08577J597638Q74758m69177n18575N15973
$$ plain form
7950 654582 1639457 1922300 1212879 101674 -709398 -813365 -285803 296436 457886 440334
7940 440334 697929 974694 666844 -53736 -440170 -443141 -711680 -1243313 -1166899 -132373
7930 -132373 1102277 1712847 1482039 402263 -1165552 -1888893 -589100 1682503 2372541
7921 2372541 840893 -678832 -376931 708967 826877 318541 572573 1515349 2042495
7912 2042495 2019351 2011918 1734337 576356 -817076 -1216528 -707623 -322838 -132752 609996
7902 609996 1608468 1551709 198938 -1024660 -867942 380590 1585108 1936152 1346249
7893 1346249 432957 74729 393254 494263 -196597 -987080 -1103810 -1000249 -1395233 -1838257
7883 -1838257 -1550542 -923053 -697090 -392757 767041 2027211 2098411 1506159 1877679
$$ packed form
7950F54582R84875K82843p09421j111205q11072j03967N27562N82239J61450j7552
7940D40334K57595K76765l07850p20580l86434k971k68539n31633P6414J034526
7930a32373J234650O10570k30808j079776j567815p23341J299793K271603O90038
7921B372541j531648j519725L01901J085898J17910n08336K54032R42776N27146
7912B042495k3144p433k77581j157981j393432l99452N08905L84785J90086P42748
7902F09996R98472n6759j352771j223598J56718J248532J204518L51044n89903
7893A346249r13292l58228L18525J01009o90860p90483j16730J03561l94984m43024
7883a838257K87715O27489K25963L04333J159798J260170P1200n92252L71520
$$ plain form
7874 1877679 3126512 3525744 2636167 1958678 2289755 2511196 1688679 579803 268459
7865 268459 758039 1549659 2274115 2304527 1163341 -281328 -510784 386454 754445 30160
7855 30160 -489656 -142389 -156093 -1383542 -2614841 -2472995 -1474572 -829057 -508140 74859
7845 74859 606464 540217 305930 521091 827688 762494 910401 1821796 2555420 1824270
7835 1824270 132090 -691500 95346 1417562 1960254 1425536 293445 -719656 -952737
7826 -952737 -331351 333408 109848 -1043998 -2393345 -3255689 -3305582 -2481330 -1175475
7817 -1175475 -199172 20564 -37711 246352 661199 509921 -276466 -914110 -637168 497736
7807 497736 1629096 1814801 901297 -337851 -1145102 -1621564 -2160889 -2423027 -1788863
$$ packed form
7874A877679J248833L99232q89577o77489L31077K21441q22517j108876l11344
7865B68459M89580P91620P24456L0412j141186j444669k29456Q97238L67991p24285
7855C0160n19816L47267j3704j227449j231299J41846R98423O45515L20917N82999
7845G4859N31605o6247k34287K15161L06597o5194J47907R11395P33624p31150
7835A824270j692180q23590P86846J322216N42692n34718j132091j013101k33081
7826i52737O21386O64759k23560j153846j349347q62344m9893Q24252J305855
7817a175475R76303K19736n8275K84063M14847j51278p86387o37644K76942J134904
7807D97736J131360J85705r13504j239148q07251m76462n39325k62138O34164
$$ plain form
7798 -1788863 -686230 -329271 -988356 -1639129 -1617774 -1468555 -1696315 -1839601 -1436029 -864169
7788 -864169 -487054 84410 1070711 1742726 1433507 610593 128894 91778 223158 658773
7778 658773 1498829 2155066 1980734 1103844 8567 -1125908 -2066342 -2248084 -1615285
7769 -1615285 -1043618 -1127145 -1230939 -594709 335461 664800 516783 642444 983774 727454
7759 727454 -366981 -1559281 -1963890 -1244933 220317 1406857 1391446 546519 304720
7750 304720 1161629 1834590 1261139 405506 779765 1959083 2147093 844108 -607583
7741 -607583 -1099568 -984528 -1063530 -1513153 -2088012 -2504990 -2454803 -1954482 -1662434 -2087068
7731 -2087068 -2632513 -2325607 -1346771 -795009 -946788 -883794 -84647 656800 345801 -946289
$$ packed form
7798a788863J102633L56959o59085o50773K1355J49219k27760j43286M03572N71860
7788h64169L77115N71464R86301O72015l09219q22914m81699l7116J31380M35615
7778F58773Q40056O56237j74332q76890j095277j134475r40434j81742O32799
7769a615285N71667q3527j03794O36230R30170L29339j48017J25661L41330k56320
7759G27454j094435j192300m04609P18957J465250J186540j5411q44927k41799
7750C04720Q56909O72961n73451q55633L74259J179318J88010j302985j451691
7741f07583m91985J15040p9002m49623n74859m16978N0187N00321K92048m24634
7731b087068n45445L06906R78836N51762j51779O2994P99147P41447l10999j292090
$$ plain form
7721 -946289 -2331492 -3014602 -2647206 -1364473 161349 1102301 1186210 807299 438132
7712 438132 259379 242083 131527 -499564 -1610002 -2251826 -1497468 187678 1234736
7703 1234736 795508 -343493 -861898 -359661 525836 978872 688129 -29472 -554488
7694 -554488 -544390 -233307 -70614 -217163 -549433 -870683 -879269 -335476 375405 348621
7684 348621 -612852 -1370042 -779757 760164 1927404 2245840 2241880 2138317 1623187 910770
$$ packed form
7721i46289j385203o83110L67396J282733J525822R40952Q3909l78911l69167
7712D38132j78753j7296j10556o31091j110438o41824P54358J685146J047058
7703A234736m39228j139001n18405N02237Q85497M53036k90743p17601n25016
7694e54488J0098L11083J62693j46549l32270l21250q586N43793P10881k6784
7684C48621r61473p57190N90285J539921J167240L18436l960j03563n15130p12417
$$ [...]
##END NTUPLES=NMR SPECTRUM
##END=
