##TITLE=31Pdec_SR-157-K3-TFAA-H2o
 CDCl3, 24 sc
 10.7.2023
##JCAMPDX= 6.0         $$ Bruker NMR JCAMP-DX V2.0
##DATA TYPE= NMR SPECTRUM
##DATA CLASS= NTUPLES
##ORIGIN= UXNMR, Bruker Analytische Messtechnik GmbH
##OWNER= root
$$ XWIN-NMR		Version 3.5
$$ Mon Jul 10 15:50:27 2023 Russian Standard Time (UT+4h)  she@DPX200
##.OBSERVE FREQUENCY= 81.013821
##.OBSERVE NUCLEUS= ^31P
##.ACQUISITION MODE= SIMULTANEOUS
##.ACQUISITION SCHEME= undefined
##.AVERAGES= 24
##.DIGITISER RES= 16
##SPECTROMETER/DATA SYSTEM= spect
##.PULSE SEQUENCE= zgpg30
##.SOLVENT NAME= CDCl3
##.SHIFT REFERENCE= (INTERNAL, CDCl3, 0, 248.564)
##AUDIT TRAIL= $$ (NUMBER, WHEN, WHO, WHERE, WHAT)
$$ ##TITLE= Audit trail, XWIN-NMR		Version 3.5
$$ ##JCAMPDX= 5.01
$$ ##ORIGIN= Bruker BioSpin GmbH
$$ ##OWNER= she
$$ F:/spectra/data/she/nmr/P31/1/pdata/1/auditp.txt
$$ ##AUDIT TRAIL=  $$ (NUMBER, WHEN, WHO, WHERE, WHAT)
(   1,<2023-07-10 15:48:16.37 +0400>,<she>,<DPX200>,
      <created by zg, POWCHK disabled, PULCHK disabled
       configuration hash MD5:
       00 E9 B6 7A A2 85 ED C7 34 08 36 98 17 FE 4E 26
       data hash MD5: 32K
       24 89 2D 9F CF A1 AA 72 2B 26 B7 25 03 4E EF A3>)
(   2,<2023-07-10 15:48:19.14 +0400>,<she>,<DPX200>,
      <Start of raw data processing
       efp BC_mod = 2 LB = 1 FT_mod = 6 PKNL = 1 PHC0 = -10631.38 PHC1 = -76.51532 SI = 64K 
       data hash MD5: 64K
       B0 63 7C 18 4C 97 7D E7 2B F3 74 59 94 15 02 38>)
(   3,<2023-07-10 15:48:30.46 +0400>,<she>,<DPX200>,
      <pk PHC0 = 2.562815 PHC1 = 0 
       data hash MD5: 64K
       6E B6 9F 43 48 8C 1E 6C F3 21 35 DB 06 FA 3D 08>)
(   4,<2023-07-10 15:48:46.29 +0400>,<she>,<DPX200>,
      <pk PHC0 = -1.000001 PHC1 = 0 
       data hash MD5: 64K
       2E DA 84 70 A2 79 22 D7 15 36 1B 61 52 FF C2 68>)
(   5,<2023-07-10 15:48:53.90 +0400>,<she>,<DPX200>,
      <abs ABSG = 5 
       data hash MD5: 64K
       06 66 B1 A2 54 45 C9 7F 39 59 08 67 0D FE 46 BD>)
$$ ##END=
$$ 
$$ hash MD5
$$ 7C D9 4A FE 64 52 B4 1A E4 AF 4C 09 5D EF 9C DE
##$RELAX= 
##$RELAX= 
##$RELAX= 
##$RELAX= 
##$RELAX= 
##$RELAX= 
##$RELAX= 
##$RELAX= 
##$RELAX= 
$$ Bruker specific parameters
$$ --------------------------
##$DU= <F:/spectra>
##$EXPNO= 1
##$NAME= <P31>
##$PROCNO= 1
##$TYPE= <nmr>
##$USER= <she>
##$AMP= (0..31)
100 100 100 100 100 100 100 100 100 100 100 100 100 100 100 100 100 100 
100 100 100 100 100 100 100 100 100 100 100 100 100 100 
##$AQSEQ= 0
##$AQ_mod= 1
##$AUNM= <au_zg>
##$AUTOPOS= <>
##$BF1= 81.014009
##$BF2= 200.13
##$BF3= 200.13
##$BF4= 200.13
##$BF5= 200.13
##$BF6= 200.13
##$BF7= 200.13
##$BF8= 200.13
##$BYTORDA= 1
##$CFDGTYP= 0
##$CFRGTYP= 5
##$CHEMSTR= <none>
##$CNST= (0..31)
1 1 145 1 1 1 1 1 1 1 1 1 1 1 1 1 1 1 1 1 1 1 1 1 1 1 1 1 1 1 1 1 
##$CPDPRG= <waltz16>
##$CPDPRG1= <>
##$CPDPRG2= <waltz16>
##$CPDPRG3= <>
##$CPDPRG4= <mlev>
##$CPDPRG5= <mlev>
##$CPDPRG6= <mlev>
##$CPDPRG7= <mlev>
##$CPDPRG8= <mlev>
##$CPDPRGB= <>
##$CPDPRGT= <>
##$D= (0..31)
$$ [...]
##$SUBNAM3= <"">
##$SUBNAM4= <"">
##$SUBNAM5= <"">
##$SUBNAM6= <"">
##$SUBNAM7= <"">
##$SUBNAM8= <"">
##$SUBNAM9= <"">
##$SW= 501.771253377433
##$SWIBOX= (0..15)
0 1 3 0 0 0 0 0 0 0 0 0 0 0 0 0 
##$SW_h= 40650.406504065
##$TD= 32768
##$TD0= 1
##$TE= 0
##$TE2= 300
##$TE3= 300
##$TEG= 300
##$TL= (0..7)
0 120 53 12 22 120 120 120 
##$TP= (0..7)
150 150 150 150 150 150 150 150 
##$TP07= 0
##$TPNAME0= <>
##$TPNAME1= <>
##$TPNAME2= <>
##$TPNAME3= <>
##$TPNAME4= <>
##$TPNAME5= <>
##$TPNAME6= <>
##$TPNAME7= <>
##$TPOAL= (0..7)
0.5 0.5 0.5 0.5 0.5 0.5 0.5 0.5 
##$TPOFFS= (0..7)
0 0 0 0 0 0 0 0 
##$TUNHIN= 0
##$TUNHOUT= 0
##$TUNXOUT= 0
##$USERA1= <user>
##$USERA2= <user>
##$USERA3= <user>
##$USERA4= <user>
##$USERA5= <user>
##$V9= 5
##$VALIST= <valist>
##$VCLIST= <CCCCCCCCCCCCCCC>
##$VD= 0
##$VDLIST= <DDDDDDDDDDDDDDD>
##$VPLIST= <PPPPPPPPPPPPPPP>
##$VTLIST= <TTTTTTTTTTTTTTT>
##$WBST= 1024
##$WBSW= 4
##$XGAIN= (0..3)
0 0 0 0 
##$XL= 0
##$YL= 0
##$YMAX_a= 6151
##$YMIN_a= -6033
##$ZGOPTNS= <>
##$ZL1= 120
##$ZL2= 120
##$ZL3= 120
##$ZL4= 120
##$ABSF1= 248.5645
##$ABSF2= -253.2056
##$ABSG= 5
##$ABSL= 3
##$ALPHA= 0
##$AQORDER= 0
##$ASSFAC= 0
##$ASSFACI= 0
##$ASSFACX= 0
##$ASSWID= 0
##$AUNMP= <proc_1d>
##$AZFE= 0.1
##$AZFW= 0.5
##$BCFW= 0
##$BC_mod= 2
##$BYTORDP= 0
##$COROFFS= 0
##$CY= -3
##$DATMOD= 1
##$DC= 0
##$DFILT= <>
##$DTYPP= 0
##$F1P= 0
##$F2P= 0
##$FCOR= 1
##$FTSIZE= 65536
##$FT_mod= 6
##$GAMMA= 0
##$GB= 0
##$INTBC= 1
##$INTSCL= 6.047779e-11
##$ISEN= 30
##$LB= 1
##$LEV0= 0
##$LPBIN= 0
##$MAXI= 10000
##$MC2= 0
##$MEAN= 0
##$ME_mod= 0
##$MI= 50
##$NCOEF= 0
##$NC_proc= -6
##$NLEV= 6
##$NOISF1= 182.463
##$NOISF2= 159.3651
##$NSP= 0
##$NTH_PI= 0
##$NZP= 0
##$OFFSET= 248.5645
##$PC= 4
##$PHC0= -10629.82
##$PHC1= -76.51532
##$PH_mod= 1
##$PKNL= yes
##$PPARMOD= 0
##$PSCAL= 0
##$PSIGN= 0
##$REVERSE= no
##$SF= 81.0140089999694
##$SI= 65536
##$SIGF1= 159.3651
##$SIGF2= -187.1042
##$SINO= 113.3802
##$SIOLD= 16384
##$SREGLST= <1H.CDCl3>
##$SSB= 0
##$STSI= 65536
##$STSR= 0
##$SW_p= 40650.406504065
##$SYMM= 0
##$S_DEV= 0
##$TDeff= 32768
##$TDoff= 0
##$TI= <>
##$TILT= no
##$TM1= 0
##$TM2= 0
##$TOPLEV= 0
##$USERP1= <user>
##$USERP2= <user>
##$USERP3= <user>
##$USERP4= <user>
##$USERP5= <user>
##$WDW= 1
##$XDIM= 65536
##$YMAX_p= 307428096
##$YMIN_p= -11250225
$$ End of Bruker specific parameters
$$ ---------------------------------
##NTUPLES= NMR SPECTRUM
##VAR_NAME=  FREQUENCY,     SPECTRUM/REAL,   SPECTRUM/IMAG
##SYMBOL=    X,             R,               I
##VAR_TYPE=  INDEPENDENT,   DEPENDENT,       DEPENDENT
##VAR_FORM=  AFFN,          ASDF,            ASDF
##VAR_DIM=   65536,         65536,           65536
##UNITS=     HZ,            ARBITRARY UNITS, ARBITRARY UNITS
##FACTOR=    0.620285442955139, 1,           1
##FIRST=     20137.2065510682, 0,            0
##LAST=      -20513.1999529968, 0,           0
##MIN=       -20513.1999529968, -11250225,   0
##MAX=       20137.2065510682, 307428096,    0
$$ Real data points
##PAGE= N=1
##DATA TABLE= (X++(R..R)), XYDATA
$$ [...]
42943b373763Q95380J441831R85058j18390o45563j25852M40123J78234k28214
$$ -2373763 -1478383 -36552 948506 830116 184553 58701 498824 677058 448844
42934D48844J82240P10185n2241j612438j774328J62424K069357J757795j72492
$$ 448844 631084 1341269 1289028 -323410 -2097738 -1935314 134043 1891838 1719346
42925A719346j391335r09911J44226M47322J4152k81647N5351O76544Q50976K48211
$$ 1719346 328011 -581900 -437674 9648 23800 -257847 -202496 474048 1325024 1573235
42915A573235o66616j081289p00873J1139M40862L96949R1059j11404O8998M71863
$$ 1573235 906619 -174670 -875543 -864404 -423542 -26593 64466 -46938 22060 493923
42905D93923M62909k81378j081341r81332j00097N08444L54583j3297j52235l06747
$$ 493923 956832 675454 -405887 -1387219 -1487316 -978872 -624289 -637586 -789821 -1096568
42895a096568n03427j60865P54539J180899M43255n30437m93332K44810L69274
$$ -1096568 -1599995 -1760860 -1006321 174578 617833 87396 -405936 -161126 208148
42886B08148l77529q81983l79166N68627J022089P74987K26569k23265l30591
$$ 208148 -169381 -1051364 -1430530 -861903 160186 935173 1161742 938477 607886
42877F07886k6766M02768M77989J17817j86288m0778K23547o3591r42130j592043
$$ 607886 581120 983888 1461877 1579694 1393406 1352628 1576175 1512584 570454 -1021589
42867a021589j259385j70282P97868J191652J238774J089731N34562k81693o68537
$$ -1021589 -2280974 -2451256 -1653388 -461736 777038 1866769 2401331 2119638 1451101
42858A451101m42771l81131q84092j024839Q610J292337J371221M87592k4262
$$ 1451101 1008330 627199 -256893 -1281732 -1273122 19215 1390436 1878028 1853766
42849A853766j22435q61674j932505j656392J29026J391650R32512K0174l7954
$$ 1853766 1731331 869657 -1062848 -2719240 -2590214 -1198564 -266052 -245878 -283832
42840b83832J08229l54724n99589J17731O59843j05329j083098p02805L65835
$$ -283832 -175603 -530327 -1129916 -1012185 -352342 -457671 -1540769 -2243574 -1877739
42831a877739M41102k97389m62219q4783j71770l53307M75797J649897J497566
$$ -1877739 -1436637 -1734026 -2196245 -2281028 -2452798 -2806105 -2330308 -680411 817155
42822H17155L24220r1571J68942o46181k209445j872017Q46472K718479J442669
$$ 817155 1141375 1049804 1218746 572565 -1636880 -3508897 -2662425 56054 1498723
42813A498723r32198j334263j13368L51596k39855k14191P58245J166574L61438
$$ 1498723 566525 -767738 -881106 -529510 -769365 -983556 -225311 941263 1302701
42804A302701m73364l42232K56317M62121K40823K1913K6110K34322M05695R3089
$$ 1302701 829337 487105 743422 1205543 1446366 1468279 1494389 1728711 2134406 2227495
42794B227495p51589j305791p48614M44970Q70185k6471j221779j411292m89346
$$ 2227495 1475906 170115 -578499 -133529 736656 710185 -511594 -1922886 -2412232
42785b412232N81750J000693Q19582N22936L13356M6192k82932l99057k38953
$$ -2412232 -1830482 -829789 -10207 512729 826085 872277 589345 190288 -48665
42776d8665j63156l28466k64222L55586Q71389L79840q15034j386230p21660L52427
$$ -48665 -211821 -540287 -804509 -448923 422466 802306 -12728 -1398958 -2120618 -1768191
42766a768191Q16174O60146M92670N69742O41988M00319j84470p24144o45775
$$ -1768191 -952017 -291871 200799 770541 1412529 1812848 1628378 904234 258459
42757B58459P5466O13360K74999m57960o03995j53377N4569k31591m21280k56055
$$ 258459 333925 947285 1222284 764324 160329 6952 61521 -170070 -591350 -847405
42747h47405j40267j91853m2121K67545K65572N9472K12270M72982m3894j107722
$$ -847405 -987672 -1179525 -1221646 -954101 -688529 -629057 -416787 56195 12301 -1095421
42737a095421j222059J87740J710335J789063N78791o65335j077926n30479N33280
$$ -1095421 -2317480 -2129740 -419405 1369658 1948449 1283114 205188 -325291 207989
42728B07989J145832O49317k55269l68258P9513j43708q78580o27716N94604P90455
$$ 207989 1353821 2003138 1747869 1379611 1459124 1315416 436836 -190880 403724 1194179
42718A194179p08894j806346r11335N74664P84585L08805N08182P86139k2071
$$ 1194179 485285 -1321061 -2232396 -1657732 -873147 -564342 -56160 729979 707908
42709G07908j035797p04989L00533J71536q74821j060210j23161N35255M39721
$$ 707908 -327889 -1032878 -732345 -560809 -1435630 -2495840 -2619001 -2083746 -1644025
42700a644025M39545P27494O43278L04629M04597N96073M7876p29449o57199k32697
$$ -1644025 -1204480 -476986 166292 470921 875518 1471591 1519467 790018 132819 -99878
42690i9878o51921j261029m38263J277230J734157Q04812M92306J143306P51227
$$ -99878 -751799 -2012828 -2451091 -1173861 560296 1365108 1857414 3000720 3751947
42681C751947j160675k152963p91190Q68217N33426r09565j216156j71028P91318
$$ 3751947 2591272 438309 -352881 515336 1048762 139197 -1076959 -1247987 -456669
42672d56669R29161M20995n42654j384025j008860N61183J557845P75923o22880
$$ -456669 472492 893487 350833 -1033192 -2042052 -1480869 76976 852899 230019
42663B30019q99265j72102K98543K01339J16541J99902K24482K70604L45005K9651
$$ 230019 -669246 -841348 -542805 -341466 -224925 -25023 199459 470063 815068 844719
42653H44719o57842r20547m28880J08605K57513M76623P89965M15180m76891m58569
$$ 844719 186877 -733670 -1162550 -1053945 -796432 -319809 470156 885336 408445 -50124
42643e0124O29936Q73148n76336j681788p37713O81825L57499q46364o65844O31606
$$ -50124 579812 1452960 876624 -805164 -1542877 -861052 -503553 -1349917 -2015761 -1384155
42633a384155J046439N10755N69418J079665N01591p95589q06237M27881O37164
$$ -1384155 -337716 173039 742457 1822122 2323713 1528124 721887 1149768 1786932
42624A786932p25748j513038o41080K38045m9624k44509N85062J035873O056j007476
$$ 1786932 1061184 -451854 -1092934 -854889 -904513 -1149022 -563960 471913 477969 -529507
42614e29507l81401Q13375P35038r3076O071P33377M58743p00404r83631j5318
$$ -529507 -910908 -97533 637505 544429 550500 1283877 1742620 1042216 58585 43267
42604D3267N95698k7097p23272l55041M38575M50427k40098n85963j36143N41168
$$ 43267 638965 611868 -111404 -466445 -27870 422557 182459 -403504 -539647 1521
42594A521P53190M11021j10830m77280o19631n69477k74872K42394O61707O21914
$$ 1521 754711 1165732 1054902 577622 -42009 -611486 -886358 -643964 17743 639657
42584F39657K15622j02139j07994M5421K17470L14862K0786q07793j457618r67492
$$ 639657 855279 753140 645146 690567 908037 1222899 1243685 435892 -1021726 -1989218
42574a989218L50768R68667J85606q21625o55005M57097J275213J243417O39713
$$ -1989218 -1638450 -669783 -484177 -1305802 -1960807 -1503710 -228497 1014920 1654633
42565A654633k79515j190651j286855j85686J019137Q54546m48824j181241n62483
$$ 1654633 1375118 184467 -1102388 -1288074 -268937 585609 136785 -1044456 -1606939
42556a606939K94958J98860m67552n73652Q7039P55734R00492P14728N53552M08316
$$ -1606939 -1311981 -1113121 -1580673 -2154325 -2067286 -1311552 -411060 303668 857220 1265536
42546A265536L1597o13794j109581q96069R254P88820O86135l2070m27932j05092
$$ 1265536 1297133 683339 -426242 -1322311 -1313057 -524237 161898 129828 -298104 -403196
42536d03196M85404Q70412R66648O33263l03791j297018j270919j31508P54349
$$ -403196 82208 952620 1919268 2552531 2248740 951722 -319197 -450705 303644
42527C03644L55172n00919m06097M31765N99383j55036m82781L33680J126583
$$ 303644 658816 157897 -248200 183565 782948 627912 145131 478811 1605394
42518A605394O11883o69209j247282q54239m47647m57431l03593K47024M54900
$$ 1605394 2217277 1548068 300786 -553453 -1001100 -1458531 -1762124 -1515100 -1060200
42509a060200j38722p35036l26900P79884J289204N81782o08657j179374p74571
$$ -1060200 -1198922 -1933958 -2260858 -1480974 -191770 390012 -218645 -1398019 -2172590
42500b172590J45052Q48757P88306m8199r44816r43763J28239J319882J577449
$$ -2172590 -2027538 -1178781 -390475 -438674 -1383490 -2327253 -2199014 -879132 698317
42491F98317R27893K28679j09378n04613j173230j444811p01804M48820P72659
$$ 698317 1626210 1854889 1745511 1240898 67668 -1377143 -2078947 -1630127 -857468
42482h57468R4130m57752q5259O11263O73566J83476j08688m8961o1932j17864
$$ -857468 -763338 -1221090 -1306349 -695086 -21520 161956 53268 4307 -57625 -175489
42472a75489K61506R07598R30137R3406o22962m07473J81798J43638m08684n37792
$$ -175489 86017 993615 1923752 2017158 1394196 986723 1168521 1312159 903475 365683
42462C65683m0800K70463j11782o70499p27853l23918J37731N30848Q15374O81281
$$ 365683 324883 595346 483564 -186935 -914788 -1238706 -1100975 -570127 245247 926528
42452I26528l030o52629n36124J66569N07044R0452l53001o3701N76937N55756
$$ 926528 923498 270869 -265255 -98686 408358 498810 145809 82108 659045 1214801
42442A214801l03220j033777q04847K4716M54756J38906k84652j25527M23912
$$ 1214801 911581 -122196 -927043 -902327 -447571 -308665 -593317 -718844 -294932
42433b94932N03900k74865j134891r19897L63648J295910P66464n01063r05641
$$ -294932 208968 -65897 -1200788 -2120685 -1757037 -461127 305337 -195726 -1101367
42424a101367j66065M88568L22262J3643J79178L13164O869n4623N19541O29867
$$ -1101367 -1267432 -778864 -456602 -442959 -263781 49383 56252 1629 521170 1151037
42414A151037n56249j642952p95750J100422J371373m16745j747915r43543O56358
$$ 1151037 594788 -1048164 -1843914 -743492 627881 211136 -1536779 -2480322 -1823964
42405a823964J216413R51832Q30506O31025o1786m70205k187K77066n96456j405551
$$ -1823964 -607551 344281 1174787 1805812 1744026 1273821 1271634 1548700 952244 -453307
42395d53307n02135J229286J410201k73186j755323j695694p80270J48063J141196
$$ -453307 -955442 273844 1684045 1410859 -344464 -2040158 -2820428 -2672365 -1531169
42386a531169J924910J591134K23136p72574o67162l35726n58601q28900n96973
$$ -1531169 393741 1984875 2208011 1435437 768275 432549 -126052 -954952 -1551925
42377a551925l36571m79886m83053J11533P12358O85768L99722M06166M74812
$$ -1551925 -1888496 -2368382 -2851435 -2739902 -2027544 -1341776 -942054 -535888 -61076
42368f1076K86141K00633M59836M86085j00791o10996m03008m9002l16250p58851
$$ -61076 225065 425698 885534 1371619 1270828 659832 256824 207822 -108428 -867279
42358h67279n04786K20241O03618O93720R90783J076874J76967j126800j317632
$$ -867279 -1372065 -1151824 -548206 145514 1136297 2213171 2390138 1263338 -54294
42349e4294j93891P46163M74751l30545o77303o44672o91610o06732k0529P11617
$$ -54294 -248185 497978 972729 642184 -35119 -679791 -1371401 -1978133 -1998662 -1287045
42339a287045R68509P74804N59870L49280j38446p88228j068745o75730J60365
$$ -1287045 -318536 456268 1016138 1365418 1226972 438744 -630001 -1305731 -1145366
42330a145366R03937J017839L14968o67619r70300l29306L23711N9449o47511
$$ -1145366 -241429 776410 1091378 423759 -546541 -875847 -552136 -492687 -1140198
42321a140198n60376L40942O11905m79342j553109q90086J009609J934668R57630
$$ -1140198 -1700574 -1359632 -747727 -1227069 -2780178 -3670264 -2660655 -725987 231643
42312B31643m14522n19694K46649M29358j53324l82240J75247O21123K99349j53956
$$ 231643 -182879 -702573 -455924 -26566 -179890 -562130 -386883 234240 533589 379633
42302C79633N1340N12400K81467n66811r30393k44713P09912Q82257L15399q6516
$$ 379633 430973 943373 1224840 658029 -272364 -517077 192835 1075092 1390491 1303975
42292A303975O5668J61460l53097j038620j089758n04749N1669L19254N44773
$$ 1303975 1369643 1531103 1178006 139386 -950372 -1455121 -1403452 -1084198 -539425
42283e39425O07573Q4077o42573n07737N06214R54131M0262r94691o97294M01687
$$ -539425 68148 152225 -490348 -998085 -491871 462260 502522 -492169 -1189463 -787776
42273g87776P68440K20762k30707k70499l55720l41628K50033Q72586O15149q796
$$ -787776 -19336 201426 -29281 -299780 -655500 -997128 -747095 125491 740640 731844
42263G31844K05540Q44902M30153p75719r36517J28049N36570k14922k97581Q35579
$$ 731844 937384 1782286 2212439 1436720 500203 628252 1164822 949900 652319 1487898
42253A487898R44249j005149k273668m59911K256992K237680k9817j069465p6702
$$ 1487898 2432147 1426998 -846670 -1306581 950411 3188091 3158274 2088809 2012107
42244B012107L92824q13442j740119j036363r4540k61997o15630l2154O82688
$$ 2012107 2404931 1591489 -148630 -1184993 -1279533 -1541530 -2157160 -2189314 -1506626
42235a506626L98519k52475o8417O36222P38113K80579K32333P01461P31422j43829
$$ -1506626 -1108107 -1360582 -1428999 -792777 -54664 225915 458248 1159709 1891131 1747302
42225A747302j141990j287143o55972j75712k89727k76823O30989J703913J319369
$$ 1747302 605312 -681831 -1337803 -1513515 -1803242 -2080065 -1449076 254837 1574206
42216A574206n91954j961239j309206J71471N69197J08905K35788P87436M00213
$$ 1574206 982252 -978987 -2288193 -2116722 -1547525 -1438620 -1202832 -415396 -15183
42207a5183o75908o99998M81844R77120M5094o33982J26509J013698M81876p63914
$$ -15183 -691091 -1391089 -909245 67875 112969 -521013 -394504 619194 1101070 337156
42197C37156j082673l44767L99509O48605N43069J17223m00217l37654L99534
$$ 337156 -745517 -1090284 -690775 -42170 500899 618122 217905 -119749 279785
42188B79785Q67895M53087k24868n04940o65942q97006n48221N61738J317601
$$ 279785 1147680 1600767 1375899 870959 205017 -691989 -1240210 -678472 639129
42179F39129R43975K98885L13615L47097m80819j428712j242680k92928L9905
$$ 639129 1583104 1881989 2195604 2542701 2061882 633170 -609510 -902438 -862533
42170h62533m64137q05083m40378K54350P70513P02164j39557r60382l90011J302940
$$ -862533 -1326670 -2131753 -2572131 -2317781 -1547268 -845104 -984661 -1945043 -2335054 -1032114
42160a032114J827873J54327j445607o61787J120429J017077o37557r90036M61857
$$ -1032114 795759 950086 -495521 -1157308 -36879 980198 342641 -647395 -185538
42151a85538J172426k3764j137836o17324K58561l1643p47780n95058N9525L20287
$$ -185538 986888 963124 -174712 -792036 -533475 -565118 -1312898 -1907956 -1848431 -1528144
42141a528144M86411J055619J355715O85203k76988n43308l14940k36547j76077
$$ -1528144 -1041733 13886 1369601 2054804 1777816 1234508 919568 683021 506944
42132E06944R3369K7548o36752r20616j4851J135238J007240k80692j168648p42364
$$ 506944 600313 627861 -8891 -929507 -944358 190880 1198120 917428 -251220 -993584
42122i93584L69658R50993L84111p93466j172578M7233J654002J583878j69349
$$ -993584 -623926 327067 711178 -82288 -1254866 -1207633 446369 2030247 1860898
42113A860898j265167l39798J033476Q75706l11513p89377l61019m8035j6061
$$ 1860898 595731 255933 1289409 2165115 1853602 1064225 703206 655171 639110
42104F39110K33309L54820k36452q53983n19093J04214k78191j130882p93240
$$ 639110 872419 1227239 990787 136804 -382289 -278075 -556266 -1687148 -2480388
42095b480388O21715J289977O50309N0101J66070O5379n86540n98234N20811J332089
$$ -2480388 -1858673 -568696 81613 131714 297784 363163 -223377 -821611 -300800 1031289
42085A031289O38526o42918r27487p0747R32378J280286O48146p52213j789685
$$ 1031289 1669815 1026897 99410 28663 961041 2241327 2889473 2137260 347575
42076C47575j307047J00808O22669o19o2490J037211J469507L9999j537373j273290
$$ 347575 -959472 -858664 -235995 -236614 -299104 738107 2207614 2247613 710240 -563050
42066e63050K0329M47293K27041O66405J192820K99938j221707j024221Q57766
$$ -563050 -542721 -95428 131613 798018 1990838 2290776 1069069 44848 902614
42057I02614J699454K32477j505285j389136m5824P20452N25518J01975k19895
$$ 902614 2602068 2834545 1329260 -59876 -105700 614752 1140270 1242245 1022350
42048A022350m34842k75149K03125K75643l13674o97635k08492M65159L33572
$$ 1022350 587508 312359 515484 791127 477453 -220182 -428674 36485 370057
42039C70057l90863p42157m00754J72606N69157O95937N54260K90877J43179J3065
$$ 370057 -20806 -762963 -1163717 -991111 -421954 273983 828243 1119120 1262299 1275364
42029A275364m26439r73032r32506k21056L43909K40207p2313p0462Q7786J87046
$$ 1275364 848925 -124107 -1056613 -1277669 -933760 -693553 -765866 -836328 -748542 -561496
42019e61496L94650N81249K17083m96907n47672J59101L17372n82564j038071
$$ -561496 -166846 414403 631486 134579 -413093 -253992 63380 -519184 -1557255
42010a557255J02101J446857J086041k83966m75226N80638P77014o39074j876257
$$ -1557255 -1455154 -8297 1077744 793778 318552 899190 1676204 1037130 -839127
42001h39127j492976m03350m6430k16357J12406R67981J534188J375958O34295
$$ -839127 -2332103 -2735453 -2781883 -2998240 -2885834 -1917853 -383665 992293 1626588
41992A626588l95942j201684j165439l59896L13460K90228P2100L03282P41029
$$ 1626588 1230646 28962 -1136477 -1496373 -1182913 -892685 -820585 -517303 223726
41983B23726P45144K98600p2085p9912R5875J40085j30939n90118p77672m13857
$$ 223726 968870 1267470 1195385 1115473 1211348 1351433 1220494 630376 -147296 -561153
41973e61153P9657J08784j02829J64604P76482P24539k24555r12171m41352M54379
$$ -561153 -481496 -372712 -475541 -310937 465545 1190084 965529 53358 -387994 66385
41963F6385N14465k37327o74991j93770O30840Q71542K32663o94075r53900k71413
$$ 66385 580850 343523 -331468 -525238 105602 977144 1209807 515732 -438168 -709581
41953g09581M40525J79818o08947n61359M39378R28903J92657n27995j30735M65115
$$ -709581 -269056 -89238 -698185 -1259544 -820166 108737 301394 -226601 -357336 107779
41943A07779r600p95179k91620J077542J298506q5988j313091j151447m15578
$$ 107779 98179 -697000 -988620 88922 1387428 1301440 -11651 -1163098 -1578676
41934a578676j63844j64959l6750k81813r77308q32360Q87135K505713J833625
$$ -1578676 -1742520 -1907479 -1944229 -2226042 -3203350 -4035710 -3148575 -642862 1190763
41925A190763n58847j832873o97067J042329J278752L59529j6505N01192P56655
$$ 1190763 631916 -1200957 -1898024 -855695 423057 782586 766081 1267273 2023928
41916B023928J42095o06442p28058m06173j02049J57146L59346J40270n56494
$$ 2023928 2166023 1559581 831523 425350 323301 480447 839793 980063 423569
41907D23569j017813o31306J65048M61292J27181j71538k6077K98026M23461K65491
$$ 423569 -594244 -1225550 -1060502 -599210 -472029 -643567 -669644 -371618 51843 317334
41897C17334r0524m29915m11278K4702M17504M03497K61495L03268J84728l91490
$$ 317334 226810 -203105 -614383 -589681 -172177 231320 492815 796083 980811 589321
41887E89321p92821l56571K43566j17291j008518r30043J70464O78132K126m28181
$$ 589321 -203500 -560071 -316505 -433796 -1442314 -2372357 -2201893 -1523761 -1521635 -1949816
41877a949816L07689R70827L45736n65099k17521Q45031R20799r7695p85367n54925
$$ -1949816 -1642127 -671300 -325564 -890663 -1108184 -263153 657646 559951 -225416 -780341
41867g80341j86209j52124k1560M30568Q52197J081963J156548P02635m92162
$$ -780341 -966550 -1118674 -1140234 -709666 142531 1224494 2381042 3083677 2591515
41858B591515j516891j258521j43768L81891q629l23115p4413K61953N92763J261242
$$ 2591515 1074624 -183897 -327665 54226 45597 -277518 -351931 -89978 502785 1764027
41848A764027J599956L80798j781495k491391r51662O45829L67112o63518m27166
$$ 1764027 3363983 3744781 1963286 -528105 -1479767 -833938 -466826 -1130344 -1557510
41839a557510N96722M22199j006341j759806j016890L8134N50576J102923J932358
$$ -1557510 -960788 -538589 -1544930 -3304736 -4321626 -4283492 -3732916 -2629993 -697635
41830f97635J995793Q13970l44509l46606M7955k94599p59919j33820R41356P66423
$$ -697635 1298158 2112128 1767619 1421013 1468968 1174369 414450 280630 1221986 1988409
41820A988409m30911o15588O14815J094962l56036j713271q78432Q29830P46383
$$ 1988409 1557498 941910 1556725 2651687 2295651 582380 -296052 533778 1280161
41811A280161q35633j278723J9903Q94474K40044m10533N2273M77678k4301k97573
$$ 1280161 444528 -834195 -814292 80182 320226 -90307 -38034 439644 415343 117770
41801A17770M40081P54001l77617j231521q9376J497527J010683q45323j321737
$$ 117770 557851 1311852 934235 -297286 -386662 1110865 2121548 1276225 -45512
41792d5512j08208N72672r669k16337N95361Q87763j44117j115051q66636j17585
$$ -45512 -153720 418952 409283 192946 788307 1676070 1531953 416902 -449734 -567319
41782e67319K52402N66311J049106R89450J48958n88278p28070p59926p09278
$$ -567319 -314917 251394 1300500 2289950 2438908 1850630 1122560 362634 -346644
41773c46644R2373J213361J114981k77979j065557l72733K66734l29287j023940
$$ -346644 -254271 959090 2074071 1796092 730535 357802 624536 295249 -728691
41764g28691o00329J09977L6389r7206N74369J086012L37028p33916p14166j12248
$$ -728691 -1329020 -1219043 -1182654 -1279860 -705491 380521 717549 -16367 -730533 -842781
41754h42781j14838k25391O29583J709027J481157K27529n97108q79625j482541
$$ -842781 -957619 -1183010 -553427 1155600 2636757 2864286 2267178 1387553 -94988
41745i4988k009241j303290J92628Q92007O93308R19314J696388J641019L62822
$$ -94988 -2104229 -3407519 -3214891 -2322884 -1629576 -710262 986126 2627145 2989967
41736B989967p97495r05729m95151j44204L04446P36632N61110j02282m22913
$$ 2989967 2192472 1286743 791592 647388 951834 1688466 2249576 2147294 1724381
41727A724381k93329m10808q14498p70982k16618J45551K45574O13931R32221
$$ 1724381 1431052 1020244 205746 -565236 -781854 -636303 -390729 223202 1155423
41718A155423L13013q49433j111419l44556k5373p12014j091921k42972Q85013
$$ 1155423 1468436 619003 -492416 -836972 -862345 -1574359 -2666280 -2909252 -2024239
41709b024239J122895P23199M49072L12233P9815m8163K4924K6337k386K24023
$$ -2024239 -901344 -178145 270927 583160 662975 614812 639736 666073 663687 887710
41699H87710L31803k61595r51487n97670L62186L77847m41866l17582R30391J192762
$$ 887710 1219513 957918 6431 -591239 -229053 148794 -293072 -610654 319737 1512499
41689A512499l27187j484037o98893M64057K08399m27141J28061P51800l37619
$$ 1512499 1185312 -298725 -997618 -533561 -325162 -752303 -624242 127558 -210061
41680b10061j948916j570749L44953J051981R045n25895N32430J570587J252350
$$ -210061 -2158977 -3729726 -3384773 -2332792 -2323747 -2849642 -2317212 -746625 505725
41671E05725L51228j61674n47155r64950p69834k7416J12860n92022q66101j06166
$$ 505725 856953 695279 148124 -816826 -1586660 -1614076 -1501216 -2093238 -2959339 -3065505
41661c065505N88427M67406L91434R60088J176728L27049m62507r7755N23496
$$ -3065505 -2477078 -2009672 -1618238 -658150 518578 845627 383120 285365 808861
41652H08861J46583n52015k60772M34135n762j233057j391233j44549Q51320O80100
$$ 808861 955444 403429 142657 576792 571030 -662027 -2053260 -2197809 -1346489 -666389
41642f66389L05663M95536N36616j19962n91163q1584O01681L03218o28307r85023
$$ -666389 -360726 134810 671426 551464 -39699 -121283 480398 783616 155309 -829714
41632h29714n64427j95051k78805l89334j52052L38963Q34845R78910L48824q09291
$$ -829714 -1394141 -1589192 -1867997 -2257331 -2409383 -2070420 -1235575 -256665 92159 -717132
41622g17132j299484l71269R48275J042337K0806m57651K76197R89428O11706
$$ -717132 -2016616 -2387885 -1439610 -397273 -376467 -834118 -557921 431507 1043213
41613A043213j80293k80247P7752m2152o36369q97334n47939k8594L58368O03013
$$ 1043213 862920 582673 660425 618273 -18096 -915430 -1463369 -1491963 -1133595 -530582
41603e30582N49078J54294m8809L87588R12219O14774l70874j047925j072001
$$ -530582 18496 172790 123981 511569 1423788 2038562 1667688 619763 -452238
41594d52238j069889j344192j282359m06066Q05010J545694J539189R74435J78137
$$ -452238 -1522127 -2866319 -4148678 -4554744 -3749734 -2204040 -664851 309584 487721
41585D87721l91288l76673J9472K89933L83924N78867O16346r5720j205218j391742
$$ 487721 96433 -280240 -260768 29165 413089 991956 1608302 1512582 307364 -1084378
41575a084378j66433J205289J290275K72817o06237p75576o36832n54420m09003
$$ -1084378 -1250811 -45522 1244753 1517570 911333 135757 -501075 -1055495 -1464498
41566a464498j5542O31554J388537J817760J360340J49129p73816o82251k18982
$$ -1464498 -1480040 -848486 540051 2357811 3718151 3867280 3093464 2411213 2192231
41557B192231m83651j372941j690142q21692N01885J187185Q66988n3101q33916
$$ 2192231 1708580 335639 -1354503 -2176195 -1674310 -487125 379863 326762 -507154
41548e07154q15775K9776Q48699P17422k02384q23359n09517K73335P97776R13143
$$ -507154 -1322929 -1293153 -444454 272968 70584 -752775 -1262292 -988957 -191181 721962
41538G21962P51898K30940o14965j199013r10500J3698O34693L80741l55685p57934
$$ 721962 1473860 1704800 1089835 -109178 -1019678 -1005980 -371287 9454 -346231 -1104165
41528a104165m69743J60231N36083L83326n8715l09250j26287K58938M35414L36102
$$ -1104165 -1573908 -1413677 -877594 -494268 -552983 -862233 -988520 -729582 -294168 41934
41518D1934L16281O01934Q43376N17673k74327q16491p18806m32533n04863p04496
$$ 41934 358215 960149 1803525 2321198 2046871 1230380 511574 79041 -425822 -1130318
41508a130318m28848K43795N95131L72673J52505L65652O14699M02524J6946O5058
$$ -1130318 -1559166 -1315371 -720240 -347567 -195062 170590 785289 1187813 1204759 1269817
41498A269817M19816L31473m21511j109833r85841k13955M03930L68061j14649
$$ 1269817 1689633 2021106 1599595 489762 -496079 -710034 -306104 61957 -52692
41489e2692m83035l28219L01436Q28112N33147n83689j424253q54729P26510J582774
$$ -52692 -535727 -863946 -562510 265602 798749 215060 -1209193 -2063922 -1337412 245362
41479B45362Q28373l01357j76724Q39582R72968k18002j171999p19773K82964
$$ 245362 1073735 772378 595654 1435236 2408204 2190202 1018203 298430 581394
41470E81394M62601j23903n10699l50791Q6556O45791J030842O27968m14451q43350
$$ 581394 1043995 920092 409393 58602 145158 790949 1821791 2449759 2035308 1191958
41460A191958j64937K43149o62883j495285n68051R26689N20568j292572j494062
$$ 1191958 1027021 1270170 607287 -887998 -1456049 -529360 -8792 -1301364 -2795426
41451b795426N88973K048713R98982o30294n53152L23790P7411o63285n8032J395133
$$ -2795426 -2206453 -157740 841242 210948 -342204 -18414 58997 -604288 -662320 732813
41441G32813J485405q4931j252505p89830J69042J69164o26614j089348o59474
$$ 732813 2218218 2133287 880782 90952 259994 429158 -197456 -1286804 -1946278
41432a946278K25334O91801L21730k59120o5190P38596Q72509l6514o70188j44651
$$ -1946278 -1720944 -1029143 -707413 -966533 -1031723 -293127 579382 542868 -127320 -271971
41422b71971L97696l19462j405963j130373L10040J206832R60928M38585J22952
$$ -271971 125725 -193737 -1599700 -2730073 -2420033 -1213201 -252273 186312 309264
41413C09264k19335k98703L63447R78332K90511j121585j282416J97607J459337
$$ 309264 89929 -208774 154673 1133005 1423516 301931 -980485 -782878 676459
41404F76459J150909P6729m80568m39483k29550J03041L60132M0845o21562o67370
$$ 676459 1827368 1904097 1423529 984046 754496 857537 1217669 1258514 636952 -30418
41394c0418J9335M07542O7533j81081O1330O578o05833o12536N82476J520204
$$ -30418 -11083 396459 463992 282911 344241 350819 -255014 -867550 -285074 1235130
41384A235130O65825j135636j744480o56330O31230Q84578M10521L5531o9445
$$ 1235130 1900955 765319 -979161 -1635491 -1004261 -119683 290838 326369 256924
41375B56924j81574k96020o8998O02023J182992R71227P0065n49117l63991j04613
$$ 256924 75350 -220670 -289668 312355 1495347 2466574 2536639 1987522 1623531 1518918
41365A518918n03233r06197l27562O44306N78231m08398q08176l11692k20772
$$ 1518918 1015685 109488 -218074 426232 1004463 596065 -212111 -523803 -744575
41356g44575q87968q97765L41569J268294O84093k54386o5530O62133N89037m4513
$$ -744575 -1632543 -2530308 -2188739 -920445 -236352 -490738 -556268 105865 694902 650389
41346F50389j96660O893j19436k25293K66525O47853P1220o02766n9344J047841
$$ 650389 453729 460622 341186 115893 382418 1030271 1101491 498725 439381 1487222
41336A487222R95025j85376r17648q05753q88677j222618n65874J118264K039931
$$ 1487222 2482247 2296871 1379223 573470 -315207 -1537825 -2103699 -985435 1054496
41327A054496J225952p6197n15102n05351r49264j473299j126856N6755J168940
$$ 1054496 2280448 2204251 1689149 1183798 234534 -1238765 -2365621 -2308866 -1139926
41318a139926J483370Q30312l87358j152593o37352O05932J167425P33367L46575
$$ -1139926 343444 1173756 786398 -366195 -1003547 -397615 769810 1503177 1849752
41309A849752M17355J1212j142982j560977k27282J400846J263776l00366j183879
$$ 1849752 2267107 2278319 1135337 -425640 -652922 747924 2011700 1711334 527455
41300E27455o19253J83058L75734N43413J014887Q53349m82743j729291j350487
$$ 527455 -91798 91260 466994 1010407 2025294 2878643 2395900 666609 -683878
41291f83878J97199J019495L53250o33841p11156j08064L11428M24493N51454
$$ -683878 -486679 532816 886066 252225 -458931 -566995 -255567 168926 720380
41282G20380M41135l35873j223373j090093O0323Q97671O53456J22228J78757
$$ 720380 1161515 825642 -397731 -1487824 -1427501 -529830 123626 245854 424611
41273D24611L81314k684n15304l00230K83502K42797k62557k26714K84224J68649
$$ 424611 805925 803241 287937 -12293 271209 514006 251449 24735 308959 477608
41263D77608o02592o27370N95614J554990R12538m72382q80895j57180M69118
$$ 477608 -124984 -752354 -156740 1398250 2310788 1838406 957511 800331 1269449
41254A269449L54130m3417l10564n64674p99734o92203k14999J98801K46386Q8648
$$ 1269449 1623579 1580162 1269598 704924 -94810 -787013 -1002012 -803211 -556825 -468177
41244d68177M2822K14548L98489K47817k23325l44259M12098J292086Q91385p10503
$$ -468177 -425355 -210807 187682 435499 212174 -132085 280013 1572099 2463484 1752981
41234A752981j619193p22661N92691N70321k02485Q235R66055Q16205n83782j128240
$$ 1752981 133788 -588873 3818 574139 371654 379889 1345944 2162149 1578367 450127
41224D50127J39463J354852P50536o46667q39572O3126M49363o5830m36317k28884
$$ 450127 589590 1944442 2694978 2048311 1208739 1271865 1721228 1655398 1219081 990197
41214I90197n3305j08822L8137K02827l26578j281404j497033p92642k79824l74307
$$ 990197 936892 828070 866207 1069034 742456 -538948 -2035981 -2828623 -3108447 -3482754
41204c482754o9773J068009J715986P57862p81122j137278k93471L64049K89223
$$ -3482754 -3552527 -2484518 -768532 -10670 -791792 -1929070 -2222541 -1858492 -1569269
41195a569269J80000L75344L00868l28000q99107q05529j39685O96943J350652
$$ -1569269 -1389269 -1013925 -713057 -1041057 -1940164 -2745693 -2885378 -2188435 -837783
41186h37783J389135O03634l79605n25166L01013J048217P86764j81189p72766
$$ -837783 551352 1154986 775381 250215 551228 1599445 2386209 2205020 1432254
41177A432254l62892N73208Q89456k4696j289645j258313L72219J829218J434518
$$ 1432254 1069362 1642570 2532026 2507330 1217685 -40628 331591 2160809 3595327
41168C595327j61311j033849o70583j33446L6941K52780K86107o88383k050303
$$ 3595327 3434016 2400167 1729584 1596138 1633079 1885859 2171966 1483583 -566720
41159e66720j839266K23439J790023J169135k75960n10948J02595K9134n46194
$$ -566720 -2405986 -2182547 -392524 776611 500651 -10297 92298 121432 -424762
41150d24762k83471P03435J036987M49973n5598j46412l37834m65065P4389O75099
$$ -424762 -708233 -4798 1032189 1482162 1426564 1280152 942318 477253 551642 1226741
41140A226741J43596j007359r87931L08906R55221J19984o31815m0968Q96850
$$ 1226741 1370337 362978 -624953 -316047 639174 759158 127343 86375 983225
41131I83225Q40714J40362l33998p31301j182366q26276N02331J104049j61894
$$ 983225 1823939 1964301 1630303 899002 -283364 -1109640 -607309 496740 334846
41122C34846j568447q43336J145219J524963j65074j315187k77939J352283J374601
$$ 334846 -1233601 -2076937 -931718 593245 428171 -887016 -1164955 187328 1561929
41113A561929j5057j052048r05914j53063M06417M10441k8825k90189J92111R20121
$$ 1561929 1546872 494824 -411090 -564153 -157736 252705 223880 -66309 125802 1045923
41103A045923P05895m92994j169113m39593M93072J80387p54135o51853M50477
$$ 1045923 1751818 1258824 89711 -349882 143190 323577 -430558 -1082411 -631934
41094f31934Q97101R6465o64948m34668M9408n4392k24593K26788O82204K82923
$$ -631934 265167 361632 -303316 -737984 -688576 -742968 -967561 -740773 -58569 224354
41084B24354l77118j12504P85443Q96924m5114p60389n03120q6941l24121p17019
$$ 224354 -152764 -265268 520175 1417099 1371985 611596 108476 21535 -302586 -1019605
41074a019605m72222J69522M79650M06742L81383M80663M82079L19258k2652n36903
$$ -1019605 -1491827 -1322305 -842655 -435913 -54530 426133 908212 1227470 1204818 667915
41064F67915p41631j3598J126814J150700k34623j197447m01980P06759Q1645
$$ 667915 -73716 -87314 1039500 2190200 1955577 758130 356150 1062909 1144554
41055A144554j401877j030741J375931K836292J527782p07033j369899p24108
$$ 1144554 -257323 -1288064 87867 2924159 4451941 3744908 2375009 1650901
41047A650901n19586r19039p58437L4348L42206j07947l66528N7386N76004P13677
$$ 1650901 1131315 212276 -546161 -511813 -169607 -277554 -644082 -586696 -10692 702985
41037G02985O60989M55808j97945r76888r08423K07620J249616J205568M15400
$$ 702985 1363974 1819782 1621837 644949 -263474 -55854 1193762 2399330 2814730
41028B814730j79821l42975m13355m35803k39974p5940l34916p40725o28082q2269
$$ 2814730 2634909 2291934 1878579 1442776 1202802 1126862 791946 51221 -576861 -659130
41018f59130K2319o01517j033558m50124O02079R96440O18525K38366R5074k40932
$$ -659130 -636811 -1238328 -2271886 -2722010 -2119931 -1123491 -504966 -266600 -171526 -412458
41008d12458o14750k29381P71043J011965k4515q83338k76793P56358L96280j023012
$$ -412458 -1027208 -1256589 -485546 526419 501904 -381434 -658227 98131 494411 -528601
40998e28601j485260l93691P39266Q29389N64198P23857Q87577N68439J47054
$$ -528601 -2013861 -2407552 -1668286 -838897 -274699 449158 1336735 1905174 2052228
40989B052228j37687p30663j466946j220796J38469R77081L67428k37134N23535
$$ 2052228 1914541 1183878 -283068 -1503864 -1365395 -388314 -20886 -258020 265515
40980B65515J277074L6240k106528k161646J59901J842866J024512n32580m94653
$$ 265515 1542589 1578829 -527699 -2689345 -2529444 -686578 337934 -194646 -689299
40971f89299P19640J229552O65229M5399k62511o28757p71217l9633J039330J097583
$$ -689299 30341 1259893 1925122 1970521 1708010 1079253 308036 268403 1307733 2405316
40961B405316J7061p21244k62908L08130k65408j316641j160875L19209J348268
$$ 2405316 2422377 1701133 1438225 1746355 1480947 164306 -996569 -677360 670908
40952F70908P15243o11142r75463k88904J87431j21021m03594J30629J086010
$$ 670908 1386151 775009 -200454 -489358 -301927 -422948 -826542 -695913 390097
40943C90097J468703Q34936m18987j398894j207972K40474J694406J581159j17699
$$ 390097 1858800 2693736 2274749 875855 -332117 -91643 1602763 3183922 3066223
40934C066223j725268j920437j077223j53085O64195J406311J478521N37552n26360
$$ 3066223 1340955 -579482 -1656705 -1809790 -1145595 260716 1739237 2276789 1750429
40925A750429p12522m18750n70825q51295l11894O69796P88898O7074j17980N40433
$$ 1750429 1037907 619157 48332 -802963 -1114857 -445061 343837 410911 292931 833364
40915H33364P15079j07391n01455M93283J477454P18989j075204j733280p54124
$$ 833364 1548443 1441052 939597 1432880 2910334 3629323 2554119 820839 66715
40906F6715K28554K250p15213o38030L35611J256001J341347O16666k83078o50898
$$ 66715 295269 297519 -417694 -1055724 -720113 535888 1877235 2493901 2210823 1559925
40896A559925k97834K23715J74695n20870j169906j103782m11345J86365J21455
$$ 1559925 1262091 1485806 1660501 1139631 -30275 -1134057 -1545402 -1359037 -1237582
40887a237582l81349m80446L49759J587110K095646J347048l7339j034747j207543
$$ -1237582 -1618931 -2099377 -1749618 -162508 1933138 3280186 3242847 2208100 1000557
40878A000557q15642l06229K0042P1959N317P8638K74677K42292j68679n26397
$$ 1000557 184915 -121314 -101272 -29313 -23996 54642 329319 571611 402932 -123465
40868a23465k96669L99083Q52405O21632K4592l38043l05992j56635j1901L35415
$$ -123465 -420134 -21051 831354 1452986 1477578 1139535 833543 676908 665007 1000422
40858A000422Q43194Q98681R6327q70011q39265J76173P89342J05218r81709j083647
$$ 1000422 1843616 2742297 2838624 1968613 1129348 1305521 2094863 2200081 1218372 134725
40848A34725k84586J89391q8946k96985J12253N27773K18005n21042p47656q628
$$ 134725 -149861 39530 -49416 -346401 -234148 293625 511630 -9412 -757068 -765696
40838g65696J178125J720396Q76424q17151j733832q85383P30862J279051L91683
$$ -765696 412429 2132825 3009249 2192098 458266 -427117 303745 1582796 1974479
40829A974479o37002q47924n85771l28411R6592O19105N16704l25127q05310j51342
$$ 1974479 1337477 489553 -96218 -424629 -328037 291068 807772 482645 -322665 -474007
40819d74007Q17035Q96523J89197l95669o30756q80980j043476o92552k477M51339
$$ -474007 343028 1239551 1428748 1033079 402323 -478657 -1522133 -2214685 -2217162 -1765823
40809a765823O25017Q99141J230594J198293P45675K01952k54059n75949n97418
$$ -1765823 -1140806 -241665 988929 2187222 2932897 3134849 2880790 2304841 1707423
40800A707423l64873l14143n28344l72958M20100R71280M83190m04507o08588
$$ 1707423 1342550 1028407 500063 127105 547205 1518485 2001675 1597168 988580
40791I88580l36766m93619q59625m53115N17524P63077M9224m50282k24118j76187
$$ 988580 651814 158195 -701430 -1154545 -637021 126056 175280 -275002 -499120 -675307
40781f75307p62783r81980o3067J194506J703497J527167J094367J50507j356254
$$ -675307 -1438090 -2420070 -2483137 -1288631 414866 1942033 3036400 3186907 1830653
40772A830653k322493j723796j65912R31637J129706R01193M29138l03915p40264
$$ 1830653 -491840 -2215636 -2381548 -1449911 -320205 580988 1010126 706211 -34053
40763c4053l60124K53854J89642k72784j95298K75517J87793l37662j93714N84233
$$ -34053 -394177 -140323 49319 -223465 -418763 -143246 44547 -293115 -486829 97404
40753I7404N64683o38327j413059o08142O18598P08796J31766K95285J037219
$$ 97404 662087 23760 -1389299 -1997441 -1378843 -670047 -538281 -242996 794223
40744G94223J072965L69203R2463L51934R334j010071j216983o9211Q60772L16827
$$ 794223 1867188 2236391 2328854 2680788 2690122 1680051 463068 393857 1254629 1571456
40734A571456o69552o46231j49708m49504r94673l36340R41650O83399j255329
$$ 1571456 901904 255673 105965 -343539 -1338212 -1674552 -732902 -49503 -1304832
40725a304832k272765p42977J564760K108897R76403K4637j24384k81101n74035
$$ -1304832 -3577597 -4320574 -2755814 -646917 329486 354123 229739 -51362 -625397
40716f25397k16868O50834P76030j23212o60936J06046J154404J042859L0034
$$ -625397 -842265 -191431 584599 461387 -199549 -93503 1060901 2103760 2133794
40707B133794n01182j81649R532n35564j120835q92548j17278K95476J10500q8337
$$ 2133794 1632612 1450963 1460495 924931 -195904 -1088452 -1205730 -910254 -799754 -888091
40697h88091N6748K12962J21561J42126N35600P49313J86625o29550o20995J72129
$$ -888091 -831343 -618381 -496820 -354694 180906 930219 1116844 487294 -133701 38428
40687C8428N50188O368n10797k07827L10883K59138Q6590M93922Q66645J94166
$$ 38428 588616 594984 84187 -123640 187243 446381 532971 1026893 1893538 2087704
40677B087704r20723q56740M29596J057435q0202j663930j739317j82165J383376
$$ 2087704 1166981 310241 739837 1797272 1717070 53140 -1686177 -1868342 -484966
40668d84966J499438J60354j312366j378059J76775J681680J333977m46400j479284
$$ -484966 1014472 1174826 -137540 -1515599 -1338824 342856 1676833 1230433 -248851
40659b48851q02564K00287J72040k75696m3933M50049K67587j13864L54030J153505
$$ -248851 -1051415 -851128 -679088 -954784 -998717 -548668 -281081 -394945 -40915 1112590
40649A112590Q22112n03812j062591j54806R12959J015661O67405N70169K88081
$$ 1112590 1934702 1430890 368299 213493 1126452 2142113 2809518 3379687 3667768
40640C667768n31307r45914j67752P12032R5486j494445j894324m47138J011075
$$ 3667768 3136461 2190547 2022795 2734827 2830313 1335868 -558456 -1005594 5481
40631E481Q63199o5552m0393R13068J304341O27979o2085j04074k35567j040692
$$ 5481 868680 803128 762735 1675803 2980144 3608123 3546038 3441964 3206397 2165705
40621B165705j686129j240839k91966M4924K2091N92138J251981N18689j235797
$$ 2165705 479576 -761263 -1053229 -1008305 -986214 -394076 857905 1376594 140797
40612A40797j564263M40058K222162J154485j552074k473429p58633J062646J001738
$$ 140797 -1423466 -983408 1238754 2393239 841165 -1632264 -2390897 -1328251 -326513
40603c26513Q149k07326K57242L15497j06302k69013k3306J87017K39111K88063
$$ -326513 -318364 -525690 -268448 47049 -59253 -328266 -351572 -164555 74556 362619
40593C62619K06333j21106l29258j38844L5039k08150l94690J04554Q71964R29453
$$ 362619 568952 447846 118588 -20256 14783 -193367 -588057 -483503 388461 1317914
40583A317914K22695l43539k91217p0906j20284k68165k44077p1351K20418O60664
$$ 1317914 1540609 1197070 905853 834947 714663 446498 202421 131070 351488 1012152
40573A012152R86036Q03748K07002l24953o68684j075853j421474j151300j51170
$$ 1012152 1998188 2801936 3008938 2683985 2015301 939448 -482026 -1633326 -1784496
40564a784496R50475J512804J393835P41103q7527m64379j38802J50729l33835
$$ -1784496 -834021 678783 2072618 2813721 2726194 2261815 2123013 2273742 1939907
40555A939907q68495j17329J483405J840817K41032j425162j413200m61350p4115
$$ 1939907 1071412 954083 2437488 4278305 4519337 3094175 1680975 1219625 1145510
40546A145510m1353N50576J096296M09644q86495j126413l50243p6687n09200
$$ 1145510 1104157 1654733 2751029 3160673 2274178 1147765 797522 720835 211635
40537B11635k91950P76722J151921K51529m62107n147N57950J71527m68761n15411
$$ 211635 -80315 696407 1848328 2099857 1637750 1632603 2190553 2362080 1893319 1377908
40527A377908n40756j020237r14619M47058J524982O89540r23860r55136M94650
$$ 1377908 837152 -183085 -1097704 -650646 874336 1563876 640016 -315120 179530
40518A79530J114389Q1780q92257n24201K32020J37222l38071q9560P45713J137649
$$ 179530 1293919 1375699 483442 -40759 191261 328483 -9588 -99148 646565 1784214
40508A784214P16195M6366k93275k30441J6594K02677J38738k40512p90526j090525
$$ 1784214 2500409 2546775 2253500 2023059 2039653 2242330 2381068 2140556 1350030 259505
40498B59505o30168N19025J304354P40469n16891p24116L92132R76723j46677
$$ 259505 -370663 148362 1452716 2193185 1676294 952178 1344310 2321033 2174356
40489B174356j454099r92777N83016J188469N82750K04286L07125k03688j150965
$$ 2174356 720257 -272520 310496 1498965 2081715 2286001 2593126 2389438 1238473
40480A238473r21031O12739J445153N46430n83789n00064O5430r8951o11478m74456
$$ 1238473 317442 930181 2375334 2921764 2337975 1837911 1903341 1804390 1192912 718456
40470G18456K64267J002763J497085J393865K67882j080257j050803J73908M69870
$$ 718456 982723 1985486 3482571 4876436 5144318 4064061 3013258 3187166 3657036
40461C657036p35909j175355M57700J944431J115140l50665K77596K032280J839479
$$ 3657036 2921127 1745772 2203472 4147903 5263043 4912378 5189974 7222254 9061733
40452I061733k77518j344758l93726M10248j94978q71044o93280o69432j224857
$$ 9061733 8784215 7439457 7045731 7455979 7261001 6389957 5696677 5027245 3802388
40443C802388j067748J70781P92730l2919o07541L91063J520465R48361o05365
$$ 3802388 2734640 2905421 3698151 3665232 3057691 3448754 4969219 5917580 5312215
40434E312215j240634p33585j48081J86358M94569L74759m68264j143682p88272
$$ 5312215 4071581 3337996 3189915 3376273 3870842 4245601 3777337 2633655 1845383
40425A845383n0624O9462p2673K55020M78264k20332j017655n84238N20706O28073
$$ 1845383 1794759 1864221 1791548 2046568 2524832 2304500 1286845 702607 1223313 1851386
40415A851386k54883n42807J50082M63851k06793o60521K8804J017294J065179
$$ 1851386 1596503 1053696 1203778 1667629 1460836 800315 829119 1846413 2911592
40406B911592J81187p79290j180706q03924J08118O88079K41015o40708p57568
$$ 2911592 3092779 2313489 1132783 328859 436977 1125056 1366071 725363 -32205
40397c2205r1897L37851L83507R01734J751710J535920J8537j044674n16182M02864
$$ -32205 -124102 213749 597256 1498990 3250700 4786620 4805157 3760483 3244301 3647165
40387C647165L08354k03759k563M24740J01301m42604k94155j53563r84766j643796
$$ 3647165 3955519 3751760 3749197 4173937 4275238 3832634 3538479 3384916 2400150 756354
40377G56354m47245J499114J452605n56574j531056k34861R85506K74695q12939
$$ 756354 309109 1808223 3260828 2704254 1173198 938337 1923843 2198538 1385599
40368A385599l36426O79658L77313m47356J54672J571461J408371n50335j968684
$$ 1385599 1049173 1728831 2106144 1658788 1813460 3384921 4793292 4242957 2274273
40359B274273j553066n00901l6686J84215N65734N18688j50063m52625J67968
$$ 2274273 721207 220306 183620 367835 933569 1452257 1302194 849569 1017537
40350A017537P72897M54487j88549q1653O83261J125493O87643l40828j151453
$$ 1017537 1790434 2244921 2056372 1974719 2657980 3783473 4471116 4130288 2978835
40341B978835q65339N75564J771943J159585p88244j875221j102825J26120L53273
$$ 2978835 2113496 2689060 4461003 5620588 4832344 2957123 1854298 1980418 2333691
40332B333691N4258K41401N53910J96163l40238j05004N14159L95599m04786p98795
$$ 2333691 2387949 2629350 3183260 3379423 3039185 2934181 3448340 3843939 3439153 2640358
40322B640358l97292J99800N61201O78364L60297m53885j048910p19139Q6965
$$ 2640358 2243066 2442866 3004067 3682431 4042728 3588843 2539933 1820794 1907759
40313A907759M67313M82150O90292P78029R3958q10961p86574p7306l6553p91719
$$ 1907759 2375072 2857222 3547514 4325543 4419501 3608540 2821966 2744660 2708107 1916388
40303A916388r38246O9612R02138M24794o20658q63479j46259P17440J160128
$$ 1916388 978142 1047754 1949892 2374686 1754028 890549 744290 1461730 2621858
40294B621858J051858L75410n55826j047728p52246o2846N23305R41110J204343
$$ 2621858 3673716 4049126 3493300 2445572 1693326 1630480 2153785 3094895 4299238
40285D299238J110023O52999K76871L96819R58959J552918J667856R76532k20369
$$ 4299238 5409261 6062260 6339131 6735950 7694909 9247827 10915683 11892215 11671846
40276A1671846j088527j274644j370002j728095j550431k45887J006385O23301
$$ 11671846 10583319 9308675 7938673 6210578 4660147 4414260 5420645 6043946
40268F043946q37489j296348k68118N43557O2338o71432m95821J50709M34979
$$ 6043946 5206457 3910109 3641991 4185548 4247886 3576454 3080633 3231342 3666321
40259C666321N32118P59222O09824k09243q38323m65773L88994P49243N31230
$$ 3666321 4198439 4957661 5567485 5358242 4519919 4054146 4443140 5192383 5723613
40250E723613J67809k83142p90330q84547l58086K87507P43283J364216K074356
$$ 5723613 5891422 5608280 4817950 3933403 3575317 3862824 4606107 5970323 8044679
40241H044679J874516L85917j080709j107759j00872M22307r7404q69979r93651
$$ 8044679 9919195 10305112 9224403 8116644 8015772 8438079 8340675 7470696 6477045
40232F477045k88012P23934J135070M82625m04390k11326Q76861J166429O897
$$ 6477045 6189033 6912967 8048037 8530662 8126272 7914946 8791807 9958236 9965133
40223I965133j018173m34675Q75423J098932J77023m11086N3457Q52827J202564
$$ 9965133 8946960 8512285 9387708 10486640 10663663 10252577 10306034 11158861 12361425
40214A2361425J171767J273613J827590K639209L025290K521573J644479J307864
$$ 12361425 13533192 14806805 16634395 19273604 22298894 24820467 26464946 27772810
40206B7772810J548702J761031J969995K519628K760282J900505J036230K046049
$$ 27772810 29321512 31082543 33052538 35572166 38332448 40232953 41269183 43315232
40198D3315232M431599O005136O924968R640550J4264360J8282705K2116228K9256002
$$ 43315232 47746831 53751967 60676935 70317485 84581845 102864550 124980778 154236780
40190A54236780L7271630L4598015J3374167j7242116l8017958l9706954l0134830
$$ 154236780 191508410 226106425 239480592 222238476 184220518 144513564 114378734
40183A14378734k1399934j6981410j3659724r800726o833617n434376m530549
$$ 114378734 92978800 75997390 62337666 52536940 45703323 40268947 35738398
40176C5738398l390581k296752j549416j083243o29246J86081J223350J535565
$$ 35738398 32347817 30051065 28501649 27418406 26789160 26975241 28198591 29734156
40168B9734156Q21652N49955J999213M007446M793849N109884O952195R968770
$$ 29734156 30555808 31105763 33104976 37112422 41906271 47016155 53968350 63937120
40160F3937120J2170616J3590993J6160021K0802157K7803783L7873784M7526151
$$ 63937120 76107736 89698729 105858750 126660907 154464690 192338474 239864625
40153B39864625M5457022K2106449j5318068m5172548n2770196m3676345l2367784
$$ 239864625 285321647 307428096 292110028 246937480 194167284 150490939 118123155
40146A18123155k4872138j8562222j2610391r543297q845671p148764m435832
$$ 118123155 93251017 74688795 62078404 52535107 43689436 36540672 32104840
40139C2104840l700306m693944l988941j394611n43763k347022l275605j493268
$$ 32104840 28404534 23710590 19721649 18327038 17783275 15436253 12160648 10667380
40131A0667380K39171l90888j653692j414267o49081r11357j312314n07327O45188
$$ 10667380 10906551 10515663 8861971 7447704 6798623 5887266 4574952 4067625 4712813
40122D712813P07578J40012J48426M98390K21126n90365j057678p47214K02384
$$ 4712813 5420391 5560403 5708829 6207219 6428345 5837980 4780302 4033088 4235472
40113D235472J267675J451404K11421j276428j246365P0664O88030r0881q35540
$$ 4235472 5503147 6954551 7165972 5889544 4643179 4713843 5401873 5310992 4475452
40104D475452n99895k29885l60221k35970N06813Q73907L90711N7705L37867J27489
$$ 4475452 3875557 3645672 3285451 3049481 3556294 4430201 4820912 4878617 5216484 5343973
40094E343973j001740j497203l40553R18112M79388q39484j038133o9673N07227
$$ 5343973 4342233 2845030 2504477 3422589 3901977 3062493 2024360 1954687 2461914
40085B461914K15033k2447J72859K14798k5215M0851M52955M52852k74362j024512
$$ 2461914 2676947 2654500 2827359 3042157 3016942 3057793 3510748 3963600 3689238 2664726
40075B664726r65326o2890R14965J032209Q6365r10011p05084M71741R95627J23802
$$ 2664726 1699400 1636510 2551475 3583684 3670049 2760038 2054954 2526695 3522322 3646124
40065C646124q21336l75883R03171J353734O11970k10433l95794l14913k54639
$$ 3646124 2824788 2448905 3352076 4705810 5317780 5107347 4711553 4396640 4142001
40056D142001J62696R60560J179048K5455j743266k341040r95741R97435J710645
$$ 4142001 4304697 5265257 6444305 6469760 4726494 2385454 1389713 2387148 4097793
40047D097793Q84497R5957M71102J170629Q94158K7895q615R15709J569230J583366
$$ 4097793 4982290 5078247 5549349 6719978 7614136 7642031 7633416 8549125 10118355 11701721
40037A1701721K050568L431135M472536M166465L541609M260782O075178O786129
$$ 11701721 13752289 17183424 21655960 25822425 29364034 33624816 39699994 46486123
40029D6486123M597999n3884m823696p336778p094043n659953m703910m202683
$$ 46486123 51084122 51030238 46206542 38869764 31775721 26115768 21411858 17209175
40021A7209175l251303k015140j453326j405211p59248L50751M63735o21365j179041
$$ 17209175 13957872 11942732 10489406 9084195 8324947 8675698 9139433 8518068 7339027
40012G339027k84625P76008Q94529R20546J620730J828641N40196p83688j93775
$$ 7339027 7054402 7830410 8724939 9645485 11266215 13094856 13635052 12851364 12657589
40003A2657589J691446K803751K803571K917887L485127M077638N409837Q386690
$$ 12657589 14349035 17152786 19956357 22874244 26359371 30437009 35846846 44233536
39995D4233536J1292286J0599959N233116j949866p423798r971606j0090858q546792
$$ 44233536 55525822 66125781 71358897 69409031 61985233 52013627 41922769 33375977
39987C3375977o424946m952183m204427l129886j511131o16455j186756k102384
$$ 33375977 26951031 21998848 17794421 14664535 13153404 12536949 11350193 9247809
39979I247809k000198j122026n57336n43225n46741l93264l39114l91081l12888
$$ 9247809 7247611 6125585 5568249 5025024 4478283 4085019 3745905 3354824 3041936
39970C041936r4590P4219J07237N0129M4873K74270N68088K83040p54900j478460
$$ 3041936 2947346 3021565 3128802 3178931 3223804 3498074 4066162 4349202 3594302 2115842
39960B115842p70238P29938J271595M82231k42134j07826m6666p75318j341198
$$ 2115842 1345604 2075542 3347137 3829368 3587234 3479408 3432742 2657424 1316226
39951A316226p45033K89920N07571P1534n4872J37210K4997j85538J56259O70918
$$ 1316226 571193 861113 1368684 1440218 1385346 1522556 1547553 1362015 1518274 2189192
39941B189192L72924n59187q78057k08958M24256K37228l35791o12763n46452
$$ 2189192 2562116 2002929 1124872 915914 1340170 1577398 1241607 628844 82392
39932H2392k71960K45658P07229N55265O32L3242Q40781J170203R3934j377087
$$ 82392 -189568 56090 763319 1318584 1319216 1352458 2193239 3363442 3457376 2080289
39922B080289j498337j39085J169285J329938P31583J49916k97629o57365n09264
$$ 2080289 581952 442867 1612152 2942090 3673673 3823589 3525960 2868595 2359331
39913B359331L70953J194225Q90832l75939j181335n74966P11754J218848N41107
$$ 2359331 2730284 3924509 4815341 4439402 3258067 2683101 3394855 4613703 5154810
39904E154810m24050q54513q92690r44400q00393q4773Q28968J157117Q66915
$$ 5154810 4730760 3876247 2983557 2039157 1238764 1153991 1982959 3140076 4006991
39895D006991O71756P56624M23230n58066j130487l08154J267434K132511J977189
$$ 4006991 4678747 5435371 5858601 5300535 4170048 3861894 5129328 7261839 9239028
39886I239028J675137J522506Q37365l91511q41698L32975K028801K519695J582331
$$ 9239028 10914165 12436671 13274036 12882525 12040827 12373802 14402603 16922298 18504629
39877A8504629L27646n13984j035881j232604q12192N4614P15306Q32320N08841
$$ 18504629 18832275 18318291 17282410 16049806 15237614 15292228 16007534 16839854 17348695
39868A7348695k23991j219380j704329r80777L74985J028778O39517N2303k53655
$$ 17348695 17124704 15905324 14200995 13220218 13595203 14623981 15263498 15315801 15062146
39859A5062146o18403r06348k44770J327682K318544J776588O87602M27459Q98755
$$ 15062146 14443743 13537395 13292625 14620307 16938851 18715439 19403041 19830500 20729255
39850B0729255J289973J659950K431796L105440K949632K487890K859971L984730
$$ 20729255 22019228 23679178 26110974 29216414 32166046 34653936 37513907 41498637
39842D1498637M697263M513502L932034L093139J507114p87215l027295m812889
$$ 41498637 46195900 50709402 54641436 57734575 59241689 58454474 55427179 50614290
39834E0614290o213453o742601n639184l517684k313477k882096l828911l543143
$$ 50614290 44400837 37658236 32019052 28501368 26187891 23305795 19476884 15933741
39826A5933741k350497j643825j718788j698058j185512p67513q30052q59336
$$ 15933741 13583244 11939419 10220631 8522573 7337061 6569548 5739496 4880160
39818D880160k89670N26304O79880p8767q37685m73140R19246J903607J340803
$$ 4880160 4590490 5116794 5796674 5717907 4880222 4407082 5326328 7229935 8570738
39809H570738j28509q15734j23167P72394N92577l84398q78522l94749K33401
$$ 8570738 8442229 7626495 7503328 8275722 8868299 8483901 7605379 7210630 7444031
39800G444031O0062p68615j291153r35077m5672Q12609J620487K545042L131404
$$ 7444031 7504093 6735478 5444325 4509248 4463576 5276185 6896672 9441714 12573118
39791A2573118K643228J287566K26665k8120l61193j516733k666344k555429j485941
$$ 12573118 15216346 16503912 16730577 16702457 16341264 14824531 12158187 9602758 8116817
39782H116817q99978j243685j513500r45782J750N33177L97761k66444j073423
$$ 8116817 7216839 5973154 4459654 3513872 3515622 4048799 4446560 4180116 3106693
39773C106693j309203o60244j8523m53437j371470j060704O94578K041913J656774
$$ 3106693 1797490 1137246 1118723 665286 -706184 -1766888 -1072310 969603 2626377
39764B626377M47994j44618j61379l24977m41194K0764N73715L51450l76781o00025
$$ 2626377 3074371 2929753 2768374 2443397 2002203 2022967 2596682 2948132 2571351 1971326
39754A971326j77456P9480k25374o05104n19783Q8423R58860J586275J404582
$$ 1971326 1793870 1873350 1647976 1042872 523089 611512 1570372 3156647 4561229
39745D561229N34281J9170O68063K001277K929861K987747K261232P96385j004472
$$ 4561229 5095510 5114680 5782743 7784020 10713881 13701628 15962860 16759245 15754773
39736A5754773k052451j774098j150272j373723j958498j579730m28749m9027
$$ 15754773 13702322 11928224 10777952 9404229 7445731 5866001 5437252 5388225
39728E388225p97210j213114m08279M75630M2885j298710k027040j471375k30168
$$ 5388225 4591015 3377901 2969622 3445252 3488137 2189427 162387 -1308988 -1539156
39719a539156Q00093J060781M38612n86758j173187r59818m27492j54922j32504
$$ -1539156 -739063 321718 760330 173572 -999615 -1959433 -2386925 -2541847 -2674351
39710b674351q7031K1910J90850N64363J031463J081491M95133k08762m21792
$$ -2674351 -2761382 -2739472 -2548622 -1984259 -952796 128695 623828 415066 -6726
39701f726j80678J06030K66758L16295K01925K6932J50769O27443R09522N62113
$$ -6726 -187404 -81374 185384 501679 703604 730536 881305 1508748 2418270 2980383
39691B980383j00574n58100q26214j073125r65955k38575L94031o1775j222948
$$ 2980383 2879809 2321709 1495495 422370 -543585 -782160 -388129 -449904 -1672852
39682a672852j448620l3855J611894J690378L10222q23256p25756j47777j21908
$$ -1672852 -3121472 -3155327 -1543433 146945 457167 -366089 -1091845 -1239622 -1361530
39673a361530m16237p9891R55610J637003J159096n0868r33215r43113l34652
$$ -1361530 -1777767 -1857658 -902048 734955 1894051 1843183 909968 -33145 -367797
39664c67797L33985O12792L08624l75643r00983q54222l17094L29115P50084O81153
$$ -367797 -33812 578980 887604 511961 -389022 -1243244 -1560338 -1231223 -481139 200014
39654B00014K1997p51911p51905J65844Q49664K97423o90245m55032R70973J669266
$$ 200014 222011 -529900 -1281805 -1115961 -266297 31126 -659119 -1114151 -143178 1526088
39644A526088O33315o65687m98963N45523O67403k71851p72779l44674k01859
$$ 1526088 2159403 1493716 994753 1540276 2207679 1935828 1163049 818375 616516
39635F16516r48159j377720n01299P32681J006004P19212R62699J309965N40756
$$ 616516 -331643 -1709363 -2210662 -1477981 -471977 247235 1209934 2519899 3060655
39626C060655q65553j093672l697M01291p31025j457835j22623J715032J492383
$$ 3060655 2195102 1101430 1097733 1499024 767999 -689836 -812459 902573 2394956
39617B394956l97465j282606l60317L93250k92115j045386l76821Q86487J123492
$$ 2394956 1997491 714885 354568 747818 455703 -589683 -966504 -80017 1043475
39608A043475M35220P2077L06453L97586Q1785k62987n31995p83829o05785K57212
$$ 1043475 1478695 1550772 1857225 2254811 2336596 2073609 1541614 757785 152000 409212
39598D09212J007818P19169j45601l48165K38880O38349M83529L29588K64329
$$ 409212 1417030 2136199 1990598 1642433 1881313 2519662 3003191 3332779 3597108
39589C597108k95906j174072j274910l64145L51464Q8269l42353p2366L00297
$$ 3597108 3301202 2127130 852220 488075 839539 927808 585455 513089 813386
39580H13386j43998q96288p38324K94006R67184P11891K57516K82470M21432K4874
$$ 813386 669388 -226900 -965224 -671218 295966 1007857 1265373 1547843 1969275 1994149
39570A994149p36667j053802n43923K47249M68080m8168n69690l31112N31942
$$ 1994149 1257482 203680 -340243 -92994 375086 326918 -242772 -573884 -41942
39561d1942J162560J024018M21109m2050j64156j80317l64657p32029r92701q11297
$$ -41942 1120618 2144636 2565745 2523695 2359539 2179222 1814565 1082536 89835 -721462
39551g21462k35434K97334N46796P20438Q50798M76528m59719r91726l51251O42610
$$ -721462 -956896 -659562 -112766 607672 1458470 1934998 1475279 483553 132302 774912
39541G74912N95639l22652o13939J91913Q74974M93203l83769q55927q17592m19952
$$ 774912 1370551 1047899 433960 625873 1500847 1994050 1610281 754354 -63238 -483190
39531d83190L08025Q00182K61383q25493r68746m2595L15416n02924q67215K27968
$$ -483190 -175165 625017 886400 60907 -907839 -950434 -635018 -1137942 -2005157 -1777189
39521a777189J161365M09623o37702Q037J372356J128758k97064m24293R14835
$$ -1777189 -615824 -206201 -843903 -835866 536490 1665248 1368184 943891 1858726
39512A858726J228596l32509j518828p49790M89231L88029m38930n90387l18584
$$ 1858726 3087322 2754813 1235985 486195 975426 1363455 924525 334138 15554
39503A5554n09995p07014k7051R40155R23351O1446l38491J80729P37923N47422
$$ 15554 -494441 -1201455 -1228506 -288351 635000 696446 357955 538684 1276607 1824029
39493A824029j28831n10542k29486K71098J51819p15114j228060m22650Q26558
$$ 1824029 1695198 1184656 955170 1226268 1378087 662973 -565087 -987737 -161179
39484a61179P48022n77209j021745M31442J976635J507910n12397j994605j941049
$$ -161179 586843 9634 -1012111 -580669 1395966 2903876 2391479 396874 -1544175
39475a544175r08384L06046J069930P81195l22062q59371n1946R47479P46534
$$ -1544175 -2452559 -2146513 -1076583 -295388 -617450 -1476821 -1528767 -581288 165246
39466A65246j04470j79540L35261J17973p42654p50603L80757J102666N03771
$$ 165246 60776 -118764 216497 334470 -408184 -1158787 -778030 324636 828407
39457H28407l28992j93805M08007L25450l71947o17340O5646R97048J180111L10472
$$ 828407 499415 305610 713617 1039067 667120 49780 115426 1112474 2292585 2603057
39447B603057r07521j375740p82650k8644m8476m93583l09494N65445J017900
$$ 2603057 1695536 319796 -462854 -491498 -539974 -1033557 -1343051 -777606 240294
39438B40294L77200o42531r06862j58905Q71509J205965M22009q38135j289591
$$ 240294 617494 -25037 -931899 -1090804 -219295 986670 1408679 570544 -719047
39429g19047m57316N71390N50500j39849j37394P09557J102179L85171m39654
$$ -719047 -1176363 -604973 -54473 -194322 -331716 377841 1480020 1865191 1425537
39420A425537l10701L74872N63111Q3397l75279l68544j37870j38857m83059p69831
$$ 1425537 1114836 1489708 2052819 2136216 1760937 1392393 1254523 1115666 632607 -137224
39410a37224m85848K29914N20208j6278n17064l7268Q56898Q15662j70234p30377
$$ -137224 -623072 -393158 127050 110772 -406292 -443560 413338 1229000 1058766 328389
39400C28389k87949J75878o8619l41860Q5001P03096P37584M16767L10624J93483
$$ 328389 40440 216318 147699 -194161 -109160 593936 1331520 1748287 2058911 2252394
39390B252394m28350j197986j266405m96626L83701O46117J63484n78697q34450
$$ 2252394 1824044 626058 -640347 -1136973 -753272 -107155 56329 -522368 -1356818
39381a356818l42824K12876P7658l08079J32000J234716J561049O20792k41506
$$ -1356818 -1699642 -1486766 -1409108 -1717187 -1585187 -350471 1210578 1831370 1589864
39372A589864R1183Q71153Q98675L92523K39199L36213L5190m38578l55484J40396
$$ 1589864 1681047 2552200 3450875 3843398 4082597 4418810 4454000 4015422 3659938 3800334
39362C800334K19760l19823r07779j111265q91958l15536K71322K58285l30929
$$ 3800334 4020094 3700271 2792492 1681227 789269 473733 745055 1003340 672411
39353F72411n78909m2623M15072M2387m66352j75244M51297M51703J00045K10200
$$ 672411 93502 50879 465951 508338 41986 -133258 318039 769742 869787 1079987
39343A079987L97216k53608j246526j205829j37381N81877L97729N9667p5609
$$ 1079987 1477203 1223595 -22931 -1228760 -1366141 -784264 -386535 -326868 -402477
39334d02477m51547q72753m52174O27103R90626K32675l83235P598O05668M71043
$$ -402477 -854024 -1726777 -2178951 -1551848 -561222 -328547 -711782 -704184 -98516 372527
39324C72527o9012l35279l89513m18011j53945L18385K72019l99870p21454k01459
$$ 372527 303515 -31764 -421277 -839288 -993233 -674848 -402829 -802699 -1524153 -1725612
39314a725612K72052k4200l58139J39256Q98905Q86487L26501J56094L66126K07749
$$ -1725612 -1453560 -1477760 -1835899 -1696643 -797738 88749 415250 571344 937470 1145219
39304A145219l22761m84918j33627R4056m4496m8974L16667N25875J59372l13520
$$ 1145219 822458 337540 203913 297969 253473 204499 521166 1047041 1206413 892893
39294H92893j04980P34171J150664L01580j205104j767490p51830N59188O27159
$$ 892893 787913 1522084 2672748 2974328 1769224 1734 -750096 -190908 436251
39285D36251k58500o06630q8035J60527l48515o47555j47074K85263l0301k87815
$$ 436251 177751 -428879 -516914 -356387 -704902 -1352457 -1499531 -1214268 -1244569 -1532384
39275a532384K63582P40477J00313p65885k03121J421259J940529M61924j384551
$$ -1532384 -1268802 -528325 -428012 -1193897 -1397018 24241 1964770 2426694 1042143
39266A042143j703043n94262M56559N71465J45103m1812K19450M54220J46699
$$ 1042143 -660900 -1255162 -798603 -227138 -82035 -123847 95603 549823 696522
39257F96522n48860q93311m85084J79060L54852Q187k43277K5344N92966Q78405
$$ 696522 147662 -745649 -1230733 -1051673 -696821 -688634 -931911 -906567 -313601 564804
39247E64804M86223l70817r26241o44308M2322K66366j7358o3365K60210J19486
$$ 564804 1051027 680210 -246031 -890339 -848017 -581651 -599009 -662374 -402164 -282678
39237b82678p53458j221518l15179J120731J391273J57953j221156j344541j08813
$$ -282678 -1036136 -2257654 -2572833 -1452102 -60829 97124 -1124032 -2468573 -2577386
39228b577386J365935J706179N71262p24021n50264P69817J125596l31698j684029
$$ -2577386 -1211451 494728 1065990 341969 -208295 561522 1687118 1355420 -328609
39219c28609j005621O65489R03463m14601j106370j18627J130480J134984K29410
$$ -328609 -1334230 -668741 234722 -179879 -1286249 -1404876 -274396 860588 1089998
39210A089998m72212o45651n47204k85090L3433J44774L5308o8259j96691m29665
$$ 1089998 617786 -27865 -575069 -860159 -826726 -681952 -646644 -714903 -911594 -1341259
39200a341259l11381N60867J463743J241217J11821n01744j28280J57495l11758
$$ -1341259 -1652640 -1091773 371970 1613187 1725008 1223264 1094984 1252479 940721
39191I40721o94898k15484M51402L32849k84410m72520j41541N2355j82662n28374
$$ 940721 245823 30339 481741 814590 530180 57660 -83881 -31526 -214188 -742562
39181g42562n97838k10873N01044R54162O15850j19386k97540J06874N7186p60592
$$ -742562 -1340400 -1551273 -1050229 -96067 519783 400397 102857 209731 266917 -493675
39171d93675j181713l72781P01706O98595j09249m83587j74247J10162K00816
$$ -493675 -1675388 -2048169 -1346463 -647868 -757117 -1240704 -1414951 -1304789 -1103973
39162a103973N19079Q46554M65167m11710o54855P8656Q25068Q60161O67049Q31475
$$ -1103973 -584894 261660 726827 315117 -339738 -261082 563986 1424147 2091196 2922671
39152B922671R73198N18775k40025o93633r34979j339831j557492r37095K03758
$$ 2922671 3895869 4414644 4174619 3480986 2546007 1206176 -351316 -1288411 -1084653
39143a084653P89174N70395M72162R89089J242554L68794r44246j310688n80453
$$ -1084653 -295479 274916 747078 1736167 2978721 3347515 2403269 1092581 512128
39134E12128J43104J86954q6482k84134m26017k94587M10821J014914L53890j155829
$$ 512128 655232 842186 755704 471570 45553 -249034 161787 1176701 1530591 374762
39124C74762j453908K27527J848493J341728l84341r51351l9054N94531O7670
$$ 374762 -1079146 -851619 996874 2338602 1954261 1002910 963856 1558387 1626057
39115A626057p25767j017794r93394o32206M00654J450359J233251j21253j022347
$$ 1626057 900290 -117504 -1110898 -1743104 -1342450 107909 1341160 1219907 197560
39106A97560p42846j48432J56200N48316Q76833L04635p10939m89520R01481J091052
$$ 197560 -545286 -693718 -537518 10798 887631 1192266 481327 -8193 893288 1984340
39096A984340q32775k363091j261267R28796J393883L18700n4166O38591P96747
$$ 1984340 1151565 -1211526 -2472793 -1543997 -150114 168586 114420 753011 1549758
39087A549758N3879k90084R5794Q5868n76753p66262j30574K81776m4663l76097
$$ 1549758 1603637 1313553 1409347 1495215 918462 152200 21626 303402 258739 -117358
39077a17358l20521l71051n15851r1497N97221L76835n68054n22661R22166J792116
$$ -117358 -437879 -808930 -1324781 -1416278 -819057 -442222 -1010276 -1532937 -610771 1181345
39067A181345O22760j253558j677712n77329N01864P12220L45818k26926p12009
$$ 1181345 1804105 550547 -1127165 -1704494 -1202630 -490410 -144592 -371518 -1083527
39058a083527n58575L31724R94994N38620m98000q35186j50327P43315J072406
$$ -1083527 -1642102 -1310378 -315384 223236 -274764 -1109950 -1260277 -516962 555444
39049E55444P06353p5615p31156o98730q1991K99180M1178k18315J24087O18592
$$ 555444 1261797 1186182 455026 -243704 -325695 -26515 14663 -203652 -79565 539027
39039E39027N69813K05315J38687K30382j8318l78489k56619J53000J26750l46847
$$ 539027 1108840 1314155 1452842 1683224 1664906 1286417 1029798 1182798 1309548 962701
39029I62701n77040l30404m6524N1130J62068K58129J06461p7922J02417L25783
$$ 962701 385661 55257 8733 59863 221931 480060 586521 508599 611016 936799
39019I36799r5489q75573q55672K31469J132981P75495k58890o71369k41819J26510
$$ 936799 841310 -34263 -889935 -658466 474515 1250010 991120 319751 77932 204442
39009B04442j36396n28762k77580N55253J018650L61546q88848j275512j41827
$$ 204442 68046 -460716 -738296 -183043 835607 1197153 308305 -967207 -1109034
39000a109034J347252J535840M03105m87582j63459O11062O67501k4751p28011
$$ -1109034 238218 1774058 2177163 1689581 1526122 2137184 2804685 2779934 2051923
38991B051923j093766j221703j074923n68953M7073M63459O98167Q04808O19248
$$ 2051923 958157 -263546 -1338469 -1907422 -1860349 -1396890 -698723 106085 725333
38982G25333K40467J97578N40704M05151o90615j728309j461358l32629J92131
$$ 725333 965800 1163378 1704082 2109233 1418618 -309691 -1771049 -2103678 -1911547
38973a911547o5196Q6049Q97538J036710j20613j178289q12079J46550J56682
$$ -1911547 -1976743 -1890694 -993156 43554 -77059 -1255348 -2067427 -1920877 -1764195
38964a764195m85298k81440P83909J095668P4533p66163j22237J095608J082332
$$ -1764195 -2249493 -2530933 -1747024 -651356 -576823 -1342986 -1465223 -369615 712717
38955G12717l61565j707477j687900n14266P51810J317920J122938O89206N83347
$$ 712717 351152 -1356325 -3044225 -3558491 -2806681 -1488761 -365823 323383 906730
38946I06730P40135M44473o52128j692289j407168J68105J413599R84644m53422
$$ 906730 1646865 2091338 1439210 -253079 -1660247 -1492142 -78543 906101 452679
38937D52679r73132K02307J692910J673072R9496j344706j335194k63731N77283
$$ 452679 -520453 -318146 1374764 3047836 3147332 1802626 467432 203701 780984
38928G80984N12339j58890p95737r12288l83807L49090N53656J27984j11371L85116
$$ 780984 1293323 1134433 338696 -573592 -957399 -608309 -54653 73331 -38040 347076
38918C47076Q87412M04589o40425q93909j63977K70051k57791p38677k29883N30374
$$ 347076 1234488 1639077 998652 104743 -59234 210817 -46974 -785651 -1015534 -485160
38908d85160L49016m41775n64845Q8584L34164l07537p70951l5596J350494J943773
$$ -485160 -136144 -577919 -1142764 -1054180 -720016 -1027553 -1798504 -1834100 -483606 1460167
38898A460167J132264l02241j135463q95852j77927J06013k42249n72371l53507
$$ 1460167 2592431 2290190 1154727 258875 80948 186961 -55288 -627659 -981166
38889i81166Q5478J22703j84065k22412K47852Q25585J042021P43359M3612o12511
$$ -981166 -895688 -772985 -957050 -1179462 -931610 -106025 935996 1679355 1722967 1110456
38879A110456n51830L37541J108519P90099k29726p39042n21213n00480r21395
$$ 1110456 558626 896167 2004686 2794785 2565059 1826017 1304804 804324 -117071
38870a17071p47453M62494J345840N57097j063631j510295l76221P82088P84409
$$ -117071 -864524 -402030 943810 1500907 437276 -1073019 -1449240 -667152 117257
38861A17257K01768Q2498M19425M89042P47o79602j025335o96646J82671Q39543
$$ 117257 319025 401523 820948 1309990 1310737 631135 -394200 -1090846 -908175 -68632
38851f8632M86104n59385j017497l17846N92755O99190L81404N08861P88367L43049
$$ -68632 417472 -141913 -1159410 -1477256 -884501 -185311 196093 704954 1493321 1836370
38841A836370m43440k64578Q33941J180682M2250j118702r16566j35573j82584
$$ 1836370 1392930 1128352 1962293 3142975 3185225 2066523 1149957 1014384 831800
38832H31800o68173l25885M76513K63600p96492r17358K60470Q79747p2296j001973
$$ 831800 163627 -162258 314255 577855 -218637 -1135995 -875525 4222 -68074 -1070047
38822a070047l33518R04772Q90471J5066k8200P16263O58242m01206q63396j44940
$$ -1070047 -1403565 -498793 391678 406744 378544 1094807 1753049 1351843 488447 343507
38812C43507K91484m92846j228891n45846P49924R96357K08829l25830l05596
$$ 343507 634991 142145 -1086746 -1632592 -882668 113689 322518 -3312 -308908
38803c08908n36736j038510p70511M62703J367024J068742M02586L95556N38065
$$ -308908 -845644 -1884154 -2654665 -2191962 -824938 243804 646390 1041946 1580011
38794A580011j91633j303812j340589k60106L32399l01553q08979O7045J318368
$$ 1580011 1388378 84566 -1256023 -1516129 -1183730 -1485283 -2294262 -2227217 -908849
38785i08849J064936n97948j692836j107067K20437R95533J073572Q53385M22649
$$ -908849 156087 -441861 -2134697 -3241764 -3021327 -2025794 -952222 -98837 323812
38776C23812k0072Q9445P55239J067629M82626l56708p70830j059637j465501
$$ 323812 303740 393185 1148424 2216053 2698679 2341971 1571141 511504 -953997
38767i53997j162775L86957J879596J608480N2065p01774n1854L79276n34903
$$ -953997 -2116772 -1729815 149781 1758261 1810326 1108552 1056698 1435974 901071
38758I01071j664474j425491m2959J043644J172427Q20456N20221L56238K65859
$$ 901071 -763403 -2188894 -2231853 -1188209 -15782 804674 1324895 1681133 1946992
38749A946992J26770k58662p59927q07526j99274L50946J19009m62599l42533
$$ 1946992 2073762 1815100 1055173 247647 48373 399319 518328 55729 -286804
38740b86804N01945Q31864j12391j355025j346138l8190J024423P65439j05653
$$ -286804 215141 1047005 934614 -420411 -1766549 -1804739 -780316 -14877 -120530
38731a20530l33174L3428l0826o71066q07722J79141J493176K074903J774196
$$ -120530 -453704 -420276 -451102 -1122168 -1929890 -1750749 -257573 1817330 3591526
38722C591526R04228l47632j413891j350941k59895L61817k26075o59132K97717
$$ 3591526 4495754 4148122 2734231 1383290 1123395 1485212 1259137 600005 897722
38713H97722J375694O71679j019702j255050M3966M30723r18602j781502o37387
$$ 897722 2273416 2945095 1925393 670343 714309 1145032 226430 -1555072 -2192459
38704b192459Q36905O83166j80128J40252J139778Q95217n59782j267721m28795
$$ -2192459 -1355554 -672388 -852516 -712264 427514 1322731 762949 -504772 -933567
38695i33567O70202Q57650M20394k0978m82338j004273j176388p43631J6201P28063
$$ -933567 -263365 594285 1014679 993701 511363 -492910 -1669298 -2412929 -2396728 -1668665
38685a668665J145090R77225J93736n49475n14742Q8352L55267n2321n59244n81201
$$ -1668665 -523575 453650 647386 97911 -416831 -328479 26788 -25533 -584777 -1165978
38675a165978j45136M04259P48566O40205R6521m70653o90879o33537m48947k6609
$$ -1165978 -1311114 -906855 -158289 481916 578437 107784 -583095 -1216632 -1665579 -1692188
38665a692188N04271M98497k07858n52919M34679J879657J864695N1192j697345
$$ -1692188 -1187917 -689420 -897278 -1450197 -1015518 864139 2728834 2780026 1082681
38656A082681j688935m09804M27098J15038n04399m22557K88050P37018M18925
$$ 1082681 -606254 -1016058 -588960 -473922 -978321 -1400878 -1112828 -375810 43115
38647D3115j78728l17573p4145j15087m66117l53199M06002P92291R0487q17990
$$ 43115 -135613 -453186 -527331 -642418 -1108535 -1461734 -1055732 -263441 -172954 -990944
38637i90944o85121J91025M83684q6031m73770n4270N72324O83478L25194j22450
$$ -990944 -1676065 -1485040 -1001356 -1087387 -1561157 -1615427 -1043103 -359625 -34431 -156881
38627a56881m13925l11485K06618N32285P8137o11531l91937O87073J202335L52341
$$ -156881 -570806 -882291 -675673 -143388 -65251 -676782 -1068719 -381646 820689 1173030
38617A173030q80410j119134l14644N40599P72800M91300J36962L1979O6622l31492
$$ 1173030 292620 -826514 -1141158 -600559 172241 663541 800503 832482 899104 567612
38607E67612j430854k364315j855090J0609J615282J792802J091511N69386L08364
$$ 567612 -863242 -3227557 -5082647 -5072038 -3456756 -1663954 -572443 -3057 305307
38598C05307q0678l33013J8855N85216N83341Q9215j62877n5121j35674m04246
$$ 305307 224629 -108384 -89529 495687 1079028 1168243 1005366 950245 814571 410325
38588D10325j43261P09287J007995p6194j608891j844582m30211J152216J438495
$$ 410325 267064 976351 1984346 1908152 299261 -1545321 -1975532 -823316 615179
38579F15179N52755m03969q59105r78164q00782j34938O83884Q84702M08559R7818
$$ 615179 1167934 763965 -95140 -1073304 -1874086 -2009024 -1325140 -440438 -31879 65939
38569F5939L09899K68855n06832j068934m18226O89525O80967m41659j100224
$$ 65939 375838 644693 137861 -931073 -1349299 -659774 21193 -420466 -1520690
38560a520690n19873L27113M42668J34290P2773J45336k6889k65061k34740n2051
$$ -1520690 -2040563 -1713450 -1270782 -1136492 -1063719 -918383 -945272 -1210333 -1445073 -1497124
38550a497124P3845K24782L43062O9778m98442n86855J26556Q10596O13827n7155
$$ -1497124 -1423279 -1198497 -855435 -785657 -1284099 -1870954 -1744398 -933802 -319975 -377130
38540c77130j93030K72477M42464j23040p53522o37942L8658L03309l12111j004503
$$ -377130 -570160 -297683 144781 21741 -731781 -1369723 -1331065 -1027756 -1339867 -2344370
38530b344370o13064P23586J504759Q61070j87720l14128Q1610k16503q96128
$$ -2344370 -2957434 -2233848 -729089 131981 -55739 -369867 -288257 -504760 -1400888
38521a400888n58945O35071R42862O2606j28104J144286J822654K45903j879124
$$ -1400888 -1959833 -1324762 -381900 -319294 -447398 696888 2519542 2765445 886321
38512H86321j936907l55636M09783j27320k43972N98820Q98922j6562p37546j99493
$$ 886321 -1050586 -1406222 -996439 -1123759 -1367731 -768911 130011 113449 -624097 -823590
38502h23590O47643N94946l3302l77887m61997n57298l03946M56826R29379M80380
$$ -823590 -175947 418999 385697 7810 -454187 -1011485 -1315431 -858605 70774 551154
38492E51154k95103n71013n60855q09075r87729n34471J27491K36739J21710O66121
$$ 551154 256051 -314962 -875817 -1684892 -2672621 -3207092 -3079601 -2842862 -2721152 -2055031
38482b055031J555968J458064J04545j099719j018886k31611J45681J35529M21795
$$ -2055031 -499063 959001 1063546 -36173 -1055059 -1286670 -1140989 -1005460 -583665
38473e83665Q30849N29137l76199o65747J92077J095106Q65064m5715l89442j31737
$$ -583665 247184 776321 400122 -265625 -73548 1021558 1886622 1840907 1451465 1319728
38463A319728l50935j227238j534649n68669O64577R58003N68878L92556L55163
$$ 1319728 968793 -258445 -1793094 -2361763 -1697186 -739183 -170305 222251 577414
38454E77414j18334o39748k94089O92639J108341N77357p1774l50597o74639j117937
$$ 577414 459080 -180668 -474757 217882 1326223 1903580 1831806 1481209 806570 -311367
38444c11367r83931j36943N08104M60663L91762O72525M97315n12714j125905
$$ -311367 -1295298 -1432241 -924137 -463474 -71712 600813 1098128 585414 -540491
38435e40491l24733P56113M25249p86440r00548K95830R37776J80531m98392J32078
$$ -540491 -865224 -109111 316138 -470302 -1370850 -1075020 -137244 43287 -455105 -323027
38425c23027J044949P69147k10330m19203J61885K81839l80827q12378m64778
$$ -323027 721922 1491069 1280739 861536 1023421 1305260 924433 112055 -352723
38416c52723l7145j31921l17282p7116K32773O6946l22577l12477P7607K92491
$$ -352723 -389868 -521789 -839071 -916187 -683414 -616468 -939045 -1251522 -1173915 -881424
38406h81424J54800L1676J31552J86809n9414m51578o55621n19254p2843N79272
$$ -881424 -726624 -694948 -563396 -376587 -436001 -887579 -1543200 -2062454 -2135297 -1556025
38396a556025J177992J294212O84696k81309p62777k62908O86033R35939L5595
$$ -1556025 -378033 916179 1600875 1319566 556789 293881 979914 1915853 1951448
38387A951448j101421j235649l81193K28361j58391q29615p49772o7912K51965
$$ 1951448 850027 -385622 -766815 -538454 -696845 -1526460 -2276232 -2344144 -2092179
38378b092179l1356j66376L15383R14059J039148Q51701P54618O03601O6156n65421
$$ -2092179 -2123535 -2289911 -1974528 -1060469 -21321 830380 1584998 2188599 2254755 1689334
38368A689334o50887k35671r1202n13676p35286o2660Q36916O26357p13240j507668
$$ 1689334 1038447 802776 711574 197898 -537388 -600048 236868 863225 149985 -1357683
38358a357683n44750J110150J397384J2982j287690j182109l05939J87231L26796
$$ -1357683 -1902433 -792283 605101 618083 -669607 -1851716 -2157655 -1970424 -1643628
38349a643628O35340P85711K77575k24058K50327J086173O70291j047478k133698
$$ -1643628 -1008288 -222577 54998 -169060 81267 1167440 1837731 790253 -1343445
38340a343445j273361N10776J362750P67202l92171j028668n43049Q15905J787872
$$ -1343445 -2616806 -2106030 -743280 23922 -368249 -1396917 -1939966 -1124061 663811
38331F63811J209868k76912p32569L40406J113884J76403j255629j233549j6623
$$ 663811 1873679 1596767 864198 1204604 2318488 2494891 1239262 5713 -10910
38322a0910N88282P5948l97870k02331k9404m12095q84031q80412m11543K93114
$$ -10910 577372 653320 255450 53119 23715 -388380 -1272411 -2152823 -2564366 -2271252
38312b271252R21176R44423K68265k22769K06051Q19985M58924m84419o65011
$$ -2271252 -1350076 -405653 -137388 -360157 -154106 665879 1124803 640384 -24627
38303b4627j25934k30501j165236j425969k82646J027541J279799Q12930L25793
$$ -24627 -150561 -381062 -1546298 -2972267 -3254913 -2227372 -947573 -134643 191150
38294A91150k69102q59888n82067O12980J280694O05782j92714P2352N26327n5491
$$ 191150 -77952 -937840 -1519907 -906927 373767 979549 786835 859187 1385514 1330023
38284A330023q35302k99220Q87131P54265o53941j210618p2496J075303P03508
$$ 1330023 494721 195501 1082632 1836897 1182956 -27662 -100158 975145 1678653
38275A678653m78811r64425n39188J398K04271J62422L7284L342J79521K99113
$$ 1678653 1199842 235417 -303771 -302373 -98102 64320 101604 104946 284467 583580
38265E83580j3255n17024n90655k39431n3539j36912m7039J46441r9707n25242
$$ 583580 570325 53301 -537354 -776785 -830324 -967236 -1014275 -867834 -967541 -1492783
38255a492783j44845R79038J409710M56316o97503q53881n06652n79335o63865
$$ -1492783 -1637628 -658590 751120 1207436 509933 -343948 -850600 -1429935 -2093800
38246b093800M6615R76769R21222K6468n17590l82847j76810P5763Q33140J477459
$$ -2093800 -2047185 -1070416 -149194 -122726 -640316 -1023163 -1199973 -1124210 -291070 1186389
38236A186389O87301j238669k138615q39453J152400J733122P84714l55591r51106
$$ 1186389 1873690 635021 -1503594 -2343047 -1190647 542475 1327189 971598 20492
38227B0492j121364q01427J15683R05295O29096l49228o28501K40121J067286
$$ 20492 -1100872 -1902299 -1786616 -881321 -252225 -601453 -1229954 -989833 77453
38218G7453P50083j95865m87981J17245O60395M29062j76044m02683k40933l04052
$$ 77453 827536 631671 143690 260935 921330 1350392 1174348 771665 530732 226680
38208B26680p88269j068440n42597M58238J008005P18108R5910k47418k72090
$$ 226680 -561589 -1630029 -2172626 -1714388 -706383 11725 107635 -139783 -411873
38199d11873k15935r4815J35359K53769P4202j09183J47885P02028Q71666L44276
$$ -411873 -627808 -722623 -587264 -333495 -259293 -368476 -220591 481437 1353103 1697379
38189A697379l21652l52516K51677O76785K94896n30251r08486o08089k97756
$$ 1697379 1375727 1023211 1274888 1951673 2246569 1716318 807832 199743 -98013
38180i8013m00141l00767O38694J703334J499708m936j243793j189622o32754
$$ -98013 -498154 -798921 -160227 1543107 3042815 3037879 1794086 604464 -28290
38171b8290o93657j106043r47338k58707K30572M46870Q19515J138022Q19193
$$ -28290 -721947 -1827990 -2775328 -3034035 -2803463 -2356593 -1537078 -399056 420137
38162D20137J46817j6737K60617L5533p97996j129293l42154P43253J139021Q77842
$$ 420137 566954 550217 810834 846367 48371 -1080922 -1423076 -679823 459198 1337040
38152A337040L81286l74842j334893j788656j149154J31940J036801J064274N04854
$$ 1337040 1718326 1343484 8591 -1780065 -2929219 -2797279 -1760478 -696204 -191350
38143a91350J7389J17820O32940O70435k08611r74512l75896Q96666Q30367q53510
$$ -191350 -173961 -56141 576799 1247234 1038623 64111 -311785 584881 1415248 561738
38133E61738k049051j401873k14797J70q384R53337J846344R64726p97447r23562
$$ 561738 -1487313 -2889186 -3103983 -3103813 -3112197 -2158860 -312516 652210 -145237 -1068799
38123a068799P70765J775350P35659p60615r48686k87138k4135j29165M6165L42459
$$ -1068799 -298034 1477316 2212975 1452360 503674 216536 192401 63236 109401 451860
38113D51860L11762K12178L48795K32106n25352j186771q70627J1761M09972L06348
$$ 451860 763622 975800 1324595 1556701 1031349 -155422 -1026049 -1014288 -604316 -297968
38103b97968N62733J258294J354414K58654j165276j619258r06531J4834K87481
$$ -297968 264765 1523059 2877473 3136127 1970851 351593 -554938 -540104 -252623
38094b52623J8841j69232r2859j23940m26990n98820l19441J00561K47636K76858
$$ -252623 -233782 -403014 -495873 -619813 -1046803 -1645623 -1965064 -1864503 -1616867 -1340009
38084a340009N16700P62803O04509J53955k11636m85390o80097l38172O13308
$$ -1340009 -823309 -60506 544003 697958 486322 932 -679165 -1017337 -404029
38075d04029J051924P7335j141957o77882J060465J571272K9588j344123o93350
$$ -404029 647895 725230 -416727 -1094609 -34144 1537128 1566716 222593 -470757
38066d70757P52737R37539K01393J85299P47319L36026j103582j881080j214069
$$ -470757 281980 1219519 1420912 1606211 2353530 2689556 1585974 -295106 -1509175
38057a509175j68421K70711L23894K83845r0393n39853j91707Q65340J281557
$$ -1509175 -1677596 -1406885 -1082991 -799146 -889539 -1429392 -1621099 -755759 525798
38048E25798M77061l51256j55398L15912l7320p08824n44445J64048K13170l33854
$$ 525798 1002859 651603 496205 812117 774797 65973 -478472 -314424 -101254 -435108
38038d35108k79760M59903N84914k33952n57379L65220J013901o7744j643940
$$ -435108 -714868 -254965 329949 95997 -461382 -96162 917739 849995 -793945
38029g93945j411973M51219J526957Q45068Q8739N57571J102266L41028q70388
$$ -793945 -2205918 -1754699 -227742 617326 706065 1263636 2365902 2706930 1836542
38020A836542r47594k73350l60782j104680j025506L2693O05305J53255j41012
$$ 1836542 888948 615598 254816 -849864 -1875370 -1842677 -1237372 -1084117 -1225129
38011a225129L91692P88971L46373j22988P7352K20241l04465n74363K76921J232433
$$ -1225129 -833437 -44466 301907 178919 256271 476512 172047 -402316 -125395 1107038
38001A107038Q20437m48798p97695J36826R91241Q47860J82585l72405q12464
$$ 1107038 1927475 1478677 680982 817808 1809049 2656909 2839494 2467089 1654625
37992A654625j100327r09005l36207M0501N2429J04720L38162L89624Q2038l35093
$$ 1654625 554298 -354707 -690914 -650413 -597984 -493264 -155102 234522 316560 -18533
37982a8533o31999o37828l6299J064086J633717Q49971m74750q28181k78131l52888
$$ -18533 -650532 -1288360 -1324659 -260573 1373144 2223115 1748365 920184 642053 289165
37972B89165j451563j999873q53330R26753J682587J335585Q10359L03808n02698
$$ 289165 -1162398 -3162271 -4015601 -3088848 -1406261 -70676 739683 1043491 540793
37963E40793j171364q97839O9885O44273M57584J38539Q3182K6618q3540J42307
$$ 540793 -630571 -1528410 -1458525 -814252 -356668 -218129 -134947 -108329 -191869 -49562
37953d9562O30064O82624J20767k96597r5562R1523l95380j043404r15792j43985
$$ -49562 580502 1263126 1383893 1087296 991734 1083257 687877 -355527 -1271319 -1415304
37943a415304K89810N5035k18875j45711j03583k89737j98803M21077Q94220O42751
$$ -1415304 -1125494 -1070459 -1289334 -1435045 -1538628 -1828365 -2027168 -1606091 -711871 -69120
37933f9120K46566N41587J097072P39117n09013j248984p63844p8141k90320q35458
$$ -69120 177446 719033 1816105 2555222 2046209 797225 33381 -44760 -335080 -1170538
37923a170538m50201P32338J279292N39516n03502p16034k28975J17332L8546
$$ -1170538 -1620739 -888401 390891 930407 426905 -289129 -518104 -400772 -362226
37914c62226j50685l21098n78110o59205q6661Q72956J118595J24600j037222
$$ -362226 -512911 -834009 -1412119 -2071324 -2157985 -1285029 -166434 -41834 -1079056
37905a079056q71068M80710J237571K98460j257630j583639l80096R90287J356420
$$ -1079056 -1950124 -1469414 -231843 66617 -1191013 -2774652 -3154748 -2164461 -808041
37896h08041Q32246J58658j75162k0758M74544P61120L37988m61312o90848l0107
$$ -808041 24205 182863 7701 -13057 461487 1222607 1560595 1099283 408435 378328
37886C78328P40368P55491N2050p17428j060607q50041k11386M71977P74365O59110
$$ 378328 1118696 1874187 1926237 1208809 148202 -701839 -913225 -441248 333117 992227
37876I92227M19988J94580l9552q2114K40137M99305J27707n40394o05592o7800
$$ 992227 1412215 1606795 1567243 1485129 1725266 2224571 2352278 1811884 1206292 1138492
37866A138492J13610l44102n49925m1911L48478m2232n33122l00933K45065L18840
$$ 1138492 1252102 908000 358075 316164 664642 622410 89288 -211645 33420 352260
37856C52260J31602L15901O68762N53388J3418m67757p68232q27594k43714Q71825
$$ 352260 483862 799763 1468525 2021913 2035331 1567574 799342 -28252 -271966 599859
37846E99859J384657N87655n39348o95868j87869j76202o55462p00611k78377
$$ 599859 1984516 2572171 2032823 1336955 1149086 972884 317422 -383189 -661566
37837f61566j98976m61897k39532M68464O57560L332n89753m40586J7930J60864
$$ -661566 -860542 -1322439 -1561971 -1093507 -435947 -432615 -1022368 -1462954 -1445024 -1284160
37827a284160Q7703K38041O70153R54753N54577m90505j138253l57266J105850
$$ -1284160 -1196457 -958416 -288263 666490 1221067 730562 -407691 -764957 340893
37818C40893J161378o89166k281400j816126l90111J43970J89077R68067J539621
$$ 340893 1502271 813105 -1468295 -3284421 -3674532 -3530562 -3341485 -2373418 -833797
37809h33797K49189j687369j389800J036963K359845J095126o35961q72249l92214
$$ -833797 -584608 -2271977 -3661777 -2624814 -264969 830157 194196 -678053 -1070267
37800a070267l94378l72392K62050P60869N99636L89942J90881q18319j997165
$$ -1070267 -1464645 -1837037 -1574987 -814118 -214482 175460 366341 -451978 -2449143
37791b449143j254620J258599K346796N15519j330846l37801J794718J717273
$$ -2449143 -3703763 -2445164 -98368 417151 -913695 -1251496 543222 2260495
37783B260495l05085j365170o87050n6295l01436m87135k64720k86361m39179
$$ 2260495 1955410 590240 -96810 -153105 -454541 -941676 -1206396 -1492757 -1931936
37774a931936j4984N84764M30344o1802Q2299L42545k93017r62881j60788J212680
$$ -1931936 -1946920 -1362156 -931812 -993614 -911315 -568770 -861787 -1824668 -1985456 -772776
37764g72776R28280o58662q89870P58631J707143N27206q81149o67080J49412
$$ -772776 155504 -503158 -1393028 -634397 1072746 1599952 718803 51723 201135
37755B01135m1659o17585k04642P11526P47030P7367r625O24705Q35487N8944
$$ 201135 159476 -458109 -662751 48775 795805 873172 863547 1488252 2323739 2382683
37745B382683r65419j272324o61586K72449O51048J47336m74912k20937O31910
$$ 2382683 1417264 144940 -516646 -244197 406851 554187 79275 -141662 490248
37736D90248P96550l5021o48578k92909O8009n48356j293884o84475R71885J767814
$$ 490248 1286798 1251777 603199 310290 378299 -170057 -1463941 -2148416 -1176531 591283
37726E91283P55258q38116j232884j95171R09952Q51718p3166n28121R4341Q47967
$$ 591283 1346541 508425 -724459 -919630 -9678 842040 768874 240753 335094 1183061
37716A183061N47738n23023r99465l62844M71683O15279K84556N4712p5588k98914
$$ 1183061 1730799 1207776 208311 -154533 317150 932429 1216985 1271697 1196109 897195
37706H97195l80440q8535K40598J92122k1557Q7823M65817N59491Q1463o20758
$$ 897195 516755 428220 668818 860940 839383 927206 1393023 1952514 2033977 1413219
37696A413219r08012m05790O25188J363942J097868m5937j195845j589407j153463
$$ 1413219 505207 99417 724605 2088547 3186415 3140478 1944633 355226 -798237
37687g98237l37720K86639L16606j86802o46674n28352M9043N11869N21273J79076
$$ -798237 -1135957 -849318 -532712 -719514 -1366188 -1894540 -1845497 -1333628 -812355 -633279
37677f33279k30624l50768Q4280P36255P06482k91760j214231r34845J44403O90954
$$ -633279 -863903 -1214671 -1130391 -394136 312346 20586 -1193645 -2128490 -1984087 -1293133
37667a293133L86738J49108M65341P11974L65850j75798l60462k06225N5812K89134
$$ -1293133 -906395 -757287 -291946 420028 785878 610080 249618 43393 99205 388339
37657C88339J81326n12334j244200j062509K6263R42307R98599N67027R7832m21667
$$ 388339 569665 57331 -1186869 -2249378 -2223115 -1280808 -282209 284818 382650 -39017
37647c9017p06881j22076J006136J227006j0587j205106p34707Q25578J459834
$$ -39017 -745898 -867974 138162 1365168 1354581 149475 -585232 240346 1700180
37638A700180L48156j275602j722513n56450J167303J881217R52917n33709q74406
$$ 1700180 2048336 772734 -949779 -1506229 -338926 1542291 2495208 1961499 1087093
37629A087093J30783Q71739J72451j070224j283320m41824J95987P2720j38296
$$ 1087093 1217876 2089615 2262066 1191842 -91478 -533302 -337315 -264595 -402891
37620d02891J54706O76383R15205P42216K50233m18695r56800j066353q29266
$$ -402891 -248185 428198 1343403 2085619 2335852 1917157 960357 -105996 -935262
37611i35262n62969l69120j76389q5910k23106l32271j543O76999J083720Q28039
$$ -935262 -1498231 -1867351 -2043740 -2129650 -2352756 -2685027 -2686570 -2009571 -925851 -97812
37601i7812K51866J5552K81428M56975j08602j146173j506570n32409Q92392J294670
$$ -97812 154054 169606 451034 908009 799407 -346766 -1853336 -2385745 -1493353 -198683
37591a98683N01283k17804Q894N63875M71141k08501p23504p52650n00115j01645
$$ -198683 302600 84796 93690 657565 1128706 920205 196701 -555949 -1056064 -1157709
37581a157709L99986P38983O28960J46257l87051o69880m39044L08802R43720
$$ -1157709 -757723 -18740 610220 756477 369426 -300454 -739498 -430696 513024
37572E13024O94630k13778o67218k61612J19963j20312k26345M62224J009513
$$ 513024 1207654 993876 326658 65046 185009 64697 -161648 300576 1310089
37563A310089J98195j332150j810756q83752J19741L88761M85191P83862O86235
$$ 1310089 1508284 176134 -1634622 -2518374 -2398633 -2009872 -1524681 -740819 -54584
37554e4584q897m03758l1939J75026m82691j001915k14230J032469Q95820n98531
$$ -54584 -63481 -467239 -499178 -324152 -806843 -1808758 -2022988 -990519 -94699 -693230
37544f93230j463664o79797M58025N43126J09684L93495J163122J203433L73832
$$ -693230 -2156894 -2836691 -2378666 -1835540 -1725856 -1332361 -169239 1034194 1408026
37535A408026k55750j58477N3703j42009m89047o57688o30750k54639N45286J014947
$$ 1408026 1152276 993799 1047502 905493 416446 -241242 -871992 -1126631 -581345 433602
37525D33602K99536q82276p94942O34932J395411M43141o61338m25131J62355
$$ 433602 733138 -149138 -944080 -309148 1086263 1529404 868066 442935 605290
37516F05290k86848q12284J13915J400226Q54434q70401j043053N70965J209815
$$ 605290 318442 -493842 -379927 1020299 1874733 1004332 -38721 532244 1742059
37507A742059k95996j672937j074679J77070L26980k788K85149L76955o23877
$$ 1742059 1446063 -226874 -1301553 -1124483 -797503 -800291 -515142 -138187 -762064
37498g62064j388643m24119J013680P21635p60103r88995M04137J298957O16109
$$ -762064 -2150707 -2574826 -1561146 -839511 -1599614 -2588609 -2184472 -885515 -269406
37489b69406k68836j00783M34433K85004k37023k74571J39422L35330K5423n10182
$$ -269406 -538242 -639025 -204592 80412 -156611 -431182 -291760 43570 68993 -441189
37479d41189q10083n27323K63182R69976J055301O03890J1842n25061p90909m04584
$$ -441189 -1251272 -1778595 -1515413 -545437 509864 1113754 1125596 600535 -190374 -594958
37469e94958M36497O94464j50927j061424p71198L66037R91718P30821K90337
$$ -594958 -158461 536003 385076 -676348 -1447546 -1081509 -89791 641030 931367
37460I31367n1594o00283j037860n99539L89865O06132k73679r67202m99875M57809
$$ 931367 879773 279490 -758370 -1357909 -968044 -361912 -635591 -1602793 -2102668 -1644859
37450a644859Q22854O20914M31725J48262o39204j413610j010201O76696K073809
$$ -1644859 -822005 -201091 230634 378896 -260308 -1673918 -2684119 -2007423 66386
37441F6386J636750j16956j062930j61405J128939Q78017n69802j205210m29779
$$ 66386 1703136 1586180 523250 361845 1490784 2368801 1798999 593789 164010
37432A64010K09664l13060r40251n52945J26704J6950l51392K0034O06077L08014
$$ 164010 373674 60614 -879637 -1432582 -1305878 -1288928 -1640320 -1620286 -1014209 -706195
37422g06195m59297m87019O9101J39699j50586K03543R73941R15191K0704m05584
$$ -706195 -1165492 -1652511 -1583410 -1443711 -1594297 -1390754 -416813 498378 519082 113498
37412A13498k7771Q4883m54569o68556l1274O93694Q61882O84377K50189o28049
$$ 113498 85727 170610 -283959 -952515 -983789 -290095 571787 1256164 1506353 878304
37402H78304j318877p98063M68950P94760j35023p20247o6193P06706N55894J11413
$$ 878304 -440573 -1238636 -769686 25074 -109949 -830196 -896389 -189683 366211 477624
37392D77624J77665K81137j68084o74876o69875m40299j89018M41404J118240
$$ 477624 655289 936426 768342 93466 -576409 -1016708 -1205726 -764322 353918
37383C53918P34423n09678p95516L70683R40072l56536j559158n43029J310921
$$ 353918 1088341 578663 -216853 153830 1093902 737366 -821792 -1364821 -53900
37374e3900J256983l28573p25945M97397R11472n31958j749835r59321O52675
$$ -53900 1203083 874510 148565 645962 1557434 1025476 -724359 -1683680 -1031005
37365a031005J043685K24231m17640l66521j10239J27712N06743Q65895Q35386
$$ -1031005 12680 236911 -180729 -547250 -657489 -529777 -23034 842861 1678247
37356A678247L87236k49021q19169q76845p4898R54014Q70762n27219j583294
$$ 1678247 2065483 1816462 997293 120448 45550 999564 1870326 1343107 -240187
$$ [...]
##END NTUPLES=NMR SPECTRUM
##END=
