##TITLE=31Pdec_SR-157-K3-TFAA6'
 CDCl3, 24 sc
 7.6.2023
##JCAMPDX= 6.0         $$ Bruker NMR JCAMP-DX V2.0
##DATA TYPE= NMR SPECTRUM
##DATA CLASS= NTUPLES
##ORIGIN= UXNMR, Bruker Analytische Messtechnik GmbH
##OWNER= root
$$ XWIN-NMR		Version 3.5
$$ Wed Jun  7 14:24:15 2023 Russian Standard Time (UT+4h)  she@DPX200
##.OBSERVE FREQUENCY= 81.013821
##.OBSERVE NUCLEUS= ^31P
##.ACQUISITION MODE= SIMULTANEOUS
##.ACQUISITION SCHEME= undefined
##.AVERAGES= 24
##.DIGITISER RES= 16
##SPECTROMETER/DATA SYSTEM= spect
##.PULSE SEQUENCE= zgpg30
##.SOLVENT NAME= CDCl3
##.SHIFT REFERENCE= (INTERNAL, CDCl3, 0, 248.564)
##AUDIT TRAIL= $$ (NUMBER, WHEN, WHO, WHERE, WHAT)
$$ ##TITLE= Audit trail, XWIN-NMR		Version 3.5
$$ ##JCAMPDX= 5.01
$$ ##ORIGIN= Bruker BioSpin GmbH
$$ ##OWNER= she
$$ F:/spectra/data/she/nmr/P31/1/pdata/1/auditp.txt
$$ ##AUDIT TRAIL=  $$ (NUMBER, WHEN, WHO, WHERE, WHAT)
(   1,<2023-06-07 14:23:14.54 +0400>,<she>,<DPX200>,
      <created by zg, POWCHK disabled, PULCHK disabled
       configuration hash MD5:
       00 E9 B6 7A A2 85 ED C7 34 08 36 98 17 FE 4E 26
       data hash MD5: 32K
       AF 09 F8 5E 18 1F F0 E1 29 8F 5D B1 88 9D A2 9B>)
(   2,<2023-06-07 14:23:19.98 +0400>,<she>,<DPX200>,
      <Start of raw data processing
       efp BC_mod = 2 LB = 1 FT_mod = 6 PKNL = 1 PHC0 = -10641.4 PHC1 = -22.31514 SI = 64K 
       data hash MD5: 64K
       DE 6F C3 13 85 3D 5C FD 36 A3 2E D1 C4 16 73 9F>)
(   3,<2023-06-07 14:23:40.01 +0400>,<she>,<DPX200>,
      <pk PHC0 = -4.198225 PHC1 = 0 
       data hash MD5: 64K
       AA 32 4B 61 64 04 93 F7 C0 2D C0 1B FC B6 16 CE>)
$$ ##END=
$$ 
$$ hash MD5
$$ A9 90 9F A2 13 2C 4D 5C E2 4B FB A1 73 38 A0 16
##$RELAX= 
##$RELAX= 
##$RELAX= 
##$RELAX= 
##$RELAX= 
##$RELAX= 
##$RELAX= 
##$RELAX= 
##$RELAX= 
$$ Bruker specific parameters
$$ --------------------------
##$DU= <F:/spectra>
##$EXPNO= 1
##$NAME= <P31>
##$PROCNO= 1
##$TYPE= <nmr>
##$USER= <she>
##$AMP= (0..31)
100 100 100 100 100 100 100 100 100 100 100 100 100 100 100 100 100 100 
100 100 100 100 100 100 100 100 100 100 100 100 100 100 
##$AQSEQ= 0
##$AQ_mod= 1
##$AUNM= <au_zg>
##$AUTOPOS= <>
##$BF1= 81.014009
##$BF2= 200.13
##$BF3= 200.13
##$BF4= 200.13
##$BF5= 200.13
##$BF6= 200.13
##$BF7= 200.13
##$BF8= 200.13
##$BYTORDA= 1
##$CFDGTYP= 0
##$CFRGTYP= 5
##$CHEMSTR= <none>
##$CNST= (0..31)
1 1 145 1 1 1 1 1 1 1 1 1 1 1 1 1 1 1 1 1 1 1 1 1 1 1 1 1 1 1 1 1 
##$CPDPRG= <waltz16>
##$CPDPRG1= <>
##$CPDPRG2= <waltz16>
##$CPDPRG3= <>
##$CPDPRG4= <mlev>
##$CPDPRG5= <mlev>
##$CPDPRG6= <mlev>
##$CPDPRG7= <mlev>
##$CPDPRG8= <mlev>
##$CPDPRGB= <>
##$CPDPRGT= <>
##$D= (0..31)
0 1 0 0 0 0 0 0 0 0 0 0.03 2e-05 3e-06 0 0 0 0 0 0 0 0 0 0 0 0 0 0 0 0 
0 0 
##$DATE= 1686133393
##$DBL= (0..7)
120 120 120 11 120 120 24 19 
##$DBP= (0..7)
150 150 150 150 150 150 150 150 
##$DBP07= 0
##$DBPNAM0= <>
##$DBPNAM1= <>
##$DBPNAM2= <>
##$DBPNAM3= <>
##$DBPNAM4= <>
##$DBPNAM5= <>
##$DBPNAM6= <>
##$DBPNAM7= <>
##$DBPOAL= (0..7)
0.5 0.5 0.5 0.5 0.5 0.5 0.5 0.5 
##$DBPOFFS= (0..7)
$$ [...]
##$SUBNAM2= <"">
##$SUBNAM3= <"">
##$SUBNAM4= <"">
##$SUBNAM5= <"">
##$SUBNAM6= <"">
##$SUBNAM7= <"">
##$SUBNAM8= <"">
##$SUBNAM9= <"">
##$SW= 501.771253377433
##$SWIBOX= (0..15)
0 1 3 0 0 0 0 0 0 0 0 0 0 0 0 0 
##$SW_h= 40650.406504065
##$TD= 32768
##$TD0= 1
##$TE= 0
##$TE2= 300
##$TE3= 300
##$TEG= 300
##$TL= (0..7)
0 120 53 12 22 120 120 120 
##$TP= (0..7)
150 150 150 150 150 150 150 150 
##$TP07= 0
##$TPNAME0= <>
##$TPNAME1= <>
##$TPNAME2= <>
##$TPNAME3= <>
##$TPNAME4= <>
##$TPNAME5= <>
##$TPNAME6= <>
##$TPNAME7= <>
##$TPOAL= (0..7)
0.5 0.5 0.5 0.5 0.5 0.5 0.5 0.5 
##$TPOFFS= (0..7)
0 0 0 0 0 0 0 0 
##$TUNHIN= 0
##$TUNHOUT= 0
##$TUNXOUT= 0
##$USERA1= <user>
##$USERA2= <user>
##$USERA3= <user>
##$USERA4= <user>
##$USERA5= <user>
##$V9= 5
##$VALIST= <valist>
##$VCLIST= <CCCCCCCCCCCCCCC>
##$VD= 0
##$VDLIST= <DDDDDDDDDDDDDDD>
##$VPLIST= <PPPPPPPPPPPPPPP>
##$VTLIST= <TTTTTTTTTTTTTTT>
##$WBST= 1024
##$WBSW= 4
##$XGAIN= (0..3)
0 0 0 0 
##$XL= 0
##$YL= 0
##$YMAX_a= 5238
##$YMIN_a= -5026
##$ZGOPTNS= <>
##$ZL1= 120
##$ZL2= 120
##$ZL3= 120
##$ZL4= 120
##$ABSF1= 0
##$ABSF2= 0
##$ABSG= 0
##$ABSL= 0
##$ALPHA= 0
##$AQORDER= 0
##$ASSFAC= 0
##$ASSFACI= 0
##$ASSFACX= 0
##$ASSWID= 0
##$AUNMP= <proc_1d>
##$AZFE= 0.1
##$AZFW= 0.5
##$BCFW= 0
##$BC_mod= 2
##$BYTORDP= 0
##$COROFFS= 0
##$CY= -3
##$DATMOD= 1
##$DC= 0
##$DFILT= <>
##$DTYPP= 0
##$F1P= 0
##$F2P= 0
##$FCOR= 1
##$FTSIZE= 65536
##$FT_mod= 6
##$GAMMA= 0
##$GB= 0
##$INTBC= 1
##$INTSCL= 6.047779e-11
##$ISEN= 30
##$LB= 1
##$LEV0= 0
##$LPBIN= 0
##$MAXI= 10000
##$MC2= 0
##$MEAN= 0
##$ME_mod= 0
##$MI= 50
##$NCOEF= 0
##$NC_proc= -6
##$NLEV= 6
##$NOISF1= 182.463
##$NOISF2= 159.3651
##$NSP= 0
##$NTH_PI= 0
##$NZP= 0
##$OFFSET= 248.5645
##$PC= 4
##$PHC0= -10645.6
##$PHC1= -22.31514
##$PH_mod= 1
##$PKNL= yes
##$PPARMOD= 0
##$PSCAL= 0
##$PSIGN= 0
##$REVERSE= no
##$SF= 81.0140089999694
##$SI= 65536
##$SIGF1= 159.3651
##$SIGF2= -187.1042
##$SINO= 113.3802
##$SIOLD= 16384
##$SREGLST= <1H.CDCl3>
##$SSB= 0
##$STSI= 65536
##$STSR= 0
##$SW_p= 40650.406504065
##$SYMM= 0
##$S_DEV= 0
##$TDeff= 32768
##$TDoff= 0
##$TI= <>
##$TILT= no
##$TM1= 0
##$TM2= 0
##$TOPLEV= 0
##$USERP1= <user>
##$USERP2= <user>
##$USERP3= <user>
##$USERP4= <user>
##$USERP5= <user>
##$WDW= 1
##$XDIM= 65536
##$YMAX_p= 416521548
##$YMIN_p= -156253899
$$ End of Bruker specific parameters
$$ ---------------------------------
##NTUPLES= NMR SPECTRUM
##VAR_NAME=  FREQUENCY,     SPECTRUM/REAL,   SPECTRUM/IMAG
##SYMBOL=    X,             R,               I
##VAR_TYPE=  INDEPENDENT,   DEPENDENT,       DEPENDENT
##VAR_FORM=  AFFN,          ASDF,            ASDF
##VAR_DIM=   65536,         65536,           65536
##UNITS=     HZ,            ARBITRARY UNITS, ARBITRARY UNITS
##FACTOR=    0.620285442955139, 1,           1
##FIRST=     20137.2065510682, 0,            0
##LAST=      -20513.1999529968, 0,           0
##MIN=       -20513.1999529968, -156253899,  0
##MAX=       20137.2065510682, 416521548,    0
$$ Real data points
##PAGE= N=1
##DATA TABLE= (X++(R..R)), XYDATA
$$ [...]
15387 2008673 2190682 2200520 1470339 119740 -1090729 -1509524 -1001923 -32489 570186
15378 570186 441583 214642 571496 951689 198517 -1508078 -2530972 -1902246 -520044
15369 -520044 189900 -192567 -1336953 -2846450 -3973087 -3669471 -1918704 -300728 -216074
15360 -216074 -1069482 -1249515 -501123 -118710 -820039 -1633395 -1381749 -465206 -389749 -1728152
15350 -1728152 -3233790 -3272847 -1797600 -356956 -122958 -582081 -642483 -396028 -825417
15341 -825417 -2016003 -2811259 -2460453 -1616987 -1284016 -1598395 -2135313 -2643043 -2880520
15332 -2880520 -2378495 -1051166 355973 960973 582216 -370534 -1291670 -1415504 -259241
15323 -259241 1463754 2167483 1305120 230853 380225 1299501 1442123 347336 -1076487
15314 -1076487 -2073201 -2674878 -2911739 -2491482 -1472443 -463068 79096 210492 103925
15305 103925 -179193 -475712 -578590 -582761 -809031 -1391875 -2227099 -3177169 -3992337 -4218560
15295 -4218560 -3568534 -2275975 -868816 162478 365350 -435767 -1565201 -1785498 -692750
15286 -692750 683141 1159623 711261 -9618 -755834 -1575047 -2231870 -2506810 -2569807 -2453068
15276 -2453068 -1844686 -1031818 -1099880 -2311774 -3304772 -2994557 -2207943 -2095638 -2077013 -1092472
15266 -1092472 142997 241188 -296920 13802 711744 33749 -1634497 -1851534 -124141
15257 -124141 1036060 39898 -1459477 -1576476 -1102439 -1583125 -2497789 -2483211 -1929743
15248 -1929743 -2198237 -3160004 -3465932 -2699845 -1623102 -720840 84042 666182 861055
15239 861055 991879 1255425 1185276 657264 562257 1334680 1778191 823037 -389401 82882
15229 82882 2022245 3320607 2969791 1973570 1263100 545579 -338139 -562478 337136
15220 337136 1429588 1600522 1046575 759215 1039208 1307722 1165149 915231 904732 842104
15210 842104 211275 -785208 -1315066 -1193589 -1368196 -2437334 -3357813 -2803294 -1354963
15201 -1354963 -762688 -1175553 -1043202 -36109 202633 -877866 -1266717 384367 2146742
15192 2146742 1608850 -369606 -1223163 -742516 -722658 -1302649 -760018 1063101 2111428
15183 2111428 1462318 684150 967050 1271742 525179 -415728 -452628 -233870 -879266 -1949635
15173 -1949635 -2218834 -1583060 -813872 -123410 668685 1039654 207199 -1412834 -2271575
15164 -2271575 -1396431 570817 2123162 2276558 1220142 -91249 -892465 -1168461 -1262553
15155 -1262553 -1235995 -999738 -806920 -998155 -1380741 -1493120 -1377794 -1422422 -1563768 -1394628
15145 -1394628 -934821 -516581 -118562 277334 8747 -1317769 -2423954 -1541473 837383
15136 837383 2152377 1288825 136354 641538 1946749 1960409 561186 -546003 -528173
15127 -528173 -210476 -300699 -397723 -60742 332018 319020 188688 514567 1199676 1405639
15117 1405639 429252 -1438684 -2981611 -3146106 -2091402 -905201 -257664 229072 1103549
15108 1103549 2089096 2393805 1733135 618944 -270764 -713623 -947348 -1191478 -1214500
15099 -1214500 -536275 786508 1862926 1877640 1106062 511790 509039 756468 1026751 1446016
15089 1446016 1826811 1672162 1122417 1063105 1852942 2654865 2554487 1750318 1048424 656250
15079 656250 157026 -594085 -1267864 -1764831 -2477387 -3486890 -3877154 -2561187 -15076
15070 -15076 1516358 402356 -2081544 -3002764 -1410057 621541 1055572 457461 429367
15061 429367 933288 815118 6357 -593877 -789836 -922008 -647570 298599 759787 -338584
15051 -338584 -1644753 -901736 1448091 2743142 2181627 1635322 2031306 1893767 406638
15042 406638 -934795 -1071587 -1163035 -2072963 -2555781 -1734639 -1048713 -1701992 -2338930 -1522686
15032 -1522686 -555064 -1302006 -2861613 -3082653 -2118540 -1757888 -2173522 -2002391 -995114
15023 -995114 -75440 695953 1781440 2271011 836825 -1628675 -2740228 -1988195 -1166137
15014 -1166137 -1386892 -1848846 -1806273 -1729055 -2047484 -2387739 -2422780 -2174564 -1458677 -308309
15004 -308309 365979 -9270 -334034 551704 1562682 833763 -983774 -1371461 233144
14995 233144 1821063 2156606 2115721 2265937 1766897 490478 -210137 147538 252209
14986 252209 -590004 -1265420 -1075187 -952583 -1322051 -988098 440835 1198598 98503
14977 98503 -1365028 -1483528 -1067857 -1686199 -2793134 -2853527 -2060504 -1660218 -1539696 -731178
14967 -731178 412742 746880 508223 828941 1450676 1072178 -164964 -674581 -74736
14958 -74736 165176 -806726 -1857478 -1671956 -566346 213983 -4167 -1059551 -2299065
14949 -2299065 -2755669 -1833329 -207472 709030 458124 -94735 -231679 -192631 -176993 313450
14939 313450 1409692 2104864 1522258 341903 -48066 535073 1017473 792145 446591
14930 446591 579977 839308 646094 201457 92857 312463 379869 211817 126322 73563
14920 73563 -324690 -885739 -867181 -123217 581690 792213 959601 1230609 691372 -1147349
14910 -1147349 -2977138 -3164154 -2072368 -1467938 -1895952 -2205520 -1676478 -1021817 -952039
14901 -952039 -1196484 -1449816 -1969267 -2634238 -2650030 -1880609 -1325088 -1510926 -1529549 -551338
14891 -551338 739772 1237185 1031645 841382 600377 -144637 -938548 -797340 253739
14882 253739 1053912 765679 -239392 -942135 -629528 561775 1620072 1403710 -181674
14873 -181674 -1984174 -2855418 -2718526 -2151880 -1485839 -732713 70973 837452 1331537
14864 1331537 989524 -449310 -2005704 -2166762 -873765 278857 248175 -325608 -748205
14855 -748205 -1444680 -2471265 -2486251 -806855 814030 357477 -1462988 -2348622 -1824823
14846 -1824823 -1368118 -1588273 -1590864 -1144378 -1240804 -2105730 -2645468 -2450190 -2547355 -3478967
14836 -3478967 -4281545 -4136090 -3487231 -2721618 -1294093 817442 2234282 1988817 1052683
14827 1052683 827053 1157718 1151979 992794 1402852 1968340 1615742 461732 -325315 -448402
14817 -448402 -839906 -1915819 -2774879 -2599914 -1832183 -1361154 -1301966 -1210705 -992092 -935144
14807 -935144 -1081652 -1101859 -780427 -303415 -29407 -126694 -435795 -631673 -568493 -476902
14797 -476902 -729156 -1408525 -2221579 -2798362 -2899087 -2383879 -1339913 -366837 -312323 -1291279
14787 -1291279 -2200027 -1805748 -363103 470848 -366172 -1961011 -2535526 -1538458 -2008
14778 -2008 912131 953551 473793 -31614 112007 1407114 3357289 4599140 4297910 2955659
14768 2955659 1578883 681730 421769 883874 1620414 1663079 747270 -125897 -127756 107407
14758 107407 -424524 -1439868 -2016380 -2284386 -2969809 -3603816 -2913882 -1070041 176626
14749 176626 29910 -270477 388098 1188250 752772 -769716 -2062660 -2324287 -1674366
14740 -1674366 -562994 365703 448279 -147232 -343486 367762 1123492 1132026 956634 1282077
14730 1282077 1403467 466370 -551924 11283 1681155 2182737 783413 -647954 -502872
14721 -502872 458625 804132 622758 721098 874758 395585 -380162 -686508 -875967 -1859979
14711 -1859979 -3258984 -3593791 -2380973 -759121 141809 302409 86763 -408717 -885100
14702 -885100 -773864 -151677 151777 -194785 -550650 -510512 -559157 -911413 -792339 221506
14692 221506 1123086 859138 -10773 -289414 -98147 -426610 -1196863 -1364600 -790189 -415085
14682 -415085 -503175 -294253 311198 321432 -545374 -1139376 -729967 -190566 -379714 -629783
14672 -629783 -69592 594590 48872 -1505231 -2539339 -2190531 -1003466 4543 116024
14663 116024 -815761 -1944663 -1789581 -30616 1599601 1378884 -12563 -567282 39086
14654 39086 233113 -747391 -1784133 -1928537 -1829376 -2313079 -2872328 -2535465 -1325391 -23027
14644 -23027 797282 860273 85278 -987426 -1411148 -1052385 -812682 -1100973 -1077635 -168142
14634 -168142 749811 751430 485544 1009797 1747705 1260558 -295613 -1256013 -1068615 -1072396
14624 -1072396 -2112757 -2971280 -2203006 -407513 563736 26958 -1061090 -1688212 -1743493
14615 -1743493 -1503446 -1190165 -1165399 -1690397 -2257955 -1961528 -868473 -231324 -782432
14606 -782432 -1556113 -1252087 -238324 -61097 -1077572 -1807189 -1018361 585633 1467605
14597 1467605 1262998 804525 671519 734505 920371 1382046 1826432 1613481 788406 183664
14587 183664 117570 -192101 -1300625 -2308508 -1870593 -153716 1142544 830059 -436282
14578 -436282 -1177100 -862691 -148815 332047 693085 1166923 1386555 881933 76285 54132
14568 54132 1108601 2114355 1855079 624558 -105944 508018 1813027 2627519 2522469
14559 2522469 1931806 1407165 1060721 577480 -361769 -1573824 -2356952 -2218055 -1520994
14550 -1520994 -1086187 -1247410 -1704749 -2177613 -2628154 -2854553 -2531851 -1818494 -1312357
14541 -1312357 -1193509 -1003489 -489288 9487 312523 766568 1377662 1375366 404711 -498208
14531 -498208 -89197 1310688 2216392 1946650 1177763 578516 -18606 -810338 -1355476
14522 -1355476 -1264299 -896367 -790934 -858422 -710429 -473687 -650101 -1231828 -1497712 -889511
14512 -889511 164836 563495 -280091 -1672153 -2269423 -1533767 -283499 420500 590381
14503 590381 1012380 1845849 2249960 1543381 112311 -1110906 -1567333 -1209876 -299008
14494 -299008 516876 433673 -624953 -1692571 -1857786 -1377370 -1178664 -1598040 -2230173
14485 -2230173 -2690522 -2772886 -2139221 -778891 377546 364184 -288157 -108042 1031146
14476 1031146 1564572 758933 100128 974894 2198187 1585131 -644291 -1968157 -1108967
14467 -1108967 305996 188956 -1339738 -2601635 -2683560 -2142849 -1928535 -2387908 -3096602
14458 -3096602 -3228596 -2358613 -1088826 -431385 -492380 -487962 -187600 -296285 -962410 -1086181
14448 -1086181 1565 1187067 1071250 53350 -416712 -140094 -236275 -1097061 -1779152
14439 -1779152 -1631427 -1214784 -1182993 -1310265 -1118727 -614689 60811 962120 1868008 2149648
14429 2149648 1576732 741240 329207 435457 783824 1036220 742556 -250995 -1112035
14420 -1112035 -644363 960081 1913208 1045658 -584248 -1127766 -313059 596561 720939
14411 720939 355071 39445 -127759 -176332 -72542 21053 -81708 -112862 315897 860673
14401 860673 657285 -412206 -1368465 -1416631 -968377 -867053 -1082494 -917011 -355361 -391479
14391 -391479 -1662534 -3250302 -3449354 -1731517 515593 1451871 702948 -530858 -1099438
14382 -1099438 -1078397 -1162017 -1417139 -1204768 -220961 960980 1606284 1684629 1627572 1439494
14372 1439494 654475 -662052 -1478668 -962903 216486 531166 -444939 -1535871 -1695058
14363 -1695058 -1377718 -1584404 -2285017 -2697157 -2651671 -2652086 -2792098 -2640616 -2168900 -1806504
14353 -1806504 -1515393 -814426 96409 286753 -438559 -994975 -512466 421603 669977
14344 669977 100581 -401218 -74687 1031996 2177062 2452838 1619527 525873 101606
14335 101606 -55784 -1126818 -2988871 -3989687 -3301486 -2127568 -1718531 -1557336 -726783
14326 -726783 182597 139731 -270898 344646 1847617 2778720 2624753 2195075 1907850 1402623
14316 1402623 842287 878808 1155867 526172 -944069 -1834623 -1604753 -1272206 -1364971 -1016164
14306 -1016164 84917 644716 -141565 -1014533 -572407 531484 807630 239936 -204837
14297 -204837 -438025 -911109 -1121326 -261750 1012757 1210374 250991 -529042 -579325 -707987
14287 -707987 -1278914 -1442319 -670998 247136 366075 -264705 -1087200 -1766452 -2024041 -1637069
14277 -1637069 -1027411 -1025546 -1673270 -2071547 -1719340 -1112341 -728286 -458087 -423454 -1163432
14267 -1163432 -2376375 -2671484 -1454569 1285 352140 7540 -19015 -64045 -1047620
14258 -1047620 -2421523 -2669359 -1693781 -1021518 -1446914 -1983689 -1595690 -664391 -107731
14249 -107731 -68813 -165226 -264803 -370372 -308683 -39243 215852 463449 944407 1363696
14239 1363696 930447 -323245 -1082805 -386657 895263 1110704 -53268 -1441356 -2208746
14230 -2208746 -2684348 -3291244 -3559837 -2854054 -1612061 -1083851 -1733507 -2466790 -1916830
14221 -1916830 -264646 897205 652933 -56587 89979 838174 889114 -10700 -799231
14212 -799231 -902768 -895473 -986369 -329256 1276987 2300595 1428550 -258386 -600785 566032
14202 566032 1247402 252777 -1162424 -1159282 278275 1599540 1738326 1096788 642087
14193 642087 665012 665413 220341 -395660 -615701 -357742 -10506 224972 426585 418217 -102299
14182 -102299 -736585 -558776 473495 1156360 689638 -157709 -283546 178214 441540
14173 441540 419718 375718 -78594 -1326830 -2591130 -2795873 -2237876 -2025971 -2180993 -1825959
14163 -1825959 -1093700 -1145675 -2142086 -2833528 -2541443 -2023793 -1907118 -1756592 -1327803 -1296703
14153 -1296703 -1915648 -2213685 -1471261 -412464 27648 169134 808865 1751436 2151946
14144 2151946 1815318 1272368 907890 673138 368853 -214700 -1090385 -1786166 -1758686 -1180969
14134 -1180969 -663527 -236773 482612 1222404 1388716 1414959 2187625 2998257 2047554 -454596
14124 -454596 -1887267 -999430 99084 -691636 -2202609 -2262079 -1438429 -1812524 -3129993
14115 -3129993 -3114666 -1296832 187453 -138279 -1289791 -1742202 -1263337 -302916 844609
14106 844609 1691963 1646366 907450 296308 68180 -96686 -67545 501867 1042508 603418
14096 603418 -504251 -1060098 -927955 -1111560 -1743972 -1793725 -1125588 -1043621 -2089102 -2928775
14086 -2928775 -2350676 -1014956 -254485 -260652 -421536 -538126 -765792 -989399 -972168 -663825
14076 -663825 -57181 642261 679210 -434849 -1721336 -1608330 -199055 747508 434467
14067 434467 17228 361576 506951 -594866 -2267193 -3260746 -3527303 -3618950 -3385789
14058 -3385789 -2554265 -1722822 -1552831 -1712823 -1689870 -1810044 -2373200 -2692212 -2189572 -1551721
14048 -1551721 -1532983 -1563706 -993342 -761805 -2047281 -3916904 -4270359 -2833063 -1338771
14039 -1338771 -814068 -534445 137163 639366 418698 -201110 -862783 -1652675 -2311065
14030 -2311065 -2179345 -1401285 -1021862 -1392782 -1609187 -1095051 -628447 -1063853 -2001755
14021 -2001755 -2516219 -2388570 -1846080 -849114 487856 1387914 1248884 588750 344655
14012 344655 564785 571849 141534 -294041 -485334 -648730 -892966 -967575 -648618 58778
14002 58778 1049454 2004878 2283995 1521054 320428 -266376 -50981 133114 -238312 -609418
13992 -609418 -358146 57454 -274930 -1267769 -1847534 -1428765 -623643 -278872 -453329 -696674
13982 -696674 -798490 -792346 -612958 -266512 -84105 -315880 -667418 -708137 -560272 -684669
13972 -684669 -1126892 -1510349 -1697497 -1910556 -2192621 -2247497 -1873251 -1191515 -499635 -217247
13962 -217247 -720965 -1742377 -2257879 -1655129 -697530 -501246 -871296 -720277 74419
13953 74419 540889 356488 282590 576058 443741 -400584 -1105375 -1297743 -1798152 -2764233
13943 -2764233 -2699739 -712513 1573583 2019291 840379 -259322 -887402 -1860657 -2910446
13934 -2910446 -2763051 -1482770 -611760 -643495 -303902 1037101 2018638 1334088 -203288
13925 -203288 -718951 420628 2190626 3184608 2754245 1452758 689191 1306634 2348428
13916 2348428 2099096 495271 -629952 -68468 1227914 1763104 1448520 1030588 590960
13907 590960 -240173 -1228030 -1771539 -1790760 -1518471 -870851 93604 547145 -256123 -1734613
13897 -1734613 -2528692 -2190732 -1492502 -1140620 -1050781 -942712 -825521 -674979 -311406 104464
13887 104464 6554 -782103 -1601909 -1735734 -1403696 -1490115 -2248197 -2750656 -2014551 -431866
13877 -431866 564791 389231 102564 776523 1765184 1647065 502780 -108988 461493
13868 461493 1027733 578030 -119982 105838 908069 1109748 634412 426330 785863 1054394
13858 1054394 869363 561108 215145 -559599 -1634434 -2074698 -1313609 36590 943855
13849 943855 1012061 480528 -278727 -869710 -941233 -618257 -571877 -1220369 -2065332 -2287972
13839 -2287972 -1928003 -1932003 -2803463 -3645725 -3132894 -1350435 107827 263744 172964 1268410
13829 1268410 2858299 2815667 825190 -838691 -566613 261549 -306688 -1445360 -776051
13820 -776051 1708993 3371569 2740047 1348922 1036904 1398973 1159273 512086 526168
13811 526168 1201618 1659338 1668436 1582110 1190598 78874 -1036509 -751795 1035711 2728792
13801 2728792 2957213 1993197 917038 244555 -115528 -224102 -68117 170191 257958
13792 257958 155241 -105945 -529226 -963838 -1131546 -1078567 -1299134 -2113411 -3117400 -3513104
13782 -3513104 -2879706 -1493692 -87431 565322 106797 -1042795 -1904166 -1829789 -1171921
13773 -1171921 -823726 -1066291 -1142058 -200352 1458198 2478792 2018421 904998 711832
13764 711832 1739767 2615580 2151873 849063 -82320 -519216 -1205128 -2078242 -2130991
13755 -2130991 -1126675 -237847 -401562 -1003172 -926315 -138530 584668 872630 786628 152393
13745 152393 -1093638 -2170887 -2119937 -1166944 -535461 -902514 -1857918 -2826251 -3569948
13736 -3569948 -3731605 -2933283 -1628532 -922859 -1163954 -1535398 -1396731 -1134104 -1242669
13727 -1242669 -1496903 -1615967 -1853361 -2242351 -2153100 -1409627 -946375 -1364508 -1697380 -820841
13717 -820841 641512 1192237 630623 -167797 -1095000 -2570029 -3705696 -2917977 -730454
13708 -730454 208035 -1190215 -2723941 -2179152 -588628 -432260 -1856998 -2783881 -2151090
13699 -2151090 -986730 -354535 -101412 47537 -277717 -1171786 -1913971 -1955242 -1615500
13690 -1615500 -1323613 -902502 -88663 827092 1335335 1311285 1024257 845820 985337 1166512
13680 1166512 735434 -389247 -1176195 -689154 431350 730342 27508 -502025 -344636
13671 -344636 -281915 -705626 -876353 -517166 -581529 -1450880 -1852817 -878166 243217 -58754
13661 -58754 -1248568 -1807223 -1809636 -2257763 -2523061 -1000426 1662802 2566887 557302
13652 557302 -1940275 -2243142 -840639 -132905 -1058349 -2463926 -3026440 -2502870 -1566302
13643 -1566302 -1333661 -2500824 -4200214 -4499946 -2864461 -1165221 -1176019 -2098060 -2061294
13634 -2061294 -1203641 -1272535 -2478873 -2923204 -1581896 38403 169048 -745429 -1056739
13625 -1056739 -433800 -9869 -394475 -792964 -267175 969085 1909782 2000081 1607723
13616 1607723 1318668 1096936 398924 -946262 -2318943 -2943863 -2692621 -2049774 -1529945
13607 -1529945 -1357983 -1458041 -1509830 -1292893 -1137164 -1546930 -2160752 -1859374 -445162
13598 -445162 649125 218702 -944044 -1320340 -987959 -1109469 -1549084 -936895 759447
13589 759447 1661120 623547 -1173397 -2117835 -2220302 -2307946 -2430801 -2180964 -1613905
13580 -1613905 -860570 220283 1097958 448921 -1839074 -3669202 -3183126 -1270961 -97739
13571 -97739 -14682 225551 821315 632693 -537316 -1391632 -1206909 -760276 -745321 -765114
13561 -765114 -425262 -91815 -14090 110891 230312 -186064 -881917 -737294 411640 1181664
13551 1181664 680311 -117942 -35681 424273 124533 -653785 -634146 411329 1341591 1257824
13541 1257824 418178 -441553 -901969 -949485 -852751 -947417 -1206254 -1228260 -908721 -689302
13531 -689302 -839305 -1085338 -1340520 -2009841 -2957282 -3061972 -1764275 -304455 -236051
13522 -236051 -1237492 -1691844 -1092642 -467668 -496487 -643581 -402424 -111235 -61697 146128
13512 146128 777403 1282830 1012415 86053 -812420 -1082329 -538298 359969 636283 -118478
13502 -118478 -875439 -361846 893895 1017196 -416226 -1528676 -864403 440018 450688
13493 450688 -670142 -1092604 -37794 1462393 2275722 2222172 1457796 158468 -1005468
13484 -1005468 -1301913 -1143334 -1718840 -3031770 -3500351 -2220325 -554742 -397119 -1532325
13475 -1532325 -1984063 -820215 586726 443217 -1170763 -2546811 -2532839 -1760360 -1546236
13466 -1546236 -2111463 -2481700 -2060589 -1525822 -1712998 -2252949 -2203599 -1709889 -1852541 -2714609
13456 -2714609 -2884318 -1544651 66188 368244 -201499 50071 1326408 1938374 858868
13447 858868 -746201 -1213572 -551645 -29677 -270519 -682533 -512221 285548 1168700
13438 1168700 1535217 1191918 536269 89413 -200816 -695293 -1044243 -360290 1115510
13429 1115510 1598522 39644 -2028693 -2299587 -809522 332981 98283 -404397 -262571
13420 -262571 -264924 -1198132 -2205203 -2098077 -1210887 -635453 -414568 163366 1014147 1327680
13410 1327680 906490 272990 -360634 -1167936 -1939941 -2272240 -2344241 -2503479 -2334055 -1317023
13400 -1317023 -206792 -354932 -1644467 -2557558 -2495318 -2461472 -2984767 -3051627 -2035547
13391 -2035547 -1146972 -1584278 -2391062 -1780702 90161 1352872 1175745 653281 782323
13382 782323 1042717 655088 169070 768361 2361895 3307464 2301544 70267 -1343069
13373 -1343069 -950697 111292 250534 -469131 -760055 -278165 -65706 -703183 -1373314
13364 -1373314 -1299288 -887440 -736705 -724073 -914529 -2034919 -3866361 -4551641 -3140648
13355 -3140648 -1597453 -2200755 -3889367 -3699403 -1381257 235610 -304575 -1146538 -570324
13346 -570324 286566 -246327 -1463797 -1690769 -1091066 -1017011 -1553235 -1688461 -1320307 -1243943
13336 -1243943 -1468892 -1225739 -532887 -244487 -493478 -431689 298920 984323 991429 582349
13326 582349 306303 282198 301009 156325 -170645 -318696 211077 1224992 1721284 1167704
13316 1167704 317902 37528 -748 -497854 -1113516 -1121532 -917013 -1412107 -2283599 -2389299
13306 -2389299 -1748724 -1435429 -1500259 -840077 522152 890551 -596137 -2498271 -3077863
13297 -3077863 -2447897 -1735983 -1306838 -924629 -700481 -758097 -717528 -461183 -620791 -1388145
13287 -1388145 -1743545 -954103 10558 -195056 -1257306 -1828518 -1622741 -1463721 -1610480
13278 -1610480 -1506392 -1067763 -807233 -623170 183045 1449426 1946720 1027440 -528844
13269 -528844 -1700909 -2322338 -2578954 -2314161 -1425779 -320827 545928 1121319 1419442
13260 1419442 1303038 958057 1002920 1652851 2238537 2040933 1245840 606463 444178 444923
13250 444923 264115 -105299 -528195 -959980 -1403338 -1757156 -1794951 -1389491 -809706 -591977
13240 -591977 -906432 -1268440 -1198811 -931293 -1004396 -1359785 -1446274 -1103599 -661224 -202028
13230 -202028 476022 1068731 824696 -272717 -1203049 -1267666 -1018721 -1267159 -1858339 -2132137
13220 -2132137 -1993135 -1716344 -1213712 -436624 -96887 -848641 -1887470 -1591564 210063
13211 210063 1728453 1482270 143552 -589898 -237012 244737 46956 -654496 -1363925
13202 -1363925 -1870541 -2005667 -1533055 -665521 -185097 -601719 -1490781 -2041407 -1987592 -1584350
13192 -1584350 -936523 39371 1030351 1354182 812530 68535 -113586 315344 845660
13183 845660 993508 477191 -677422 -1729992 -1444063 479716 2462670 2539801 868373
13174 868373 -268460 635653 2353425 2629878 1141202 -313804 -341851 427054 532760
13165 532760 -296241 -911166 -273768 1251035 2246687 1791225 498030 -212530 139020
13156 139020 555336 71393 -774181 -733553 184288 558453 -480312 -2057679 -2755634
13147 -2755634 -2249743 -1202799 -200461 473745 498385 -175766 -871952 -824230 -215638
13138 -215638 68535 -353279 -1066480 -1693491 -2227518 -2459618 -1914763 -680314 377037
13129 377037 591173 139768 -576028 -1516964 -2524152 -2930229 -2340052 -1363602 -891506
13120 -891506 -959188 -978748 -788254 -708704 -721279 -398378 291578 811044 842704 674803
13110 674803 625761 614525 511359 408730 262920 -256073 -1143417 -1648262 -1033703 353120
13100 353120 1306820 1201975 763977 1035361 1869789 2102669 1273687 385800 412459 750425
13090 750425 167898 -1087116 -1477577 -596266 31276 -835307 -2417141 -3321223 -3544743
13081 -3544743 -3872084 -4190551 -3838624 -3022601 -2425205 -1846613 -738833 268757 69535
13072 69535 -821228 -679960 711754 1562289 777906 -514360 -895943 -574311 -429942
13063 -429942 -478734 -379409 -434114 -996279 -1647330 -1846101 -1698637 -1421491 -898685 -394051
13053 -394051 -645109 -1490210 -1566005 -321828 854443 673356 -69951 56414 770317
13044 770317 862402 507022 865004 1772738 1767236 492560 -599648 -309409 862585 1723863
13034 1723863 1821891 1489928 1210854 1192637 1110939 371472 -916901 -1673477 -1242792 -502482
13024 -502482 -643963 -1385122 -1509488 -734338 172294 766791 1138161 1035459 127891 -1040123
13014 -1040123 -1639047 -1895277 -2531813 -3154934 -2721165 -1453584 -663791 -674279 -569701
13005 -569701 -76485 58151 -245235 -151683 291360 -30970 -1165615 -1671913 -1086390 -915217
12995 -915217 -2141175 -3511225 -3568443 -2811475 -2415833 -2209628 -1530329 -990212 -1666566
12986 -1666566 -3194925 -4186906 -4123244 -3587333 -3026411 -2417130 -1833579 -1377928 -841442
12977 -841442 -169192 181423 -18974 -279276 -232306 -170094 -99531 670544 2087261 2655564
12967 2655564 1447934 -201882 -496007 196724 197084 -638363 -852102 14265 633837 -32507
12957 -32507 -1438148 -2635093 -3422820 -3799801 -3411905 -2233263 -1043134 -623943 -924628
12948 -924628 -1344708 -1436126 -1111950 -550531 -94372 -13293 -286765 -674895 -813979 -247575
12938 -247575 1082887 2224748 1916284 351228 -673018 -76470 987909 909432 -43262
12929 -43262 -472249 -163997 -75881 -467827 -694456 -663156 -860343 -948388 -15978 1557107
12919 1557107 2132243 1169558 39604 -142829 -78179 -824239 -1960850 -2230047 -1238590
12910 -1238590 332379 1630989 2086747 1532984 486177 -161801 -166920 -177559 -708230
12901 -708230 -1511153 -2192290 -2658211 -2686774 -1987847 -1050888 -878891 -1389086 -1265193 -104112
12891 -104112 619186 -168986 -1196498 -781093 280239 -210117 -2296467 -3596376 -2841462
12882 -2841462 -1628711 -1792122 -2752108 -2778912 -1670476 -657939 -353416 -308838 -295608
12873 -295608 -538685 -652954 228063 1867293 2684948 1736743 -35573 -1200756 -1538033
12864 -1538033 -1508175 -1021738 -10754 495889 -508521 -2072830 -2183655 -731664 161574
12855 161574 -693710 -1799229 -1353224 172121 1222235 1639064 2186799 2447560 1215049
12846 1215049 -1179738 -2757918 -2364372 -832814 563950 1468661 1882774 1595129 832435
12837 832435 468427 891202 1396271 1236757 581972 -31843 -489438 -832123 -865493 -559815
12827 -559815 -287752 -201894 82146 742520 1232520 975997 139554 -674630 -1091937 -1055057
12817 -1055057 -740029 -597476 -922252 -1246916 -883111 -186505 -306768 -1375852 -2063298
12808 -2063298 -1475862 -357590 315362 726172 1242946 1283835 451089 -288095 -78329
12799 -78329 148270 -727599 -1610312 -657648 1294684 1411639 -791763 -2456620 -1672892
12790 -1672892 -259956 -634399 -1980978 -1786640 94971 1345137 709148 -523557 -686777
12781 -686777 298599 1470409 2068282 1858165 1132704 632097 792383 1128063 1045064 902711
12771 902711 1273959 1568148 751797 -768871 -1535353 -1299533 -1198956 -1485743 -1043362
12762 -1043362 209325 508778 -959106 -2342557 -1854310 -630792 -844048 -2169328 -2479880
12753 -2479880 -1400169 -699581 -1200659 -1627282 -994254 -143505 -113057 -566600 -751487
12744 -751487 -795833 -1150099 -1625530 -1747342 -1429665 -834294 -171908 151952 -36128 -33194
12734 -33194 936645 2158474 1932430 18342 -1714464 -1687426 -499047 268398 29487
12725 29487 -771942 -1583565 -1856683 -1109410 312502 1265753 1210106 769815 432950 -204435
12715 -204435 -1256364 -1837132 -1419030 -755518 -492300 -30537 1110055 1950321 1409857
12706 1409857 63688 -791829 -984522 -1088123 -1086802 -810870 -870601 -1694692 -2413841 -2172175
12696 -2172175 -1708518 -2012938 -2288309 -1174588 674495 1353186 656203 142781 440328
12687 440328 649215 469191 725880 1439283 1430585 418609 -343734 -175234 -9442 -622843
12677 -622843 -1382553 -1529034 -1302731 -1023141 -332322 852834 1738953 1720982 1136041 510121
12667 510121 19643 -45269 559345 1180490 871497 52187 84178 938358 1024662 -168501
12657 -168501 -1148994 -927282 -560174 -1083866 -1676214 -1257160 -383755 -61656 -30121 216394
12647 216394 -20630 -1323170 -2439188 -1773417 87344 1118276 641656 -294301 -911456
12638 -911456 -1376643 -1668634 -1410331 -904314 -937269 -1422636 -1473602 -947489 -726043 -1263195
12628 -1263195 -1970244 -2322744 -2544762 -2814635 -2725937 -2073299 -1462988 -1518251 -1879680 -1567685
12618 -1567685 -238616 1291729 1856404 1142240 -33415 -672022 -600702 -281628 110033
12609 110033 808948 1698389 2163211 1920691 1351476 760113 -6684 -898077 -1368129 -1202173
12599 -1202173 -938769 -947982 -760866 66241 1001419 1126996 281262 -914681 -1772887 -1877322
12589 -1877322 -1220837 -429605 -314051 -803241 -932930 -257912 479598 535459 153423 -206067
12579 -206067 -694529 -1356128 -1463773 -541250 624912 929163 335372 -472519 -1125283
12570 -1125283 -1385983 -731229 787407 1908525 1529546 202673 -761054 -1059666 -1177675
12561 -1177675 -1145378 -885400 -1128559 -2377882 -3431416 -2705219 -797124 128817 -483718
12552 -483718 -992243 -453095 -58321 -851497 -1862372 -1784076 -1063191 -858474 -1024183 -758111
12542 -758111 -499553 -1343807 -2771175 -2814688 -933231 844132 570017 -964514 -1497592
12533 -1497592 -574382 -14172 -1064875 -2603034 -2883798 -1929711 -1050380 -710118 -231226
12524 -231226 638536 1242152 1239028 1105705 1085705 727424 -91538 -688823 -658664 -505023
12514 -505023 -638933 -682810 -429251 -535990 -1404902 -2187435 -1902347 -959755 -606812 -1260439
12504 -1260439 -2227199 -2742747 -2583958 -1993847 -1594164 -1970656 -2844225 -3173253 -2526580
12495 -2526580 -1657665 -1241449 -963573 -519000 -431704 -905101 -896753 406918 2035882 2510357
12485 2510357 1959710 1537951 1369359 741248 -20393 314430 1733629 2558054 1637275
12476 1637275 -183525 -1290194 -1155502 -512508 -217566 -320205 -136817 739519 1591589
12467 1591589 1320932 108588 -654517 -457245 -420486 -1233589 -1788634 -1098588 -203865
12458 -203865 -527159 -1466273 -1509758 -836130 -721297 -1020270 -482083 749403 1203638 642220
12448 642220 431088 1180479 1979075 2232565 2391513 2551487 2157671 1458527 1466151 2056207
12438 2056207 1849095 444176 -920882 -1423631 -1702828 -2335475 -2888840 -3019559 -2961050
12429 -2961050 -2489573 -1062102 605543 910192 -187632 -984744 -852593 -1091613 -2171009
12420 -2171009 -2474326 -1146274 4960 -770365 -2359996 -2676930 -1857887 -1448480 -1499482
12411 -1499482 -719405 1009751 2295568 2323357 1715502 1282239 1135480 1116410 1214230 1494532
12401 1494532 2068480 2888241 3325490 2623985 1156141 380233 1008698 2083192 2427609
12392 2427609 2072836 1624328 1233354 910231 868001 853285 167838 -975864 -1299470 -410302
12382 -410302 361251 -68809 -1056578 -1645916 -2017802 -2424010 -2189490 -1105577 -346314
12373 -346314 -553463 -538646 479156 1008020 -272029 -1737325 -1031589 1074855 1804531
12364 1804531 679178 -139832 405354 993885 634247 71097 -93776 -462517 -1308896
12355 -1308896 -1868762 -1830305 -1865345 -2145066 -1979204 -1411661 -1451142 -2157404 -2258831 -1366327
12345 -1366327 -810617 -1407356 -2079323 -1755970 -1086189 -1056783 -1306202 -1146444 -1026948 -1479281
12335 -1479281 -1578728 -115464 2216317 3341094 2400916 652250 -226160 195951 1125000
12326 1125000 1486699 790377 -434232 -1083021 -684367 55520 227620 -129970 -296488
12317 -296488 81792 745710 1369886 1806585 1910569 1588492 1001582 440241 70215 -50428
12307 -50428 71208 209707 7010 -575005 -1169502 -1556766 -1931399 -2360784 -2397971 -1664549
12297 -1664549 -537623 206096 291593 104951 59526 180341 289106 256190 1272 -498003
12287 -498003 -1068015 -1366390 -1223952 -932002 -1000351 -1520554 -1946815 -1777789 -1333875 -1398743
12277 -1398743 -2046411 -2414267 -1921745 -1099983 -691988 -497958 106492 891720 975197 208101
12267 208101 -591293 -925051 -1249531 -1976251 -2578170 -2236443 -985196 238005 521845
12258 521845 -233780 -1276741 -1664832 -1157693 -405808 -48267 111964 590674 1191123
12249 1191123 1214897 574405 -116011 -558878 -1009683 -1381152 -1089807 -178136 292919 -446066
12239 -446066 -1801355 -2579895 -2309988 -1394497 -499337 -155946 -372804 -344443 666647
12230 666647 1831272 1267969 -1210545 -3092065 -2189917 275662 1243303 -152652 -1983465
12221 -1983465 -2728819 -2917407 -3140535 -2608956 -943695 276167 -497580 -2239616 -2625988
12212 -2625988 -1369707 -441928 -959541 -1637257 -907540 854332 2123214 2246070 1711129
12203 1711129 1098316 746467 1002551 1801987 2227948 1434823 -45732 -800652 -382601
12194 -382601 229255 225764 100632 628183 1401611 1214551 -303743 -2110413 -2882720 -2332617
12184 -2332617 -1277471 -646104 -588200 -552050 -119180 486148 875336 1177591 1743659 2266741
12174 2266741 1902474 536638 -688872 -666957 230046 639240 1031 -813058 -800316
12165 -800316 -130460 322311 371919 663931 1304395 1221366 -280612 -1847444 -1328838 1105772
12155 1105772 2622348 1409468 -667311 -679297 1119315 1849388 446294 -995060 -771766
12146 -771766 54956 66182 14965 1059604 2188199 1720919 328149 151044 1423405
12137 1423405 2283708 1804577 968933 487715 -126806 -815665 -466280 929969 1530821
12128 1530821 297919 -1200066 -1098648 -55995 -73288 -1371653 -2275591 -1911243 -1324123
12119 -1324123 -1684598 -2670523 -3125860 -2529692 -1371569 -561204 -772435 -2009368 -3541287
12110 -3541287 -4424732 -4242269 -3326559 -2348720 -1751320 -1421280 -835268 272021 1353298
12101 1353298 1507091 591219 -546554 -1132921 -1284591 -1473965 -1692596 -1615158 -1229077
12092 -1229077 -806970 -488195 -284637 -268073 -426268 -623673 -965014 -1721172 -2539596 -2410686
12082 -2410686 -1117991 -91221 -773463 -2485930 -3126152 -1973447 -540690 -302189 -801505
12073 -801505 -792229 -301583 -398935 -1302303 -1907333 -1385706 -385416 -159332 -963976 -1843996
12063 -1843996 -1827278 -845762 539150 1797570 2487688 2073624 403596 -1586574 -2374741
12054 -2374741 -1503925 -262026 -169898 -1149899 -1857714 -1573486 -908802 -628049 -681812 -742630
12044 -742630 -914404 -1337733 -1626049 -1342282 -760002 -590609 -1081904 -1798814 -2189333 -2069897
12034 -2069897 -1704322 -1613257 -2030953 -2362860 -1659739 21793 1315735 1188909 335854
12025 335854 152423 808440 1342853 1314715 1121570 774506 -259873 -1746650 -2564166
12016 -2564166 -2412973 -2371782 -3043618 -3414535 -2565804 -1364093 -1111047 -1413342 -984976
12007 -984976 -9281 58127 -1064836 -1960969 -1732061 -1202388 -1312939 -1642166 -1396890 -892343
11997 -892343 -1035903 -1889203 -2633947 -2716160 -2376991 -2181095 -2444002 -3014547 -3388967 -3183497
11987 -3183497 -2539432 -1817625 -1062924 -301418 -122904 -1015373 -2123070 -1879543 -262967
11978 -262967 817141 91166 -1303237 -1637174 -1076684 -965695 -1438834 -1450936 -866902
11969 -866902 -772423 -1541977 -2170252 -1999995 -1759928 -2198674 -2816797 -2790732 -2267922 -1851468
11959 -1851468 -1506235 -934995 -518263 -850099 -1601664 -1825747 -1328321 -852470 -849367 -928387
11949 -928387 -752966 -677184 -1017576 -1262207 -627354 780956 1830806 1470481 -122494
11940 -122494 -1507839 -1297044 222151 1086318 -52768 -1860727 -1671602 890058 3038493
11931 3038493 2420696 225822 -783188 -277855 -275838 -1441091 -1954179 -623363 1106025
11922 1106025 1409400 571080 -167861 -725246 -1523658 -1992732 -1568165 -1230088 -2082417
11913 -2082417 -3102913 -2424477 -468910 421351 -521377 -1546849 -1270527 -421024 -69250
11904 -69250 -2211 264968 457279 406601 513000 542053 -513213 -2442943 -3283050 -1999531
11894 -1999531 -302050 -363587 -1901311 -2986041 -2728693 -1643986 -268130 913299 852227
11885 852227 -978132 -3194684 -3754010 -2433176 -760919 227223 757256 1063397 883886
11876 883886 295870 -220616 -653501 -1300436 -1837139 -1775538 -1734054 -2786161 -4451543 -4923866
11866 -4923866 -3695277 -2378051 -2214650 -2285206 -1288728 151729 435088 -508483 -1226709
11857 -1226709 -1051735 -907387 -1528845 -2137127 -1649109 -447256 7621 -899669 -2242952
11848 -2242952 -2852761 -2558472 -1820427 -819910 419297 1402295 1460902 631541 -384816
11839 -384816 -1095593 -1474626 -1498152 -1181020 -1013041 -1503258 -2269164 -2503633 -2374020 -2807439
11829 -2807439 -3684944 -3600991 -1970448 -48032 958965 1515244 2426079 3062697 2332838
11820 2332838 633674 -615201 -911227 -825907 -617053 -32070 657372 659068 -215648 -1303533
11810 -1303533 -1951396 -1961769 -1403698 -646860 -282973 -418195 -497533 -351095 -614112 -1398770
11800 -1398770 -1638905 -876473 -535900 -1812305 -3281270 -2649966 -303262 1137473 630707
11791 630707 -211543 -95407 234597 -19182 -148920 396711 497956 -945322 -2925498
11782 -2925498 -3492219 -2435498 -1443882 -1750179 -2694334 -2793857 -1597986 -166521 158808
11773 158808 -712033 -1534360 -1279770 -357418 136189 -35730 -171263 123577 415175 211332
11763 211332 -348087 -650963 -169155 936385 1555221 581807 -1436806 -2443032 -1380400
11754 -1380400 362473 981666 663342 583118 565339 -313735 -1435956 -1203755 187643
11745 187643 720039 -390118 -1600268 -1574263 -994553 -1046434 -1605208 -1831923 -1438460 -631758
11735 -631758 249361 554658 -237280 -1516754 -1982894 -1378924 -739769 -691831 -682709 -209400
11725 -209400 334716 400944 -71016 -868225 -1451088 -952240 568586 1382469 270569
11716 270569 -1132621 -428495 1493662 1376595 -1214138 -2849238 -1394318 980443 1653769
11707 1653769 1449750 2294320 3425554 2845631 941645 -219229 -205682 -206950 -422163
11698 -422163 -644 774261 604214 -539726 -1269884 -1032129 -765567 -1146762 -1695509
11689 -1695509 -1855586 -1697841 -1361171 -867621 -600147 -1013998 -1803882 -2136536 -1670409
11680 -1670409 -731966 232917 749108 336572 -778182 -1475511 -1096434 -462305 -696963
11671 -696963 -1635636 -2354939 -2637093 -2791057 -2611403 -1802995 -1039398 -1262658 -2108477 -2270800
11661 -2270800 -1381391 -382991 8544 148357 571674 1109138 1193264 573228 -402507 -989130
11651 -989130 -712037 -20119 150744 -327156 -573720 -92162 511348 666617 679404 748908
11641 748908 260340 -955546 -1703333 -1002957 251541 524500 -182800 -749424 -890814
11632 -890814 -1182331 -1535065 -1203751 -219976 535725 697784 676870 571253 -36875 -1072929
11622 -1072929 -1720166 -1389466 -338221 655840 810799 -99735 -1193807 -1089381 265080
11613 265080 1123784 193444 -1487541 -2088658 -1605601 -1440462 -1915600 -1946034 -1113949 -404712
11603 -404712 -518636 -771697 -268295 687750 952139 -27471 -1437824 -1796704 -641206
11594 -641206 599057 147732 -1686864 -2779756 -2128979 -982387 -444673 92947 928736
11585 928736 591018 -1557483 -3105949 -1688159 998943 1320749 -878407 -2260106 -1285939
11576 -1285939 -145306 -717718 -1740481 -1393794 -215001 262477 -52140 -390684 -789128
11567 -789128 -1612486 -2358687 -2271270 -1547958 -987689 -932585 -1169802 -1332522 -1039543 -310226
11557 -310226 8703 -842762 -2079203 -2011183 -430476 921099 728295 -318283 -930996
11548 -930996 -998792 -1138098 -1428368 -1444248 -970549 -201242 244592 -520516 -2527030 -3995392
11538 -3995392 -2898895 193139 2301997 1664213 -259402 -1166111 -835850 -540513 -768417
11529 -768417 -984092 -954421 -969607 -1040239 -889494 -584828 -463010 -594707 -823227 -1113553
11519 -1113553 -1501821 -1922976 -2251782 -2251600 -1606850 -493391 203104 22973 -155934 503766
11509 503766 1021197 -81273 -1935674 -2045465 -171321 927160 -427362 -2387802 -2693227
11500 -2693227 -1987590 -2003069 -2321976 -1499506 -167325 -273244 -1774776 -2667220 -2220998
11491 -2220998 -1850978 -2522391 -3368895 -3366518 -2628156 -1527922 -123929 1007637 858212
11482 858212 -444054 -1461014 -1464407 -1357166 -1910402 -2400854 -1935415 -986313 -491816 -319612
11472 -319612 178318 730768 525013 -319677 -839423 -720292 -707330 -1434096 -2629154 -3582064
11462 -3582064 -3735105 -2788441 -961809 693117 963596 -207627 -1582187 -2044958 -1653740
11453 -1653740 -1074767 -654765 -496004 -811919 -1529031 -1966170 -1639164 -1090787 -1182616 -1809607
11443 -1809607 -2141770 -1950999 -1708011 -1396220 -401934 1123409 1975978 1592244 982799
11434 982799 1150703 1528182 1080717 207188 160109 918262 1054599 -220068 -2106909
11425 -2106909 -3516419 -4179157 -4112387 -3100972 -1387115 -53753 68491 -613353 -1188697
11416 -1188697 -1477260 -1834804 -2148912 -1931385 -1335959 -1219084 -1942425 -2762818 -2792964 -2082842
11406 -2082842 -1271329 -555099 305496 1082628 1011149 -91994 -1303807 -1683400 -1385266
11397 -1385266 -1119695 -984964 -628444 -246711 -449160 -1158743 -1588409 -1436333 -1226884
11388 -1226884 -1292402 -1329355 -1230145 -1404002 -1861443 -1890229 -1153447 -285131 108162 202147
11378 202147 220935 -97814 -679510 -745013 -55969 405354 -120608 -947133 -1114570 -887940
11368 -887940 -996801 -1222435 -959599 -485627 -457713 -797776 -1236010 -2149253 -3497242 -3819683
11358 -3819683 -2060767 239936 559998 -1097771 -2321773 -1871025 -1068133 -1314396 -2202010
11349 -2202010 -2746315 -2777123 -2329648 -1165845 262764 737004 19666 -568399 -185045
11340 -185045 213685 -344215 -1006863 -505472 484805 114963 -1778058 -3210550 -2722178
11331 -2722178 -1202735 -433356 -770118 -1214728 -1270843 -1533430 -2279640 -2611135 -1810081
11322 -1810081 -797891 -1035901 -2264596 -2735625 -1829520 -949484 -1233723 -1843736 -1558060
11313 -1558060 -833477 -923652 -1788985 -2282139 -1895087 -1104104 -430943 -239902 -923574 -2199763
11303 -2199763 -2828126 -2145001 -1183901 -1086598 -1278241 -686102 141501 -28507 -762403 -608389
11293 -608389 310387 495678 -259004 -526066 302635 1197607 1363817 1105428 633968 -154599
11283 -154599 -555199 347525 1710462 1578107 -154790 -1500988 -1523406 -1465855 -2057159
11274 -2057159 -2056105 -647673 832435 978838 318475 -178189 -866398 -2125758 -2829392
11265 -2829392 -1916071 -384911 -10019 -872331 -1668413 -1746255 -1407071 -804209 63549
11256 63549 676531 528869 43601 -19636 275085 347083 193529 314832 802143 1220292
11246 1220292 1238372 905253 497106 316571 301645 -170878 -1457271 -2662638 -2426639
11237 -2426639 -821502 562214 635465 -165220 -1064012 -1851590 -2219228 -1593315 -309660
11228 -309660 294067 -316791 -1128416 -1276878 -1188796 -1251854 -774545 590848 1610385 989501
11218 989501 -746859 -2123347 -2677532 -2835671 -2563376 -1534188 -253450 306549 135230
11209 135230 207927 997493 1749966 1464076 154446 -1090348 -1259192 -555995 -117298
11200 -117298 -425661 -589974 167515 988860 505817 -965406 -1848092 -1787938 -2023976 -3012352
11190 -3012352 -3379892 -1991274 251775 1530218 1144006 -163624 -1154014 -991076 84734
11181 84734 824007 398633 -466881 -710785 -698507 -1329229 -1996935 -1447626 -334756 -551705
11171 -551705 -1958563 -2306481 -864515 443826 296037 -154151 292786 978877 1183293
11162 1183293 1564367 2385238 2388302 950225 -553364 -996105 -1216441 -2018239 -2413781
11153 -2413781 -1516442 -374610 -231241 -642938 -904501 -1532330 -2664760 -2877451 -1454058
11144 -1454058 -32218 -73556 -515497 48410 759438 334649 -346489 -42263 178830
11135 178830 -1118687 -2580839 -1894683 285336 1304540 653465 111334 251679 -101802
11126 -101802 -1026466 -1086726 -79378 455489 -33575 -256772 372676 494943 -958808
11117 -958808 -2937056 -3644075 -2660043 -1034446 -70306 -357079 -1337009 -1719600 -851218
11108 -851218 525001 1332612 1410119 1112965 524141 -105197 -74901 585009 629026 -571303
11098 -571303 -1731039 -1467731 -372616 174106 249629 824696 1783754 2173518 1812110
11089 1812110 1174815 327738 -661246 -1050897 -578584 -419344 -1551512 -3089162 -3686158
11080 -3686158 -3505333 -3221945 -2369919 -624292 510758 -409353 -2129029 -2313902 -1089050
11071 -1089050 -540377 -1236826 -1773098 -1541862 -1473092 -1884030 -1814864 -863577 104215 349332
11061 349332 -93866 -1130567 -2518272 -3248783 -2514662 -1117335 -522972 -823776 -1000784
11052 -1000784 -744215 -553515 -517450 -443355 -640187 -1175017 -1121955 -59636 625051 -347214
11042 -347214 -1908116 -2213258 -1462475 -1084169 -1104122 -634878 -97976 -457496 -950655 -188014
11032 -188014 1030307 686578 -1012975 -1862304 -1174367 -469998 -690738 -1244750 -1834674
11023 -1834674 -2748119 -3287395 -2403754 -1016939 -1239907 -3090076 -4342735 -3845545 -2646451
11014 -2646451 -1710190 -958623 -756444 -1801058 -3175267 -2999326 -1465969 -800859 -1754644
11005 -1754644 -2624322 -2333586 -1948412 -2309384 -2568684 -2112076 -1796603 -2212704 -2616799
10996 -2616799 -2595407 -3030777 -4406995 -5686722 -5793252 -4961501 -3990968 -3298012 -3019556
10987 -3019556 -2916584 -2205366 -751003 -32872 -1272148 -3107429 -3171433 -1546951 -360476
10978 -360476 -324894 -308037 -129009 -818587 -1875230 -1300938 950872 2369467 1588865
10969 1588865 143828 -292084 81379 746146 1866123 2800694 2159723 392895 -146765
10960 -146765 1181752 2110059 1064991 -545575 -1048456 -1056675 -1658959 -2282958 -2174668
10951 -2174668 -2120836 -2913577 -3695680 -3448685 -2696468 -2347100 -2275056 -2252621 -2712021 -3403322
10941 -3403322 -3014082 -1418977 -551683 -1603977 -3080598 -3194963 -2488813 -2284195 -2117755
10932 -2117755 -834823 886150 1276734 171963 -892028 -961521 -503940 -158252 8225
10923 8225 -18724 -446141 -1259702 -2126713 -2717869 -2840457 -2439084 -1691321 -959333 -624835
10913 -624835 -1040845 -2233005 -3369612 -3262783 -1988619 -1109875 -1465743 -1882338 -1255593
10904 -1255593 -550809 -989638 -1570840 -703376 689952 350324 -1625708 -3006852 -3025126
10895 -3025126 -2967898 -3280539 -2963062 -2060893 -1925924 -2568586 -2470217 -1553729 -1624600 -3156315
10885 -3156315 -4275500 -3803045 -2818714 -2301410 -1640878 -517421 22298 -514129 -1077619
10876 -1077619 -1009877 -1097931 -1821294 -2312933 -1857968 -878687 27302 520715 -1123 -1574604
10866 -1574604 -2617441 -1869735 -901790 -2001234 -4028612 -3692123 -908184 765165 -448383
10857 -448383 -2338441 -2804527 -2567649 -2577747 -2163638 -1275568 -1407700 -2697597 -3041527
10848 -3041527 -1637936 -557331 -1238392 -2197290 -1794166 -655168 117268 598223 661419
10839 661419 -402779 -1803427 -1636879 -359379 -690162 -2938568 -3944109 -2145294 -122606
10830 -122606 -323618 -1761615 -2834774 -3835508 -4599292 -3365925 -384830 955632 -813529
10821 -813529 -2618299 -1977975 -1003759 -2064837 -3204705 -1828043 209798 -440344 -2950126
10812 -2950126 -3905869 -2823372 -1998537 -2128638 -1874160 -972937 -521846 -734207 -997725
10803 -997725 -1374481 -1927499 -1790237 -898263 -983947 -2714890 -3783995 -2285561 -21838
10794 -21838 255518 -951884 -1315025 -645259 -462325 -937487 -1122730 -1141652 -1600512 -1893342
10784 -1893342 -1383186 -1044552 -1764233 -2410928 -1740790 -667929 -468651 -443854 345306
10775 345306 845004 -14322 -933542 -458254 210440 -606201 -1787480 -1284839 217986
10766 217986 566195 -188978 -429906 -292118 -1294301 -3251497 -4352531 -4052146 -3591644
10757 -3591644 -3850573 -4477952 -4814978 -4351882 -2950274 -1595262 -1741998 -3043653 -3414191
10748 -3414191 -2261603 -1475646 -2069814 -2468414 -1707543 -1499195 -3005092 -4286273 -3421387
10739 -3421387 -1693469 -1134566 -1233217 -666270 -71266 -499069 -1213054 -1441124 -2075890
10730 -2075890 -3308984 -3160573 -951264 493783 -955970 -2991881 -2505256 -458157
10722 -458157 254603 -511607 -1102603 -1603563 -2872951 -3829601 -3111716 -1876615 -1887407
10713 -1887407 -2490146 -2346889 -2203687 -3001921 -3374130 -2101867 -873438 -1410043 -2131880
10704 -2131880 -1070645 205217 -749535 -2773169 -3089565 -2001575 -1866254 -2936345 -3726127
10695 -3726127 -4039539 -4391815 -4002599 -2413768 -1310654 -1809436 -2066131 -580262 610446
10686 610446 -639431 -2541709 -2389948 -1116322 -1068572 -1698919 -1366108 -1006710 -2002794
10677 -2002794 -2800118 -1749566 -856416 -2400548 -4285922 -3361291 -1101923 -1136253 -3017105
10668 -3017105 -3336216 -1555246 -111623 15120 -354049 -1295176 -2913041 -3417976 -1838282
10659 -1838282 -716006 -2365844 -4751618 -4964399 -4144503 -4703657 -5485472 -4381227 -3010767
10650 -3010767 -3793180 -4931396 -3486623 -1029660 -971274 -2561780 -2829031 -2213195 -2908092
10641 -2908092 -3838813 -2763873 -1235865 -2002232 -3597293 -2976709 -1317023 -1647972 -2999941
10632 -2999941 -2600812 -1604480 -2801202 -4862480 -4730710 -3494217 -4043932 -5288251 -4608166
10623 -4608166 -3427439 -4238499 -4997962 -2953315 -929507 -2784023 -5711585 -4673720
10615 -4673720 -1600184 -2074750 -5359125 -6158158 -4272646 -3910786 -5055512 -4176810 -2225001
10606 -2225001 -3262956 -6137561 -6021060 -3369430 -2944972 -4835699 -4937081 -3463807 -4281195
10597 -4281195 -6502824 -5600326 -2387421 -2054053 -4596341 -5052219 -3019004 -3023562 -5477254
10588 -5477254 -6137737 -4665984 -4986049 -7044492 -6848466 -4692021 -4745372 -6639466 -6102135
10579 -6102135 -3561293 -3316617 -4811645 -3840028 -1574327 -2816082 -6129831 -5721206 -2328103
10570 -2328103 -1881866 -4170970 -3765051 -1512276 -3479536 -8587350 -9300362 -5132425 -3474978
10561 -3474978 -6127331 -7042914 -4678671 -4535917 -7802717 -9189940 -7681393 -7982740 -10035160
10552 -10035160 -8703685 -4864009 -4869082 -8217068 -8054447 -4483825 -4474666 -8053661 -8116263
10543 -8116263 -4557399 -4518518 -7960712 -7698831 -4460958 -6399463 -12644016 -13569577 -8797719
10534 -8797719 -8116613 -12807606 -13529905 -8861943 -7863645 -11713250 -11429580 -6633559 -7287229
10525 -7287229 -13683141 -14652852 -9010377 -8106624 -13642704 -14637411 -10018888 -11248778 -18566673
10516 -18566673 -18958344 -12053252 -12215589 -20227400 -20614539 -12362563 -12369963 -22254210 -24026429
10507 -24026429 -15847223 -16910518 -28425657 -28443456 -15804182 -16573823 -33791361 -37934089
10499 -37934089 -23700184 -23699294 -44664492 -49349415 -29825425 -31488085 -65847363 -76617452
10491 -76617452 -48130344 -59177948 -139444929 -156253899 21999910 295223782 416521548
10484 416521548 306649907 138619595 81911280 105483760 97824382 53975675 40531794
10477 40531794 59414936 58076860 32704936 25383447 40081181 41255798 24221476
10470 24221476 18893166 29792680 31235784 19214957 16247033 25501332 26221032 15214915
10462 15214915 11491811 18460682 19193111 10909651 9472118 17414370 19507932 12626527
10454 12626527 10452135 15939139 16722251 10474534 8861718 13722674 13878687 8099511
10446 8099511 7723787 13891985 14810249 8444334 6160532 10731599 11733424 6332017
10438 6332017 4480371 9340880 11552201 7419064 5053241 7959262 9163719 5980293
10430 5980293 4885318 7646210 7588816 3437732 2451928 6319177 7965417 5572461 5793416
10421 5793416 9811126 10161148 5066436 2354022 5117291 6539975 3214210 1043397
10413 1043397 3353938 5016833 3113008 2328476 5023214 6295170 3500012 1105926
10405 1105926 1968892 2860226 2206151 3270276 6374997 6891743 4090337 3182531 5626758
10396 5626758 6238818 2917254 454015 1546356 2566296 1445121 1450058 3870993 4932801
10387 4932801 3206535 2489990 4307615 4951064 2821918 1464436 2592851 3192730 2041993
10378 2041993 2055813 3817395 3870133 1714665 1403694 3941681 5203477 3616306 2750619
10369 2750619 4020122 4038906 1702871 798818 2939129 4662479 4028448 3488710 4025762
10360 4025762 3209829 1173843 1529769 4192582 4472707 1550433 378176 2610389 3424241
10351 3424241 549017 -1312227 1022049 3660463 2984565 1736236 3023912 4434863
10343 4434863 3084516 1109311 1281385 1970012 1039397 317208 1793055 3404420 2738447
10334 2738447 1290488 1328090 1969471 1731364 1624423 2640489 3358110 2739929 2179010
10325 2179010 2540064 2479815 1609567 1725124 3112737 3451146 2097252 1460811 2473968
10316 2473968 2937102 2038083 2012907 3465235 3681368 1676645 267375 903734 1124271
10307 1124271 -442077 -1226377 463350 2256836 2111232 1592723 2034102 1689866 -373625
10298 -373625 -1647052 -421347 1167474 1177330 1144837 2498795 3468827 2538723 1431582
10289 1431582 1743596 2017846 976987 259844 1107078 1674095 543675 -297384 1070976
10280 1070976 3043235 3368091 2730252 2766413 3116411 2944731 2902261 3355002 3161433 2117877
10270 2117877 1910442 2894077 2925842 1181418 -74108 578688 1320431 657456 24350
10261 24350 661172 1224040 786439 936374 2513646 3471483 2405809 1066300 942403
10252 942403 552580 -1300699 -2714303 -1859147 -94804 728344 1264010 2366529 2646566
10243 2646566 1116902 -328648 147038 1279508 1170064 455917 537895 964347 984768
10234 984768 1383017 2416893 2335375 378997 -1108236 -75526 1954215 2487773 1810706
10225 1810706 1634810 1980314 1898671 1603106 1629109 1428463 684735 362234 812151 739023
10215 739023 -381586 -967768 -8742 1165709 1435681 1829401 3114474 3870153 2979644
10206 2979644 1802136 1806016 2131075 1527444 728312 879589 1407331 1312690 943774 889007
10196 889007 747345 318955 290244 670000 457407 -274963 -144994 958596 1513745 1234804
10186 1234804 1517419 2366874 2064470 708965 575236 1885719 2012793 262064 -565487
10177 -565487 829219 1770623 345987 -1349843 -1196140 -427316 -375528 316778 2305743
10168 2305743 3203861 1891710 1425664 3978823 6424909 5083460 1762561 659828
10160 659828 1804192 2130190 1115232 812626 1530573 1617944 798941 245436 22907
10151 22907 -596419 -1146763 -904412 -704094 -1428052 -2084175 -1725945 -1561081 -2648369 -3396261
10141 -3396261 -2095275 -45494 695392 707995 1302974 1310199 -669436 -2605010 -1569376
10132 -1569376 1273804 2122940 212980 -1713548 -2122278 -2160516 -2462792 -2014200 -717076
10123 -717076 -139530 -921092 -1662091 -1059887 520600 1957153 2519962 2097804 1386840
10114 1386840 1535188 2626318 3206153 2303485 907102 319683 277832 12301 -165051
10105 -165051 147195 147506 -834547 -1819354 -1521039 -191833 1138839 2070693 2347502 1435513
10095 1435513 -213391 -1046029 -691173 -575645 -1194155 -1013827 513695 1363023 203042
10086 203042 -1211507 -1030364 -255746 -355804 -404494 649870 1199127 -355263 -2083650
10077 -2083650 -1110869 1692792 2998491 1993236 807528 672860 799826 758766 1088532
10068 1088532 1526267 1063937 -105286 -631396 -5342 1032042 1846922 2347831 2473985
10059 2473985 2364664 2453892 2589101 2045193 1070551 907989 1528721 1316441 -1063
10050 -1063 -470980 647842 1188477 -257763 -1602886 -642988 1206586 1377603 323791
10041 323791 215865 1099501 1417895 1142625 1463415 2247704 2391573 1906780 1440004 682139
10031 682139 -670737 -1525048 -1014021 -259194 -515553 -1008881 -682692 -464130 -1509321
10022 -1509321 -2814846 -2960819 -2607403 -2816534 -2633537 -1014171 566424 339343 -529095
10013 -529095 6060 1102180 632869 -723955 -551991 976592 1376125 74220 -934197
10004 -934197 -588702 45889 159698 130792 -15553 -728218 -1461907 -1187995 -305275 -127873
9994 -127873 -706829 -1009169 -898655 -1082120 -1468478 -1387906 -1071887 -1244691 -1679374 -1698842
9984 -1698842 -1538226 -1716687 -1744852 -966335 10283 159522 -371174 -772393 -875518 -865324
9974 -865324 -665789 -539886 -1086584 -1854003 -1553667 -457500 -559463 -2324091 -3596036
9965 -3596036 -3084809 -2431199 -3102739 -3790404 -3009242 -1914925 -2159247 -3022540 -3091096 -2916008
9955 -2916008 -3582299 -4260920 -3538559 -1915956 -1032981 -1518752 -2939797 -4504938 -4946933
9946 -4946933 -3537649 -1827256 -2051240 -3435323 -3102107 -1048059 -441667 -2179777 -3402330
9937 -3402330 -2668935 -2109842 -2845510 -2987308 -2066980 -2532839 -4711997 -5393006 -3719083
9928 -3719083 -3105625 -4846306 -5639742 -4227973 -4177313 -6793647 -7936766 -5690258 -4298206
9919 -4298206 -6194386 -7312249 -5132143 -3910874 -6495292 -8589311 -7054214 -5995737
9911 -5995737 -8282206 -9383054 -6489762 -4843310 -7624345 -9322068 -7139782 -7799272
9903 -7799272 -13839636 -16242780 -11919383 -13097110 -24592385 -30085290 -22609064 -29089913
9895 -29089913 -71222222 -114557646 -99224014 -23229182 46345005 57480244 31157611
9888 31157611 16328271 22140908 24784209 16511768 11783426 15356304 16189453 10975219
9880 10975219 8829280 12164854 13057755 9657974 8955501 11910235 11192726 5475997 2292436
9871 2292436 4610821 6730809 5572341 4937424 6399630 6164463 3372248 2410170 4667373
9862 4667373 6149277 5220167 5066740 6747364 7111262 5335821 4617223 5688718 5233196
9853 5233196 2445083 951380 2404191 3861301 3252641 2227203 2094359 1878822 1673048
9844 1673048 3147564 5561113 5815897 3528662 1767874 2009028 2597737 2706788 3396531
9835 3396531 4231639 3341678 1488236 1652448 3878273 4879440 3533545 2455437 3202210
9826 3202210 4076002 3728604 3065994 2591403 1548717 560005 1482134 3835847 4908037
9817 4908037 4065535 3397409 3537853 2713203 746555 91839 1667816 3236871 3210648
9808 3210648 2743084 2799111 2403413 1198277 728332 1709735 2667115 2571003 2337732 2582977
9798 2582977 2373056 1379354 931677 1704203 2388748 1782494 474666 -376973 -431525 138803
9788 138803 890620 957447 113665 -357293 488140 1307599 492488 -806459 -330758 1421870
9778 1421870 2038052 1316387 1211184 1914125 1548314 -26436 -600461 627108 1913920
9769 1913920 2255278 2675077 3483733 3308656 1825062 657295 602122 561793 75563 295757
9759 295757 1574392 2604907 2799880 3073912 3563826 3133074 1858798 1360295 1864608
9750 1864608 1654913 305509 -354964 420675 850003 -129072 -869187 96534 1568615
9741 1568615 1794093 1008806 291719 -207814 -422847 389726 2082065 2997740 2292136
9732 2292136 1243113 1044461 1056248 523962 217169 874750 1641270 1540041 1043095 808247
9722 808247 376156 -423284 -303424 1527401 3494824 3528914 1918105 644682 566632
9713 566632 851791 784638 641441 806980 1123205 1274315 1217783 1147311 1246599 1390301
9703 1390301 1151963 430971 -168141 -141478 69946 -173653 -518383 -211704 439335 419539
9693 419539 -378247 -1113907 -1392814 -1438789 -1117946 -198339 609438 383521 -360508 -316018
9683 -316018 421013 488948 -391267 -943702 -401411 581236 1263709 1509847 1077433 -117584
9673 -117584 -981497 -292456 1131024 1242274 -68245 -711547 304177 1496111 1518691
9664 1518691 1056745 1155125 1536020 1662701 1847062 2226701 2106678 1345650 1040515 1849182
9654 1849182 2891253 3215971 3115281 3100365 2838718 2091240 1584998 1945423 2647501 2856194
9644 2856194 2492971 1820447 854967 -163834 -547063 -8166 910286 1593042 1849999
9635 1849999 1585719 872754 381654 733851 1470588 1753978 1869382 2633923 3508933 3017666
9625 3017666 1128800 -500235 -874317 -576613 -163913 506912 1029787 459576 -873994
9616 -873994 -1367287 -558764 175453 -104992 -687203 -805631 -643363 -169230 1114155 2619344
9606 2619344 2843433 1791159 1195099 1620028 1640429 803226 835523 2490220 3715035
9597 3715035 2840998 1326334 1156162 1538189 673262 -826847 -995670 121516 783535
9588 783535 538709 463986 871655 1039787 970414 1330514 1809453 1530855 1005844 1640818
9578 1640818 3156163 3511851 1918537 141325 11138 1103828 1881221 1990060 2198278
9569 2198278 2670531 2599982 1593875 451052 99837 319598 178497 -484517 -858221
9560 -858221 -581287 -402566 -838161 -1103331 -375635 660665 836258 452777 629553 1077217
9550 1077217 395476 -1384735 -2483610 -1961502 -799038 106676 1121957 2279537 2412007
9541 2412007 1067583 -282253 -220735 739103 1409810 1725354 2056682 2056242 1556526 1404755
9531 1404755 1951663 1874318 118839 -2008998 -2454229 -1310159 -300969 -13344 414860
9522 414860 1188145 1450743 1089544 1117236 1834352 2157753 1421514 589596 845025 1831257
9512 1831257 2171756 1296800 6078 -649995 -466796 49633 518675 1002819 1532532
9503 1532532 1774563 1469471 839154 128536 -873839 -2221189 -3090303 -2591524 -1126790
9494 -1126790 35996 454447 725715 1095926 1148612 1006960 1423786 2260492 2262564 974350
9484 974350 -393066 -710098 -327019 43746 608956 1688167 2686226 2899360 2502701
9475 2502701 1902147 1056644 251900 376527 1373818 1623360 208356 -1301815 -951972
9466 -951972 606495 1104352 109718 -566299 72725 764277 218726 -837079 -886661 150235
9456 150235 1053899 1137083 857167 692900 403972 -199774 -476196 242369 1302663 1204112
9446 1204112 -306618 -1595553 -1271674 -86547 295467 -305886 -740433 -608681 -652795
9437 -652795 -1169208 -1527272 -1387705 -1048022 -497880 473657 1211561 839239 63458 518826
9427 518826 2053383 2692037 1798271 1033447 1311288 1216199 -101059 -782070 884607
9418 884607 3272998 3502138 1536891 -152774 -270978 226699 321133 80149 -323356
9409 -323356 -976644 -1516083 -1414957 -944322 -695245 -416355 466963 1528251 1841979 1512236
9399 1512236 1383167 1489432 1149077 411737 45082 153050 120234 -82341 176776 883717
9389 883717 1231538 967656 785982 1120436 1503379 1409016 952074 496013 177626 -23642
9379 -23642 -204409 -514931 -855314 -840708 -459010 -304874 -648867 -878829 -538891 -215399
9369 -215399 -491193 -733404 -72692 985005 1230569 651175 296129 452373 351524 -271761
9359 -271761 -638628 -190071 656237 1257054 1403324 1124544 661452 668105 1576383 2697352
9349 2697352 2797785 1668421 372897 -87663 368930 1311438 2217418 2461797 1679118
9340 1679118 260090 -1069843 -2064145 -2783560 -2938036 -2199190 -914851 298192 1355903
9331 1355903 2244860 2281913 1072721 -182595 108387 1467252 1717347 113644 -1511058
9322 -1511058 -1381487 -121964 501227 63842 -438513 -315171 128962 365342 276907 84249
9312 84249 118089 562815 1167915 1445001 1310270 1155521 1124731 838041 123549 -500855
9302 -500855 -494438 -25021 402510 688393 1025910 1316493 1228638 752182 251806 -25161
9292 -25161 -126581 -52151 391737 1204679 1918751 2023032 1607391 1287547 1418011 1671738
9282 1671738 1605156 1371894 1512253 2166102 2877808 3122629 2684626 1652390 494217
9273 494217 -24545 368353 817729 264753 -937850 -1226752 69771 1717186 2159865
9264 2159865 1351802 408562 106463 401421 875074 937446 22464 -1706467 -3147799
9255 -3147799 -3346690 -2498616 -1406024 -386175 669207 1540674 1713899 1048930 -41297
9246 -41297 -930703 -1068050 -333957 608129 829469 295380 -136790 -176049 -620777 -1816987
9236 -1816987 -2600085 -1788818 2740 1171326 1220651 934027 879554 944587 1132290 1616980
9226 1616980 2003138 1606531 621991 100343 533427 1188163 1104270 244775 -525900 -295211
9216 -295211 1038186 2476733 2693487 1429112 -123298 -626393 80306 1249517 2214236
9207 2214236 2618418 2294887 1568639 1141394 1058195 446610 -1001888 -2095114 -1704369
9198 -1704369 -563197 -254878 -899354 -1232490 -745658 -291257 -451052 -624574 -152749
9189 -152749 638322 1005089 755851 271541 -45608 -136383 -303045 -808235 -1348339 -1336647
9179 -1336647 -915592 -965900 -1642020 -1794352 -657296 777493 1166806 797173 842722 1325029
9169 1325029 1385881 1153953 1579706 2497130 2634516 1818966 1481758 2374375 3241885 2641365
9159 2641365 1031653 135093 828634 2349836 3211922 2532018 831976 -314965 113884
9150 113884 1315344 1560695 349212 -1051210 -1264026 -237107 1135431 2073909 2296042
9141 2296042 1895686 1165738 331545 -505719 -994010 -577822 553900 1144149 366260
9132 366260 -797458 -717449 651715 1835536 1929627 1390189 799862 182460 -242218 126464
9122 126464 1264634 2301974 2661474 2561681 2165892 1210930 -193553 -1338174 -1871340
9113 -1871340 -2137969 -2238602 -1671488 -363190 805334 1075037 746722 525116 501154
9104 501154 294295 -230333 -819867 -1113217 -835361 -33931 758635 944399 489578 -171124
9094 -171124 -712664 -972883 -683117 227911 1227859 1702673 1704499 1596882 1317470 751606
9084 751606 430854 915054 1816844 2421451 2848017 3435844 3488127 2166674 323386 -356251
9074 -356251 4605 -338199 -1659694 -2050282 -616960 713442 20314 -1683334 -2143475
9065 -2143475 -1283823 -923638 -1687580 -2240612 -1681098 -942098 -1184881 -2033973 -2323968 -1919492
9055 -1919492 -1766143 -2245727 -2460393 -1622072 -451169 -262986 -938648 -1018842 -5879
9046 -5879 814207 563653 376062 1501574 2988586 3059257 2052643 1899345 2891384 3166567
9036 3166567 1741010 52308 -257360 534585 1180496 1208951 871072 424463 215132
9027 215132 551471 970206 610025 -294012 -492048 217942 372835 -927084 -2435681
9018 -2435681 -2423093 -950279 521327 1044880 816388 486738 591045 1195992 1665451
9009 1665451 1329329 580032 471590 1079793 1360390 865574 293168 -23495 -649691 -1478644
8999 -1478644 -1270455 302098 1698308 1730249 1251043 1322865 1201932 -161862 -1852619
8990 -1852619 -2171205 -1292372 -803331 -1084903 -1050924 -285617 386365 560602 857484 1542091
8980 1542091 1903280 1486819 899203 875580 1291653 1519261 1231883 562628 -143841 -548179
8970 -548179 -561808 -456493 -564066 -914862 -1256385 -1258332 -709424 148633 555119 35897
8960 35897 -811712 -1068634 -907805 -1218753 -1826665 -1460328 154934 1631770 2000392 2029393
8950 2029393 2605849 3192592 2989979 2359420 1891045 1264942 317828 1298 805307 1435952
8940 1435952 765924 -7007 896066 2834738 3649729 2964003 2330726 2373472 2080969 1050714
8930 1050714 256194 146880 -125647 -1017643 -1731929 -1595640 -923669 -112218 790040 1336099
8920 1336099 946641 201231 356093 1282775 1525369 774595 443469 1166420 1688298 1211865
8910 1211865 880465 1518170 1704911 -8299 -2311362 -2696194 -1045288 392259 258182
8901 258182 -587780 -943538 -696698 -111127 818681 1812147 2218925 1936592 1550806 1312504
8891 1312504 872308 244360 32962 338942 399511 -221648 -982990 -1394157 -1735397 -2091665
8881 -2091665 -1683025 -174195 1160992 874728 -502080 -1073274 -154526 1116970 1766576
8872 1766576 2113433 2533648 2520967 1788281 1157113 1324218 1598796 971273 -196265 -696421
8862 -696421 -263391 301914 521026 634014 722681 481712 -127175 -847413 -1637405 -2361966
8852 -2361966 -2279485 -953226 553289 709796 -294125 -778155 -44230 891643 1243237
8843 1243237 1438780 1661091 1157931 -134244 -931263 -661776 -624225 -1764991 -2802991
8834 -2802991 -2219643 -811914 -304590 -429032 375171 1907992 2258721 963215 -83074
8825 -83074 635068 2405654 3772767 4230431 3732920 2106368 -1306 -851099 454159
8816 454159 2559138 3471083 2948237 2225450 1937535 1587425 889619 355096 258332 45316
8806 45316 -654049 -1125765 -452238 1020615 1902686 1493209 568662 124853 7350 -521042
8796 -521042 -1274580 -1195747 20622 1278791 1478355 858315 376165 271410 -33332 -828762
8786 -828762 -1610065 -1748263 -1243578 -651402 -432277 -508457 -531212 -554583 -1085824 -2152838
8776 -2152838 -2768490 -2069071 -735355 -279797 -925459 -1350247 -785417 -76051 -55939 -161753
8766 -161753 343326 866528 491286 -285847 -219087 718033 1349644 1053590 283641 -516607
8756 -516607 -1308924 -1773135 -1408566 -511963 -25117 -147118 -29143 811005 1619678 1449979
8746 1449979 485985 -187839 138117 1072761 1559541 975304 -116818 -497603 243001
8737 243001 1143085 1127635 349862 -311347 -600752 -866269 -1017643 -587015 156492 210168
8727 210168 -722776 -1648701 -1614775 -1001313 -927951 -1722857 -2519010 -2322273 -1150092 675
8717 675 235226 -335813 -901036 -1010995 -954298 -1054664 -1105671 -760913 -90057 509692 621011
8706 621011 -67804 -1404882 -2424732 -2099364 -723279 244835 61932 -517541 -779315
8697 -779315 -1162250 -1990176 -2312584 -1315260 30012 225590 -453828 -464379 578505 1515121
8687 1515121 1551865 1123587 817038 691367 747445 1006496 1159667 1097282 1454740 2470910
8677 2470910 2826492 1253806 -1010345 -1353797 509707 1995983 1313247 -293145 -811375
8668 -811375 -161377 570431 1066719 1506989 1454611 474764 -809106 -1471078 -1528277 -1442731
8658 -1442731 -1059544 -127563 739001 814126 538544 845267 1492594 1301966 23925 -1164498
8648 -1164498 -1196845 -226282 1000813 2004942 2474139 2096414 1056188 223884 290908
8639 290908 939058 1282001 927396 175038 -646723 -1425364 -1806044 -1232124 85158 819730
8629 819730 -33234 -1614877 -2025035 -738397 752318 984422 241026 -300553 -182857
8620 -182857 347441 1121939 1819691 1634558 325012 -887649 -690546 395948 772558
8611 772558 231778 182318 1249663 2135456 1477613 -260876 -1492657 -1361341 -299930
8602 -299930 685732 783227 -121336 -1281338 -1720493 -1197595 -238081 706964 1558234 2118967
8592 2118967 2042869 1454385 967056 910086 1057550 1156358 1133955 809510 87959 -565685
8582 -565685 -581230 -206031 -178586 -484616 -357814 350389 749604 171397 -925397 -1623483
8572 -1623483 -1503542 -772383 -46482 -33978 -769609 -1280186 -807031 -96073 -351639 -1127625
8562 -1127625 -772053 886456 1965403 1256671 16467 59590 1240798 1963992 1434402
8553 1434402 345501 -275157 -137845 173493 -207636 -1398450 -2357536 -2145798 -1388809
8544 -1388809 -1389521 -1908964 -1354479 605590 2357108 2873332 3117227 3884201 4010416 2280806
8534 2280806 -222564 -1412160 -918244 91321 991002 1873942 2255539 1459842 153379
8525 153379 -142475 826419 1721736 1488305 402717 -760561 -1445234 -1127180 410221
8516 410221 2344390 3316236 2948478 2117740 1640133 1551967 1776382 2448355 3191061 3040523
8506 3040523 1765354 570225 662793 1484732 1274371 -536528 -2301648 -2088528 -182671
8497 -182671 1199212 749569 -344689 -240651 1000056 1769861 1309620 379189 -325351
8488 -325351 -938110 -1380464 -1039431 -57906 375891 -259039 -1021883 -1162288 -1271523 -1836380
8478 -1836380 -1957492 -797927 753155 1273200 835342 476333 408452 197889 35684
8469 35684 311412 502792 51151 -219332 698916 1815426 1150391 -1143225 -2685285
8460 -2685285 -2181723 -920032 -412994 -381976 25779 593798 762812 826519 1240283 1595620
8450 1595620 1341299 823673 615188 431186 -242607 -920865 -646453 423246 1007649
8441 1007649 399549 -673655 -1187957 -1184948 -1497976 -2406044 -3115572 -2732764 -1440194 -341050
8431 -341050 -152104 -445645 -388617 133679 542094 496290 295259 342887 638699 925560
8421 925560 1071279 1166698 1360490 1643594 1784609 1581118 1169791 842809 538759 -80615
8411 -80615 -911973 -1263094 -729633 214318 837288 935251 682986 247287 -30812 314127
8401 314127 1050555 1074444 -214378 -1873779 -2535894 -2058043 -1211080 -301689 757854
8392 757854 1426225 949954 -247424 -878924 -623196 -444535 -900092 -1376998 -1390738 -1398331
8382 -1398331 -1697335 -1639895 -781090 96011 50254 -605964 -940482 -913438 -1180871 -1680963
8372 -1680963 -1568909 -659780 50887 -313490 -1381254 -2135658 -2119898 -1545100 -622749 534608
8362 534608 1502774 1757223 1415577 1143195 1093151 617137 -539425 -1480879 -1355978 -698704
8352 -698704 -555266 -746916 -323678 492035 447763 -476990 -719406 326694 1179860 719784
8342 719784 72095 581769 1443977 1259170 697460 1302503 2442570 2053722 221473
8333 221473 -609301 638182 2190284 2417826 2029748 2155309 2308376 1778631 1357590
8324 1357590 1907212 2452974 1553324 -264603 -1238241 -998441 -709956 -862079 -680739
8315 -680739 140784 721795 462942 -32267 -95217 -28751 -310842 -579328 -272314 208402
8305 208402 -81882 -1123534 -1710670 -1074377 -115853 -335041 -1706113 -2459251 -1336862
8296 -1336862 633014 1386654 447201 -721437 -926109 -613960 -602626 -582280 159993 1227361
8286 1227361 1454932 522946 -725522 -1473681 -1563436 -1022338 34739 874577 543489
8277 543489 -739476 -1454764 -688536 564433 806778 127850 -181281 246418 422916
8268 422916 -166332 -620517 -163167 443753 72822 -823888 -681127 882894 2337907
8259 2337907 2068734 180572 -1812850 -2577009 -2023915 -1211594 -1272060 -2094244 -2246802
8250 -2246802 -759428 1336778 2160143 1452674 676518 631052 514899 -174281 -472074
8241 -472074 266025 849573 19562 -1292231 -1168459 415280 1630874 1496298 892885
8232 892885 768127 779948 162237 -1093542 -2330234 -2819210 -2161064 -764848 155287
8223 155287 -172071 -982799 -954579 -6707 882578 1363410 1955458 2718160 3055770 2933876
8213 2933876 2921346 2850635 1891586 291883 -489516 14281 412601 -375731 -1439107 -1409156
8203 -1409156 -546220 -65544 -181266 -58320 722154 1664651 2085493 1660656 563022
8194 563022 -468481 -669250 -266586 -330418 -1214924 -1975377 -1855239 -1393413 -1322068 -1338596
8184 -1338596 -911968 -410741 -340617 -266721 297006 662826 28747 -803680 -347085 1172405
8174 1172405 1902828 920850 -719504 -1706949 -1909150 -1711846 -1163718 -389610 108625
8165 108625 202509 431224 982281 1107376 213576 -1058702 -1589825 -1240978 -853770 -990641
8155 -990641 -1345124 -1409516 -1166042 -920789 -812845 -773768 -817222 -1043395 -1286032 -1037865
8145 -1037865 -19801 1287310 2049988 2045397 1828638 1848475 1869947 1520059 924860 406457
8135 406457 -30307 -414580 -400001 221380 849616 662501 -170963 -576731 -5413 853092
8125 853092 1044441 517803 -67298 -351254 -592583 -1004188 -1179192 -484618 989682 2182490
8115 2182490 2070644 831929 -390093 -875338 -952750 -1095465 -1083461 -575578 51611 189238
8105 189238 1743 140570 595284 675941 190064 -200127 -38076 282584 347458 497581
8095 497581 1129404 1709268 1335611 169972 -542907 -136853 497456 158924 -901590
8086 -901590 -1310686 -614197 -32487 -731504 -2171853 -3038269 -3226918 -3681406 -4414688 -4145809
8076 -4145809 -2340610 -301711 628493 878585 1520672 2173769 1540862 -264269 -1488954
8067 -1488954 -1100615 -110587 -423 -776294 -1282041 -838652 127210 808752 845999 514818
8057 514818 360078 571906 690595 158008 -853246 -1536288 -1441320 -959587 -655269 -474125
8047 -474125 148105 1570269 3424516 4671002 4326446 2504069 594139 -79074 315914
8038 315914 587450 253902 -36119 148484 295623 -14872 -326713 -258680 -424857 -1470861
8028 -1470861 -2740024 -2942112 -1911540 -726235 -141664 155778 611181 993968 911279
8019 911279 529027 319912 370983 261996 -450885 -1691708 -2712077 -2646033 -1487244 -303841
8009 -303841 -85752 -612236 -982267 -971274 -1046380 -1175268 -694620 400485 1110482 934091
7999 934091 777124 1561116 2682413 2850048 1952582 1004769 492711 -82287 -937815 -1332217
7989 -1332217 -551215 1075715 2484086 2797347 1880762 508331 -4089 971369 2361709
7980 2361709 2343458 585072 -1182882 -1241287 147509 1343745 1277567 164635 -1201444
7971 -1201444 -2107586 -2144343 -1460811 -692778 -185254 439574 1435834 2063088 1371597 -297947
7961 -297947 -1459964 -1229930 -200530 595843 887417 982166 998404 836142 625804 665375
7951 665375 921345 954313 457924 -314607 -821903 -873906 -789158 -830875 -774964 -385523 -73648
7940 -73648 -414033 -985115 -552523 1150390 2591438 2137781 83829 -1815018 -2432411
7931 -2432411 -1994784 -1039818 191664 1245833 1436205 771471 155906 245255 689302
7922 689302 856584 716708 584986 515863 441662 522350 854015 1089856 838239 325212
7912 325212 243571 908581 1833223 2252126 1942332 1345871 831967 122557 -1132838 -2377482
7902 -2377482 -2535975 -1596897 -866677 -1034973 -986614 360792 1901226 1643794 -219944
7893 -219944 -1403522 -807135 139696 -23183 -713655 -731539 -252085 -87781 -91937 280918
7883 280918 636913 293588 -309737 -259445 176028 -47038 -899490 -1277218 -887444 -740317
7873 -740317 -1410929 -2023051 -1565559 -330112 636951 910536 848000 728137 380125 -310467
7863 -310467 -913336 -744656 254748 1094428 648186 -845889 -1782154 -1176570 -98249
7854 -98249 -276771 -1637493 -2353080 -1426138 -59721 96871 -840087 -1412938 -969631 -362915
7844 -362915 -467353 -892203 -701695 48932 260723 -643368 -1747377 -1717973 -501818 672816
7834 672816 856180 234013 -604865 -1418029 -1998314 -1936056 -1310766 -970233 -1376484 -1723442
7824 -1723442 -1094534 -59861 -16633 -1099888 -1939973 -1666736 -1011811 -932316 -1117861 -649556
7814 -649556 473804 1321518 1289737 683775 145432 75072 607255 1628943 2673955 3166944
7804 3166944 2981418 2569107 2401543 2441802 2309154 1831348 1223405 737490 345196 -125892
7794 -125892 -666694 -1055603 -1121602 -913214 -606374 -328737 -59978 333491 862823 1167897
7784 1167897 761205 -257210 -1027391 -914871 -453292 -673302 -1542841 -1863694 -963326
7775 -963326 292901 716481 401849 368978 962791 1468270 1313705 902160 954379 1468410
7765 1468410 1675637 886818 -784057 -2447511 -3115951 -2467778 -1069072 121747 495475
7756 495475 158354 -301465 -413836 -239900 -85756 182719 1090183 2474362 2999642 1612223
7746 1612223 -695310 -1627844 -333287 1558270 2086560 1223115 281295 -99974 -332734
7737 -332734 -669546 -736979 -320097 204390 402852 223745 -207635 -794349 -1349964 -1586814
7727 -1586814 -1312818 -500934 718578 1929961 2498097 2112735 1221989 687183 1019102
7718 1019102 2001961 2878031 2856236 1772745 406390 -165283 334239 1202120 1661588
7709 1661588 1470261 648742 -663278 -1874018 -2222222 -1761919 -1397198 -1594767 -1793818
7700 -1793818 -1458410 -860021 -327297 354878 1160972 1388763 788144 195920 168119 -44167
7690 -44167 -1102530 -2154259 -2085961 -1329187 -978753 -913506 -427979 -30835 -697779 -1748378
7680 -1748378 -1540533 -206801 411570 -205162 -424181 709919 1816377 1391270 46251
7671 46251 -692471 -584535 -452290 -689867 -1129105 -1695456 -2215293 -2134210 -1248956 -212121
7661 -212121 340495 579911 818650 773815 210322 -344598 -332280 -87545 -269426 -801660
7651 -801660 -1090224 -926193 -540310 -117343 170277 18947 -565758 -1055943 -1122759 -1123856
7641 -1123856 -1340487 -1256113 -320917 951004 1461115 952145 246704 90160 356108 476432
7631 476432 185190 -344305 -832706 -1151947 -1272479 -1109872 -670325 -377533 -790645 -1666442
7621 -1666442 -1853613 -777626 499013 657398 93200 188742 897817 785666 -343192
7612 -343192 -807938 172793 943276 -4688 -1497740 -1532170 -518227 -549694 -1948855 -2719558
7602 -2719558 -1595646 263991 1217863 1265965 1355056 1627118 1406080 456793 -598161
7593 -598161 -1052505 -836282 -440821 -333507 -487271 -504187 -207176 114897 225574 413097
7583 413097 1077633 2033418 2638806 2535280 1885233 961880 -75127 -977984 -1398198 -1285422
7573 -1285422 -1107002 -1418946 -2145925 -2445588 -1617927 -230583 172476 -1039891 -2441211
7564 -2441211 -2111694 -131507 1475041 1300062 -1689 -1014888 -1160683 -555069 571833
7555 571833 1581977 1503636 215384 -1182424 -1825694 -2058317 -2311827 -2125675 -1230215
7546 -1230215 -491411 -542511 -474704 655127 1877889 1569464 61440 -811721 -468615
7537 -468615 -71096 -334673 -651209 -580648 -536013 -627975 -355270 138638 -60584 -1039744
7527 -1039744 -1674001 -1297160 -461677 342357 1282335 2040195 1674565 332623 -479870
7518 -479870 -206953 -213569 -1371287 -2333506 -1697229 -414195 -251893 -1012268 -1254610 -917800
7508 -917800 -1094196 -1708432 -1620822 -914076 -936387 -1872807 -2304454 -1641745 -1077746 -1421040
7498 -1421040 -1785348 -1396842 -1057862 -1577284 -2147051 -1743471 -1058215 -1430709 -2601219
7489 -2601219 -3182040 -2944371 -2958705 -3520412 -3558606 -2462928 -1140916 -634088 -687036 -406463
7479 -406463 338533 858261 587426 -406110 -1560849 -2146119 -1779812 -896200 -364103 -455206
7469 -455206 -649054 -670343 -1069991 -2259642 -3503627 -3625492 -2529549 -1354710 -1112442
7460 -1112442 -1667007 -2097624 -1662681 -359912 1111675 1858617 1527400 632350 24237
7451 24237 56330 401449 581025 462094 275628 304618 542347 660651 483037 419977
7441 419977 1010002 1967249 2286956 1588893 700691 393414 219618 -562655 -1453223 -1236628
7431 -1236628 107626 1185974 1071397 392034 177578 504195 807273 822434 582581
7422 582581 -14181 -967809 -1780301 -1877050 -1329661 -740658 -449449 -179398 479429 1426302
7412 1426302 2019583 1757020 940420 399002 431810 416158 -190813 -889778 -782997 104676
7402 104676 867014 940528 566640 123671 -231327 -271975 157179 651397 610859 79633
7392 79633 -494601 -1123838 -1922826 -2155114 -1030246 546155 662986 -786681 -1695785
7383 -1695785 -812718 567993 1027240 1282698 2390329 3274078 2262692 160838 -573872
7374 -573872 590676 1725351 1553843 970706 942874 843998 -109069 -1209676 -1299802 -603394
7364 -603394 -360879 -1036051 -1837999 -1943407 -1497472 -1227392 -1405272 -1503877 -976425 -145463
7354 -145463 160385 -146613 -274421 36100 -97628 -1140541 -1904578 -1119013 397048
7345 397048 662548 -624360 -1808509 -1901414 -1746305 -2069789 -2074042 -1011832 145628 -44156
7335 -44156 -1354953 -2280892 -2113519 -1437603 -797090 -72055 711225 1010799 637680 249972
7325 249972 419670 686688 207048 -866013 -1419332 -973431 -495111 -1006425 -1911220 -1713349
7315 -1713349 -304955 638719 -69273 -1569077 -2372255 -2296176 -1946856 -1229286 121760
7306 121760 1100786 340324 -1516295 -2102098 -466732 1581131 1993194 1011295 220444
7297 220444 196481 336617 335140 509852 857778 869883 394140 -33344 128129 823179
7287 823179 1513998 1623889 981210 84302 -251679 214498 802806 723142 41564 -417649
7277 -417649 35941 1325845 2599130 2712685 1179733 -1022408 -2006211 -873361 1132666
7268 1132666 1880870 690373 -1051885 -1638851 -935776 -242035 -515959 -1215158 -1125353
7259 -1125353 -44612 934072 945616 528362 742455 1570498 2011079 1603957 960512 675198
7249 675198 600062 511920 638175 968549 782245 -361394 -1630522 -1765247 -718900 323955
7239 323955 537500 319407 426018 954595 1581422 2247496 2957005 3179564 2290632 740200
7229 740200 -48123 514179 1146880 347526 -1389524 -2189638 -1494685 -694829 -761409 -841491
7219 -841491 -75336 693404 409357 -201642 145360 952740 768875 -188243 -362279 372182
7209 372182 498240 -401583 -944101 -522170 -348362 -1028701 -1258518 -214305 748667 397165
7199 397165 -146897 618097 1818188 1565162 8742 -1201531 -1762172 -2693079 -3832233
7190 -3832233 -3742503 -2286943 -1146926 -1262587 -1594703 -1107477 -371028 -340199 -852340 -1262257
7180 -1262257 -1554244 -1929788 -2070841 -1637499 -930932 -402626 -5376 412821 565915 155413
7170 155413 -527045 -926888 -908905 -742843 -620161 -480750 -214771 81540 19446 -697098
7160 -697098 -1582349 -1507329 -84464 1519624 1959684 1506095 1404806 1759833 1476927 355954
7150 355954 -361373 -21789 379239 -34927 -593694 -482853 -326458 -1038502 -2094676 -2422639
7140 -2422639 -2226832 -2331081 -2332687 -1248042 300600 554396 -551335 -1004255 218010
7131 218010 1530713 1223618 -11501 -418481 146637 473648 170480 -88782 -125908 -438868
7121 -438868 -836525 -421612 771972 1467418 955345 68051 -219132 -86331 -66288 49239
7111 49239 570179 976923 694716 233662 450500 1065749 1076795 439845 124915 461366
7101 461366 614855 -17406 -948733 -1532130 -1783460 -1798506 -1289689 -362183 83231 -452370
7091 -452370 -1118307 -864503 -31793 199631 -383464 -864108 -763873 -661458 -995184 -1239233
7081 -1239233 -827250 -198508 -230175 -986546 -1673782 -1699892 -1223699 -644616 -67602 492812
7071 492812 729901 273852 -735121 -1630761 -1896696 -1631129 -1182092 -596325 195400 799022
7061 799022 539081 -591956 -1630215 -1662775 -885775 -254751 -267527 -552354 -627537 -575950
7051 -575950 -746229 -1095739 -1176603 -744273 -127798 141080 -19099 -137095 200945 801148
7041 801148 1117442 994894 888908 1236307 1799111 1844801 977601 -333975 -1148853 -986425
7031 -986425 -291872 114144 -64905 -474865 -748599 -787345 -382457 713007 1939005 1928357
7021 1928357 190774 -1733179 -1891677 -458460 559745 170753 -408436 150996 1301783
7012 1301783 1629459 899969 21189 -434728 -567932 -367967 264078 737966 69873 -1712065
7002 -1712065 -3168802 -2925249 -1228812 306401 398624 -677767 -1588166 -1500497 -866134
6993 -866134 -516580 -434652 -40896 547582 495271 -363349 -1090388 -1057501 -896154 -1353666
6983 -1353666 -1976892 -1830914 -1005527 -468598 -699079 -1281896 -1675168 -1677890 -1299468 -762195
6973 -762195 -442324 -339372 28883 726048 980770 350334 -371278 -341036 -124806 -777417
6963 -777417 -1939073 -2230818 -1345600 -359257 -7156 -52373 -418921 -1415032 -2493013 -2315850
6953 -2315850 -716967 709324 725889 -4409 -287941 -152057 -210919 -273637 194089 863769
6943 863769 968340 516730 63227 -350284 -978229 -1383134 -774145 681147 1836023
6934 1836023 1970738 1460534 954749 622382 382371 236128 117110 -120504 -381003 -411213
6924 -411213 -325574 -590114 -1306242 -1953602 -2096835 -1948964 -1894685 -1793919 -1258984 -501429
6914 -501429 -314494 -968095 -1541783 -888750 792026 1913377 1311685 -311028 -1216368
6905 -1216368 -647002 552706 1226383 1132339 725656 350275 48947 -211726 -526081 -1027971
6895 -1027971 -1590342 -1760177 -1243070 -261747 723943 1381488 1482771 983536 397060 557696
6885 557696 1519700 2145622 1450515 32040 -632648 -167378 340258 81608 -325115 47639
6875 47639 922447 1242245 732489 138495 -53026 -235003 -735771 -1043817 -589850 218412
6865 218412 513263 238893 41984 -32423 -712706 -2068214 -2905430 -2299094 -997620 -433567
6855 -433567 -834406 -1257792 -1156426 -862872 -665858 -493225 -568358 -1312612 -2383544 -2839257
6845 -2839257 -2562525 -2465744 -2856349 -2744825 -1484118 -17117 466394 186707 -28060
6836 -28060 -342970 -1285629 -2105510 -1478657 223668 1046532 150149 -1129258 -1480936 -1386856
6826 -1386856 -1713493 -1838925 -656567 1268879 2144572 1415154 371313 97057 108704
6817 108704 -387931 -976367 -748918 58008 276204 -414979 -923756 -299739 898550 1420780
6807 1420780 1092973 949546 1570665 2113868 1553773 380891 168243 1409565 2685982
6798 2685982 2502232 1263932 541886 727476 604410 -554564 -1656482 -1316478 131260
6789 131260 1203321 1361901 1350829 1595236 1553399 930100 360710 308039 251423 -275225
6779 -275225 -665564 -199500 599557 642948 -53045 -505373 -430188 -570431 -1183349 -1382125
6769 -1382125 -587086 250665 -251960 -2001638 -3454302 -3493937 -2606488 -1987552 -2001811 -2012691
6759 -2012691 -1568276 -1111855 -1184643 -1416613 -1035923 -222549 -15395 -635855 -896168 74155
6749 74155 1377902 1599339 872826 503719 856328 950264 198910 -721624 -1060605 -939051
6739 -939051 -637109 71819 1225624 2090178 2012323 1372390 1074311 1446745 2123134 2645741
6729 2645741 2740539 2319055 1628726 1155011 1059502 948403 396814 -582718 -1697676 -2597823
6719 -2597823 -2846939 -2183894 -982668 35428 668939 1272017 1874592 2011865 1610669
6710 1610669 1232750 1134409 893934 313279 -185881 -475840 -1059881 -1935019 -2148111 -1275048
6700 -1275048 -373104 -481362 -1025638 -845137 -104478 79948 -533678 -1107119 -1106047 -791789
6690 -791789 -505333 -441964 -939833 -2041865 -2975591 -2979130 -2375527 -1911843 -1452055 -471366
6680 -471366 526111 461279 -580520 -1435345 -1663129 -1863110 -2137232 -1793317 -908436 -643457
6670 -643457 -1399172 -2066065 -1867827 -1632574 -2254934 -3035294 -2749208 -1592783 -860556 -1127813
6660 -1127813 -1792463 -2167347 -2134989 -1798052 -1148364 -137877 1173897 2379367 2616617
6651 2616617 1306913 -772227 -1868582 -1157805 330366 1086265 768235 65244 -339897
6642 -339897 -140321 544519 959594 316468 -905900 -1234758 -375077 155099 -469557 -688660
6632 -688660 998964 3105485 2903360 533406 -1073479 -448830 641072 316168 -747695
6623 -747695 -993435 -580453 -746482 -1683929 -2544234 -2877569 -2808385 -2308019 -1425938 -814420
6613 -814420 -984627 -1401891 -1249124 -679828 -371300 -295574 -19576 166961 -344870 -1176860
6603 -1176860 -1348190 -895966 -778086 -1084520 -790853 350282 1127163 750653 90292
6594 90292 119293 332676 -97074 -602432 -147748 779029 761206 -177768 -483533 430028
6584 430028 1168539 491263 -838555 -1265320 -550784 374815 985463 1401955 1414229 521945
6574 521945 -934548 -1735020 -1262683 -270602 257888 339482 509594 677902 294877 -548012
6564 -548012 -1054341 -908653 -797346 -1353508 -2122909 -2152952 -1337073 -563992 -555632 -1077236
6554 -1077236 -1414229 -1208345 -622375 -2848 364142 352676 69445 -268796 -611966 -1068097
6544 -1068097 -1571921 -1826412 -1710288 -1502219 -1538768 -1857980 -2302959 -2720327 -2917815 -2718625
6534 -2718625 -2228137 -1752665 -1317745 -653808 183416 700433 747901 804206 1048244 848521
6524 848521 -112250 -850184 -251057 1121681 1528981 334154 -1266590 -1917987 -1544139
6515 -1544139 -870807 -406975 -292842 -464567 -594810 -390843 -124101 -269028 -561528 -228637
6505 -228637 690305 1188241 780839 201495 135505 205606 -122987 -469634 -187274 512986
6495 512986 842533 405580 -653447 -1933649 -2726387 -2377995 -1276805 -712868 -1105217
6486 -1105217 -1245975 -131277 1402788 1951372 1544261 1051197 394494 -984708 -2361350
6477 -2361350 -2273255 -803782 388199 491572 359149 591288 512976 -265072 -831735 -502749
6467 -502749 -83246 -473219 -1023591 -514983 937232 2172111 2687630 2874006 2844390 2216598
6457 2216598 1052951 21315 -503315 -691363 -541987 205845 1202249 1419657 518441
6448 518441 -392462 -121903 866716 975556 -305141 -1588518 -1356825 169412 1522970
6439 1522970 1858590 1560943 1240648 1026290 933627 1098269 1330688 1122466 465939 66229
6429 66229 352369 868079 1055200 1008435 960977 702723 160238 -81129 387231 970722
6419 970722 882353 270220 -314116 -1004555 -2089959 -2822573 -2067365 -126436 1232054
6410 1232054 790498 -851306 -2094182 -1782488 13434 1936384 2306092 907026 -543150
6401 -543150 -525843 279457 246870 -660419 -1207726 -1236711 -1727178 -2612979 -2638948 -1704447
6391 -1704447 -1294967 -1983080 -2469907 -1917811 -1320052 -1521747 -1701259 -1053861 -306682 -205512
6381 -205512 -95050 507837 511825 -817933 -1959286 -1213615 417510 630585 -651316
6372 -651316 -1375797 -601347 507125 871077 754390 658228 584312 591649 733722 436541
6362 436541 -739639 -1889230 -1790004 -949512 -953943 -1881495 -2251973 -1671869 -1456739 -2101263
6352 -2101263 -2206895 -910745 453015 434792 -254760 -38945 1027288 1590673 1168632
6343 1168632 569759 486627 835062 1286956 1500372 1020163 -158130 -1068990 -672828 743942
6333 743942 1786728 1615579 778548 299277 477316 801989 697157 95615 -605189 -991054
6323 -991054 -983196 -759184 -460449 -134165 145908 330186 456439 409030 -162879 -1231524
6313 -1231524 -1888800 -1154972 628423 1869244 1444040 -139137 -1498558 -1801160 -1195107
6304 -1195107 -337726 136812 10914 -342460 -375057 -51639 162901 651 -361878 -753503
6294 -753503 -1137338 -1239256 -758395 -146058 -373552 -1492017 -2177620 -1359409 285148
6285 285148 1206232 920887 252710 -105066 -331665 -696309 -861513 -411690 346310 585148
6275 585148 -104084 -1235210 -1927054 -1773768 -1182219 -901677 -1270022 -1886872 -1965911 -1100154
6265 -1100154 150325 569952 -401774 -1693403 -1568018 205703 1891038 1994795 1125708
6256 1125708 756781 892005 365616 -854601 -1320554 -361024 765216 618376 -656947
6247 -656947 -1997743 -2799445 -2824383 -1736672 187416 1546636 1125453 -593416 -2060132
6238 -2060132 -2449326 -2051296 -1324673 -528818 -70490 -267920 -798619 -1121404 -1327226 -1792566
6228 -1792566 -2126023 -1438863 161091 1232012 605922 -1213380 -2679674 -2855881 -2046115
6219 -2046115 -1054061 -324271 79017 13504 -723095 -1790403 -2234412 -1599812 -820709 -1148161
6209 -1148161 -2234853 -2367585 -915344 628001 748511 -40021 -283550 234158 735651
6200 735651 1141817 1914207 2578259 2134045 957174 593627 1352284 1753574 957686 134167
6190 134167 485136 1335404 1423862 937893 799029 758448 -139416 -1568803 -2051057 -1171133
6180 -1171133 -253536 -418595 -1069600 -899861 339544 1663676 2043464 1397940 623308
6171 623308 695388 1471610 1630123 391402 -1046592 -863674 678955 1325043 52932
6162 52932 -1300150 -686483 1176185 2020264 1366153 803976 1249614 1831328 1746903 1483228
6152 1483228 1571955 1611270 1297048 1102025 1064209 232563 -1558069 -2639748 -1726579 -145915
6142 -145915 -81040 -1289829 -1598462 -405376 487351 -116736 -1009964 -675440 465073
6133 465073 1081427 1001220 939968 975283 632286 130431 360808 1595261 3014405 3630754
6123 3630754 3196054 2147252 1007682 -40706 -1057524 -1879429 -2053609 -1524121 -983345
6114 -983345 -935854 -835558 -76679 552936 -245797 -2049818 -2938975 -2187964 -1082354 -593630
6104 -593630 -70861 923227 1381460 736860 197979 614224 705916 -637972 -1901239 -1192586
6094 -1192586 354511 285709 -923445 -541278 1688452 2866053 1573545 -6779 144573
6085 144573 835207 138341 -1383668 -1998953 -1654631 -1445357 -1489913 -1283920 -1178096 -1640345
6075 -1640345 -1855808 -889955 420676 586345 -49967 107419 1096177 1205621 -208335
6066 -208335 -1613952 -1604867 -726731 -162986 131360 895679 1960618 2335547 1695817 932998
6056 932998 1070619 2029084 2655064 1915796 -8994 -1909426 -2775676 -2571104 -1752887
6047 -1752887 -603565 529747 888899 50632 -1117714 -1100764 467190 2257270 2757876
6038 2757876 1863836 678807 134500 212170 364347 283352 97021 -15212 -106995 -252435
6028 -252435 -289945 -83845 106990 -44693 -291188 -26891 776339 1417977 1415193 1020740
6018 1020740 613469 260483 164491 725594 1648872 1812399 756515 -418259 -513085 51110
6008 51110 14088 -727687 -1120319 -731714 -292706 -362252 -538820 -337588 -71156 -465319
5998 -465319 -1777354 -3371564 -3917011 -2379545 612475 2840990 2740429 1148445 -85622
5989 -85622 -639141 -1493506 -2609930 -2689292 -1465982 -449733 -705027 -1374305 -1222989 -362310
5979 -362310 435104 944882 1084353 429908 -810754 -1357755 -508138 657175 797025
5970 797025 123988 -463984 -1061772 -2110774 -2942461 -2679194 -2002429 -2219742 -2949905 -2666106
5960 -2666106 -1416003 -924625 -1707940 -2141495 -1112630 266077 626853 424152 754897
5951 754897 1382223 1402667 1023260 1225844 2155695 3088262 3633936 3852968 3488578 2224902
5941 2224902 587813 -408224 -481229 -144163 302079 969776 1686040 2000605 1916740 1826578
5931 1826578 1737747 1360206 902005 863920 1020314 608057 -304702 -684865 -113697 516664
5921 516664 395332 -79651 -245220 -363931 -955859 -1562585 -1206241 164717 1524361
5912 1524361 1958679 1401103 385501 -317309 -19789 1250038 2485475 2591392 1480261
5903 1480261 -63093 -1303956 -1889009 -1690562 -996934 -514763 -489907 -249643 579246
5894 579246 1009352 86911 -1154900 -846215 696519 1090918 -481393 -1836202 -1113573
5885 -1113573 351020 253829 -1006275 -1121191 385083 1559634 1135903 78191 -476366
5876 -476366 -943094 -2031845 -3144037 -3133141 -1886291 -319510 639494 535816 -481513
5867 -481513 -1511987 -1545858 -698429 -117808 -323863 -556306 -233097 72239 -109928 -57699
5857 -57699 827380 1589601 1022555 -275946 -689594 -6719 528983 381384 269486 496721
5847 496721 430104 10770 145772 934251 1008448 -413227 -2048580 -2183438 -818122 797181
5837 797181 1827007 1990200 987829 -858429 -2051298 -1415570 209800 1039279 735190
5828 735190 399001 493731 353485 -222762 -492378 -232097 -220190 -711082 -770835 126494
5818 126494 1027676 919440 222160 -105956 -92816 -282991 -416827 203989 1380515 2173443
5808 2173443 2241919 2029683 1714252 995873 40039 -329984 242161 982140 858818 -230474
5798 -230474 -1392008 -1614196 -654873 668668 1085758 101264 -1375094 -1920586 -1063266
5789 -1063266 430653 1529918 1717842 961599 -396622 -1569881 -1759139 -1026008 -397928
5780 -397928 -765024 -1838956 -2467535 -1931619 -753193 -131419 -579290 -1296053 -1171106
5771 -1171106 -291897 137433 -458642 -1112219 -710282 329513 665203 -40111 -789706
5762 -789706 -777368 -261069 231208 651088 1006665 912871 99422 -1014071 -1681217 -1625333
5752 -1625333 -1289126 -1365128 -2028179 -2554716 -2028973 -654724 197181 -244166 -1016987 -896029
5742 -896029 -278738 -359723 -1001489 -1070010 -621845 -821110 -1550879 -1263499 133425 463389
5732 463389 -1356502 -3133457 -2427373 -227811 592831 -486357 -1310695 -566959 692975
5723 692975 1218582 1192332 1092057 591013 -526626 -1514905 -1602927 -1033877 -519094 -277171
5713 -277171 -170006 -262624 -688847 -1258757 -1587949 -1457981 -920910 -275330 35260 -223695
5703 -223695 -834528 -1452796 -1983427 -2323448 -2061282 -986196 297577 852381 446846
5694 446846 -296790 -623164 -155928 943525 1855400 1591726 205992 -968169 -951726
5685 -951726 -393557 -369271 -624394 -235179 537186 560746 -231202 -776719 -761960 -979734
5675 -979734 -1574905 -1509768 -329070 906662 1131964 591610 21441 -402147 -623791 -236106
5665 -236106 787086 1674912 1822246 1476434 1034347 507918 119275 426821 1267256 1539768
5655 1539768 723283 -279881 -487643 -147987 -20373 -219348 -486763 -772601 -855248 -266591
5645 -266591 711093 939693 77592 -693944 -452529 71751 -76595 -403820 -33639 558756
5635 558756 407500 -100446 166192 1130114 1675981 1407325 813022 34094 -1088944 -2019954
5625 -2019954 -2039762 -1563314 -1528481 -1683354 -1007229 289111 843999 336280 -35091 426444
5615 426444 952026 829722 475915 417516 470538 527679 979548 1708098 1766572 782501
5605 782501 -268926 -384899 210849 746066 994710 1068039 904123 609473 617639 945301
5595 945301 969559 427458 -101259 -149348 48600 372851 1183485 2203268 2148027 467805
5585 467805 -1463729 -2030389 -1481526 -1138247 -1159742 -575269 746811 1678890 1545558 1017681
5575 1017681 924949 1121970 990380 409920 -185564 -312444 226540 1163049 1826430 1727783
5565 1727783 1095766 518575 196747 -22194 -94748 102294 250728 -63871 -501387 -274199
5555 -274199 576915 1071198 728740 234882 173798 -18639 -1004720 -2089977 -1900920 -325435
5545 -325435 1225257 1591304 1065818 592247 517959 581653 578613 476627 156624 -461841
5535 -461841 -1143286 -1530431 -1530538 -1271398 -838984 -332097 -14160 -110404 -563188 -1186941
5525 -1186941 -1818160 -2073934 -1411053 27523 1003766 424119 -1143109 -2034556 -1589426
5516 -1589426 -778978 -591202 -813455 -881370 -953147 -1351947 -1665618 -1313053 -544008 -15577
5506 -15577 253502 635181 930327 652969 122671 198421 824017 897665 -34028 -899830
5496 -899830 -590186 342058 331157 -1082803 -2607225 -2822056 -1827811 -841555 -525324 -410509
5486 -410509 -29930 163850 -420672 -1361958 -1727374 -1493373 -1486737 -1934265 -2149817 -1837939
$$ [...]
##END NTUPLES=NMR SPECTRUM
##END=
