##TITLE=31Pdec_SR 79 AcCl:Ac2O
 , 124 sc
 24.08.2021
##JCAMPDX= 6.0         $$ Bruker NMR JCAMP-DX V2.0
##DATA TYPE= NMR SPECTRUM
##DATA CLASS= NTUPLES
##ORIGIN= UXNMR, Bruker Analytische Messtechnik GmbH
##OWNER= root
$$ XWIN-NMR		Version 3.5
$$ Tue Aug 24 13:25:15 2021 Russian Standard Time (UT+4h)  she@DPX200
##.OBSERVE FREQUENCY= 81.013821
##.OBSERVE NUCLEUS= ^31P
##.ACQUISITION MODE= SIMULTANEOUS
##.ACQUISITION SCHEME= undefined
##.AVERAGES= 124
##.DIGITISER RES= 16
##SPECTROMETER/DATA SYSTEM= spect
##.PULSE SEQUENCE= zgpg30
##.SOLVENT NAME= DMSO
##.SHIFT REFERENCE= (INTERNAL, DMSO, 0, 248.564)
##AUDIT TRAIL= $$ (NUMBER, WHEN, WHO, WHERE, WHAT)
$$ ##TITLE= Audit trail, XWIN-NMR		Version 3.5
$$ ##JCAMPDX= 5.01
$$ ##ORIGIN= Bruker BioSpin GmbH
$$ ##OWNER= she
$$ F:/spectra/data/she/nmr/P31/1/pdata/1/auditp.txt
$$ ##AUDIT TRAIL=  $$ (NUMBER, WHEN, WHO, WHERE, WHAT)
(   1,<2021-08-24 13:24:01.68 +0400>,<she>,<DPX200>,
      <continue with go, POWCHK disabled, PULCHK disabled
       configuration hash MD5:
       00 E9 B6 7A A2 85 ED C7 34 08 36 98 17 FE 4E 26
       data hash MD5: 32K
       08 A9 83 C9 43 56 33 4F A6 6E 2B C7 B4 60 BF 8B>)
(   2,<2021-08-24 13:24:04.29 +0400>,<she>,<DPX200>,
      <Start of raw data processing
       efp BC_mod = 2 LB = 1 FT_mod = 6 PKNL = 1 PHC0 = -7719.638 PHC1 = -101.1265 SI = 64K 
       data hash MD5: 64K
       11 CD 48 C7 F8 D7 4D C4 EB 61 79 99 A9 64 F8 3E>)
(   3,<2021-08-24 13:24:34.76 +0400>,<she>,<DPX200>,
      <pk PHC0 = -25.1914 PHC1 = 208.6 
       data hash MD5: 64K
       00 BE 0B 80 45 E2 A5 17 30 B1 C7 81 87 E8 49 22>)
(   4,<2021-08-24 13:24:37.87 +0400>,<she>,<DPX200>,
      <abs ABSG = 5 
       data hash MD5: 64K
       A6 ED D2 3E 0E 30 A4 86 9D 1C 9B 89 9F D5 9F 31>)
$$ ##END=
$$ 
$$ hash MD5
$$ D8 9F 11 75 E1 6B 27 F1 EC D8 0C A0 B1 94 8B 93
##$RELAX= 
##$RELAX= 
##$RELAX= 
##$RELAX= 
##$RELAX= 
##$RELAX= 
##$RELAX= 
##$RELAX= 
$$ Bruker specific parameters
$$ --------------------------
##$DU= <F:/spectra>
##$EXPNO= 1
##$NAME= <P31>
##$PROCNO= 1
##$TYPE= <nmr>
##$USER= <she>
##$AMP= (0..31)
100 100 100 100 100 100 100 100 100 100 100 100 100 100 100 100 100 100 
100 100 100 100 100 100 100 100 100 100 100 100 100 100 
##$AQSEQ= 0
##$AQ_mod= 1
##$AUNM= <au_zg>
##$AUTOPOS= <>
##$BF1= 81.014009
##$BF2= 200.13
##$BF3= 200.13
##$BF4= 200.13
##$BF5= 200.13
##$BF6= 200.13
##$BF7= 200.13
##$BF8= 200.13
##$BYTORDA= 1
##$CFDGTYP= 0
##$CFRGTYP= 5
##$CHEMSTR= <none>
##$CNST= (0..31)
1 1 145 1 1 1 1 1 1 1 1 1 1 1 1 1 1 1 1 1 1 1 1 1 1 1 1 1 1 1 1 1 
##$CPDPRG= <waltz16>
##$CPDPRG1= <>
##$CPDPRG2= <waltz16>
##$CPDPRG3= <>
##$CPDPRG4= <mlev>
##$CPDPRG5= <mlev>
##$CPDPRG6= <mlev>
##$CPDPRG7= <mlev>
##$CPDPRG8= <mlev>
##$CPDPRGB= <>
##$CPDPRGT= <>
##$D= (0..31)
0 1 0 0 0 0 0 0 0 0 0 0.03 2e-05 3e-06 0 0 0 0 0 0 0 0 0 0 0 0 0 0 0 0 
0 0 
##$DATE= 1629796861
##$DBL= (0..7)
120 120 120 11 120 120 24 19 
##$DBP= (0..7)
150 150 150 150 150 150 150 150 
##$DBP07= 0
##$DBPNAM0= <>
##$DBPNAM1= <>
$$ [...]
##$SUBNAM3= <"">
##$SUBNAM4= <"">
##$SUBNAM5= <"">
##$SUBNAM6= <"">
##$SUBNAM7= <"">
##$SUBNAM8= <"">
##$SUBNAM9= <"">
##$SW= 501.771253377433
##$SWIBOX= (0..15)
0 1 3 0 0 0 0 0 0 0 0 0 0 0 0 0 
##$SW_h= 40650.406504065
##$TD= 32768
##$TD0= 1
##$TE= 0
##$TE2= 300
##$TE3= 300
##$TEG= 300
##$TL= (0..7)
0 120 53 12 22 120 120 120 
##$TP= (0..7)
150 150 150 150 150 150 150 150 
##$TP07= 0
##$TPNAME0= <>
##$TPNAME1= <>
##$TPNAME2= <>
##$TPNAME3= <>
##$TPNAME4= <>
##$TPNAME5= <>
##$TPNAME6= <>
##$TPNAME7= <>
##$TPOAL= (0..7)
0.5 0.5 0.5 0.5 0.5 0.5 0.5 0.5 
##$TPOFFS= (0..7)
0 0 0 0 0 0 0 0 
##$TUNHIN= 0
##$TUNHOUT= 0
##$TUNXOUT= 0
##$USERA1= <user>
##$USERA2= <user>
##$USERA3= <user>
##$USERA4= <user>
##$USERA5= <user>
##$V9= 5
##$VALIST= <valist>
##$VCLIST= <CCCCCCCCCCCCCCC>
##$VD= 0
##$VDLIST= <DDDDDDDDDDDDDDD>
##$VPLIST= <PPPPPPPPPPPPPPP>
##$VTLIST= <TTTTTTTTTTTTTTT>
##$WBST= 1024
##$WBSW= 4
##$XGAIN= (0..3)
0 0 0 0 
##$XL= 0
##$YL= 0
##$YMAX_a= 9148
##$YMIN_a= -9395
##$ZGOPTNS= <>
##$ZL1= 120
##$ZL2= 120
##$ZL3= 120
##$ZL4= 120
##$ABSF1= 248.5645
##$ABSF2= -253.2056
##$ABSG= 5
##$ABSL= 3
##$ALPHA= 0
##$AQORDER= 0
##$ASSFAC= 0
##$ASSFACI= 0
##$ASSFACX= 0
##$ASSWID= 0
##$AUNMP= <proc_1d>
##$AZFE= 0.1
##$AZFW= 0.5
##$BCFW= 0
##$BC_mod= 2
##$BYTORDP= 0
##$COROFFS= 0
##$CY= -3
##$DATMOD= 1
##$DC= 0
##$DFILT= <>
##$DTYPP= 0
##$F1P= 0
##$F2P= 0
##$FCOR= 1
##$FTSIZE= 65536
##$FT_mod= 6
##$GAMMA= 0
##$GB= 0
##$INTBC= 1
##$INTSCL= 5.30512e-09
##$ISEN= 30
##$LB= 1
##$LEV0= 0
##$LPBIN= 0
##$MAXI= 10000
##$MC2= 0
##$MEAN= 0
##$ME_mod= 0
##$MI= 50
##$NCOEF= 0
##$NC_proc= -7
##$NLEV= 6
##$NOISF1= 182.463
##$NOISF2= 159.3651
##$NSP= 0
##$NTH_PI= 0
##$NZP= 0
##$OFFSET= 248.5645
##$PC= 4
##$PHC0= -7744.83
##$PHC1= 107.4735
##$PH_mod= 1
##$PKNL= yes
##$PPARMOD= 0
##$PSCAL= 0
##$PSIGN= 0
##$REVERSE= no
##$SF= 81.014009
##$SI= 65536
##$SIGF1= 159.3651
##$SIGF2= -187.1042
##$SINO= 113.3802
##$SIOLD= 16384
##$SREGLST= <1H.CDCl3>
##$SSB= 0
##$STSI= 65536
##$STSR= 0
##$SW_p= 40650.406504065
##$SYMM= 0
##$S_DEV= 0
##$TDeff= 32768
##$TDoff= 0
##$TI= <>
##$TILT= no
##$TM1= 0
##$TM2= 0
##$TOPLEV= 0
##$USERP1= <user>
##$USERP2= <user>
##$USERP3= <user>
##$USERP4= <user>
##$USERP5= <user>
##$WDW= 1
##$XDIM= 65536
##$YMAX_p= 273167504
##$YMIN_p= -297667456
$$ End of Bruker specific parameters
$$ ---------------------------------
##NTUPLES= NMR SPECTRUM
##VAR_NAME=  FREQUENCY,     SPECTRUM/REAL,   SPECTRUM/IMAG
##SYMBOL=    X,             R,               I
##VAR_TYPE=  INDEPENDENT,   DEPENDENT,       DEPENDENT
##VAR_FORM=  AFFN,          ASDF,            ASDF
##VAR_DIM=   65536,         65536,           65536
##UNITS=     HZ,            ARBITRARY UNITS, ARBITRARY UNITS
##FACTOR=    0.620285442955139, 1,           1
##FIRST=     20137.2065510759, 0,            0
##LAST=      -20513.1999529892, 0,           0
##MIN=       -20513.1999529892, -297667456,  0
##MAX=       20137.2065510759, 273167504,    0
$$ Real data points
##PAGE= N=1
##DATA TABLE= (X++(R..R)), XYDATA
$$ [...]
13022B345093J142134q18704j863895j279464L70544J399026N56573j195790j897020
13013a241503j281982m51810M06932J565708J950992P73553j26461P91191Q09692
13004C196312l149782p525268n336155K892493Q157471N179151q34906k924820
12996c45504j718130j481052k198075j256247P19152J270511P54306Q45000Q70869
12987b539170l7037J12557K623692M375943K393631p45003j242255q22232l007779
12978A112347n234632k112723M361015N697487o88609o806369m745788K902554
12970e514718O840117K569108m992700p695947l228889K739823L847401J010798
12962d425007n3240J481654L86114m290284n208697J688140Q465165N935023k146143
$$ plain form
13022 2345093 3487227 2668523 804628 -474836 -104292 1294734 1851307 655517 -1241503
13013 -1241503 -2523485 -2975295 -2568363 -1002655 948337 1721890 1595429 2386620 3196312
13004 3196312 46530 -7478738 -12814893 -9922400 -1764929 3414222 2579316 -345504
12996 -345504 -2063634 -3544686 -5742761 -6999008 -6279856 -5009345 -4255039 -3410039 -2539170
12987 -2539170 -2576207 -2463650 160042 4535985 6929616 6184613 4942358 4120126 1112347
12978 1112347 -4122285 -6235008 -1873993 3823494 3134885 -3671484 -8417272 -5514718
12970 -5514718 1325399 3894507 -1098193 -8794140 -12023029 -9283206 -5435805 -4425007
12962 -4425007 -4478247 -2996593 -2610479 -6900763 -12109460 -10421320 -1956155 3978868 1832725
12953A832725n019249j364633Q31726r57244p24500L570319N578099J767620k508822
12944C006041k258535j5076M99491M42223J025609m44424m564144n944025r42620
12935i195460N512630O270212J462855k977266l174019J73448M103338N029454
12927G205192J160490m178387n093362r35777K674038K343752J032168J396843
12919E604957J235608j051700k647061j945466j850750l253118j996816K622165
12911c282181L809417j605244n451565k39512P651359P113335l44283l876342
12903C774984q10234J372893l49222l96180L309129M669815O21967k893514j116536
12894H183102J644623q0238l884066m318162j542149O92321J637200K531820K155802
$$ plain form
12953 1832725 -3186524 -4551157 -3719431 -4676675 -5401175 -1830856 3747243 5514863 3006041
12944 3006041 747506 732430 1231921 1674144 2699753 2255329 -2308815 -8252840 -9195460
12935 -9195460 -3682830 2587382 4050237 1072971 -2101048 -1927600 2175738 7205192
12927 7205192 8365682 4187295 -906067 -1841844 832194 3175946 4208114 5604957
12919 5604957 6840565 5788865 3141804 1196338 -654412 -3907530 -5904346 -3282181
12911 -3282181 527236 -1078008 -6529573 -6769085 882274 7995609 7651326 3774984
12903 3774984 2964750 4337643 3988421 3592241 6901370 11571185 12193152 9299638 8183102
12894 8183102 9827725 9747487 5863421 1545259 3110 695431 2332631 4864451 7020253
12885G020253j122726m909834n312724k606149k03245Q44446K196731L813051
12877b80197L466132J101523n117K024782M269056K460595l089573p101357n488868
12868b643024o17284J417883j312498l999400k049537K048883K453365r42988
12860e644600k245754J048462L786344J099492l825568m340159R0201L969895
12852f061687M219573L290778L502954L301112J138668r19909m39984J258157
12844I289662J319864k41932j476397k183032l175022l143440m29302K611648
12836B572049J771290j994484k799251J293407M836756L316715j89073q02135
12828H005274M29869N86r25696N84774K367480O78000j751588K43706L459799
$$ plain form
12885 7020253 5897527 987693 -4325031 -6931180 -7134425 -6289979 -4093248 -280197
12877 -280197 3185935 4287458 4282341 6307123 10576179 13036774 9947201 2845844 -2643024
12868 -2643024 -3260308 -1842425 -3154923 -7154323 -9203860 -7154977 -4701612 -5644600
12860 -5644600 -7890354 -6841892 -3055548 -1956056 -5781624 -10121783 -10031582 -6061687
12852 -6061687 -1842114 1448664 4951618 8252730 9391398 8471489 8031505 9289662
12844 9289662 10609526 10367594 8891197 6708165 3533143 389703 -39599 2572049
12836 2572049 4343339 2348855 -450396 843011 5679767 8996482 8807409 8005274
12828 8005274 8435143 8435729 7510033 8094807 10462287 11140287 9388699 9632405 13092204
12819A3092204l18603r308732j1166921j419620P999168N408634m099493p394457
12811g207820k007919L602217M301529K739674J315862q49007k641809p81067
12803a528340L689984N331007K284642j345773k504927k989094m269046l839297
12795e170844R6031M261432M322952J064039p42392J104905L318562J416832m133925
12786E537592p663992n193119j6838J632226l48133k64913L171525L709888j705810
12777a141574n911216j878145N328652N601955o02821l501317K91129L398024
12769A584687M50306m057177m032332m37546K333516K908624J991867k42525k506598
12760b007178k255509K67956J782964J362526J396930J907018k22248m359430
$$ plain form
12819 13092204 12773601 3464869 -7702052 -9121672 -1122504 4286130 186637 -7207820
12811 -7207820 -9215739 -5613522 -1311993 1427681 2743543 1894536 -747273 -1528340
12803 -1528340 2161644 7492651 9777293 8431520 5926593 2937499 -1331547 -5170844
12795 -5170844 -5074813 -813381 3509571 4573610 3831218 4936123 8254685 9671517 5537592
12786 5537592 -2126400 -7319519 -7336357 -5704131 -6052264 -6317177 -3145652 564236 -1141574
12777 -1141574 -7052790 -8930935 -3602283 1999672 1396851 -2104466 -1813337 1584687
12769 1584687 2034993 -2022184 -6054516 -6492062 -4158546 -1249922 741945 499420 -2007178
12760 -2007178 -4262687 -3994731 -2211767 -849241 547689 2454707 2232459 -2126971
12752b126971n040875p78686K694024J757397N91117K700104L834836q5224m303382
12743g57660k479574K299110K518456j287950k322218L31465R48848j852312k799860
12734e401695J13477K161995Q94991N72833L706678N190982K46699o847067p924898
12725g286005k071672L747392M085485P92794o59503K105193N875155N240951
12717A1829790j155676p951698q490020k909189K100183K235129M68091J091012
12709b782378K969505K493100K03548m38941N25180m21069l653534m692219p71218
12700f568026M672372O451877L857648m3814l117326n181281n662546l597383
12692i188479q9011J914153J170622k62778J40505K245514L813850L228561Q21344
$$ plain form
12752 -2126971 -7167846 -7946532 -5252508 -3495111 -2903994 -203890 3630946 3545722 -757660
12743 -757660 -3237234 -938124 1580332 292382 -2029836 -1698371 -749523 -2601835 -5401695
12734 -5401695 -5288218 -3126223 -2231232 -1658399 2048279 7239261 7485960 638893 -7286005
12725 -7286005 -9357677 -5610285 -1524800 -732006 -1391509 713684 6588839 11829790
12717 11829790 10674114 2722416 -5767604 -8676793 -6576610 -4341481 -3873390 -2782378
12709 -2782378 187127 2680227 2883775 2444834 2970014 2548945 -1104589 -5796808 -6568026
12700 -6568026 -1895654 4556223 8413871 8370057 5252731 71450 -5591096 -9188479
12692 -9188479 -9277490 -7363337 -6192715 -6455493 -6314988 -4069474 -255624 2972937 3794281
12683C794281j837694l176060k522126m37229J816150L194055L216941J947295
12675E995613K64194m73574j32366m96101k632691m244160k186589K318865M067040
12666B480231O15232m172031n158277k113935J272227K409866J462100q5520p2148
12657c362255L082778P069020O064970j813321r527552q406663N04167P387058
12649I98202N877342o14769n286849n416606j972815L108275O533329M729293
12641G955402j396711n807426m416398k05376J446145j39363j599869j022632
12633e186228O22162K109496K994073K911049K162262K033718K716398K359641
12625A2722571N0963k055531j797384m14362m02886j546401j800493r22989n05024
$$ plain form
12683 3794281 1956587 -1219473 -3741599 -4178828 -2362678 831377 4048318 5995613
12675 5995613 6259807 5786233 5653867 5157766 2525075 -1719085 -3905674 -1586809 2480231
12666 2480231 3095463 -1076568 -6234845 -8348780 -7076553 -4666687 -3204587 -3290107 -3362255
12657 -3362255 -279477 6789543 12854513 11041192 1513640 -6893023 -6388856 998202
12649 998202 6875544 6260775 973926 -4442680 -6415495 -3307220 3226109 7955402
12641 7955402 6558691 751265 -3665133 -3870509 -2424364 -2563727 -4163596 -5186228
12633 -5186228 -4564066 -2454570 539503 3450552 5612814 7646532 10362930 12722571
12625 12722571 12773534 10718003 8920619 8506257 8103371 6556970 4756477 3833488 3328464
12616C328464j125714j765129j492605j46257J698486K328781L02121k584224
12608E43923k500252N68685J852774n94326j689830K696116P619468N475798j969869
12599A2002487n550429k098288J861429R93518j649554j215256J398349K614298
12591H356554K122448J452750q367l339512o584729o615668l300635P02108L091759
12582d123292L118457J332693k21335N93732K980587L646301J441296j082805
12574G685634j999949k509313l246302k039753J601175L535675O83005l342131
12566C68041l050993O76983K377173P06905j89791J958169M048124K759834q02099
12557H852346l242394k817561j64750K462264K130679j986503o274613n833720
$$ plain form
12616 3328464 2202750 437621 -1054984 -1201241 497245 2826026 3128147 543923
12608 543923 -1956329 -1387644 465130 -129196 -1819026 877090 8496558 13972356 12002487
12599 12002487 6452058 4353770 6215199 7208717 5559163 4343907 5742256 8356554
12591 8356554 10479002 11931752 11923385 8583873 1999144 -4616524 -7917159 -7215051 -4123292
12582 -4123292 -1004835 327858 106523 700255 3680842 7327143 8768439 7685634
12574 7685634 5685685 3176372 -69930 -2109683 -508508 3027167 3710172 368041
12566 368041 -2682952 -2005969 371204 1078109 888318 2846487 6894611 9654445 8852346
12557 8852346 5609952 2792391 2627641 5089905 7220584 5234081 -1040532 -6874252
12549f874252n74488M399156M956313J894125j491678k791595j089734K505556
12541I33403M351656J769502k343626k424183J409907K924572m81745l401214
12533B738272j447011J163773j069469m753830k584030M039008O148453R55405
12525E190571m147296l359986j90039M41730L88343K705139L986469K4799m857767
12516A81963l132568K807283K567163n764803j0646022l401189Q324549J0758645
12508A695021K511760n515686o019482k107618J399700M265897O078097L569482
12500E877171k678372n552851j131988M280470L149220j946096l343992q67843
12492b214281n34507k866274k386207J204103J573468k354302l128692K381352
$$ plain form
12549 -6874252 -7448740 -3049584 1906729 3800854 2309176 -482419 -1572153 933403
12541 933403 5285059 7054561 4710935 2286752 3696659 6621231 6139486 2738272
12533 2738272 1291261 2455034 1385565 -3368265 -5952295 -1913287 4235166 5190571
12525 5190571 1043275 -2316711 -2506750 -2065020 -1676677 1028462 5014931 5039730 181963
12516 181963 -2950605 -143322 2423841 -3340962 -13986984 -17388173 -9063624 1695021
12508 1695021 4206781 -1308905 -7328387 -9436005 -8036305 -3770408 2307689 5877171
12500 5877171 3198799 -2354052 -3486040 794430 3943650 1997554 -1346438 -2214281
12492 -2214281 -2748788 -5615062 -8001269 -6797166 -5223698 -7578000 -10706692 -8325340
12484h325340O377854K654404k697288j235666L943852L786548j871535n052540
12476b419711k749972L23762J043640R64078M21363j928609l625414r05330L097059
12467e779134J619443l587182l398551L420023O986045K434246j831946J294456
12459A157400N215867J198633o132653o405387r54621q0755n351207p240600j185528
12450a9778851N341036N113384J333483O80308K923911L033416m12448l940995
12442e706756m392668j907129J292131K930435K218188N43863P3219J440980L532925
12433B5188M929469M477473J695528j798384k973459j529709j085274l493983
12425B46849m852956j265900M165015N489400K914398J281869J019793j674357
$$ plain form
12484 -8325340 -1947486 706918 -1990370 -3226036 717816 4504364 2632829 -2419711
12476 -2419711 -5169683 -4845921 -3802281 -2838203 -2416840 -4345449 -7970863 -8876193 -5779134
12467 -5779134 -4159691 -7746873 -11145424 -7725401 -739356 1694890 -137056 1157400
12459 1157400 6373267 7571900 1439247 -4966140 -5920761 -6001516 -11352723 -18593323 -19778851
12450 -19778851 -14437815 -9324431 -7990948 -7310640 -4386729 -1353313 -1765761 -5706756
12442 -5706756 -10099424 -12006553 -10714422 -7783987 -5565799 -5021936 -4948717 -3507737 25188
12433 25188 4954657 9432130 11127658 9329274 6355815 4826106 3740832 246849
12425 246849 -4606107 -5872007 -1706992 3782408 6696806 7978675 8998468 7324111
12417G324111n567781m007539L624706Q200459L285363n203578p450685k873796
12409b668740J379077J549162L60003N79742J360209J071240l74486k378643m097155
12400c219591m235242k519323o05626L25770J501970M024724O079209N150201
12392F502092J619307k166397m824680n612059l297976J437949M305421K015517
12384b0826k352289k623990J957878N392285K865483l222263o595644m253404
12376h852770J161004M852928M611752K400151J412484J739607M24288l424061
12368D325383n931732l332630K193361M929482L089067J56203j266151k749951
12360A413032n571447o699093k637315M459201Q107553N101980p90345l657629
$$ plain form
12417 7324111 1756330 -2251209 1373497 9573956 12859319 7655741 205056 -2668740
12409 -2668740 -1289663 259499 619502 1199244 2559453 3630693 3256207 877564 -3219591
12400 -3219591 -7454833 -9974156 -10579782 -10254012 -8752042 -4727318 1351891 6502092
12392 6502092 8121399 5955002 1130322 -4481737 -7779713 -6341764 -2036343 -20826
12384 -20826 -2373115 -4997105 -3039227 2353058 5218541 1996278 -4599366 -8852770
12376 -8852770 -7691766 -2838838 1772914 4173065 5585549 7325156 7749444 4325383
12368 4325383 -1606349 -4938979 -2745618 2183864 5272931 5429134 4162983 1413032
12360 1413032 -4158415 -10857508 -13494823 -9035622 -928069 4173911 3383566 -274063
12352b74063k069852O58164J531165P77080k99225j592554k760892j833154J874797
12343c988534M795072K760476k486880m438905n74823L942515L550574k68111
12335C291384k172507r41055n5624j454647k836301j511846K034345N059947N118330
12326F532026J690635k918036m686854j988659J721757J599205k378596n321852
12318e750374l711137O43760L434864K486352j046994m087595l581019R68623
12310a0643520O065773P154726L806666Q6311j069916j346134l173832m889482
12302d009408l018706J729624M527055L030919O19677J276367L774787L674308
12294A1604623k42452m556182n945108m407379j413552K061916M409791L332531
$$ plain form
12352 -274063 -2343915 -1685751 -154586 622494 323269 -1269285 -4030177 -5863331 -3988534
12343 -3988534 806538 3567014 1080134 -3358771 -3933594 8921 3559495 3291384
12335 3291384 1118877 177822 122198 -1332449 -4168750 -5680596 -3646251 1413696 6532026
12326 6532026 8222661 5304625 617771 -1370888 350869 1950074 -428522 -5750374
12318 -5750374 -9461511 -8817751 -5382887 -2896535 -3943529 -8031124 -11612143 -10643520
12310 -10643520 -4577747 2576979 6383645 6469956 5400040 4053906 880074 -4009408
12302 -4009408 -7028114 -5298490 -771435 2259484 2879161 4155528 7930315 11604623
12294 11604623 11362171 6805989 860881 -3546498 -4960050 -2898134 1511657 4844188
12286D844188p00458l250599j064479L169613M236780J278191k043976l262365
12278C206895l174465k524307o97870J618331K112322L24303j437211j457245
12270b029247j97589J692761L732115L968051J012920k029770n18405L970398
12262I601234M422055j131436n861840m165578L38201J374751n92076j164306
12254B821005p6356j69983j128547m70121J008144N54670j096432r88948N08497
12245I61929O38249k73800M98670K604117K865372O57421j524583k383849k504809
12236A538717j717350o2957J37213k119592k934980Q30972M627767K050638m043357
12227a692929m655847J370224N514576L053796p38988p80562J97304j256957k326472
$$ plain form
12286 4844188 4143730 893131 -171348 2998265 7235045 8513236 6469260 3206895
12278 3206895 32430 -2491877 -3189747 -1571416 540906 865209 -572002 -2029247
12270 -2029247 -2226836 -534075 3198040 7166091 8179011 6149241 5630836 9601234
12262 9601234 14023289 12891853 7030013 2864435 3202636 4577387 3985311 2821005
12254 2821005 2744649 2574666 1446119 975998 1984142 2538812 1442380 453432 961929
12245 961929 1600178 1326378 1825048 4429165 7294537 7951958 6427375 4043526 1538717
12236 1538717 -178633 -241590 -104377 -2223969 -5158949 -4327977 299790 2350428 -1692929
12227 -1692929 -6348776 -4978552 536024 3589820 2850832 2070270 2267574 1010617 -1315855
12218a315855J82642L051052J851248j628913k833555j571235n12565R2937J225653
12209a458591J576514n0305j439442m22334J043025N09510j67607J546268L179132
12200D316170P49303l776030m370277K4094L709053K365770j364174k249548M41562
12191a54077K542675Q48375k456977k445830J611243M351046J543097l191523
12183B648029l252749Q21055K169122j380494m163977k420572J55266J85928P66483
12174d471909M550693P034763L441903k552979m072138j337958K63410n49610
12166B306175o27993Q54346J969394K622204L523321K587042j656183n397066
12158F181240m528830j587730j046206j058317K036924M480912M75319n622120
$$ plain form
12218 -1315855 -1133213 1917839 3769087 2140174 -693381 -2264616 -2777181 -2684244 -1458591
12209 -1458591 117923 67618 -1371824 -1794158 -751133 -241623 -409230 1137038 4316170
12200 4316170 5065473 1289443 -3080834 -3056740 652313 3018083 1653909 -595639 -154077
12191 -154077 2388598 3236973 779996 -1665834 -54591 4296455 5839552 2648029
12183 2648029 -604720 216335 2385457 1004963 -3159014 -5579586 -5424320 -5238392 -4471909
12174 -4471909 78784 7113547 10555450 8002471 3930333 2592375 2855785 2306175
12166 2306175 1678182 2532528 4501922 7124126 10647447 13234489 11578306 6181240
12158 6181240 1652410 64680 -981526 -2039843 -2919 4477993 4953312 -668808
12150f68808m305253K472577K807211n179380q689404o53886Q357711O728390
12142H69158r90868l657246j205686r17353k581641l16382M216751L286544k785077
12133d081800m921351k94580K968426k75133l438814N42620O951158O296232q98061
12124B848697m918945j347640L225458J785744l143155m275172m24083K790917
12116c458179J970793K50203J288477L499046L360789J359877O34746J382804
12108A0288556Q18551j831292m255846n089861n298019n067453l010478N41377
12100a2904465K863191K773346K249746K881120L614942L226549K067697J88479
12092F960605l107743o498188o769062l354819M59159K399932L702573N060554
$$ plain form
12150 -668808 -4974061 -2501484 305727 -4873653 -13563057 -14216943 -5859232 869158
12142 869158 -121710 -3778956 -4984642 -5901995 -8483636 -8800018 -4583267 -1296723 -4081800
12133 -4081800 -9003151 -9297731 -6329305 -6604438 -10043252 -9500632 -2549474 3746758 2848697
12124 2848697 -2070248 -3417888 -192430 1593314 -1549841 -5825013 -6249096 -3458179
12116 -3458179 -1487386 -1237183 51294 3550340 6911129 8271006 8905752 10288556
12108 10288556 11107107 9275815 5019969 -69892 -5367911 -10435364 -13445842 -12904465
12100 -12904465 -10041274 -7267928 -5018182 -2137062 1477880 4704429 6772126 6960605
12092 6960605 3852862 -2645326 -9414388 -12769207 -12310048 -9910116 -6207543 -1146989
12084a146989M302169P80989j936961j124818Q73387R19914J29911P87190J529935
12075E114727J7385k361342k902907k187180j844579n55866K667141M122135N55131
12066B624645l623184j583364M502319N431797q64521n532772k222019L347703
12058B080604K580770k923611m387950Q27965N907176M772218K8848j625777J321025
12049H581268L799267J407299l811920o379023m655291k309562k291833k595466
12041h255261j61740L594561M611698K258106r4180l03535K29466p9632m97078
12032A302405R3197J149079J535100R95254j44538j372169j792262q70518N47013
12023A442561J081999L31384j387105l550973m436037j737252L593935O602847
$$ plain form
12084 -1146989 3155180 3936169 1999208 874390 1747777 2667691 2797602 3584792 5114727
12075 5114727 5132112 2770770 -132137 -2319317 -4163896 -4719762 -2052621 2069514 2624645
12066 2624645 -998539 -2581903 1920416 7352213 6487692 954920 -1267099 2080604
12058 2080604 4661374 1737763 -2650187 -1822222 4084954 8857172 8886020 7260243 8581268
12049 8581268 12380535 13787834 9975914 3596891 -1058400 -3367962 -5659795 -8255261
12041 -8255261 -8417001 -4822440 -210742 2047364 1953184 1649649 1879115 1799483 1302405
12032 1302405 1395602 2544681 4079781 5075035 4930497 3558328 1766066 895548 1442561
12023 1442561 2524560 2855944 1468839 -2082134 -6518171 -8255423 -4661488 1941359
12015A941359M571301J336315J224412J691348j929868o694781n201444J766268
12007a295090M812073L36274l665413p60007L356631N42564n991888o452099M55283
11998h661672O180844N156619R24658j323193j399895j212379o22772R51277K441476
11989B434963L052413L557033L826173J756546l145630p248880o429087j242389
11981c438858L609351M568790K300618l91763j955888k535464k238867p82117
11973h64198J035435J379349L0878o65095O45257J395466j398951n737699o516752
11964a0696310k781826J032401J908741J803956K579039K095979j226065l904506
11956i188591j946594K635539M407572K004451j193514k608242k414793q08075
$$ plain form
12015 1941359 6512660 7848975 9073387 10764735 8834867 2140086 -3061358 -1295090
12007 -1295090 3516983 3853257 187844 -572163 2784468 3327032 -2664856 -9116955 -8661672
11998 -8661672 -2480828 2675791 3600449 2277256 877361 -335018 -957790 -6513 2434963
11989 2434963 5487376 9044409 12870582 14627128 11481498 4232618 -2196469 -3438858
11981 -3438858 170493 4739283 7039901 6648138 4692250 2156786 -82081 -864198
11973 -864198 171237 1550586 1581464 916369 1561626 2957092 1558141 -4179558 -10696310
11964 -10696310 -13478136 -12445735 -10536994 -8733038 -6153999 -4058020 -5284085 -9188591
11956 -9188591 -11135185 -8499646 -4092074 -2087623 -3281137 -5889379 -8304172 -9112247
11948i112247K211784M385887K741204j780390m749630l943107j362070R70748
11940a0637821L577258O506850P188551L860379q82131k656528p59513J027186
11932G224231o88475m636988o463749m112035j02396K298123L311432M669301
11924A499444M992427J537415l439909l653320J672093M902003R10095m261165
11916D159083k029301N122800O723886j39951o686369n282736Q60757M056795
11908F784964K497195k0746r59042j123480j520656j694167j072527j68749k20993
11899B501799j741519l062533j466484K699329M724483J299214l830373m054781
11891b930865Q33341M275897K285810j722300k910306j233043P13817K146529
$$ plain form
11948 -9112247 -6900463 -2514576 226628 -1553762 -6303392 -10246499 -11608569 -10637821
11940 -10637821 -7060563 -553713 6634838 10495217 9613086 6956558 6197045 7224231
11932 7224231 6535756 1898768 -4564981 -8677016 -8779412 -6481289 -3169857 1499444
11924 1499444 6491871 8029286 4589377 936057 2608150 7510153 8420248 4159083
11916 4159083 2129782 7252582 13976468 13836517 7150148 1867412 2728169 6784964
11908 6784964 9282159 9261413 8302371 7178891 5658235 3964068 2891541 2722792 2501799
11899 2501799 760280 -2302253 -3768737 -1069408 3655075 4954289 1123916 -2930865
11891 -2930865 -2097524 2178373 4464183 2741883 -168423 -1401466 -687649 1458880
11883A458880L328367L155407O48231k680768m248511l230505q21386J066987
11875a323298Q56080j207614k391942m54934K750272L334082R52544r60850o83214
11866H71126r3776m17531j34855J523230K704266K098829P44139m43118j656763
11857E195547k123866q45009K66761j415594l628391j538210L558029M728809
11849D198076N13296k132812N66890K694439r28513n371511l849416R38166K013805
11840a357580j81893k18537J648550N82998k790476k588857K141262N510598L896598
11831F642663J42326k269037l203795l185972k089183j113837j374561r14263
11823g365659J942095L686862L80251m131910k603545L460386N069401K90386
$$ plain form
11883 1458880 4787247 7942654 8590885 5910117 1661606 -1568899 -2390285 -1323298
11875 -1323298 -467218 -1674832 -4066774 -4521708 -1771436 1562646 2515190 1554340 871126
11866 871126 777350 359819 224964 1748194 4452460 6551289 7295428 6852310 5195547
11857 5195547 3071681 2226672 2493433 1077839 -2550552 -4088762 -530733 4198076
11849 4198076 4711372 2578560 3145450 5839889 4911376 -460135 -4309551 -3371385 -1357580
11840 -1357580 -1539473 -1758010 -109460 473538 -2316938 -4905795 -2764533 2746065 6642663
11831 6642663 6784989 4515952 1312157 -1873815 -3962998 -5076835 -6451396 -7365659
11823 -7365659 -5423564 -1736702 -1356451 -5488361 -8091906 -4631520 437881 728267
11815G28267k293029J927936N373986P40398o423873n932513J460496N654090
11807A235758K145910k855911k516518K023146N038818L857889O00901j616207
11799G913786k065701k072030k196079j051242J936321L892688J525297l445513
11791D437527n471948k567633J217237K151304J665785K381241L123743J589229
11783H526485q53855j288181m80475j616865m401842m721833j009357K565360
11775c280563J310360l473108n653891j921043L731235M851946J107798j011132
11767d338398K563138O844505M380598l456872p447097l209711K952791L441802
11759A730756n63663k640955r71181O47211j50541j508872j633070j482391k044731
$$ plain form
11815 728267 -1564762 363174 5737160 6477558 53685 -5878828 -4418332 1235758
11807 1235758 3381668 525757 -1990761 32385 5071203 8929092 9529993 7913786
11799 7913786 5848085 3776055 1579976 528734 2465055 6357743 7883040 4437527
11791 4437527 -1034421 -3602054 -2384817 -233513 1432272 3813513 6937256 8526485
11783 8526485 7672630 6384449 5903974 4287109 -114733 -4836566 -5845923 -3280563
11775 -3280563 -1970203 -5443311 -11097202 -13018245 -9287010 -4435064 -3327266 -4338398
11767 -4338398 -1775260 5069245 9449843 5992971 -1454126 -4663837 -1711046 1730756
11759 1730756 1167093 -1473862 -2445043 -1797832 -1948373 -3457245 -5090315 -6572706 -8617437
11750h617437k086173k95205K194979L062707J869810P56471J917417M665696
11742C468265N603287K482098k502105m791760k932663r436R88492Q65384J674281
11733D845843K623827J237660k275149m547882l304775k20059J258789m2882k012762
11724b437390k132026o68931j32667j430545k099319J67502L510290L957300J012479
11715b53307j781028k075830j275655r53553j76547J706001K774875J738911Q48792
11706E52659K415559M345022K774377j822959m783220l447405j12509J665487
11698A587011J186478K88940P55405K583902L540344P08730n581317r785343o166335
11689a0882185L374124R613210O304309k235284o718317m269430k86929M61631
$$ plain form
11750 -8617437 -10703610 -10998815 -8803836 -5741129 -3871319 -3114848 -1197431 3468265
11742 3468265 9071552 11553650 9051545 4259785 1327122 1317686 2306178 3171562 4845843
11733 4845843 7469670 8707330 6432181 1884299 -1420476 -1640535 -381746 -424628 -2437390
11724 -2437390 -4569416 -5238347 -5371014 -6801559 -8900878 -8733376 -5223086 -1265786 -253307
11715 -253307 -2034335 -4110165 -5385820 -6339373 -6515920 -4809919 -2035044 -296133 552659
11706 552659 2968218 7313240 10087617 8264658 3481438 34033 -78476 1587011
11698 1587011 2773489 3062429 3817834 6401736 9942080 10650810 5069493 -4715850 -10882185
11689 -10882185 -7508061 2105149 8409458 6174174 -544143 -4813573 -5100502 -4638871
11681d638871l65751M68577J786194Q61995p44136O07782L919120M519784J632791
11672H047485q02737j701076m667615r731534j0192756k669826N731020O894497
11664i092542L449214L165940N501193L415526l030107n502104j017782L171780
11656F1118J499576j891904j447729J183872K155629K429864L814026L502178
11648A1306630r85156n658122n275418j533164R752j316144j392142J594602N255313
11639B006151O840079M977068l56705n884234o059461l45103M025870J621509
11631F825174k754928j644822K701133J799594n131181r651441o711805n62948
11623a5131224L242202M272422L712248J374118j189298o67363K238599K555970
$$ plain form
11681 -4638871 -5004622 -4536045 -2749851 -1887856 -2631992 -2024210 1894910 6414694 8047485
11672 8047485 7244748 5543672 876057 -8855477 -19048233 -21718059 -15987039 -9092542
11664 -9092542 -5643328 -2477388 3023805 6439331 3409224 -2092880 -3110662 61118
11656 61118 1560694 -331210 -1778939 -595067 1560562 3990426 7804452 11306630
11648 11306630 10321474 4663352 -612066 -2145230 -2135478 -3451622 -4843764 -3249162 2006151
11639 2006151 8846230 13823298 13466593 7582359 1522898 1177795 5203665 6825174
11631 6825174 4070246 2425424 5126557 6926151 1794970 -7856471 -14568276 -15131224
11623 -15131224 -11889022 -7616600 -3904352 -2530234 -3719532 -4386895 -2148296 407674
11615D07674j009749l520754j864604N22977L62384J35011K650276N168344L943612
11606F795171M89760j591153k319771l080606k481911J70099R54882k867525o297775
11597a0228829l007573L931091N827736J956275L27974L772340M797242j531136
11589E845120q156777o438675J69404J514304l351014n001124J395617Q473682
11581e549463P329466l07870n257507k815903L045716N884696L428707j605944
11573D151898m662064l295976M32502J976163k02274k486676j011809L075787
11565b022449N664762N308204L572730R95926l169974p237078p448488l334687
11557g671054Q93034J953094J270161J260048J170231m81728j949057m48812K877503
$$ plain form
11615 407674 -602075 -4122829 -5987433 -5464456 -5102072 -4967061 -2316785 2851559 6795171
11606 6795171 7284931 5693778 3374007 293401 -2188510 -2018411 -1063529 -3931054 -10228829
11597 -10228829 -13236402 -9305311 -3477575 -1521300 -1193326 2579014 7376256 5845120
11589 5845120 -2311657 -8750332 -8580928 -7066624 -10417638 -15418762 -14023145 -5549463
11581 -5549463 1780003 1472133 -3785374 -6601277 -3555561 2329135 5757842 4151898
11573 4151898 -510166 -3806142 -3373640 -1397477 -1599751 -4086427 -5098236 -2022449
11565 -2022449 3642313 8950517 12523247 13519173 10349199 3112121 -4336367 -7671054
11557 -7671054 -6778020 -4824926 -3554765 -2294717 -1124486 -1606214 -3555271 -4004083 -1126580
11548a126580L773698P19529k850150l084141o34952M60071j619304l608823j359656
11539i330308L642480N004837L63698l781527l88019P275730R229900K889481
11531A4906272l494707l312109k84925o24975k993549k374120P52202K029189
11523D603278J043866O94039P54203j074055k986688j157318K299176R76239n022388
11514A30352p316529j233901O764671P847730K186388l195605m478572l666572
11506b962038k803236q71528K760797N476936M153022m97698m147028l662185
11498b552958n99098J105868J80240j209362j561947j886177k373395q43561K880237
11489f860153M543399J356399k636835k033695J470995K025542o68703j634299
$$ plain form
11548 -1126580 2647118 3366647 516497 -2567644 -3202596 -2742525 -4361829 -7970652 -9330308
11539 -9330308 -5687828 -682991 -319293 -4100820 -4488839 2786891 12016791 14906272
11531 14906272 11411565 8099456 7814531 7189556 4196007 1821887 2574089 4603278
11523 4603278 5647144 6341183 7095386 6021331 3034643 1877325 4176501 5152740 130352
11514 130352 -7186177 -8420078 -1655407 6192323 8378711 5183106 704534 -2962038
11506 -2962038 -5765274 -6636802 -3876005 1600931 5753953 5256255 1109227 -2552958
11498 -2552958 -3152056 -2046188 -1865948 -3075310 -4637257 -6523434 -8896829 -9740390 -6860153
11489 -6860153 -2316754 -960355 -3597190 -5630885 -4159890 -2134348 -2803051 -4437350
11481d437350j16371p51086l872333l130077L519036Q305874M851643j624959
11473B744377k376171J684180L125795R36590Q79769L788326L242232k950882
11465A1074216p615387m991307J85460L03288l420338l940176k46172J668957
11457f981459m16201r52709L843055Q717135O549013j042384n859518m215349
11449c58417m24290P13004j80020j78535R28214J306598M68822k91425K00043
11440B183994J790079K790108J011893l284171o037591l834905P25429K046579
11432b608585n7453j25035L557223N411076J647179k997386k670997K90316k21735
11423B224603l822446m748446j395597K056541K924376K686874K347829R37319
$$ plain form
11481 -4437350 -4553721 -5304807 -9177140 -12307217 -8788181 -482307 4369336 2744377
11473 2744377 368206 2052386 5178181 6114771 6994540 10782866 14025098 11074216
11465 11074216 3458829 -1532478 -1347018 -1043730 -4464068 -8404244 -8650416 -6981459
11457 -6981459 -7397660 -8350369 -4507314 4209821 10758834 9716450 3856932 -358417
11449 -358417 -782707 -69703 -249723 -428258 499956 1806554 2275376 1983951 2183994
11440 2183994 3974073 6764181 7776074 4491903 -1545688 -5380593 -4655164 -2608585
11432 -2608585 -2666038 -2791073 766150 6177226 7824405 4827019 2156022 2446338 2224603
11423 2224603 -1597843 -6346289 -7741886 -5685345 -2760969 -74095 2273734 3211053
11415C211053p24703Q607K801036L834613J151378k998970n519031n028806j615871
11406d880694K522479L360356l3716k534814K58986M363813K757665l262459n632068
11397c080452j990141J552443R55375o40807k36137N67041J002132L189862N610732
11388F930048K581720n513203r320295l309188N471726P469046L246124m15262
11380G140716j358365j791849j667632K98356K048504J121013m83538L0083Q73054
11371F210342m95406j819545m07911P94700j621289l965859r75508M050976L515703
11362E286203j697521l037339K047585O289355M114655j024014l475733k805319
11354E697872j347912M4883P16358q12300l787582m784826k387876R21210K767891
$$ plain form
11415 3211053 2486350 2494957 5295993 9130606 10281984 7283014 1763983 -3264823 -4880694
11406 -4880694 -2358215 1002141 968425 -1566389 -1307403 3056410 5814075 2551616 -3080452
11397 -3080452 -5070593 -3518150 -2562775 -3203582 -3439719 -2872678 -1870546 1319316 6930048
11388 6930048 9511768 3998565 -5321730 -8630918 -3159192 4309854 7555978 7140716
11380 7140716 5782351 3990502 2322870 2621226 4669730 5790743 5307205 5337288 6210342
11371 6210342 5714936 3895391 3487480 4282180 2660891 -1304968 -2280476 1770500 5286203
11362 5286203 3588682 551343 2598928 8888283 13002938 11978924 8503191 5697872
11354 5697872 4349960 4394843 5111201 4298901 511319 -4273507 -6661383 -5740173 -2972282
11345b972282L305593K831585Q94799j312780j610819o62213j136690k613374
11337c276181j959634O49101J399604l81412q31786J351329K472869J018128R30974
11328A372992L954535M850832m58205o996004p103132j198625L825685M346915
11320B594993K339613O7740j673849j424653J128839K218489j455551o062571
11312b266950m740247J689070M794818O61363m602270m188758M31420L666812
11304d554742L958306L042792R35718k848831n380569l193255J783490M153839
11296b103252K705607J384403K266795K493786j23064k842586k244225L85682
11288A923146J294157L8752l69938J507387L309174K202320j283765l647619k342121
$$ plain form
11345 -2972282 333311 3164896 4059695 2746915 1136096 473883 -662807 -3276181
11337 -3276181 -5235815 -4586714 -3187110 -3568522 -4400308 -3048979 -576110 442018 1372992
11328 1372992 5327527 10178359 9720154 2724150 -4378982 -5577607 -1751922 2594993
11320 2594993 4934606 5002346 3328497 1903844 3032683 5251172 3795621 -2266950
11312 -2266950 -7007197 -5318127 -523309 138054 -4464216 -8652974 -8221554 -4554742
11304 -4554742 -596436 2446356 3382074 533243 -4847326 -8040581 -6257091 -2103252
11296 -2103252 602355 1986758 4253553 6747339 6624275 3781689 1537464 1923146
11288 1923146 3217303 3256055 2886117 4393504 7702678 9904998 8621233 4973614 2631493
11279B631493J021319K148650m34596k675821l49709L807539K792356l958774
11271D982457p953621l106288N008548O688829J378413l163072k889078j103368
11263a57180k86725J654511M848175M563752j104488o506764o121334k281598
11255e391651k67375M5800J730717L365450J026456l735440m869585r93548K621713
11246f467463K278364K42627q68641k245646m236079k935764L541027R211062
11238a480513O885988j019349m860970j070481L563819L022526P77079K424276
11230H242375M963261J258241o963892r530994k613196N171557N305919P68537
11222F601808j031671n34219k923963o581011m527379L058865P288321L567350
$$ plain form
11279 2631493 3652812 5801462 5366866 2691045 2341336 6148875 8941231 4982457
11271 4982457 -2971164 -6077452 -1068904 5619925 6998338 3835266 946188 -157180
11263 -157180 -443905 1210606 6058781 10622533 9518045 3011281 -3110053 -5391651
11255 -5391651 -5659026 -5613226 -3882509 -517059 509397 -3226043 -8095628 -9089176 -6467463
11246 -6467463 -4189099 -3946472 -4815113 -7060759 -11296838 -14232602 -10691575 -1480513
11238 -1480513 5405475 4386126 -474844 -1545325 2018494 5041020 5818099 8242375
11230 8242375 13205636 14463877 7499985 -2031009 -4644205 527352 5833271 6601808
11222 6601808 5570137 5035918 2111955 -4469056 -8996435 -5937570 1350751 4918101
11214D918101k088423l124439j411703j380490j601399J388863N142693M132587
11206E975790j339541n139765l780961K7830K549343L528644M333365M490665
11198A0645370K047964l174073p743183p234150j721840K811198J407688k605171
11190e566197j809696L926894O389675J435653m038869k206042L965852N468763
11182G566033L83378m625165m556327j425923P21690Q32689k6486o22429J58942
11173a593598K095870K662960j8972l740494m584877k136439O49012K007424K551845
11164b107269K529490J380708j09826m36263j87669j352512l743926m732145k687580
11155a1446992J294012M749414N331739K239949j883929k436913J189665L504903
$$ plain form
11214 4918101 2829678 -294761 -1706464 -3086954 -4688353 -3299490 1843203 5975790
11206 5975790 4636249 -503516 -4284477 -4256647 -1707304 1821340 6154705 10645370
11198 10645370 12693334 9519261 1776078 -5458072 -7179912 -4368714 -2961026 -5566197
11190 -5566197 -7375893 -3448999 2940676 4376329 337460 -1868582 2097270 7566033
11182 7566033 7949411 3324246 -1232081 -2658004 -1936314 -1103625 -1130111 -1752540 -1593598
11173 -1593598 502272 3165232 3146260 -594234 -5179111 -7315550 -6666538 -4659114 -2107269
11164 -2107269 422221 1802929 1693103 1256840 1069171 -283341 -4027267 -8759412 -11446992
11155 -11446992 -10152980 -5403566 -71827 2168122 284193 -2152720 -963055 2541848
11147B541848K14886m857055m747229O25284M830781M434237K323417J253187
11139F619356j78093l385128o260132o086383k909167J465152N070616N600612
11131f3167J859152l465164n389240k193494K912548O089989O173884L598525
11123I523033n66581l810311l735030j456381n02784j538005j424524J389682
11115b120901L960177L068457m61671l507566m363054l051925j72899K747915
11107c901467L578672J998826J79358k91180n66841k074912l398666j846796K320422
11098d002584N381621M564445J508325j60425P2135n44233k645229k804616M15801
11089A785240K240382j346991n406991k455499M260215L763416m943993r332063
$$ plain form
11147 2541848 2756734 -2100321 -6847550 -6222266 -1391485 3042752 5366169 6619356
11139 6619356 6441263 3056135 -3203997 -9290380 -12199547 -10734395 -5663779 -63167
11131 -63167 1795985 -1669179 -7058419 -9251913 -6339365 -249376 5924508 9523033
11123 9523033 8956452 5146141 1411111 -45270 -548054 -2086059 -3510583 -2120901
11115 -2120901 1839276 4907733 4446062 938496 -3424558 -6476483 -6649382 -3901467
11107 -3901467 -322795 1676031 1855389 1564209 997368 -1077544 -4476210 -6323006 -4002584
11098 -4002584 1379037 5943482 7451807 7291382 7363517 6819284 4174055 1369439 1785240
11089 1785240 4025622 2678631 -2728360 -5183859 -923644 2839772 -2104221 -11436284
11081a1436284k313352O353539N575013m32799j765855j93844l314017p738041
11073a5265640l771211N992978Q689922J853322l149618l04174L097405J353689
11065a503327p81542N81794J147654j311404j251589L266042M774361o05561n187869
11056h71441k738541J111636K08428r34851K656932N151879M55365m977101k577556
11047b515250K863838J689408l363438k858110J778583J761880j796107j99160
11039b638356N318948M868404j582932l664319P4175m71759o756102o535750M212924
11030g174767J1468412N326944l418562j763485L711261n21634j0191072r424194
11022a1987097K696470R861935L431870o115847o538710O9054M344062L256094
$$ plain form
11081 -11436284 -13749636 -7396097 -1821084 -2253883 -4019738 -4213582 -7527599 -15265640
11073 -15265640 -19036851 -13043873 -4353951 -2500629 -5650247 -5954421 -2857016 -1503327
11065 -1503327 -2284869 -1703075 -555421 -1866825 -3118414 147628 4921989 4316428 -871441
11056 -871441 -3609982 -2498346 -2289918 -3224769 -567837 4584042 5039407 62306 -2515250
11047 -2515250 348588 2037996 -1325442 -4183552 -2404969 -643089 -2439196 -2638356
11039 -2638356 2680592 7548996 5966064 2301745 2375920 1904161 -4851941 -11387691 -7174767
11030 -7174767 4293645 9620589 6202027 4438542 8149803 7628169 -2562903 -11987097
11022 -11987097 -9290627 571308 4003178 -2112669 -8651379 -8582325 -4238263 -982169
11014i82169J23778k346282l019042q42819K810473L933636J582135j83915O32757
11005A708552j68102n361693r226211m746286M866581R241914M888094q70888
10997C31961j072126K308681L644713J971163l5919j402517k603170k531014k68230
10988C43542J714109N99458j442446L64229N595729P879644L423933l547650o259305
10979H671243l661307o15502j188106m165255n227034k358334J563077K170842
10971d810376m70098j506542J564694M294811J703091l041046k490381K987630
10963a768217M532690j516829o875128l407204M296450N771812R5536l958458
10955b829348j662523K263021K835322J607455J434175Q49736k044479m599048
$$ plain form
11014 -982169 -858391 -3204673 -6223715 -7066534 -4256061 -322425 1259710 1075795 1708552
11005 1708552 1540450 -3821243 -13047454 -17793740 -12927159 -3685245 1202849 331961
10997 331961 -740165 1568516 5213229 7184392 7148473 5745956 3142786 611772 343542
10988 343542 2057651 2657109 1214663 1578892 7174621 15054265 18478198 14930548 8671243
10979 8671243 5009936 4394434 3206328 -958927 -6185961 -8544295 -6981218 -4810376
10971 -4810376 -5280474 -6787016 -5222322 -927511 775580 -2265466 -4755847 -1768217
10963 -1768217 2764473 1247644 -5627484 -9034688 -4738238 1033574 1129110 -2829348
10955 -2829348 -4491871 -2228850 606472 2213927 3648102 4497838 2453359 -2145689
10947b145689l333476M2052Q83330j397088k617691R1155M692559P221496O135269
10938I571917K993713J72467j447027k938523n358789p203372n223886R30390
10930h503110O288613N313149j122576o181740n234020j006748J100763M19430
10922h926239N09395K359516K354979j652016n817898m955515J70622L803173
10914a2153983L010037R14851J247171L010502K897382Q00890k78079P42607J222297
10905A413675r81338l718662l048821J191357M530935L296488o57900k263042
10897b37308L39396L662101L542467J30142k928861l013783q48915R43861M47495
10888B036595j802946k953627p47980L134671M560948K723171J482254K737192
$$ plain form
10947 -2145689 -5479165 -5437113 -4553783 -5950871 -8568562 -8477407 -3784848 3436648 9571917
10938 9571917 12565630 12738097 11291070 8352547 2993758 -4209614 -9433500 -8503110
10930 -8503110 -2214497 3098652 1976076 -4205664 -9439684 -10446432 -9345669 -8926239
10922 -8926239 -8416844 -6057328 -3702349 -5354365 -11172263 -16127778 -15957156 -12153983
10914 -12153983 -9143946 -8229095 -6981924 -3971422 -1074040 -273150 -551229 191378 1413675
10905 1413675 432337 -3286325 -6335146 -5143789 -612854 2683634 2025734 -237308
10897 -237308 102088 3764189 7306656 7436798 4507937 1494154 645239 1589100 2036595
10888 2036595 233649 -2719978 -3467958 -333287 4227661 6950832 8433086 11170278
10880A1170278K251191l286297q304025m811819M018098N677384l590727j1333884
10872h209801n817815O549604R941410J527397n628666k346819M674849M929656
10864E619815n76569l414800j581210m48784k003858j980135J313533L085472
10856A3464J41460l314326k380956P93121J208009n84981k93561K053541K348099
10847a6130P1704p45707J138842K118149O08490p9851J629918J905679j714388
10838D916706m976988l159193J330589K782493O18211j195421q49057L38795J843361
10829A649496L664614L455672q51356o146796o797993k198321K571546L573095
10821a080043J574013j042507k963493l328444j833895L11079J982015L771517
$$ plain form
10880 11170278 13421469 10135172 1831147 -2980672 1037426 6714810 3124083 -8209801
10872 -8209801 -14027616 -7478012 2463398 3990795 -1637871 -3984690 690159 5619815
10864 5619815 5043246 1628446 47236 -401548 -2405406 -4385541 -3072008 13464
10856 13464 154924 -3159402 -5540358 -4747237 -3539228 -4124209 -4417770 -2364229 -16130
10847 -16130 55574 -690133 448709 2566858 3175348 3095497 4725415 6631094 4916706
10838 4916706 -60282 -3219475 -1888886 893607 1511818 316397 -532660 -193865 1649496
10829 1649496 5314110 8769782 7918426 1771630 -5026363 -7224684 -4653138 -1080043
10821 -1080043 493970 -548537 -3512030 -6840474 -8674369 -8363290 -6381275 -2609758
10813b609758N478786M136571j521865o658311n343093J168998O056723N907048
10805F615099L156703M96175j760382k998752k230399q50113r80798j490906j12530
10796a55903J618747O56345j673733j829609p05724j697794l420918j641327K302486
10787f547430K855761j50320j362465M11346Q54747q92177q21515J231094P41021
10778c679938j935119q77610M039497N183866j7494m336843k935715k61244j62077
10769d982677M53490K640815J016663m845148n616511K687742R301189M494343
10761E149906m689702n871674l09658K058990k309R8591K830425K475403j179898
10752E60074k620947p05919R25135J679025K971235K066998l377074p716834m683402
$$ plain form
10813 -2609758 2869028 7005599 5483734 -1174577 -6517670 -5348672 708051 6615099
10805 6615099 9771802 10267977 8507595 5508843 3278444 2428331 1447533 -43373 -155903
10796 -155903 1462844 2119189 445456 -1384153 -2089877 -3787671 -7208589 -8849916 -6547430
10787 -6547430 -3691669 -3841989 -5204454 -4793108 -3938361 -4830538 -5652053 -4420959 -3679938
10778 -3679938 -5615057 -6492667 -2453170 2730696 2713202 -1623641 -4559356 -4820600 -4982677
10769 -4982677 -4529187 -1888372 -871709 -5716857 -11333368 -8645626 655563 5149906
10761 5149906 460204 -5411470 -5721128 -3662138 -3664447 -3565856 -735431 1739972 560074
10752 560074 -2060873 -2766792 -1841657 -162632 2808603 4875601 1498527 -6218307 -10901709
10743a0901709Q51331l1415m427114k046496O105610Q190593J552191k738117
10735c445126J114594M485560K84450m877108k782773K608297K952358o99299
10727c59047j523840J020276J788665o93793l225155m186104m399318l370191
10719a4948507j94019L079054L727693K770583K874826L317360J530285j360266
10711G97009j425046J469042K566369p35842m457757l382508J366785L530790
10703b71158J81514m375952m615135r91819J731778J646065J192634J859810J892173
10694a750090L60502q42344r55480j958607l703152k185560L411188O563553J969700
10685I09710n064706m666663L501562R201769N463883k702133n962484k494467
$$ plain form
10743 -10901709 -10050378 -10081793 -14508907 -16555403 -10449793 -2259200 -707009 -3445126
10735 -3445126 -2330532 2155028 2439478 -2437630 -5220403 -2612106 340252 -359047
10727 -359047 -1882887 -862611 926054 232261 -2992894 -7178998 -11578316 -14948507
10719 -14948507 -15142526 -12063472 -8335779 -5565196 -2690370 626990 2157275 797009
10711 797009 -628037 841005 3407374 2671532 -1786225 -5168733 -3801948 -271158
10703 -271158 -89644 -4465596 -9080731 -10072550 -8340772 -6694707 -5502073 -3642263 -1750090
10694 -1750090 -1389588 -2231932 -3187412 -5146019 -8849171 -11034731 -7623543 -1059990 909710
10685 909710 -4154996 -8821659 -5320097 3881672 9345555 6643422 680938 -1813529
10677a813529J518851J073022j770362j798632J781156M215808K046160j741571
10669C510903k159491K65666Q48591j323097k345270p72002J37868r12195n76984
10660c326011K375957L726040R30363k083970j562329n8439j184599l125240k450734
10651f758962m8069J646410L081377M576581L485673o93481l191339j231188N87019
10642A454021k055723n314399l573476J029992K663065J226559L26799m31684
10634d674846l286081n337341j713579N739720R732002O634618o51441p048038
10626f04986q293474k733454N412434Q143123L251807k425993l070281j348030
10618a668854j492853k019155r35581p98195k306322p83894M233624M914741j567376
$$ plain form
10677 -1813529 -294678 778344 -992018 -2790650 -1009494 3206314 5252474 3510903
10669 3510903 1351412 1617078 2465669 1142572 -1202698 -1974700 -1836832 -2749027 -3326011
10660 -3326011 -950054 2775986 3706349 1622379 60050 1611 -1182988 -4308228 -6758962
10651 -6758962 -6807031 -5160621 -2079244 2497337 5983010 5289529 2098190 867002 1454021
10642 1454021 -601702 -5916101 -9489577 -8459585 -5796520 -4569961 -4243162 -4674846
10634 -4674846 -7960927 -13298268 -15011847 -9272127 459875 7094493 6443052 -604986
10626 -604986 -8898460 -11631914 -6219480 1923643 5175450 2749457 -320824 -1668854
10618 -1668854 -3161707 -5180862 -6116443 -6914638 -9220960 -10004854 -5771230 -856489 -2423865
10609b423865n716057j173454L315558q72981o024882j541834O331587N002475
10601c103453k328736l196011J664544J518630k984866j485516N095005N058667
10593B38264k503991n673998o81899L159841J667574J331973L800218K165477
10585C503459l426607l385666L367585N434503j394783o272042j879698L881329
10577a71920K712179q07557L92355L167171R12070m912810p630628m369161K296283
10568h412018P156889N509836j303183m815335m66841L951678j22955p079727
10560e581656n888479J066584K663970j146925p70480L956563L712441j734829
10552c722811k662252K032992K769472k620162n520424k961934j160625j486475
$$ plain form
10609 -2423865 -8139922 -9313376 -5997818 -6870799 -12895681 -14437515 -8105928 -3103453
10601 -3103453 -5432189 -8628200 -6963656 -5445026 -8429892 -9915408 -4820403 238264
10593 238264 -2265727 -7939725 -8621624 -5461783 -3794209 -2462236 1337982 3503459
10585 3503459 76852 -3308814 58771 5493274 4098491 -2173551 -4053249 -171920
10577 -171920 2540259 1732702 2125057 5292228 6204298 1291488 -6339140 -10708301 -8412018
10568 -8412018 -1255129 4254707 2951524 -1863811 -2330652 1621026 1498071 -5581656
10560 -5581656 -11470135 -10403551 -7739581 -8886506 -9656986 -5700423 -1987982 -3722811
10552 -3722811 -6385063 -4352071 -1582599 -4202761 -9723185 -12685119 -13845744 -15332219
10544a5332219Q55049L769952P20249m117311q18949P067020O997110l72563l500582
10535d732244k167192n172229q426470m63993J1624520R175743m974896r243559
10527a4380320l87493K819110m253519m924878M542193P022128j674459m631784
10519a5869022K021272J106381r872844j0536107L575510J0169988O44229n375572
10511b4136165J186224L739806l014735j493780R403858O654606j0309941j2404084
10503c0374211L821641N915300j1531629j2844980P772951Q493350j8093032k1201270
10495f8041880J1241058J7589536k2888735l7026014N503667R015953q1531529
10488a66137944j31529512M853648K20921340K62094384Q2965588r1017671q9868289
$$ plain form
10544 -15332219 -14477170 -10707218 -9986969 -14104280 -14923229 -7856209 -859099 -1231662 -4732244
10535 -4732244 -6899436 -12071665 -20498135 -20962128 -9337608 -161865 -5136761 -14380320
10527 -14380320 -14767813 -11948703 -16202222 -21127100 -16584907 -9562779 -11237238 -15869022
10519 -15869022 -13847750 -12741369 -22614213 -33150320 -29574810 -19404822 -18760593 -24136165
10511 -24136165 -22949941 -19210135 -22224870 -23718650 -14314792 -7660186 -17970127 -30374211
10503 -30374211 -26552570 -20637270 -32168899 -45013879 -37240928 -28747578 -46840610 -68041880
10495 -68041880 -56800822 -39211286 -62100021 -99126035 -93622368 -84606415 -166137944
10488 -166137944 -297667456 -292813808 -71892468 190201916 273167504 182149833 92281544
10481I2281544l165673J4411369k5659889k5698968J1307667J2495971k0381004
10474E5591017k5409368M30563O123457j3086334j4742348N618126J0914665l785284
10466B1654494o532100P041447Q960774l901359n944013N162353N502006o709911
10458B5233691q567023J974570L474973o065648o540069L735280N530200k748091
10450A6027883l029320N113691L109089q920497r929891L339390J0263535L190930
10442A9164810k244674J711816M125995M66714k17390K507507j656728j0245376
10434A3612674q991520J047595L794074k367091k661728M209983K835127q057653
10426C421461j0269272J526298R493984L319328m272326k292973J834270P09864
$$ plain form
10481 92281544 89115871 103527240 77867351 52168383 63476050 75972021 55591017
10474 55591017 30181649 30612212 36735669 23649335 8906987 14525113 25439778 21654494
10466 21654494 15122394 22163841 31124615 27223256 21279243 26441596 31943602 25233691
10458 25233691 16666668 18641238 22116211 16050563 9510494 13245774 18775974 16027883
10450 16027883 12998563 18112254 21221343 12300846 2370955 5710345 15973880 19164810
10442 19164810 16920136 18631952 22757947 23224661 23007271 25514778 23858050 13612674
10434 13612674 4621154 5668749 9462823 7095732 4434004 8643987 11479114 3421461
10426 3421461 -6847811 -5321513 4172471 7491799 3219473 926500 2760770 3470634
10418C470634M06338M790927N848863j03788m124377j526700j92885l986624m710930
10409a28542J367207N351550K015082j495966p58782k074654p601525q128851
10401a1454481O14685Q762921Q054170L631560K141885Q68321l174106n236756
10393D208199j976197J760755J900649J105285R10992j571317n042367l470084
10385b174085K070748L103736j160154j663648L592335M920960j365846n459566
10377A864480j379163K514533j022484n326228k317218L617200M369911J213701
10369C534732l50801n74129j726914j925309j26508J33297j631230K34875O571394
10360D139407Q418757O45118p885798o344996K742895Q502086O345447Q4600n570788
$$ plain form
10418 3470634 3876972 8667899 14516762 14412974 10288597 8761897 8569012 4582388 -128542
10409 -128542 1238665 6590215 8605297 7109331 6350549 4275895 -3325630 -11454481
10401 -11454481 -10839796 -2076875 5977295 9608855 11750740 12619061 9444955 4208199
10393 4208199 2232002 3992757 5893406 6998691 7909683 6338366 1295999 -2174085
10385 -2174085 -103337 3000399 1840245 176597 3768932 8689892 7324046 1864480
10377 1864480 485317 2999850 1977366 -3348862 -5666080 -2048880 2321031 3534732
10369 3534732 3183931 2609802 882888 -1042421 -1168929 -1035632 -2666862 -2431987 4139407
10360 4139407 12558164 13203282 5317484 -1027512 1715383 10217469 16562916 16647516 11076728
10351A1076728p695535m619192J232440L593571R5978m021989l450221L34690
10343c453530K826321K540849O84342r07237n8862K999940L521712j259389n302176
10334A591970j704051M729981L974152j612314k14310Q074013R029174k072973
10326B1795642j1072813p206346M55194l68168n372671l518816L639331O375034
10318D726387L482630J451404J786835Q77112j064614j235263j282021l904203
10310D838267n657999k001344L578296M189519N72051j003035M48386M18222j899659
10301C482704k329439O06888L480490L574873J554550j011940k556995j324627
10293E476504J736172K076353k202007n866466l270295K859743M818767N91350
$$ plain form
10351 11076728 3381193 -1237999 -5559 3588012 3683990 -337999 -3788220 -3453530
10343 -3453530 -627209 1913640 2597982 1690745 1631883 4631823 8153535 6894146 1591970
10334 1591970 -112081 4617900 8592052 6979738 6765428 14839441 23868615 21795642
10326 21795642 10722829 3516483 3971677 3603509 -1769162 -5287978 -1648647 4726387
10318 4726387 8209017 9660421 11447256 12324368 11259754 10024491 8742470 4838267
10310 4838267 -819732 -2821076 757220 4946739 5518790 4515755 4964141 5382363 3482704
10301 3482704 1153265 1760153 5240643 8815516 10370066 9358126 6801131 5476504
10293 5476504 7212676 9289029 7087022 1220556 -2049739 810004 5628771 6220121
10285F220121m142182m032697L29645M612378N198502J770864k288766l050033
10277D617832j024679p55906l840273n763130k452647L342150N896021M181064
10269D200432J725746M48567j278031m475536o569769l990845K800555Q118945
10261I80064O669600N11975k758427k62424K321118N10624j283415J815220M886169
10252A3390504R06096n647886m680642K325756M198044j057993l506773M64084
10244F391190J904337l820317q057371l864122K717275M402949L912014M924821
10236H510776L406832k392672m515340J312398N616748M69292n689964k318019
10228D400051L999063Q84441p114345n674720L980444O437766j906856p204446
$$ plain form
10285 6220121 2077939 -1954758 -1625113 2987265 8185767 9956631 7667865 4617832
10277 4617832 3593153 2837247 -1003026 -6766156 -9218803 -5876653 19368 4200432
10269 4200432 5926178 6374745 5096714 621178 -5948591 -9939436 -7138881 980064
10261 980064 7649664 8161639 5403212 5140788 7461906 7972530 6689115 8504335 13390504
10252 13390504 14296600 8648714 3968072 6293828 10491872 9433879 5927106 6391190
10244 6391190 8295527 4475210 -3582161 -7446283 -4729008 -326059 3585955 8510776
10236 8510776 11917608 9524936 5009596 6321994 11938742 12408034 6718070 4400051
10228 4400051 8399114 9283555 2169210 -3505510 474934 6912700 5005844 -2198602
10220b198602j374384O292140O224922K232423Q34618k51824m312894o526576
10212I19823k057954M032029L953814p99668k717374P752K470305J735653l1873
10203G512507n68001m84302q63043j361444j257418l18209J382997K976414K487666
10194I507167j253907o140110p593345l083608M198966P552981L884447k361982
10186D710609m407330j382079J790181K207476J946942K309111Q03091l086754
10178D891247m514198m20134M269258L346604j018466j752870K001453M093464
10170A0896358J275947k617185l484508k444319k442826l420281l241241j070617
10162f548672J859724L527450K665852K40542r49918M37258K223466J646298p06151
$$ plain form
10220 -2198602 -3572986 2719154 8944076 11176499 12011117 11759293 7446399 919823
10212 919823 -1138131 2893898 6847712 6048044 3330670 3338422 5808727 7544380 7512507
10203 7512507 6944506 6460204 5597161 4235717 2978299 2660090 4043087 7019501 9507167
10194 9507167 8253260 2113150 -5480195 -8563803 -4364837 3188144 7072591 4710609
10186 4710609 303279 -1078800 711381 2918857 4865799 7174910 7978001 4891247
10178 4891247 377049 -43085 4226173 7572777 6554311 4801441 6802894 10896358
10170 10896358 12172305 9555120 6070612 3626293 1183467 -2236814 -5478055 -6548672
10162 -6548672 -4688948 -1161498 1504354 1744896 794978 1232236 3455702 5102000 4395849
10153D395849j949097q75827J290288L188600M139613L375719N51139l233408
10145A0882876o094925o480282l465380K012919N852043L957579j878951m770672
10137A5207j502953L068725L069259o21156l154617k990395k187321j804569j212215
10128g320035n25621k83568Q8377J043912J922747K964048N350264P345685M625492
10119A5211301k581854p415552n513324j435116r67357j974151N07613M320925
10111A52485L427889j367791l323032n96597J757433J030240O60700L139175N380653
10102A0261155L707197r71728n030587n998299l520247O70262L294157K575710
10094D987620M88725l05645l30635j254335k109502j304879k44857o77434p51637
$$ plain form
10153 4395849 2446752 1570925 2861213 6049813 10189426 13565145 14116284 10882876
10145 10882876 4787951 -1692331 -5157711 -3144792 2707251 6664830 4785879 15207
10137 15207 -1487746 1580979 4650238 4029082 874465 -2115930 -4303251 -6107820 -7320035
10128 -7320035 -7845656 -8129224 -8040847 -6996935 -5074188 -2110140 3240124 10585809 15211301
10119 15211301 12629447 5213895 -299429 -1734545 -2701902 -4676053 -4168440 152485
10111 152485 3580374 2212583 -1110449 -1707046 50387 1080627 1741327 4880502 10261155
10102 10261155 13968352 12996624 7966037 1967738 -1552509 -882247 2411910 4987620
10094 4987620 5476345 5170700 4840065 3585730 1476228 171349 -73508 -750942 -1502579
10085a502579J434130K933895N15290k234345M92638O375535P149073J174611
10077A6338248m248751m466509l326303m584680m959289n79995N097051N465095
10069D734867O1499m997187m810206p48424K133105J111538j264375p58559K199164
10060b338578K573330j244319l634875j60467M340065K661213k704305k874753
10052c382689K976078N909806J488755l465980k139128K341223L566379J933077
10044I227521J758087K942851K053376r65981k916281k643547j525787l948J992867
10035I919158K170492k025578q210536r894301m029022M530614P821773L298037
10027C580637l655503n897130k284110K037300K827178J685869K309643M390054
$$ plain form
10085 -1502579 -68449 2865446 3380736 1146391 1639029 8014564 15163637 16338248
10077 16338248 12089497 7622988 4296685 -287995 -5247284 -5827279 -730228 4734867
10069 4734867 4796366 -200821 -5011027 -5759451 -3626346 -2514808 -3779183 -4537742 -2338578
10060 -2338578 234752 -1009567 -4644442 -4804909 -464844 2196369 -507936 -3382689
10052 -3382689 -406611 5503195 6991950 3525970 1386842 3728065 7294444 9227521
10044 9227521 10985608 13928459 15981835 15015854 12099573 9456026 7930239 7926291 9919158
10035 9919158 12089650 10064072 1853536 -8040765 -12069787 -7539173 282600 3580637
10027 3580637 -74866 -5971996 -8256106 -6218806 -3391628 -1705759 603884 4993938
10019D993938M419247J278962k375491l920605l094897r33854J017200J080001
10011B464501m83418r21468R40052K109444K21470j794708n34333J187232j206742
10002A982030m995163l401070K722843N130641J248958j853865N39270L358522
9994D732166R67785l552248m165339j173517J187291J839210J908291P39030j661169
9985H21500j958085J283774L403963M35955l469459j884255L564770N791429L221445
9976A1211037P28143M35795p44669l703767m560514j759792L94444j492836m398498
9967c890657l777350m29062J398721O07942K02598K299559N128876N565743L145812
9958A0252182N93628L40503J169808k87342m281353o319418k894705K900935M806479
$$ plain form
10019 4993938 9413185 10692147 8316656 4396051 1301154 367300 1384500 2464501
10011 2464501 1981083 1059615 1999667 4109111 4330581 2535873 2001540 3188772 1982030
10002 1982030 -3013133 -6414203 -3691360 1439281 2688239 834374 1373644 4732166
9994 4732166 5699951 2147703 -2017636 -3191153 -2003862 -164652 1743639 2482669 821500
9985 821500 -1136585 147189 3551152 3987107 517648 -1366607 2198163 7989592 11211037
9976 11211037 11939180 12374975 11630306 7926539 3366025 1606233 2000677 507841 -3890657
9967 -3890657 -7668007 -8097069 -6698348 -6090406 -5887808 -3588249 1540627 7106370 10252182
9958 10252182 10845810 11186313 12356121 12068779 7787426 1468008 -1426697 1474238 6280717
9949F280717J716903j349551j043317j29730j974945m289142k262082L762400
9941G11253P848729N863683J67170l988227m329340k462125p17718l1301k66201
9932B795923r38375j486053j693916j802510j640563k30408K665588N114737M781349
9923G565772K217045N70739J266563J754212q20478m906153n843670j981897K605154
9914B427287K781786j391637m798753l585291M86418L013998K710212J940985
9906C585005K151185J840724q5437k000005k450705k590601l157407j860901K497098
9897b071044N722730L034878l056966n181777j375257K611758K155356n58183
9889A281495j579874r78067q34755j188382o26908J419112M143777N111625J643704
$$ plain form
9949 6280717 7997620 6648069 5604752 5475022 3500077 -789065 -3051147 711253
9941 711253 8559982 14423665 14590835 10602608 6273268 3811143 3093425 3062124 2795923
9932 2795923 1857548 371495 -1322421 -3124931 -4765494 -4995902 -2330314 2784423 7565772
9923 7565772 9782817 10353556 11620119 13374331 12553853 7647700 1804030 -177867 2427287
9914 2427287 5209073 3817436 -981317 -4566608 -4080190 -1066192 1644020 3585005
9906 3585005 5736190 7576914 7491477 5491472 3040767 450166 -2707241 -4568142 -2071044
9897 -2071044 3651686 6686564 3629598 -1552179 -2927436 -315678 1839678 1281495
9889 1281495 -298379 -1276446 -2111201 -3299583 -3926491 -2507379 1636398 6748023 8391727
9880H391727m114391m480116L149385Q852172L709012k493391P031002K5644786
9872D5690186K4850598m548831l2560375k8127046j903465J0688984p24468j3349250
9864A6333r642071J530274O072431M723481L284030L53215m847577n849870j02578
9855d462332M110260P96070l673624k082477J741903J532573M9269K238789M742272
9846D992703K292527j847982j729345M55821r35415m081467l031218J590722M148005
9837A854351L405590K304014J140972j425408l448867k928812k540143m000071
9829e638374k312135N648177J1513638N475123o912958j0345354j868908N161185
9821G20394J531921n317847m390421L005795P533013N373377L50681l495596n082992
$$ plain form
9880 8391727 4277336 -202780 2946605 11798777 15507789 13014398 20045400 45690186
9872 45690186 70540784 65991953 33431578 5304532 3401067 14090051 13365583 16333
9864 16333 -9625738 -8095464 -2023033 2700448 5984478 6337693 1490116 -4359754 -4462332
9855 -4462332 -352072 443998 -3229626 -5312103 -3570200 -2037627 -1988358 250431 4992703
9846 4992703 7285230 5437248 3707903 4163724 3228309 -853158 -3884376 -2293654 1854351
9837 1854351 5259941 7563955 8704927 7279519 3830652 901840 -1638303 -5638374
9829 -5638374 -7950509 -2302332 9211306 14686429 7773471 -2571883 -4440791 720394
9821 720394 2252315 -3065532 -7455953 -4450158 3082855 8456232 8806913 5311317 228325
9812B28325m150026j176272J340979J227471k23589j73033J285306J303694r28201
9803a265346k205676K54289L899441L282563k023505n244215j045630O234241
9795A886162P825839K715377j614055r09291O56562o41634j629186O78753K375286
9786A1343813n83336m400547l326817Q46316K535203J749457J829634J231293
9778A1225016l426253q253825n741146K740919P301980L432968k740872m598940
9770f0153k649784j28740J719890J738897j070570l586381j285765L460446L207505
9761A345345k451939m950159k11847M725280L562621N50813J426530K373139k640399
9752C729384r099709p324332J783739O899994K533816m110170m682556l13023
$$ plain form
9812 228325 -3921701 -5097973 -3756994 -2529523 -2753112 -2926145 -1640839 -337145 -1265346
9803 -1265346 -3471022 -3216733 682708 3965271 1941766 -3302449 -4348079 1886162
9795 1886162 9712001 12427378 10813323 9904032 10560594 9918960 8289774 8968527 11343813
9786 11343813 10760477 6359930 3033113 3879429 6414632 8164089 9993723 11225016
9778 11225016 7798763 -455062 -6196208 -3455289 3846691 7279659 4538787 -60153
9770 -60153 -2709937 -2838677 -1118787 620110 -450460 -4036841 -5322606 -1862160 1345345
9761 1345345 -1106594 -6056753 -6268600 -1543320 2019301 2570114 3996644 6369783 3729384
9752 3729384 -5370325 -12694657 -10910918 -4010924 -1477108 -5587278 -10269834 -10582857
9744a0582857K854559K698615J293961O8941r19222j249408j099061k063011m097899
9735a3095382l707627J334807P075618P465522K870835j23979J833732M454884
9727H108410L105767k33292j403885j503289m015896o945177m949583J030418
9719f806527L754138P29534k043052j97848K401976J546064J62330J930306L619938
9710E096859J176219j737013K45711L738007J683766l860837m390453O95513L158492
9701E806264m0557k512511m94119J282924m74455j577671P72772K014698r80785
9692C796560l310297q57893J869991J87723j550346K147095O810363M670625j974992
9683A1788829m492628k177613j924993m744773l842035K495254O590278L483116
$$ plain form
9744 -10582857 -7728298 -5029683 -3735722 -3666781 -4586003 -5835411 -6934472 -8997483 -13095382
9735 -13095382 -16803009 -15468202 -8392584 -927062 1943773 1819794 3653526 8108410
9727 8108410 11214177 10980885 9577000 8073711 4057815 -2887362 -7836945 -6806527
9719 -6806527 -3052389 -2322855 -4365907 -4563755 -2161779 -615715 -453385 1476921 5096859
9710 5096859 6273078 4536065 4781776 8519783 10203549 6342712 1952259 2647772 5806264
9701 5806264 5765707 3253196 2759077 4042001 3567546 1989875 2762647 4777345 3796560
9692 3796560 486263 -371630 1498361 1686084 135738 2282833 9093196 13763821 11788829
9683 11788829 7296201 5118588 3193595 -1551178 -5393213 -2897959 3692319 7175435
9675G175435j441869j596593J238350J879928O00615R89809K691603K191629r46378
9666A2782529l461773l254724j296093P54732K012254J870355K82967j696473
9658G993774k998560l509551l208841j825813k17138k669o62820L54599K919348
9649a157671K940601j161406m070956m32595O210278P328419J572277l514072
9641G714875k899441l96738p55362k023194q26031K31236k629630n778143k521722
9632i884150N279437Q293424L185445k900516l547637j143190p4012Q20458L387419
9623C416678L982951n84972n335949l384127K679735L940293j364665n782040
9615b432096m456833r58889N02674J078440K268486J663781j835751l915537j024251
$$ plain form
9675 7175435 5733566 4136973 5375323 7255251 7855866 8845675 11537278 13728907 12782529
9666 12782529 9320756 6066032 4769939 5524671 7536925 9407280 9690247 7993774
9658 7993774 4995214 1485663 -1723178 -3548991 -3766129 -3768798 -4431618 -4077019 -1157671
9649 -1157671 1782930 621524 -3449432 -3882027 2328251 9656670 11228947 7714875
9641 7714875 4815434 4418696 3663334 1640140 814109 1045345 -1584285 -7362428 -9884150
9632 -9884150 -4604713 3688711 6874156 3973640 426003 -717187 -791199 29259 3416678
9623 3416678 7399629 6814657 1478708 -1905419 774316 4714609 3349944 -2432096
9615 -2432096 -6888929 -7847818 -7345144 -6266704 -3998218 -2334437 -4170188 -8085725 -9109976
9606i109976L298705L350556l77891k711261j584280N09264J653850K468536L141918
9597F39421K511919O70379n29942l45929k94605j621953l198468k840024l2608
9588e041810L263405M579411L609568K270016J614464Q7614l423037o297105n064258
9579d401732q50817J808684J502081J073866J872775J788327L17027K66569K039714
9570E416494J610848k367572m697917j427147L208187L065385o38243k355628
9562A814407j218156m67381m26244R35165K071429j46689l215672j325968M651811
9553B672702O877137J760581n266437q204569p228822m492835J67700N499337
9545h215206O711461K133069k380587r03123L946114N015760Q71209l303103l858823
$$ plain form
9606 -9109976 -5811271 -2460715 -2838606 -5549867 -7134147 -6624883 -4971033 -2502497 639421
9597 639421 3151340 3821719 3291777 2945848 2651243 1029290 -2169178 -5009202 -5041810
9588 -5041810 -1778405 2801006 6410574 8680590 10295054 10382668 6959631 662526 -4401732
9579 -4401732 -5252549 -3443865 -1941784 -867918 1004857 2793184 3110211 3376780 5416494
9570 5416494 7027342 4659770 -38147 -1465294 1742893 4808278 4170035 1814407
9562 1814407 596251 128870 -297374 637791 2709220 2562531 -653141 -1979109 2672702
9553 2672702 9549839 11310420 6043983 -2160586 -9389408 -13882243 -13714543 -8215206
9545 -8215206 -1503745 629324 -1751263 -2654386 1291728 6307488 7178697 3875594 16771
9536A6771k520504j767325q33775J856350M870131M734857M16959m527566n343107
9527c097209j723939J455530M51227k054745r37616L272250M694283Q73560l519392
9518e86051l627679o73721J574421K706813M136974M545838J521215l403091n568744
9509F25975l217266L44421J170191p65063k143308n13017K566985K951296q93125
9500A27089n082517m754019m92267K831803L162776K875359L023049J471913j431762
9491A731424j271521K880876M953081P78864m488164l856762P91694K443853K76289
9482D239634n60433J193094J404530j065026k179459k60088J124103j40122j067752
9473B688481Q82273L639047M321761K910095J99282l556166o131006m072363J738179
$$ plain form
9536 16771 -2503733 -4271058 -5104833 -3248483 1621648 6356505 6773464 2245898 -3097209
9527 -3097209 -4821148 -3365618 -2914391 -4969136 -5906752 -2634502 2059781 2933341 -586051
9518 -586051 -4213730 -4887451 -3313030 -606217 3530757 8076595 9597810 6194719 625975
9509 625975 -2591291 -2246870 -1076679 -1841742 -3985050 -4498067 -1931082 1020214 127089
9500 127089 -4955428 -9709447 -10201714 -7369911 -4207135 -1331776 1691273 3163186 1731424
9491 1731424 459903 3340779 8293860 9072724 4584560 727798 1519492 3963345 4239634
9482 4239634 3679201 4872295 6276825 5211799 3032340 2772252 3896355 3756233 2688481
9473 2688481 3570754 7209801 11531562 14441657 14640939 11084773 4953767 881404 2619583
9464B619583N526880M013741L39657j551255k000749k403960j479791J461962
9456F526068L244187J000176k928317m040128j723742R16939J654443Q54282n5237
9447E448671J24926J270901J260061j430696m194359k917133J337789K968479
9439C868639M15683j480915k4389P22629k186424m295966j046037L750303L449353
9430C172876j047951l297118j168575J788021K949956K484733K12034l545600
9422A548376n413955k861944Q56479J057077j041898j116922M64792L39289m61186
9413f629892J616839M764284L860506k15047j552718O37403J354010m47935n32711
9404B854739J224538j17576m055551l446271K613321N125932k78070n158851j671960
$$ plain form
9464 2619583 8146463 12160204 12499861 10948606 8947857 6543897 5064106 6526068
9456 6526068 9770255 10770431 7842114 3801986 2078244 2995183 4649626 5503908 5448671
9447 5448671 5573597 6844498 8104559 6673863 2479504 -437629 900160 3868639
9439 3868639 4284322 2803407 2779018 3501647 1315223 -2980743 -4026780 -276477 3172876
9430 3172876 2124925 -1172193 -2340768 -552747 2397209 4881942 5093976 1548376
9422 1548376 -3865579 -6727523 -5871044 -4813967 -5855865 -6972787 -6507995 -6168706 -6629892
9413 -6629892 -5013053 -248769 3611737 3396690 1843972 2481375 3835385 3387450 2854739
9404 2854739 4079277 3961701 -93850 -3540121 -926800 4199132 3921062 -1237789 -2909749
9395b909749M835560N084838J04546l099954l757190n125862n088459K01874O406268
9386c348128N630545m59822k598439J339471L917304J461861n26097J721345L334260
9377A0472300k93556n167009n060934q98688J894404J570179L08678r24697k753536
9368h52859m213888l480768j022173J069372J979264J874822J89556k827121m170038
9359a1453833j171830L978537O148600L709230l19j813089k017896j740540n22947
9350d884087J694804L112233K832282K516781K863867J355395l038438n860270
9342E92567k892696K212785K326228k067002l576002k34679J419339j720141l403070
9333g342671P07876M573482K162839j636967j68829K000718k612979q512991m314620
$$ plain form
9395 -2909749 1925811 7010649 7115195 4015241 258051 -4867811 -9956270 -9754396 -3348128
9386 -3348128 2282417 1822595 -775844 563627 4480931 5942792 5416695 7138040 10472300
9377 10472300 10178744 5011735 -49199 -947887 946517 2516696 2825374 1900677 -852859
9368 -852859 -5066747 -8547515 -9569688 -8500316 -6521052 -4646230 -4456674 -7283795 -11453833
9359 -11453833 -12625663 -8647126 -2498526 1210704 1210385 -602704 -2620600 -4361140 -4884087
9350 -4884087 -3189283 -77050 2755232 5272013 8135880 9491275 6452837 592567
9342 592567 -2300129 -87344 2238884 171882 -3404120 -3638799 -2219460 -3939601 -7342671
9333 -7342671 -6634795 -2061313 101526 -1535441 -1704270 296448 -2316531 -10829522 -15144142
9324a5144142O702944R325520O84991m811330P17734O223478J307756o413259
9316a406308m902132K829273N629391K174492p77554j801306l869084m624255
9308f747483Q8610N965608N012423j412543m799633k866831o05442K09043K171961
9299b984287M175140K498960p20101n8204K890435J817848k529677l549932j110017
9290D30165j096447k704151R71351Q158186P952842j531116p963147l612301L135290
9281C740672K523908j849863k190735l31100j767808l675258k30567N288235M686309
9272F193793j833044o174938m438846k30826K809851M355733M059759J443584
9264F185066j245983j366150k50436o33736j378526J59477K199477O65377l553964
$$ plain form
9324 -15144142 -8441198 884322 1569313 -3242017 -2524283 3699195 5006951 -1406308
9316 -1406308 -6308440 -3479167 2150224 4324716 3547162 1745856 -2123228 -6747483
9308 -6747483 -6658873 -693265 4319158 2906615 -1893018 -4759849 -5365291 -5156248 -2984287
9299 -2984287 1190853 3689813 2969712 2911508 5801943 7619791 5090114 1540182 430165
9290 430165 -666282 -3370433 -2399082 5759104 13711946 12180830 4217683 605382 3740672
9281 3740672 6264580 4414717 2223982 1892882 125074 -3550184 -3780751 1507484 6193793
9272 6193793 4360749 -1814189 -6253035 -6483861 -3674010 681723 4741482 6185066
9264 6185066 4939083 3572933 3322497 2688761 1310235 1469712 3669189 4334566 780602
9255G80602n044852j777138K190048K751653Q30736K05387K424768M815767L169960
9246A0346931k974987q193894o868329q08704K892693J952723J201566L247007
9238G95006L785952k936l322701j698696J047872l45470l035933j347690K635953
9229a488643K618296o00367o92783K621975K991390j207674l739077o05383M158075
9220D055809N188030K233547k146076n841677o444931k564742K444628L137095
9212F1683k92767k151530k01432J554023O72209J36661J521295J096565k799449
9203d02742m733110m91591M548296K643387l747927m673008K433727Q350588N038451
9194H966071l025765n203617P42538O045639L184486m034617n907787M5070O143328
$$ plain form
9255 780602 -4264250 -6041388 -3851340 -1099687 -268951 -63564 2361204 7176971 10346931
9246 10346931 7371944 -821950 -7690279 -8498983 -5606290 -3653567 -2452001 795006
9238 795006 4580958 4578022 1255321 -443375 604497 259027 -2776906 -4124596 -1488643
9229 -1488643 1129653 529286 -163497 2458478 5449868 4242194 503117 -102266 4055809
9220 4055809 9243839 11477386 9331310 3489633 -2955298 -5520040 -3075412 61683
9212 61683 -231084 -2382614 -2584046 -1030023 -357814 -221153 1300142 2396707 -402742
9203 -402742 -5135852 -5627443 -1079147 1564240 -2183687 -6856695 -4422968 3927620 8966071
9194 8966071 5940306 736689 1479227 7524866 10709352 6674735 766948 812018 6955346
9185F955346N204152n76621m308757m187979l682295l895945j854613K892281
9177c454431N554742K750779k039888l089869m9904K420999J260612j896159l685746
9168b228865k462647J107361M638960N086389J430468l054506l356518J060891
9160B221533M470273J728804m200551n153773J254153P557614N964595j448987
9152A2393661o333047n463902k857477j384416Q40297M225996M709082O91920
9144F822114k646281q11292K732592K246575r37688j056730K301889L613805J34093
9135A2399077m502894n894756l678379k60141J766278Q98585j662172k351032
9127c285434J43569K300694R32543j569543j228530J068072K117866K454930L721768
$$ plain form
9185 6955346 12159498 11582877 7274120 3086141 -596154 -4492099 -6346712 -3454431
9177 -3454431 2100311 4851090 2811202 -278667 -328571 2092428 3353040 1456881 -2228865
9168 -2228865 -4691512 -3584151 1054809 6141198 7571666 4517160 1160642 2221533
9160 2221533 6691806 8420610 4220059 -933714 320439 7878053 13842648 12393661
9152 12393661 6060614 596712 -2260765 -3645181 -2804884 1421112 6130194 6822114
9144 6822114 4175833 3364541 6097133 8343708 7406020 6349290 8651179 12264984 12399077
9135 12399077 7896183 2001427 -1676952 -1937093 -170815 727770 -934402 -3285434
9127 -3285434 -3141865 -841171 91372 -1478171 -2706701 -1638629 479237 2934167 6655935
9118F655935K921179k988067q813329o499259J753253N362399J238855k233118
9110b602152M75335L930799K405364q16676r20977k78299k619894n035260l083686
9101h545446J257260L518716L920029M257169K563428k262089n273700k382244
9093b946877J888801J305336j731884j351766M69845k000593n856077k985670
9085a3208885M884850O894437M26657m269025p32179L840244J657674k752258
9077c258485j280993L619958L494700j790121m230472p28806K891582J597706
9069C15069k236207l813951k276518J28097J531337J172990o44234j899389m48079
9060h170885K654860L698619J276049j616398j924589p56348r41601j891730j21728
$$ plain form
9118 6655935 9577114 6589047 -2224282 -8723541 -6970288 -1607889 -369034 -2602152
9110 -2602152 -2126817 1803982 4209346 3392670 2471693 2193394 -426500 -5461760 -8545446
9101 -8545446 -7288186 -3769470 150559 4407728 6971156 4709067 -564633 -2946877
9093 -2946877 -1058076 247260 -1484624 -2836390 -2366545 -4367138 -10223215 -13208885
9085 -13208885 -8324035 -1429598 -1002941 -5271966 -6004145 -2163901 -506227 -3258485
9077 -3258485 -4539478 -919520 2575180 785059 -3445413 -4174219 -1282637 315069
9069 315069 -1921138 -5735089 -8011607 -7883510 -6352173 -5179183 -5823417 -7722806 -8170885
9060 -8170885 -5516025 -1817406 -541357 -2157755 -4082344 -4838692 -5780293 -7672023 -7793751
9051g793751M803063P821936M098273m089561q999257o428713n73999J778470
9043i383539r0624q95705K669220P425646Q069545L432706k935389o481554m847686
9034c037380N40630M861700M152959M68460j37943L456408M654500r75436p342503
9025F641395n852215R94055K661701k951074o063858j178280L497075j08829n397885
9016g757915j291973Q467678R519668n75502p738702k774628N117520L383201
9008F349347n293415r056167m804505M98810K626173L639994M032927J264711
9000g42125l236443m248612j313194N90905K30562J826444N506747M936508j461043
8991B089749n462803j234377M878018M209100p87710j865550Q32897K15078m176434
$$ plain form
9051 -7793751 -2990688 4831248 8929521 4839960 -4159297 -10588010 -11162009 -9383539
9043 -9383539 -9474163 -10369868 -7700648 -275002 7794543 11227249 8291860 1810306 -3037380
9034 -3037380 -2496750 2364950 6517909 6986369 6848426 10304834 14959334 13983898 6641395
9025 6641395 789180 1783235 4444936 1493862 -4569996 -5748276 -2251201 -2360030 -7757915
9016 -7757915 -9049888 -582210 8937458 8361956 623254 -2151374 2966146 6349347
9008 6349347 1055932 -8000235 -12804740 -12305930 -9679757 -6039763 -2006836 -742125
9000 -742125 -3978568 -8227180 -9540374 -8949469 -8718907 -6892463 -1385716 3550792 2089749
8991 2089749 -3373054 -4607431 270587 4479687 3691977 1826427 2659324 2874402 -1302032
8982a302032m816041O54525M913930K885236l65845J290572M864287L591686k010433
8973I705885n366347l947334j620478j329298j432785n35484p21437l077728l809130
8964a2134136Q90381P701194Q670964J716525n417973m582991K060288N081442
8956C985694P63137m169204k539434L392981O142944L842147J274250J114118
8948A3806633J88358m037475q243649p661139k620588K434938M496053L746771
8940B109902J455526q52197j141498J089648K821928N47106m424352o545622k947664
8931g887223K677137M716052K228746j156183k450770j700106J78884K674365
8923g19098M146590K317513j709417k833968J327100N332444K299938n386362
$$ plain form
8982 -1302032 -6118073 -5463548 -549618 2335618 1969773 3260345 8124632 11716318 9705885
8973 9705885 4339538 392204 -1228274 -2557572 -3990357 -4525841 -5247278 -8325006 -12134136
8964 -12134136 -11243755 -3542561 5128403 6844928 1426955 -3156036 -1095748 3985694
8956 3985694 4748831 579627 -1959807 1433174 7576118 11418265 12692515 13806633
8948 13806633 13994991 9957516 1713867 -5947272 -8567860 -6132922 -1636869 2109902
8940 2109902 3565428 2713231 1571733 2661381 5483309 6030415 1606063 -4939559 -7887223
8931 -7887223 -5210086 -494034 1734712 578529 -1872241 -3572347 -3393463 -719098
8923 -719098 3427492 5745005 4035588 1201620 2528720 7861164 10161102 4774740
8915D774740p748394j142711N727331L971932k626356l723912J708691M239673
8907E180994r44522o438559l992037L192674N738278J888479j033181J628255
8899E220381N081413K494217m792689q390531l535891M644758P371182L111232
8891A1204072j195997m70384J373313j492078o249522n010098K027446N552253
8883E739005J352808l288015k237102p64284n021933q857689k788827Q304644
8875g561393J0215825J533787l623711J919170P412009K733482m867541l523004
8867D238624L450211L981544k309003m619800o7064K055572k979854p171585l283911
8858f705266L753267N387896J740539j377942j986938j811985r08930J260199
$$ plain form
8915 4774740 -2973654 -4116365 1610966 5582898 2956542 -767370 941321 5180994
8907 5180994 4236472 -2202087 -6194124 -3001450 2736828 4625307 3592126 5220381
8899 5220381 10301794 12796011 8003322 -387209 -3923100 721658 8092840 11204072
8891 11204072 10008075 9537691 10911004 9418926 3169404 -1840694 186752 5739005
8883 5739005 7091813 3803798 1566696 802412 -4219521 -13077210 -15866037 -7561393
8875 -7561393 2654432 4188219 564508 2483678 9895687 12629169 7761628 4238624
8867 4238624 7688835 11670379 9361376 4741576 4674512 6730084 3750230 -3421355 -6705266
8858 -6705266 -2951999 2435897 4176436 2798494 811556 -1000429 -1909359 -649160
8850f49160K487954J172321K20028K317797M229736J616495l052335l923749j292143
8841C126944n93023k616864k417165J129704K438899j242317m312784j413742
8833e900348L756946L843614j245108m536940j744577M058735P221658N180555
8825A0634535n73391n942176o617219k037695K815499K371381k444046m958631
8817f751743j414734M062119M994076Q30492k942373k145647J275460K458681
8809C66331m7825k806936k218684Q27560K315559N20909j880312j715168N02240
8800d136326J756649O22164j577167k815964j916989R28059L347119J947956l051972
8791d896471n943876k182377M243097N403330J263227P7927M968412P894449K253271
$$ plain form
8850 -649160 1838794 3011115 3231143 5548940 9778676 11395171 8342836 4419087 3126944
8841 3126944 2533921 -82943 -2500108 -1370404 1068495 -173822 -4486606 -5900348
8833 -5900348 -2143402 1700212 455104 -4081836 -5826413 -1767678 5453980 10634535
8825 10634535 10061144 4118968 -2498251 -4535946 -1720447 650934 -1793112 -6751743
8817 -6751743 -8166477 -4104358 889718 1720210 -1222163 -3367810 -2092350 366331
8809 366331 318506 -2488430 -4707114 -3879554 -1563995 -1043086 -2923398 -4638566 -4136326
8800 -4136326 -2379677 -1757513 -3334680 -6150644 -8067633 -7139574 -3792455 -1844499 -4896471
8791 -4896471 -10840347 -13022724 -8779627 -3376297 -2113070 -2035143 2933269 10827718 13080989
8782A3080989n575062n553183N6937M65041n892555q844994l157193L458958L472346
8773h488716P95987K095159M936637L297330q69343j214148J275375q727n053132
8764c233578o268955o91221N301336N701846K222954p67502k337135k790291r87297
8755c849843K324684L112064o8237k669377o28005L176194L336632K09612r91174
8746C952550J778677M667369L457906j278118n329267n432789k151047J098636
8738G63917J694140L48219n08560j03432N32708J096924K222993L301235K744315
8729A2092459O07266j527343l083937m152601l380082m7403K391913j29817n056258
8720b285803n304062K38196M475639K633893j232021j670592J77868N41586j39465
$$ plain form
8782 13080989 7505927 1952744 2009681 2474722 -3417833 -12262827 -15420020 -11961062 -8488716
8773 -8488716 -7692729 -5597570 -660933 2636397 1767054 552906 1828281 1819554 -3233578
8764 -3233578 -9502533 -10193754 -4892418 809428 3032382 2264880 -72255 -2862546 -3849843
8755 -3849843 -1525159 1586905 1518668 -1150709 -1778714 1397480 4734112 4943724 3952550
8746 3952550 5731227 10398596 13856502 12578384 7249117 1816328 -334719 763917
8738 763917 2458057 2806276 2297716 2194284 2726992 3823916 6046909 9348144 12092459
8729 12092459 12699725 11172382 8088445 3935844 555762 508359 2900272 2770455 -2285803
8720 -2285803 -7589865 -7351669 -2876030 -242137 -1474158 -3144750 -2966882 -2425296 -2564761
8711b564761N70850K033797K437121K254916J725903j076962n491912o255372
8703f366420j134844M175768M205529J763685J714652K122782o68058l131508
8695B681586j65062M044705J303773o220781p836272q16257N340982L209267l088016
8686a546075n755360l216245J082762L838177L320789M22718o96500K270240M749646
8677D470152J539151l491818k391413L072746L066260l810602p183531j637758
8669f366813M506461L045620j607252j371395K466074L716550K313006K173088
8661H875339K746540Q33092k539921m059527l896738l467032r87895M448591P896449
8652I848898M440207k591295n723220l446805l50426N51551k20060k119250m277604
$$ plain form
8711 -2564761 -1993911 39886 2477007 4731923 6457826 5380864 -111048 -6366420
8703 -6366420 -7501264 -3325496 880033 2643718 4358370 6481152 5813094 2681586
8695 2681586 2516524 6561229 7865002 1644221 -6192051 -7008308 -1667326 1541941 -1546075
8686 -1546075 -7301435 -10517680 -9434918 -5596741 -2275952 -1853234 -2549734 -279494 4470152
8677 4470152 6009303 2517485 126072 3198818 6265078 2454476 -4729055 -6366813
8669 -6366813 -1860352 1185268 -421984 -1793379 672695 4389245 6702251 8875339
8661 8875339 11621879 12454971 9915050 5855523 1958785 -1508247 -2496142 1952449 9848898
8652 9848898 14289105 11697810 5974590 2527785 2177359 2728910 2508850 389600 -3888004
8643c888004l758638L49363L375364J256258k285634j067374L417570M284931
8635A683836K16246l187686k519734J170K310306M833359O230777L381533k645677
8626A0304130o157296m280989k40856K201139K971380K896551J331458j300619
8618G724898k407062q57769J147721J372524J08976j436246k509479j948763Q47310
8609B042110L349040J781376l220284o272053m218483k66247R41578m73226j066242
8600g402431L13353J502919R70181j2162L17070J563762K041986J429472J089750
8591A813900J683288J996277J022162k41504n71428o73851j457193j595735K93698
8582B269614K285570J503523j145287k564064k628705k941555j870559K690874
$$ plain form
8643 -3888004 -7646642 -7297279 -3921915 -2665657 -4951291 -6018665 -2601095 1683836
8635 1683836 1900082 -1287604 -3807338 -3806168 -1495862 3337497 9568274 12949807 10304130
8626 10304130 4146834 -134155 -375011 1826128 4797508 7694059 9025517 7724898
8618 7724898 5317836 4460067 5607788 6980312 7089288 5653042 3143563 1194800 2042110
8609 2042110 5391150 7172526 3952242 -2319811 -6538294 -6804541 -5862963 -6336189 -7402431
8600 -7402431 -7089078 -5586159 -4615978 -4628140 -4311070 -2747308 -705322 724150 1813900
8591 1813900 3497188 5493465 6515627 6274123 5702695 5028844 3571651 1975916 2269614
8582 2269614 4555184 6058707 4913420 2349356 -279349 -3220904 -5091463 -2400589
8574b400589O521042L257774m161489n707623J03741L345061o86931l608790O22906
8565b714898M276886k23379n651567k098097M824829K860953n566150o971229
8557a1262652R99770O988672N239599K134773J927350O77260k446589j679795
8549B578388L187741M118100p15772k422744K661777N163824j290752p990622
8541E289940n048636K410328L255423j837591l417575O25382L449996J579213
8533F306480j270321k221317k762920l693611l043332j02453K915674L853393
8525a8407K498757P4760j190738L32556K877370K722414j63684j726738o93420
8516D712870q16446l716333n145155k087890K024611L521549M141981N481796
$$ plain form
8574 -2400589 4120453 7378227 3216738 -2490885 -2387144 957917 270986 -3337804 -2714898
8565 -2714898 1561988 1338609 -4312958 -6411055 -1586226 1274727 -4291423 -11262652
8557 -11262652 -10262882 -3274210 1965389 4100162 6027512 6704772 4258183 2578388
8549 2578388 5766129 9884229 9168457 6745713 9407490 14571314 13280562 5289940
8541 5289940 241304 2651632 5907055 4069464 651889 1277271 4727267 6306480
8533 6306480 5036159 2814842 51922 -3641689 -6685021 -6787474 -3871800 -18407
8525 -18407 2480350 2555110 1364372 1696928 4574298 7296712 7133028 5406290 4712870
8516 4712870 3896424 180091 -4965064 -7052954 -5028343 -1506794 2635187 8116983
8508H116983L962024k229881o957789m643155j11502j333491o254188o411829
8500a5862828j085447K508130K321217M047569R091249J0241373L526409l884911
8492A0902761l409870K876210N819014J549718n120677q139516o413782k540940
8484d477082J092757L378338L345197L26623l978026n278072r98032N367950P085745
8475E865398K220214l952884n824012l693692j316710l90571j46001J50099R84281
8466f103878K734841L935027K075309j920518l566084j593915o03504l508128
8458h550850n906959k768132L281666N939191M296986K148461J009337j07091
8450f57391l37204J293855J802408j593036n119048l257472J675206K587499n32114
$$ plain form
8508 8116983 12079007 9849126 2891337 -1751818 -1863320 -3196811 -9450999 -15862828
8500 -15862828 -16948275 -14440145 -12118928 -8071359 1019890 11261263 14787672 10902761
8492 10902761 7492891 10369101 16188115 17737833 12617156 4477640 -1936142 -4477082
8484 -4477082 -3384325 -5987 3339210 3665833 -312193 -5590265 -6588297 -1220347 5865398
8475 5865398 8085612 4132728 -1691284 -5384976 -6701686 -7092257 -7238258 -7088159 -6103878
8466 -6103878 -3369037 565990 2641299 720781 -2845303 -4439218 -5042722 -8550850
8458 -8550850 -14457809 -17225941 -13944275 -8005084 -3708098 -1559637 -550300 -657391
8450 -657391 -994595 299260 2101668 508632 -4610416 -7867888 -6192682 -3605183 -4137297
8441d137297n29089M323038O614415J725655m375661l942152J691696N057419
8433F428024K623911k395598m968819k907258J668494L872426J043756l277408
8425B087528l353571N82503K483751j81542k364003N81888N335424N226990j60261
8416A0238707m360899k553255K436368L672141j452389p707967q073031k514468
8408a0314793K334877K836868K851490N566396O445010O90739o535891o024893
8400b150197J306787N518239K780393l68188N26685J186386j823543m189173k074398
8391G12991O15085m72241k247703l02900K894131K951114J560677K149983K158569
8382A0019706k107463o547425m235100K663047N060552O73450l184453j576319
$$ plain form
8441 -4137297 -4666386 -343348 6271067 7996722 3621061 -321091 1370605 6428024
8433 6428024 9051935 6656337 1687518 -1219740 448754 4321180 5364936 2087528
8425 2087528 -1266043 -683540 1800211 1618669 -745334 -163446 5171978 10398968 10238707
8416 10238707 5877808 3324553 5760921 9433062 7980673 272706 -7800325 -10314793
8408 -10314793 -7979916 -5143048 -2291558 3274838 9719848 10410587 3874696 -2150197
8400 -2150197 -843410 4674829 7455222 7087034 7613719 8800105 6976562 2787389 712991
8391 712991 1328076 855835 -1391868 -1694768 1199363 4150477 5711154 7861137 10019706
8382 10019706 7912243 1364818 -2870282 -207235 4853317 5526767 2342314 765995
8374G65995J515729J227920p14182n05761J061302R10768p04969j106107P2093
8365B522788M75385j192942l319622l465280j260849J065684J133607o77158j714026
8356f432413p67621M99486Q25938J515000L164937K980046j038209n253584m330656
8347h837076Q71628M135319K609282j94451r49580r66677j920579j771545J389529
8338e634150M590310L371455j435788m259076k101944J831966K766481M24517
8330d46229j230087M13539L110584K806912o97234l125828j391907K144281K983884
8321D567915O02023j509341j337663o69522j340623k170731j196598J178896K985959
8312A110315L132349J632795j069419l456293l162633R9098K924932J823994k060500
$$ plain form
8374 765995 2281724 3509644 2795462 2289701 3351003 4261771 3556802 2450695 2522788
8365 2522788 2998173 1805231 -1514391 -4979671 -6240520 -5174836 -4041229 -4718387 -6432413
8356 -6432413 -7200034 -6700548 -5874610 -4359610 -1194673 1785373 747164 -4506420 -8837076
8347 -8837076 -7965448 -3830129 -1220847 -1415298 -2364878 -3331555 -5252134 -7023679 -5634150
8338 -5634150 -1043840 2327615 891827 -3367249 -5469193 -3637227 -870746 -446229
8330 -446229 -1676316 -1262777 1847807 4654719 3957485 831657 -560250 1584031 4567915
8321 4567915 5169938 3660597 2322934 1653412 312789 -1857942 -3054540 -1875644 1110315
8312 1110315 4242664 5875459 4806040 1349747 -1812886 -1713788 1211144 3035138 974638
8303I74638m108351k048371J683522L894317M494810M823802M038790P1740n881797
8294G943100q675138m864111K240728N507904K098840l343011m540764r26100
8286d558552K658965K618332M62439l75751O66759J316768K42802j123274q22641
8277A085847P25830R34604j788768n457482n812096j005153N249854O667928J402447
8268B003011n049902n525757O04596O648053O259671K18880n320233n877202k410378
8259h449261J199580K624212K702181L479378N081208M786540K16345o281982
8251E358201q507460l615653L216794M502074K7026l286575j446661J503010P55220
8242a494024j536389l86693L185661L376491r62817l910914r61859M726024P098270
$$ plain form
8303 974638 -3133713 -5182084 -3498562 395755 4890565 9714367 13753157 13824897 7943100
8294 7943100 -732038 -5596149 -3355421 2152483 4251323 908312 -3632452 -4558552
8286 -4558552 -1899587 718745 1181184 805433 1472192 2788960 3031762 1908488 1085847
8277 1085847 1811677 2746281 957513 -4499969 -10312065 -11317218 -6067364 600564 2003011
8268 2003011 -3046891 -8572648 -7968052 -1319999 4939672 5158552 -161681 -6038883 -8449261
8259 -8449261 -7249681 -4625469 -1923288 1556090 6637298 11423838 11640183 5358201
8251 5358201 -3149259 -6764912 -3548118 953956 980982 -2305593 -3752254 -2249244 -1494024
8242 -1494024 -3030413 -3417106 -231445 3145046 2182229 -1728685 -2690544 2035480 9133750
8233I133750M795105R80992j959828m094544n407656m925800k697396m34293N10391
8224d099279M81157L46904J25973m59518p86689K22391K354422L657311K439683
8215D282355o19318l127968l532955k114295J64026K215178K423970M9759k449589
8206b708837j381578K519634L658564o81255n455586m533708N59874L518528K780422
8197a723942K145094K779478J509428k066898l655506j802439r23954l336685
8189g075424m234920O50052P329958Q954845N151310N14702k873167n499430n799539
8180b881613k139496K101148J952634j373832k400799m68203l5388j787165j125809
8171h158523K695758L748638n69389l806889j77777N728065N686571L28775k579016
$$ plain form
8233 9133750 13928855 14909847 12950019 8855475 3447819 -1477981 -4175377 -4609670 -4099279
8224 -4099279 -3618122 -3271218 -3145245 -3604763 -4391452 -4169061 -1814639 1842672 4282355
8215 4282355 3663037 535069 -2997886 -5112181 -4948155 -2732977 -309007 -259248 -2708837
8206 -2708837 -4090415 -1570781 2087783 1406528 -4049058 -8582766 -8022892 -4504364 -1723942
8197 -1723942 421152 3200630 4710058 2643160 -1012346 -2814785 -3738739 -7075424
8189 -7075424 -11310344 -10660292 -3330334 5624511 10775821 11290523 8417356 2917926 -2881613
8180 -2881613 -5021109 -2919961 -967327 -2341159 -4741958 -5210161 -5245549 -7032714 -8158523
8171 -8158523 -5462765 -1714127 -2283516 -6090405 -6268182 -540117 5146454 5475229 2896213
8162B896213l35636J899625O01367j080673N6796J537489k35648l651077m205802
8153b517346j048332K343099K989074J098728j406318k610747j235500K199997
8145a87345M834148L911579n0592l824697m962461l461937o59155J686486J775031
8136i38943m92549k418601j519582P50695J205094L91472J699143M637894M327328
8127G641951k27883l050669l74717K517475l77683n163782l772456K347168L751731
8118C291135j719388m954750J53218P089004O617627k13227n156053m469642j462231
8109h24307J2383o77971k171854k281374M99812M030478L751706n66283l117740
8100a345150m41751K912698J589131k212053l271417k093059k242676k395201
$$ plain form
8162 2896213 2560577 4460202 5061569 3980896 4037692 5575181 5339533 1688456 -2517346
8153 -2517346 -3565678 -1222579 1766495 2865223 1458905 -1151842 -2387342 -187345
8145 -187345 4646803 8558382 8507790 4683093 -279368 -3741305 -4400460 -2713974 -938943
8136 -938943 -1431492 -3850093 -5369675 -4618980 -3413886 -3022414 -1323271 3314623 7641951
8127 7641951 7414068 4363399 3988682 6506157 6128474 964692 -2807764 -460596 3291135
8118 3291135 1571747 -3383003 -3229785 3859219 10476846 10263619 5107566 637924 -824307
8109 -824307 -811924 -1489895 -3661749 -5943123 -5443311 -1412833 2338873 1772590 -1345150
8100 -1345150 -1786901 1125797 2714928 502875 -2768542 -4861601 -7104277 -9499478
8092i499478R84509N218639M265721p51792k421487J183885L970558K342908L4112
8083E327575J27915R4322j927885k972972j220353J26356j141698k134406p01456
8074d422602L05112j257935k452291j004978J93748q59546n41113L475193O314403
8065b50009L580801m29497J09822K057779r46922n988447m626668K461855N574061
8056A542775J402105k262448L7190L167129J308583k287190j743665J513532K143743
8047D821754O954p71284P07505J600595Q79736J00160o07571k500873m374830
8038a37854l208134P65075L433129K385012L3097l27363Q77550Q65457r25365
8029C760604j893796k7302K955676L376241K12831l422704m176841k573742j564096
$$ plain form
8092 -9499478 -8514969 -3296330 969391 217599 -2203888 -1020003 2950555 5293463 5327575
8083 5327575 5455490 5549812 3621927 648955 -571398 -445042 -1586740 -3721146 -4422602
8074 -4422602 -4117490 -5375425 -7827716 -8832694 -8638946 -9498492 -10039605 -6564412 -250009
8065 -250009 3330792 2901295 3011117 5068896 4121974 -1866473 -6493141 -4031286 1542775
8056 1542775 2944880 682432 719622 3886751 5195334 2908144 1164479 2678011 4821754
8047 4821754 4828708 4057424 4764929 6365524 7245260 7345420 6737849 4236976 -137854
8038 -137854 -3345988 -2580913 852216 3237228 3270325 2942962 3820512 4685969 3760604
8029 3760604 1866808 1839506 4795182 8171423 8384254 4961550 784709 -1789033 -3353129
8020c353129j812166j025802J867011M695703N245499L887822J570248k057390
8012I017796o206260p267647l062024K759095M404028J495112q77498K32442K018610
8003B513654J201743q77774j062805L61010M76874j361880k520125j012960J796364
7994d85899L010865J427476j481330l117394k250491l79375r1190j569915j910657
7985f847910Q45619M290613M467924J407926r41496m26620P48306K62557n64384
7976C242535M71418K278727K079944q4609j593396j438803j091770j194130n60409
7967B109507Q63327J122636l34886j151069K00225J663883R90170k85183O41853
7958E820463K727401K123132j786010m797124l310340J140124L971069K473788
$$ plain form
8020 -3353129 -5165295 -6191097 -4324086 371617 5617116 9504938 11075186 9017796
8012 9017796 2811536 -4456111 -7518135 -4759040 -355012 1140100 262602 495044 2513654
8003 2513654 3715397 2837623 1774818 2135828 2612702 1250822 -1269303 -2282263 -485899
7994 -485899 2524966 3952442 2471112 -646282 -2896773 -3276148 -3367338 -4937253 -6847910
7985 -6847910 -6002291 -1711678 2756246 4164172 3222676 2796056 3544362 3806919 3242535
7976 3242535 3713953 5992680 8072624 7988015 6394619 4955816 3864046 2669916 2109507
7967 2109507 2972834 4095470 3760584 2609515 2809740 4473623 5463793 5178610 5820463
7958 5820463 8547864 10670996 8884986 4087862 777522 1917646 5888715 8362503
7950H362503k146438o049876n558809n92138M097581L427948j358485l377017
7942c194731Q09528N925793M970416j130679n241626l918139n10429J356017J811561
7933H77711J145476j942834n676620m435968K730434P677005L486078m397387
7925e36105n061170J788233N657869J667695k602261l06943L672223J658769l792473
7916B145837m494766j50345K050913k25209j715742K53833J504895n29091j726070
7907b885745J127162L839527J339632l604308m137053M93960M187244K910520
7899C270939m69675j190951J045421K528931P67096k423806l195546m14160K935494
$$ plain form
7950 8362503 6216065 166189 -5392620 -5984758 -1887177 1540771 182286 -3194731
7942 -3194731 -2385203 3540590 8511006 7380327 2138701 -1779438 -2289867 -933850 877711
7933 877711 2023187 80353 -5596267 -10032235 -7301801 375204 3861282 -536105
7925 -536105 -5597275 -3809042 1848827 3516522 914261 607318 4279541 5938310 2145837
7916 2145837 -2348929 -2499274 -448361 -673570 -2389312 -2135479 -630584 -1159675 -2885745
7907 -2885745 -1758583 2080944 3420576 -183732 -4320785 -3826825 360419 3270939
7899 3270939 2801264 1610313 2655734 5184665 5951761 3527955 332409 -81751 2853743
$$ [...]
##END NTUPLES=NMR SPECTRUM
##END=
