##TITLE=31Pdec_SR 79 AcCl:Ac2O'
 , 124 sc
 25.08.2021
##JCAMPDX= 6.0         $$ Bruker NMR JCAMP-DX V2.0
##DATA TYPE= NMR SPECTRUM
##DATA CLASS= NTUPLES
##ORIGIN= UXNMR, Bruker Analytische Messtechnik GmbH
##OWNER= root
$$ XWIN-NMR		Version 3.5
$$ Wed Aug 25 08:54:50 2021 Russian Standard Time (UT+4h)  she@DPX200
##.OBSERVE FREQUENCY= 81.013821
##.OBSERVE NUCLEUS= ^31P
##.ACQUISITION MODE= SIMULTANEOUS
##.ACQUISITION SCHEME= undefined
##.AVERAGES= 124
##.DIGITISER RES= 16
##SPECTROMETER/DATA SYSTEM= spect
##.PULSE SEQUENCE= zgpg30
##.SOLVENT NAME= DMF
##.SHIFT REFERENCE= (INTERNAL, DMF, 0, 248.564)
##AUDIT TRAIL= $$ (NUMBER, WHEN, WHO, WHERE, WHAT)
$$ ##TITLE= Audit trail, XWIN-NMR		Version 3.5
$$ ##JCAMPDX= 5.01
$$ ##ORIGIN= Bruker BioSpin GmbH
$$ ##OWNER= she
$$ F:/spectra/data/she/nmr/P31/1/pdata/1/auditp.txt
$$ ##AUDIT TRAIL=  $$ (NUMBER, WHEN, WHO, WHERE, WHAT)
(   1,<2021-08-25 08:53:38.25 +0400>,<she>,<DPX200>,
      <created by zg, POWCHK disabled, PULCHK disabled
       configuration hash MD5:
       00 E9 B6 7A A2 85 ED C7 34 08 36 98 17 FE 4E 26
       data hash MD5: 32K
       3A 51 C1 8A 4D D0 D6 EF B4 90 24 DF 7B AA C9 54>)
(   2,<2021-08-25 08:53:40.67 +0400>,<she>,<DPX200>,
      <Start of raw data processing
       efp BC_mod = 2 LB = 1 FT_mod = 6 PKNL = 1 PHC0 = -7800.127 PHC1 = 205.6735 SI = 64K 
       data hash MD5: 64K
       25 12 57 86 2F 3D AC 54 09 28 8B 68 B4 0B 6A A7>)
(   3,<2021-08-25 08:54:08.73 +0400>,<she>,<DPX200>,
      <pk PHC0 = 16.22845 PHC1 = -35.80001 
       data hash MD5: 64K
       E4 8D DA 83 87 AF 4C 33 ED 8A F8 A7 3B 43 B3 68>)
$$ ##END=
$$ 
$$ hash MD5
$$ 75 0A D0 D5 28 EF A2 00 B0 4C C9 BB 67 6D 22 D8
##$RELAX= 
##$RELAX= 
##$RELAX= 
##$RELAX= 
##$RELAX= 
##$RELAX= 
##$RELAX= 
##$RELAX= 
$$ Bruker specific parameters
$$ --------------------------
##$DU= <F:/spectra>
##$EXPNO= 1
##$NAME= <P31>
##$PROCNO= 1
##$TYPE= <nmr>
##$USER= <she>
##$AMP= (0..31)
100 100 100 100 100 100 100 100 100 100 100 100 100 100 100 100 100 100 
100 100 100 100 100 100 100 100 100 100 100 100 100 100 
##$AQSEQ= 0
##$AQ_mod= 1
##$AUNM= <au_zg>
##$AUTOPOS= <>
##$BF1= 81.014009
##$BF2= 200.13
##$BF3= 200.13
##$BF4= 200.13
##$BF5= 200.13
##$BF6= 200.13
##$BF7= 200.13
##$BF8= 200.13
##$BYTORDA= 1
##$CFDGTYP= 0
##$CFRGTYP= 5
##$CHEMSTR= <none>
##$CNST= (0..31)
1 1 145 1 1 1 1 1 1 1 1 1 1 1 1 1 1 1 1 1 1 1 1 1 1 1 1 1 1 1 1 1 
##$CPDPRG= <waltz16>
##$CPDPRG1= <>
##$CPDPRG2= <waltz16>
##$CPDPRG3= <>
##$CPDPRG4= <mlev>
##$CPDPRG5= <mlev>
##$CPDPRG6= <mlev>
##$CPDPRG7= <mlev>
##$CPDPRG8= <mlev>
##$CPDPRGB= <>
##$CPDPRGT= <>
##$D= (0..31)
0 1 0 0 0 0 0 0 0 0 0 0.03 2e-05 3e-06 0 0 0 0 0 0 0 0 0 0 0 0 0 0 0 0 
0 0 
##$DATE= 1629867217
##$DBL= (0..7)
120 120 120 11 120 120 24 19 
##$DBP= (0..7)
150 150 150 150 150 150 150 150 
##$DBP07= 0
##$DBPNAM0= <>
##$DBPNAM1= <>
##$DBPNAM2= <>
##$DBPNAM3= <>
##$DBPNAM4= <>
##$DBPNAM5= <>
##$DBPNAM6= <>
##$DBPNAM7= <>
##$DBPOAL= (0..7)
0.5 0.5 0.5 0.5 0.5 0.5 0.5 0.5 
##$DBPOFFS= (0..7)
$$ [...]
##$SUBNAM2= <"">
##$SUBNAM3= <"">
##$SUBNAM4= <"">
##$SUBNAM5= <"">
##$SUBNAM6= <"">
##$SUBNAM7= <"">
##$SUBNAM8= <"">
##$SUBNAM9= <"">
##$SW= 501.771253377433
##$SWIBOX= (0..15)
0 1 3 0 0 0 0 0 0 0 0 0 0 0 0 0 
##$SW_h= 40650.406504065
##$TD= 32768
##$TD0= 1
##$TE= 0
##$TE2= 300
##$TE3= 300
##$TEG= 300
##$TL= (0..7)
0 120 53 12 22 120 120 120 
##$TP= (0..7)
150 150 150 150 150 150 150 150 
##$TP07= 0
##$TPNAME0= <>
##$TPNAME1= <>
##$TPNAME2= <>
##$TPNAME3= <>
##$TPNAME4= <>
##$TPNAME5= <>
##$TPNAME6= <>
##$TPNAME7= <>
##$TPOAL= (0..7)
0.5 0.5 0.5 0.5 0.5 0.5 0.5 0.5 
##$TPOFFS= (0..7)
0 0 0 0 0 0 0 0 
##$TUNHIN= 0
##$TUNHOUT= 0
##$TUNXOUT= 0
##$USERA1= <user>
##$USERA2= <user>
##$USERA3= <user>
##$USERA4= <user>
##$USERA5= <user>
##$V9= 5
##$VALIST= <valist>
##$VCLIST= <CCCCCCCCCCCCCCC>
##$VD= 0
##$VDLIST= <DDDDDDDDDDDDDDD>
##$VPLIST= <PPPPPPPPPPPPPPP>
##$VTLIST= <TTTTTTTTTTTTTTT>
##$WBST= 1024
##$WBSW= 4
##$XGAIN= (0..3)
0 0 0 0 
##$XL= 0
##$YL= 0
##$YMAX_a= 10346
##$YMIN_a= -12419
##$ZGOPTNS= <>
##$ZL1= 120
##$ZL2= 120
##$ZL3= 120
##$ZL4= 120
##$ABSF1= 0
##$ABSF2= 0
##$ABSG= 0
##$ABSL= 0
##$ALPHA= 0
##$AQORDER= 0
##$ASSFAC= 0
##$ASSFACI= 0
##$ASSFACX= 0
##$ASSWID= 0
##$AUNMP= <proc_1d>
##$AZFE= 0.1
##$AZFW= 0.5
##$BCFW= 0
##$BC_mod= 2
##$BYTORDP= 0
##$COROFFS= 0
##$CY= -3
##$DATMOD= 1
##$DC= 0
##$DFILT= <>
##$DTYPP= 0
##$F1P= 0
##$F2P= 0
##$FCOR= 1
##$FTSIZE= 65536
##$FT_mod= 6
##$GAMMA= 0
##$GB= 0
##$INTBC= 1
##$INTSCL= 5.30512e-09
##$ISEN= 30
##$LB= 1
##$LEV0= 0
##$LPBIN= 0
##$MAXI= 10000
##$MC2= 0
##$MEAN= 0
##$ME_mod= 0
##$MI= 50
##$NCOEF= 0
##$NC_proc= -7
##$NLEV= 6
##$NOISF1= 182.463
##$NOISF2= 159.3651
##$NSP= 0
##$NTH_PI= 0
##$NZP= 0
##$OFFSET= 248.5645
##$PC= 4
##$PHC0= -7783.898
##$PHC1= 169.8735
##$PH_mod= 1
##$PKNL= yes
##$PPARMOD= 0
##$PSCAL= 0
##$PSIGN= 0
##$REVERSE= no
##$SF= 81.014009
##$SI= 65536
##$SIGF1= 159.3651
##$SIGF2= -187.1042
##$SINO= 113.3802
##$SIOLD= 16384
##$SREGLST= <1H.CDCl3>
##$SSB= 0
##$STSI= 65536
##$STSR= 0
##$SW_p= 40650.406504065
##$SYMM= 0
##$S_DEV= 0
##$TDeff= 32768
##$TDoff= 0
##$TI= <>
##$TILT= no
##$TM1= 0
##$TM2= 0
##$TOPLEV= 0
##$USERP1= <user>
##$USERP2= <user>
##$USERP3= <user>
##$USERP4= <user>
##$USERP5= <user>
##$WDW= 1
##$XDIM= 65536
##$YMAX_p= 370129105
##$YMIN_p= -117252751
$$ End of Bruker specific parameters
$$ ---------------------------------
##NTUPLES= NMR SPECTRUM
##VAR_NAME=  FREQUENCY,     SPECTRUM/REAL,   SPECTRUM/IMAG
##SYMBOL=    X,             R,               I
##VAR_TYPE=  INDEPENDENT,   DEPENDENT,       DEPENDENT
##VAR_FORM=  AFFN,          ASDF,            ASDF
##VAR_DIM=   65536,         65536,           65536
##UNITS=     HZ,            ARBITRARY UNITS, ARBITRARY UNITS
##FACTOR=    0.620285442955139, 1,           1
##FIRST=     20137.2065510759, 0,            0
##LAST=      -20513.1999529892, 0,           0
##MIN=       -20513.1999529892, -117252751,  0
##MAX=       20137.2065510759, 370129105,    0
$$ Real data points
##PAGE= N=1
##DATA TABLE= (X++(R..R)), XYDATA
$$ [...]
##PAGE= N=2
##DATA TABLE= (X++(I..I)), XYDATA
13008C7328o013181l291102O19280K371616K418750K041264J481489J155264J407408
12999B228116J172155l48508j402953q5050J944754J569179p61556j904170j327102
12990A084865j249767j633672k7320K703347J953090k840911n261797r67627M683938
12981a555854L813015k119815m597999j102593J940604M23755j375195L05769
12973d268313J495431j517576l606712J030110O955160M566806l372687m781636
12965c499417J776620L976113l324925q125021p15724R528281Q931100J129409
12957I676436q51449K839447J125208o358327p755568k65898M168852r40768o162650
12948d524717k933893K734693K316414q93389K48035L472750K443779j533876
$$ plain form
13008 37328 -5975853 -9266955 -8647675 -6276059 -3857309 -1816045 -334556 820708 2228116
12999 2228116 3400271 3051763 1648810 1563760 3508514 5077693 4316137 2411967 1084865
12990 1084865 -164902 -1798574 -1825894 877453 2830543 -10368 -5272165 -6239792 -1555854
12981 -1555854 2257161 137346 -4460653 -5563246 -3622642 -3198887 -4574082 -4268313
12973 -4268313 -2772882 -4290458 -7897170 -6867060 88100 4654906 1282219 -3499417
12965 -3499417 -1722797 2253316 -1071609 -9196630 -9912354 -384073 8547027 9676436
12957 9676436 8824987 11664434 12789642 6431315 -1324253 -1590151 2578701 1637933 -4524717
12948 -4524717 -7458610 -4723917 -2407503 -3300892 -3052857 419893 2863672 1329796
12940A329796l162694k788297l149814k167989J768779L190879j709104n526884
12932a2215328k98481P462506N607716l303276n261490K538993P671394L094424
12924E296458l095467l171852j275126k491649k596294K435767O582638L377599
12916E062074k247766j907924K302670K254124k012447l253247j28844J078368
12908A147008k090818m480556k655399q6256l05853j389279n71953P90518N30951
12899i111637O1283J644706L792726L055110o52671l431654k176599J700459L836480
12890a281797J823920j814238k292133J470781M968979L578590j460350m745100
12882B48652l512742j05386K016097J867722K73946j637147k448794j315935K56094
$$ plain form
12940 1329796 -1832898 -4621195 -7771009 -9938998 -8170219 -4979340 -6688444 -12215328
12932 -12215328 -12513809 -5051303 556413 -2746863 -8008353 -5469360 2202034 5296458
12924 5296458 2200991 -970861 -2245987 -4737636 -7333930 -4898163 1684475 5062074
12916 5062074 2814308 906384 3209054 5463178 3450731 197484 68640 1147008
12908 1147008 -943810 -5424366 -8079765 -8166021 -8471874 -9861153 -10433106 -9642588 -9111637
12899 -9111637 -9050354 -7405648 -3612922 -557812 -1210483 -4642137 -6818736 -5118277 -1281797
12890 -1281797 542123 -1272115 -3564248 -2093467 2875512 6454102 4993752 248652
12882 248652 -3264090 -3369476 -1353379 514343 788289 -848858 -3297652 -4613587 -4357493
12873d357493l29732k697186k912251J474804P472349R447759N070626k421143
12865A0747733o940745m327705L693461R733585P306164j597770p949309o268392
12857D397022q86306Q71032j391787k328513R846J750442J29731k310720k286728
12848b045981m83754P67413J386479K312296K729702J486894k69993o41478r6743
12839E144835n60485k197406l443656l612748l249283k368176m75822J918261
12831h844480L607890M123766L404262J139575j607229j691308K126794N618740
12823G878010L502018k687233n479583j363852M275020M342708j038981n581703
12815C846404m707686K61029M526311M392577L19637l398099l140429n27847k17953
$$ plain form
12873 -4357493 -4687225 -7384411 -10296662 -8821858 -1349509 8098250 13168876 10747733
12865 10747733 3806988 -520717 3172744 12906329 20212493 18614723 10665414 4397022
12857 4397022 3510716 4381748 2989961 661448 671294 2421736 2551467 240747 -2045981
12848 -2045981 -2529735 -1762322 -375843 1936453 4666155 6153049 5883056 5241578 5144835
12839 5144835 4584350 2386944 -1056712 -4669460 -7918743 -10286919 -10762741 -8844480
12831 -8844480 -5236590 -1112824 2291438 3431013 1823784 132476 2259270 7878010
12823 7878010 11380028 8692795 3213212 1849360 6124380 10467088 9428107 3846404
12815 3846404 -861282 -600253 3926058 8318635 8638272 5240173 2099744 1571897 1353944
12806A353944k766983l443638J58813L740005K970812M68283J030955L026692
12798F538883J041669m178182n544538l08557N456234N441832R67136k732310
12790F682167l664727l001677j397393O35854J082334j053117l137049k085060
12782e938668J090954K728218J292122j772606m465634n022835k194720K363704
12774a1919465M104552J443207p64569J985934O033557M585369j024713k820976
12766A622896P92951K301154j740776l821896K076888Q818518N891235l974537
12758A1966433q333437l391476J752184K57508l262555k546783J54519k7689j073040
12749d504336J835272O471417N832704p33447n714757l750913J683607L897279
$$ plain form
12806 1353944 -1413039 -4856677 -4697864 -957859 2012953 2481236 3512191 6538883
12798 6538883 7580552 3402370 -2142168 -2450725 3005509 8447341 9414477 6682167
12790 6682167 3017440 15763 -1381630 -745776 336558 -716559 -3853608 -5938668
12782 -5938668 -4847714 -2119496 -827374 -2599980 -7065614 -12088449 -14283169 -11919465
12774 -11919465 -7814913 -6371706 -7136275 -5150341 883216 5468585 4443872 1622896
12766 1622896 2415847 4717001 2976225 -845671 1231217 10049735 15940970 11966433
12758 11966433 3632996 241520 1993704 2251212 -1011343 -3558126 -3403607 -3431296 -4504336
12749 -4504336 -2669064 3802353 9635057 8901610 3186853 -564060 1119547 5016826
12741E016826J341222k130319k958755j332639L19668N96120L47354P50583J011989
12732B962049l55376k051105o88317L655321N837492K479952k450755k901612
12724F487649N85602K347892N04775j225362o36228j16530j221035j651109j42182
12715D933472M89968j629757l617746k709859j153989j905585k669493N51978
12707g711011N906055P175754K460466l315914m950853k267853J427401K819864
12699A543909L91439l869916m623639J127966Q371691Q633693J098418n774272
12691F899289n658941k079588j260690k478480j186510J912532K016011r50456
12683b786833j907004N29122J787514j16871o54300K859048N190252J183307m829197
$$ plain form
12741 5016826 6358048 4227729 1268974 -63665 256003 852123 1199477 1950060 2962049
12732 2962049 2606673 555568 -132749 3522572 9360064 11840016 9389261 6487649
12724 6487649 7073251 9421143 9925918 8700556 8064328 7947798 6726763 5075654 4933472
12715 4933472 5423440 3793683 175937 -2533922 -3687911 -5593496 -8262989 -7711011
12707 -7711011 -1804956 5370798 7831264 4515350 -435503 -2703356 -1275955 1543909
12699 1543909 1935348 -1934568 -6558207 -5430241 2941450 11575143 12673561 6899289
12691 6899289 1240348 -839240 -2099930 -4578410 -5764920 -3852388 -1836377 -2786833
12683 -2786833 -4693837 -4164715 -2377201 -2494072 -3148372 -289324 4900928 6084235 1255038
12674A255038m639263J410517N036151K275845k159865l507788k868594k383489
12666e581448r99939J574255K278551J36448n65518K887556N992229L526219j923034
12657G325319l811944j280042J202510J706556J867679J536494o49286k115677
12649E781609P71552M593596J794644o748436j0577932m506794L489348M367565
12641a034848O09296j89109J820222R91047k428916k565664J386231L364941L27142
12632B280342l286843k884804L79303L094970L855763K114188k195952n803767
12624b446800m032232J824165M372881O48755k971163j040287J761313j156150
12616c039518n756608k832177N977611Q679581J091348o143257l498273L793211
$$ plain form
12674 1255038 -3384225 -1973708 3062443 5338288 3178423 -329365 -3197959 -5581448
12666 -5581448 -6581387 -5007132 -2728581 -2592133 -3157651 -270095 5722134 9248353 7325319
12657 7325319 3513375 2233333 3435843 5142399 7010078 8546572 7897286 5781609
12649 5781609 6553161 11146757 12941401 6192965 -4384967 -8891761 -5402413 -1034848
12641 -1034848 -425552 -614661 1205561 2196608 -232308 -2797972 -1411741 1953200 2280342
12632 2280342 -1006501 -3891305 -3512002 -417032 3438731 5552919 3356967 -2446800
12624 -2446800 -6479032 -4654867 -281986 366769 -2604394 -3644681 -1883368 -3039518
12616 -3039518 -8796126 -11628303 -5650692 3028889 4120237 -2023020 -5521293 -1728082
12608a728082N381107J606456J31676J640349p0173n204783o171980k79791N312187
12599F16966M678450J089194k80962l57243j703209k326564p9669J630351j002874
12590B264440m995068m944986j712049k82797j148485m14872K653379M541059
12582d039379L672251K111233J064929k93156j469767q32448P41815O75652r31061
12573G00069j697365j194842p94184l12846Q57132P51902j978325l498303N36479
12564f630283O809814P571007J785330l757018m717937l579479k925702j557554
12556g001822R11008K145826J804963K277965L272880J780644j391617j767630
12548B032217P90926J440422o82159o79724K683323L982611O20141k803932l088235
$$ plain form
12608 -1728082 3653025 5259481 5391157 7031506 6961333 1756550 -4415430 -4695221 616966
12599 616966 5295416 6384610 6103648 5746405 4043196 1716632 1636963 3267314 2264440
12590 2264440 -2730628 -7675614 -9387663 -9670460 -10818945 -11233817 -8580438 -4039379
12582 -4039379 -367128 1744105 2809034 2515878 1046111 213663 955478 1631130 700069
12573 700069 -997296 -2192138 -2986322 -3299168 -2442036 -1690134 -3668459 -7166762 -6630283
12564 -6630283 179531 7750538 9535868 5778850 1060913 -2518566 -5444268 -7001822
12556 -7001822 -6090814 -3944988 -2140025 137940 3410820 5191464 3799847 2032217
12548 2032217 2823143 4263565 3581406 2901682 5585005 9567616 10187757 7383825 4295590
12539D295590l217432m734886l820005N73288L213195K014525K060690N053776
12531E438741M594906j590791n164653j034685K807745p46974m484948K98331
12523A17672O827280L516155n281154n551188L135819P284872J621668m250179
12515G420945l172270j94705j230045l804561l750956j865800L9695K124156L015188
12506a418353N39583k584580j237146L125712M019053R77055J07892K664708K790550
12497H984474j294343l663733j310748J005559K65077M05783L493445M334882
12489A2220396m95541n678990n186646j241343M29622p95527j821604j552349
12481d121982o03015J057396K515888J532850j375779k265194M65593L677791
$$ plain form
12539 4295590 1078158 -3656728 -7476733 -6903445 -3690250 -1675725 384965 5438741
12531 5438741 10033647 8442856 3278203 2243518 5051263 4304289 -180659 117672
12523 117672 6944952 10461107 5179953 -371235 2764584 10049456 11671124 7420945
12515 7420945 4248675 4053970 2823925 -980636 -4731592 -6597392 -6557697 -4433541 -1418353
12506 -1418353 -878770 -3463350 -4700496 -1574784 2444269 3421324 3529216 6193924 8984474
12497 8984474 7690131 4026398 2715650 3721209 3986286 4392069 7885514 12220396
12489 12220396 11724855 6045865 859219 -382124 47498 -748029 -2569633 -4121982
12481 -4121982 -4724997 -3667601 -1151713 381137 -994642 -3259836 -2794243 883548
12473H83548M752429M648092L941766J051428l316790n133869l023169m94870
12465C308565M3674O37955K879634M446265K990983n04164l877586n637412m430980
12456a43066q78116R67966r04702j680560K805235O890708K887004m679966m871551
12447C92952R18185P06938o460025p232368K911260J0034042L760914o246561
12439a214663o716617m93018K329644J525665J947799J476596k704104m223595
12431h072293K342494Q789371M658923n071441p751746k906732R9530n50746Q99223
12422g563417L826207K303662j870693j591291J669085N02457l427853j780289
12414g932132L952447L919404j710703k047111M746461P385233J293797l540443
$$ plain form
12473 883548 5635977 10284069 14225835 15277263 11960473 6826604 3803435 3308565
12465 3308565 3352239 3990194 6869828 11316093 14307076 13802912 9925326 4287914 -143066
12456 -143066 -1021182 -53216 -957918 -2638478 166757 7057465 9944469 5264503 392952
12447 392952 1311137 2018075 -4441950 -11674318 -8763058 1270984 5031898 -1214663
12439 -1214663 -7931280 -8424298 -6094654 -4568989 -2621190 -1144594 -3848698 -8072293
12431 -8072293 -5729799 3059572 7718495 2647054 -5104692 -8011424 -7911894 -8462640 -7563417
12422 -7563417 -3737210 -1433548 -3304241 -4895532 -3226447 -2723990 -6151843 -7932132
12414 -7932132 -3979685 -60281 -1770984 -3818095 928366 8313599 9607396 6066953
12406F066953o86676J953043k376923o766959l452352K451261K683373k50013
12398c78293J70013J727370j195298n492487l908035K032518M296375J539172
12390a208665K93659L355467N598076K749611k311147m454976l170274j875786
12382a024035k468813l009248j125045J731810J936391l162J049530O129310P981480
12373A1198218J538673o180353n463894M39833N00987n065471m910713K999019
12365d943701O484885m6583n201217O2819O671069L116957m858887m766258J450029
12356b030887K664533j141378o41174L949538K739076n081984q430953k854274
12348a0827503K646065J490443q70389J261180M004500K369431j137454k777725
$$ plain form
12406 6066953 5380277 7333320 4956397 -1810562 -5262914 -2811653 -128280 -378293
12398 -378293 -208280 1519090 323792 -5168695 -9076730 -7044212 -2747837 -1208665
12390 -1208665 -915006 2440461 8038537 10788148 8477001 4022025 851751 -1024035
12382 -1024035 -3492848 -6502096 -7627141 -5895331 -3958940 -3962102 -2912572 3216738 11198218
12373 11198218 12736891 6556538 1092644 1532477 2033464 -3032007 -7942720 -4943701
12365 -4943701 1541184 1494601 -3706616 -3643797 3027272 6144229 1285342 -3480916 -2030887
12356 -2030887 633646 -507732 -1148906 2800632 5539708 457724 -7973229 -10827503
12348 -10827503 -8181438 -6690995 -7561384 -6300204 -2295704 73727 -1063727 -3841452
12340c841452l822811m593299j079405N962110P536835l9591o589113k437134
12332h903860O166500O824737J51441l040118K00569K628389J045271P2071J097981
12323F242981j98411l028954k34697Q004613J0632563K127900p629982p678862
12315H237151j480921R80853o80203J47017L181071J766286m200377o812482k666235
12306a527840K239907K243666p62733k327457j519484M65752K774371L938083
12298E524265K613843L05040o50471j432254l968978n033182l64842N839966M741357
12289G574744k642985n103407J172526N569419k48229q869167q995963k099294
12281a3642356K895616M370375O052179N917126j90900p102341n609668J828479
$$ plain form
12340 -3841452 -7664263 -12257562 -13336967 -7374857 161978 122387 -6466726 -8903860
12332 -8903860 -2737360 4087377 4238818 1198700 1399269 4027658 5072929 5145000 6242981
12323 6242981 6044570 3015616 2780919 10785532 21418095 23545995 15916013 8237151
12315 8237151 6756230 7737083 7056880 7203897 10384968 12151254 7950877 1138395 -1527840
12306 -1527840 712067 2955733 2193000 -134457 -1653941 -1188189 1586182 5524265
12298 5524265 8138108 8443148 7792677 6360423 2391445 -2641737 -3006579 2833387 7574744
12289 7574744 4931759 -171648 1000878 6570297 6322068 -2547099 -11543062 -13642356
12281 -13642356 -10746740 -6376365 -324186 5592940 5402040 -1700301 -7309969 -5481490
12273e481490L540442k579088n587249N15722P581591O968811J677434j351352
12265E284821j949568k741725k003636J984798N195256L590851K4679r63807p23917
12256G697752k398918l717899j203103J964911K03432m565331n239153q08849
12248h067158K489244J498404P6972J221955K306202J100547N10762L112270N477512
12239I726710K986817k332414l972501k35414L348632J841847k611811m417994
12231D333872k288923j86062j090353l056778k620073J96727K292369J712786
12223g06435m76987j946637j152596J735049M496110M295567J015110j960235
12215E298946k042368r27135j351475k276767q98824J991911L042391J929974
$$ plain form
12273 -5481490 -1941048 -4520136 -10107385 -9591663 -2010072 4958739 6636173 5284821
12265 5284821 3335253 593528 -1410108 574690 5769946 9360797 9385476 8421669 7697752
12256 7697752 5298834 1580935 377832 2342743 2546175 -2019156 -7258309 -8067158
12248 -8067158 -5577914 -4079510 -4002538 -2780583 -474381 626166 1136928 4249198 9726710
12239 9726710 12713527 10381113 6408612 6173198 9521830 11363677 8751866 4333872
12231 4333872 2044949 1858887 768534 -2288244 -4908317 -4711590 -2419221 -706435
12223 -706435 -1183422 -3130059 -4282655 -2547606 1948504 6244071 7259181 5298946
12215 5298946 3256578 2329443 977968 -1298799 -2197623 -205712 2836679 4766653
12207D766653J155678P19742j488565l850322k004638K928099M010470p54593
12199E482524m275833j375653K790022J505013k179207r06672M210284N358217
12191A0608695Q56308k833537k167207j038040k403842l218381j038242R64206
12183b70040p7372j147273J347577M775640M160703J73959k156448j276985l91048
12174E138713j192240j371290M49927J549171o85262m171262m748192k069634
12166g100069J07046m77443j474785J17010K845142K453750j573008m309390j983676
12157a1395423K197872K103535k434320m812066o83191N810855P336378K586005
12149G09645k853861l837621r29748J673439J163484j573030l370838k142443
$$ plain form
12207 4766653 5922331 6642073 5153508 1303186 -701452 2226647 6237117 5482524
12199 5482524 1206691 -168962 2621060 4126073 1946866 1040194 5250478 10608695
12191 10608695 11465003 8631466 6464259 5426219 3022377 -196004 -1234246 -270040
12183 -270040 -347412 -1494685 -147108 4628532 8789235 8963194 6806746 5529761 5138713
12174 5138713 3946473 2575183 3025110 4574281 3889019 -282243 -5030435 -7100069
12166 -7100069 -6993023 -7470466 -8945251 -8828241 -5983099 -3529349 -5102357 -9411747 -11395423
12157 -11395423 -9197551 -7094016 -9528336 -14340402 -15023593 -9212738 -1876360 709645
12149 709645 -2144216 -5981837 -6911585 -5238146 -4074662 -5647692 -9018530 -11160973
12141a1160973O41451J473612m65692j729217M76756L709569L756363J231851
12133b066280L89700J783360J342059k138663m097070j598821J372645K03133
12125d809937k807182k265977J790935M591002M031712K163857N06225j052898
12117B147737j630505n93159m28782l229161n551853k748508K648663L810976
12109e574592M47453j033797J407400K867718J559182K008677M977030M005089
12101A0664160k705696o493180j622463M056841Q91296p086441q665490k435625
12093a3396598L303670M308145L640243L024811R18147j388355o05373J856122
12085A660812J792356j70764n69892p95110l959512o207229j671155N132077L881007
$$ plain form
12141 -11160973 -10519522 -9045910 -9511602 -11240819 -10764063 -7054494 -3298131 -2066280
12133 -2066280 -1676580 106780 1448839 -689824 -4786894 -6385715 -5013070 -4809937
12125 -4809937 -7617119 -9883096 -8092161 -3501159 530553 2694410 3200635 2147737
12117 2147737 517232 -75927 -504709 -3733870 -9285723 -12034231 -9385568 -5574592
12109 -5574592 -5127139 -6160936 -4753536 -1885818 -326636 1682041 6659071 10664160
12101 10664160 7958464 1465284 -157179 3899662 4790958 -2295483 -10960973 -13396598
12093 -13396598 -10092928 -5784783 -2144540 880271 1798418 410063 -195310 1660812
12085 1660812 3453168 3282404 2712512 1917402 -2042110 -8249339 -9920494 -4788417 -907410
12076i07410m132645o091494K239412R590839P197304J050270p90129j219640
12068F936507n109679p478266k042565N621509N465853q55868k735114K612943
12060B415320O914735M398577p81445k460634o37633P81964l43912l053499m760803
12051B472670l301844N31146L070307K218323J92107k59536O6708p08174j693759
12042B587948j221173k38227k45897k89939N13878K40280k171246l464181q15838
12033e104395K722000K570446m6349o16957Q90573Q20894r71047j053204R33935
12024A45896J791275J058920J639755L423385K523623j518541l790360j759646
12016C514307O15290j73723j365525M48452K325081l57500m768754l221717M781454
$$ plain form
12076 -907410 -5040055 -11131549 -8892137 698702 7896006 8946276 8156147 6936507
12068 6936507 1826828 -5651438 -7694003 -2072494 3393359 2537491 -197623 2415320
12060 2415320 9330055 13728632 12947187 10486553 9848920 10630884 10286972 7233473 2472670
12051 2472670 -829174 -298028 2772279 4990602 5182709 4923173 4989881 4281707 2587948
12042 2587948 1366775 1128548 882651 592712 1106590 1346870 -824376 -4288557 -5104395
12033 -5104395 -2382395 188051 141702 -475255 415318 1236212 265165 -788039 145896
12024 145896 1937171 2996091 4635846 8059231 10582854 9064313 5273953 3514307
12016 3514307 4129597 3955874 2590349 3038801 5363882 5006382 237628 -2984089 1797365
12007A797365R751283M619046m910729p499653j241319M463427K338255l589106
11999E728569n265394k056737L60152l37686q81920O71088J798591N01882j454712
11990i36167k048344j735305j133716K02959J345834M31432j066750Q23558N552212
11981A435713O996404K325130l109169l478934m52399Q86571r4649o98020m17619
11972C393028k73051N44486K456719K558088j177222n224598n118699k408363
11964e249612j662200k655609j477067J886146L219922J208813o02092M32338
11956d899361K749330L649893K272903n46968k633469j621832J539864K290221
11948B800581j048009l486904p30212L032945J174568m043875m184348K026668
$$ plain form
12007 1797365 11548648 16167694 11256965 3757312 2515993 6979420 9317675 5728569
11999 5728569 463175 -1593562 -1233410 -1571096 -2453016 -1781928 16663 518545 -936167
11990 -936167 -2984511 -4719816 -5853532 -5650573 -4304739 -3873307 -4940057 -4116499 1435713
11981 1435713 8432117 10757247 7648078 4169144 3716745 4603316 4508667 3810647 3393028
11972 3393028 3119977 3664463 6121182 8679270 7502048 2277450 -2841249 -5249612
11964 -5249612 -6911812 -9567421 -11044488 -9158342 -5938420 -4729607 -5331699 -4899361
11956 -4899361 -2150031 1499862 3772765 3225797 592328 -1029504 510360 2800581
11948 2800581 1752572 -1734332 -2464544 568401 1742969 -2300906 -6485254 -4458586
11940d458586O493228M081802p56205k275022j276348j065822j575069j742502
11932b574524k890569n243619m958555O36820P439944Q681250L312090l186331
11924A216506n455305k949595J190638L387935K020067j416650l279050r96168
11916f281622M303324Q460788P636183J721727m917852p044848l960288k47445
11908c30033R7367j421999q05395K272817M295512K988319l46222l087846l481645
11899A80875j368584J045849N71193k425297l104615R73825M883630K938774k272427
11890A423223l545163j05004K109920P98735P9131J647434J142137l414626o613685
11881f477898l744276J694038L658846K334524J932295L081386K849289L41451
$$ plain form
11940 -4458586 2034642 6116444 5360239 3085217 1808869 743047 -832022 -2574524
11932 -2574524 -5465093 -10708712 -15667267 -15030447 -7590503 1090747 4402837 1216506
11924 1216506 -4238799 -7188394 -5997756 -2609821 -589754 -2006404 -5285454 -6281622
11916 -6281622 -1978298 6482490 14118673 15840400 10922548 3877700 -82588 -330033
11908 -330033 -232666 -1654665 -2460060 -187243 4108269 7096588 6750366 3662520 180875
11899 180875 -1187709 -141860 429333 -1995964 -5100579 -4126754 756876 3695650 1423223
11890 1423223 -2121940 -2226944 -117024 681711 760842 2408276 3550413 135787 -6477898
11881 -6477898 -10222174 -8528136 -4869290 -2534766 -602471 2478915 5328204 5669655
11873E669655k505099m441703n252274l820929L66915M643362N439944K648955
11865B748826p92909k621527k187049N85393M070891M356504m48357o150521o599710
11856g038459j647083K844794L102519J415442R70028J025388j44375r67902Q63840
11847D24192L440431K591293j456118l590491j089908K475783K963840J867469
11839G626491K932187M864538K728022l529032p475521n095885n89279L6510k536438
11830a038407l175079o10428J443111P29789o58076m31838O11997P38954m3246
11821b433223q36655j386132j453336j37806K781721N470314N170942J145900
11813H321725l650560m750382j144870K695241J918525k126750l761663j540660
$$ plain form
11873 5669655 3164556 -1277147 -6529421 -10350350 -9983435 -5340073 99871 2748826
11865 2748826 1955917 -665610 -2852659 -2267266 1803625 6160129 5711772 -438749 -7038459
11856 -7038459 -8685542 -5840748 -2738229 -1322787 -352759 672629 528254 -439648 424192
11847 424192 3864623 6455916 4999798 1409307 319399 2795182 5759022 7626491
11839 7626491 10558678 15423216 18151238 14622206 7146685 2050800 1461521 1498031 -1038407
11830 -1038407 -4213486 -4823914 -3380803 -2651014 -3309090 -3740928 -3128931 -2389977 -2433223
11821 -2433223 -3269878 -4656010 -6109346 -6247152 -3465431 2004883 7175825 8321725
11813 8321725 4671165 -79217 -1224087 1471154 3389679 1262929 -2498734 -4039394
11805d039394k08260k335811l440858M88147N371602M779389j8365k393481q22360
11796b619391M2114j829918l089237j797556k82352M31389K656201N965388N212920
11787D689558j418824p389044n763212J071370M694722J883468k204407j760801
11779f197170K726492O245572N491886J815674j197775j808705j220135r76987
11771D878852p19049M40159J542227P81261j535855k995415k123780J07509J818103
11762B194012J953940O99363o84079r10211m91310j333098l365798l590169n93647
11753f120997K207402J104970j854434j531891K305555M239801J171200l083629
11745a562023l119584R21091L922985K305118j955257l909772j430722K482974
$$ plain form
11805 -4039394 -4247654 -6583465 -10024323 -9536176 -4164574 614815 596450 -1797031 -2619391
11796 -2619391 -2577277 -4407195 -7496432 -9293988 -9576340 -9144951 -6488750 -523362 4689558
11787 4689558 3270734 -4118310 -9881522 -8810152 -4115430 -2231962 -4436369 -6197170
11779 -6197170 -3470678 2774894 8266780 10082454 8884679 7075974 5855839 4878852
11771 4878852 4159803 4599962 6142189 6923450 5387595 2392180 268400 375909 2194012
11762 2194012 4147952 4847315 4163236 3253025 2761715 1428617 -1937181 -5527350 -6120997
11753 -6120997 -3913595 -2808625 -4663059 -6194950 -3889395 350406 1521606 -1562023
11745 -1562023 -4681607 -3760516 162469 2467587 512330 -3397442 -4828164 -2345190
11737b345190L780305K558279J948376K510024J483009j759955l883694l083606
11729A207548k039641k724846k741201l42938J345376m23396k584991j107238
11721i411327K239157L169826J706859M25280q31612k941580l598466j332858
11713a0574721Q8400k319517m141050l15436N166587M811797m1434j612282J593423
11704g344233L861293K854317J721788J321444m04632j795284N30592L633339
11696D378624J777259k744124k589864J527721K084133j167578r84999K636952
11688D918124J273765n754503q116959j898389L431349J398811j403298J117308
11680e033792L585814M36298l195137j223055K608492K730440J298609J271132
$$ plain form
11737 -2345190 1435115 3993394 5941770 8451794 9934803 8174848 4291154 1207548
11729 1207548 -832093 -3556939 -6298140 -6641078 -5295702 -5719098 -8304089 -9411327
11721 -9411327 -7172170 -4002344 -2295485 -1870205 -2701817 -5643397 -9241863 -10574721
11713 -10574721 -10486321 -12805838 -16946888 -17262324 -12095737 -7283940 -7325374 -8937656 -7344233
11704 -7344233 -3482940 -628623 1093165 2414609 2009977 214693 745285 4378624
11696 4378624 6155883 3411759 821895 2349616 4433749 3266171 2281172 4918124
11688 4918124 6191889 437386 -7679573 -9577962 -6146613 -4747802 -6151100 -5033792
11680 -5033792 -1447978 -1011680 -4206817 -5429872 -2821380 -90940 1207669 2478801
11672B478801m64444m493868l749982L560168O779072n15191p662339l617623
11664g685406M088732K261614n197203m661289L694437P918920N696807N187870
11656A1304482O370606N83588j0196506j2177996k107626N885976K130882m609519
11648b816113k975268L704215N473959J686819r36993l1314J263663J106022K53590
11639F728580q99845k041218k088106j431722j932572k802995o64397M251005
11631h81270O628745L426626j618186l544199k274803o20685O3637k78217j555098
11622f53450k439322j279197N65259j8626k304890k040627J172367K217491j144266
11613e925261l688185o33160M490560M980083O52153l039330l421786k495450
$$ plain form
11672 2478801 2014357 -2479511 -6229493 -2669325 4109747 3594556 -4067783 -7685406
11664 -7685406 -3596674 -1335060 -6532263 -11193552 -7499115 419805 6116612 11304482
11656 11304482 17675088 18258676 8062170 -4115826 -6223452 -337476 1793406 -2816113
11648 -2816113 -5791381 -2087166 3386793 5073612 4136619 4105305 5368968 6474990 6728580
11639 6728580 5828735 3787517 1699411 267689 -1664883 -4467878 -5132275 -881270
11631 -881270 5747475 9174101 7555915 4011716 1736913 1116228 1179865 901648 -653450
11622 -653450 -3092772 -4371969 -3806710 -3825336 -6130226 -8170853 -6998486 -4780995 -5925261
11613 -5925261 -9613446 -10246606 -5756046 -775963 -123810 -3163140 -6584926 -9080376
11605i080376j348367J466068N157162N649002J844745j171128J096337N342501
11597H955944M682775j141283n216786l806514j436829k763674m907757l082088
11589h716212N91871Q50002j135564j39756K748550J548843k690810j852423M935628
11580c859871P720764J348421n618829m554328Q5239M3404k577250r62144L062204
11571e312390K914908R4774J237940N018828L950339j721124l677759K08105K366299
11562E079920j443238n478402l835517J201744M300132M071537J872172q49605
11554D918743j767620O21680L127715R79966m377453o384766k975442J079358
11546d777819K205370J859903J342333l42110j996680n45627K476766J770827
$$ plain form
11605 -9080376 -10428743 -8962675 -3805513 1843489 3688234 2517106 3613443 8955944
11597 8955944 13638719 12497436 7280650 3474136 2037307 -726367 -5634124 -8716212
11589 -8716212 -8124341 -7274339 -8409903 -8549659 -5801109 -4252266 -6943076 -8795499 -3859871
11580 -3859871 3860893 5209314 -409515 -4963843 -4878604 -4835200 -7412450 -8374594 -5312390
11571 -5312390 -2397482 -2302708 -1064768 3954060 7904399 6183275 2505516 2713621 5079920
11562 5079920 3636682 -1841720 -5677237 -4475493 -175361 3896176 5768348 4918743
11554 4918743 3151123 3772803 6900518 7880484 3503031 -2881735 -5857177 -4777819
11546 -4777819 -2572449 -712546 629787 287677 -1709003 -2254630 222136 1992963
11538A992963k576204m210727j015425J446986M5664o85647K215069L849195K64043
11529A325917l699670k259993J635937J930159j91041M84970L221086K820429
11521E267794q16154k436526k54951J864094J354017q457q49670k419281m461463
11512b760597l740281Q19380N131588M915332J330428j034665m02273O01166p08820
11503D151258l386488m371253k532755N3964Q18083k80838j000670K75269K499511
11494c773919L078682J033070j317834p84303K270841L604771P31177k906810
11486A935675k360718J463098K999321L45492k446557k255703q95770l92032L92761
11477a214433J620459L88745l480514m882988j223774K458289J507584n27352
$$ plain form
11538 1992963 -583241 -4793968 -5809393 -4362407 -4316743 -5002390 -2787321 1061874 1325917
11529 1325917 -2373753 -4633746 -2997809 -1067650 -1258691 -773721 2447365 5267794
11521 5267794 4451640 2015114 1760163 3624257 4978274 4969817 4120147 1700866 -2760597
11512 -2760597 -6500878 -5681498 -549910 4365422 5695850 4661185 4258912 4860078 4151258
11503 4151258 764770 -3606483 -6139238 -6085274 -5267191 -5548029 -6548699 -6273430 -3773919
11494 -3773919 -695237 337833 -980001 -1764304 506537 4111308 4842485 1935675
11486 1935675 -425043 1038055 4037376 4382868 1936311 -319392 -1215162 -1607194 -1214433
11477 -1214433 406026 794771 -2685743 -7568731 -8792505 -6334216 -4826632 -5353984
11469e353984J332993M013540J861597k416699j700338L076623M268125M43794
11461E525651j956939l77056K86055k206219l083731L33643L428388K326694R6505
11452D372991M85646J641215P32449m94895M29447J746056R80034m12763l21671
11443I158509l96098k598475m335331k038358K254228K905838j183800m795391
11435a028878l470690R05608L180175J538709j156775k034666j650166j573795
11427e290478q81589J920050M776014M166645J206325N88565K475296J398181
11419A0359009m247607q011531m976229M42372J794817K20682L05932J349020
11411b763535K87455q16987J579160M523231K568975k638349m947206l702782
$$ plain form
11469 -5353984 -4020991 -7451 1854146 -562553 -2262891 813732 5081857 5525651
11461 5525651 3568712 3191656 3477711 1271492 -1812239 -1478596 1949792 4276486 4372991
11452 4372991 4858637 6499852 7232301 6737406 7166853 8912909 9892943 9480180 9158509
11443 9158509 8762411 6163936 1828605 -209753 2044475 4950313 3766513 -1028878
11435 -1028878 -4499568 -3593960 -413785 1124924 -31851 -2066517 -3716683 -5290478
11427 -5290478 -6172067 -4252017 523997 4690642 5896967 6485532 8960828 10359009
11419 10359009 6111402 -1900129 -6876358 -6433986 -4639169 -4418487 -4112555 -2763535
11411 -2763535 -2476080 -3293067 -1713907 2809324 5378299 2739950 -2207256 -5910038
11403e910038k925160k628077K45454L821034L292185o9329p85568R12446J93839
11394c853214k231398r01139L638619M918661J961748O18940K392707J940347
11386H485271k386659n127319l293429o00725J78765Q14525J666487K98152k337808
11377b302740k273831l8879K80159n54886J463114M132617J680126l497921l436027
11368d548268R77306J120225l066306k312650M212169N762574j100612n916139
11360d871701k548531J077774j218841l009910J093411M714496K328808j21621
11352b556115K712944M981889J405085k036194J39637J895546k417857o348885
11344b223950l295520Q17680p43849k014625L823639R354558M686472m459912
$$ plain form
11403 -5910038 -8835198 -11463275 -11217821 -7396787 -4104602 -4173931 -4959499 -4047053 -3853214
11394 -3853214 -6084612 -6985751 -3347132 1571529 3533277 4152217 6544924 8485271
11386 8485271 6098612 971293 -2322136 -2922861 -2744096 -1929571 -263084 35068 -2302740
11377 -2302740 -4576571 -4615450 -4335291 -4890177 -3427063 705554 2385680 -1112241 -4548268
11368 -4548268 -3570962 -2450737 -5517043 -7829693 -3617524 2145050 1044438 -4871701
11360 -4871701 -7420232 -6342458 -7561299 -10571209 -9477798 -4763302 -2434494 -2556115
11352 -2556115 156829 5138718 6543803 4507609 4647246 6542792 4124935 -2223950
11344 -2223950 -5519470 -4701790 -5445639 -7460264 -3636625 5717933 10404405 5944493
11336E944493n905458q64369Q51377j034306K76445L397998J779644k114143r19026
11327A412655K822825R60532m249555l527395K381722M128815O98846m7704K874965
11318G455706K069541l452774n878319k343210J429499K292048K682572K085979
11310F341042k535121p444949n422692J251945L388385O46243J431664O235471
11302C891988N598197k400657p067155k546933K824327J073705l125193k173329
11294c925050K119173L731239K434084J346568L90200j469135k155201j0249K338536
11285D800165J745884r39424k870778k734828p48162J803937K522660N99605j047207
11276C131852J02423J746804Q35829p67071k15427K36957k056354l215943R34132
$$ plain form
11336 5944493 39035 -825334 26043 -1008263 -731818 2666180 4445824 2331681 1412655
11327 1412655 4235480 5196012 946457 -2580938 -199216 3929599 4628445 4580741 7455706
11318 7455706 9525247 6072473 194154 -2149056 -719557 1572491 4255063 6341042
11310 6341042 3805921 -3639028 -9061720 -7809775 -4421390 -3775147 -2343483 3891988
11302 3891988 9490185 7089528 22373 -2524560 299767 1373472 -1751721 -3925050
11294 -3925050 -1805877 1925362 4359446 5706014 6096214 4627079 2471878 2461629 4800165
11285 4800165 6546049 5606625 2735847 1019 -747143 1056794 3579454 4179059 3131852
11276 3131852 3234275 4981079 5816908 5049837 4834410 5071367 3015013 -200930 733202
11267G33202N399907K740478l693123m335018Q11876K898593k99416k187509o73289
11258A395701p64847k756301r13484L992027M052015j011941j958706L218724
11250E253188M588581k152648p227582l284041K542633J893597j239553k15648
11242A58527J451730j773583n095260j159993N992471O547321N13883l196768
11234C438328j097342J240991n67277l759096l625007L65884M433122M236709
11226D666312m51339m348699k818094J026257P46141k273552k94848O765749Q791646
11217A1809573J206169o585112n082392J598021L748635N08414k256841k601384
11209B345083k402176j301863J123758J256236k886287n970870k904030K201751
$$ plain form
11267 733202 6133109 8873587 5180464 845446 1657322 4555915 4256499 2068990 1395701
11258 1395701 630854 -2125447 -3038931 953096 5005111 3993170 2034464 5253188
11250 5253188 9841769 7689121 461539 -2822502 -279869 1613728 374175 158527
11242 158527 1610257 -163326 -5258586 -6418579 -426108 6121213 6635096 3438328
11234 3438328 2340986 3581977 3014700 -744396 -4369403 -4003519 429603 4666312
11226 4666312 4214973 -133726 -2951820 -1925563 -1179422 -3452974 -3747822 3017927 11809573
11217 11809573 13015742 6430630 1348238 2946259 6694894 7203308 4946467 2345083
11209 2345083 -57093 -1358956 -235198 1021038 -1865249 -7836119 -10740149 -8538398
11201h538398K625389L61419J820310N622333M714979q68363l322014M80366M633610
11192G529631L839863R3488k255127k210966r75315K43077j56555k850770n208640
11183a951314l881304O3827K279248J285645l26415o34202k71488N07004K555577
11174c73422M940653M884665J686879j912869l066879j580075P98433K062438
11166G439823J169422q24524j493878k76852M27049r66798k425520j669480j32619
11157A246623l77405j506054r46113O67735O84492l14390Q88413M181473N430430
11148I955204K857074k85573j379514k538043n709808p277956k740618M667804
11140b451430O112446p38250p252090n091974K391346N445180J774963j869819
$$ plain form
11201 -8538398 -5913009 -5551590 -3731280 1891053 6606032 5737669 2415655 2896021 7529631
11192 7529631 11369494 11462982 9207855 6996889 6021574 6264651 6108096 3257326 -1951314
11183 -1951314 -5832618 -5768791 -3489543 -2203898 -2530313 -3164515 -3436003 -2928999 -373422
11174 -373422 4567231 9451896 11138775 9225906 6159027 4578952 5377385 7439823
11166 7439823 8609245 7784721 6290843 6013991 6441040 5474242 3048722 1379242 1246623
11157 1246623 869218 -636836 -1582949 -915214 -230722 -545112 343301 4524774 9955204
11148 9955204 12812278 12526705 11147191 8609148 2899340 -4378616 -7119234 -2451430
11140 -2451430 3661016 2922766 -4329324 -9421298 -7029952 -1584772 190191 -1679628
11132a679628j244658J73803p37010j274460O98044K041024J032837J847095O047098
11123F904145O662436q39211q130590n263603K714869L097643l603754m780326
11115c238391K276651N309759j823875p988283k683047P219260Q972410L032311
11107A1076795o86538L91406q5226m780621q463334o499251n27799M932883O918912
11098B277227N090332J648788l51682n04258j154348k923730l461991k087661
11090a467323j386234k207968j852309M17742J344313o0766n3528K573089L043999
11081C51015j055919m289062j861016K172675J688781j535077j701563J200581
11073e029585K677519J738367P76553j7160j714542k445678j74040K616379K626739
$$ plain form
11132 -1679628 -2924286 -2750483 -3487493 -4761953 -4063909 -2022885 -990048 857047 6904145
11123 6904145 13566581 12727370 4596780 -666823 2048046 5145689 1541935 -3238391
11115 -3238391 -961740 4348019 2524144 -5464139 -8147186 -927926 8044484 11076795
11107 11076795 10390257 10781663 10696437 5915816 -2547518 -9046769 -9574568 -4641685 2277227
11098 2277227 7367559 9016347 8664665 8160407 7006059 4082329 620338 -1467323
11090 -1467323 -2853557 -5061525 -6913834 -6496092 -5151779 -5212545 -5266073 -2692984 351015
11081 351015 -704904 -4993966 -6854982 -4682307 -2993526 -4528603 -6230166 -5029585
11073 -5029585 -2352066 -613699 162854 145694 -1568848 -4014526 -4188566 -1572187 1054552
11064A054552J362858J400191N92790l334017o090704k698362K933154L233507
11056a546031l48001J48188M801099M981117j507044n679922k199744J288421
11048f1917l128405r606336o830106M014247R869900M239341m069241l808291
11040i380808L687262P840803L939422j488319q94719L973084N337855K78805
11032A3293385n884046o945338l078172O02429O55000j372255j834833P1633J359219
11023c132978k32523k246462p68479K958168L668359O82624m16791K466915L185197
11014F164030k321344p512071m930524J228582K042839j136266j97062M273802
11006b388014M324478L18924P62668N383220L850077m982785q458493j193815
$$ plain form
11064 1054552 2417410 3817601 4410391 1076374 -5014330 -7712692 -4779538 -1546031
11056 -1546031 -1894032 -1745844 3055255 8036372 6529328 849406 -1350338 -61917
11048 -61917 -3190322 -12796658 -19626764 -15612517 -5742617 -1503276 -5572517 -9380808
11040 -9380808 -5693546 2147257 6086679 4598360 3703641 7676725 13014580 13293385
11032 13293385 7409339 464001 -2614171 -2011742 -1356742 -2728997 -4563830 -4492197 -3132978
11023 -3132978 -3365501 -5611963 -6380442 -3422274 246085 928709 511918 2978833 6164030
11014 6164030 3842686 -3669385 -8599909 -7371327 -5328488 -6464754 -6661816 -2388014
11006 -2388014 1936464 2255388 3018056 8401276 12251353 7268568 -1189925 -2383740
10998b383740M768010N3663o377562l394172L481711L315073j016281k68213K992719
10989A171208J10728n742911m274958K756351L809192k215054m378507O87635
10981h076316L389617j142786m422701M43392P122911O704123J033564k047641
10973C004163n08100J664270J968052J348220P74512j67273k040833m443692n440072
10964c840753k878445J949170M029196J086258k297292j202590J960869J781782
10956E88195r80681j294426J053976J714238J82639L49597K627782K904028Q5558
10947G230906k152660k138475k231439l027551j924388J152508K644282J473912
10939A027095N65117R25256K6476k348576k502187P86693L528860K484101p18292
$$ plain form
10998 -2383740 2384270 2437933 -3939629 -7333801 -3852090 -537017 -1553298 -1821511 1171208
10989 1171208 1281936 -4460975 -8735933 -5979582 -2170390 -4385444 -8763951 -8076316
10981 -8076316 -4686699 -5829485 -10252186 -9808794 -2685883 4018240 5051804 3004163
10973 3004163 2496063 4160333 6128385 7476605 8251117 8083844 6043011 1599319 -3840753
10964 -3840753 -6719198 -4770028 -740832 345426 -1951866 -3154456 -1193587 588195
10956 588195 -392486 -1686912 -632936 1081302 1263941 1613538 4241320 7145348 7230906
10947 7230906 5078246 2939771 708332 -2319219 -4243607 -3091099 -446817 1027095
10939 1027095 1592212 2517468 2543944 195368 -2306819 -1520126 2008734 4492835 3774543
10930C774543l303507m693316m372701j046435L857714N900097L162509j087052
10922B191852k865032j668356P53377K684488K733011Q42040o57002M9904Q17294
10913D881576j302099m310436l501488P62962K878897L80672k653680k073404
10905d937000R88872K994453K446445o5579k910782l381884P4651M631066N336375
10896E176617J503832k273089k318548j24417M90920j956447n417910o086051
10888a1005093j812720M605650P171781L960587J89955Q32900L197908J573201
10880H714169l339216n486733k550896J892901M577149N275880L784789k28795
10872A2639248m276755m947403k752144p34745P59424L070572M510706K507554
$$ plain form
10930 3774543 471036 -4222280 -8594981 -9641416 -5783702 116395 3278904 2191852
10922 2191852 -673180 -2341536 -1588159 1096329 3829340 4671380 4014378 4064282 4881576
10913 4881576 3579477 -730959 -4232447 -3469485 -590588 -209916 -2863596 -4937000
10905 -4937000 -3948128 -953675 1492770 1427191 -1483591 -4865475 -4790824 -159758 5176617
10896 5176617 6680449 4407360 2088812 1964395 2455315 498868 -4919042 -11005093
10888 -11005093 -12817813 -8212163 -1040382 2920205 3110160 3943060 7140968 8714169
10880 8714169 5374953 -111780 -2662676 -769775 3807374 9083254 12868043 12639248
10872 12639248 8362493 3415090 662946 -71799 687625 3758197 8268903 10776457
10864A0776457p34926j028479L28801j298006m969079n019664j019590J047304
10856a917182j169770k914993j046969J146942Q04252L68685J955635K704261
10848f9139j02845l814438m171055r25925L148906N758992N424485J543156l749234
10839C042903o354647m318010P18165N859190Q085257M602706l430762q792103
10831e87301n411794K833821O490692L291696k06367J22477R25263o76173j971466
10822D810848r55132q25587l731282n661981k515883K981728N205742L374019
10814B682472J085262M66307O97235R24071J300300J554936P11496j534934l822682
10805D064463l823126q79384J895463N76824l396231l687859J655822N836620
$$ plain form
10864 10776457 10041531 9013052 9341853 8043847 3074768 -1944896 -2964486 -1917182
10856 -1917182 -3086952 -6001945 -7048914 -5901972 -5097720 -4729035 -2773400 -69139
10848 -69139 -171984 -3986422 -8157477 -9083402 -5934496 -175504 5248981 6792137 3042903
10839 3042903 -3311744 -7629754 -6911589 -1052399 7032858 11635564 8204802 -587301
10831 -587301 -5999095 -3165274 3325418 6617114 6410747 6533224 7458487 6782314 4810848
10822 4810848 3855716 3030129 -701153 -6363134 -8879017 -5897289 -691547 2682472
10814 2682472 3767734 4234041 4931276 5855347 7155647 8710583 9422079 7887145 4064463
10805 4064463 241337 -638047 1257416 1834240 -1561991 -5249850 -3594028 2242592
10797B242592K827102l009926l307117J545486L795270P97840k146996j420582
10789A323669K69017J48792m74016k18880k92346j330470j878657j145834J40371
10780c458354J560199K560499J581418j020007j787864K15004N28044l024301
10772b845362m865006o24004L941491J707039l266187k310179L075327M706121
10764d80760K521925L048301N303928K097659n139811o845532j595545J663808
10756E73973o16168j858801J195520L232493J494153l8508k54977k687996n662872
10747d623183l290010K097348K124560j756020m067N852263L771830n652123o632822
10738h112224M635358J0999535K535108o634080k911713M433230J667638n430433
$$ plain form
10797 2242592 5069694 2059768 -1247349 298137 4093407 4891247 2744251 1323669
10789 1323669 1592686 1741478 1267462 1048582 756236 -574234 -2452891 -3598725 -3458354
10780 -3458354 -1898155 662344 2243762 1223755 -564109 -349105 178939 -2845362
10772 -2845362 -7710368 -8334372 -4392881 -2685842 -5952029 -8262208 -5186881 -480760
10764 -480760 2041165 5089466 10393394 12491053 7351242 505710 -1089835 573973
10756 573973 -42195 -1900996 -705476 2527017 4021170 3982662 3727685 1039689 -4623183
10747 -4623183 -7913193 -5815845 -3691285 -5447305 -5451372 400891 4172721 -1479402 -8112224
10738 -8112224 -3476866 7522669 10057777 3423697 511984 4945214 6612852 1182419
10730A182419m261090J796131K331747K34274L703368P344610R95177r575782
10722C750854j0176999j504665L391608J212461K05757K402867J440451k669556
10714a947222k714145J359832J687912l037226n207887j348005L718200N942776
10706a545765N305765J320835m800519o203819P44052P300761L926946l265874
10698B782382j602030O372157O494992l096368r035263n030947j8782l38558j04216
10689c576633M547892O307704l5720p033576o011733P9639L293709K655273J959916
10680B186471J619943j94807k342887k331960n15746R16498Q29187p11033k551587
10671c095921k393703L35095K530274J968133J373174L091350L392767j112912
$$ plain form
10730 1182419 -3078671 -1282540 1049207 1283481 4986849 12331459 13326636 3750854
10722 3750854 -6426145 -7930810 -4539202 -3326741 -3120984 -718117 722334 -1947222
10714 -1947222 -4661367 -3301535 -1613623 -4650849 -9858736 -11206741 -7488541 -1545765
10706 -1545765 3760000 5080835 280316 -5923503 -5179451 2121310 6048256 2782382
10698 2782382 1180352 7552509 14047501 10951133 1915870 -3115077 -3133859 -3472417 -3576633
10689 -3576633 971259 7278963 7243243 209667 -5802066 -5722427 -2428718 226555 2186471
10680 2186471 3806414 3611607 1268720 -1063240 -1578986 -662488 166699 -544334 -3095921
10671 -3095921 -5489624 -5154529 -2624255 -656122 717052 3808402 7201169 6088257
10663F088257n449960l443912R37371l4686l629788j529552L595740J546581n643300
10654g563249m528149O075648J0153727K57756r029599m189406N952448O005126
10646C134302j268364k358922L335425M616674r96406m411139j693882J070893
10638A428581N31795M25873J260962j754300p174371n849843L763694R911090
10630B543481M322250m808803n417552N81163K466243j511100l129898R28297
10622d025919M449736K918279k60226j170665q15933k46329K193209N463887M944632
10613A3450671N50944j688535j28352j093236o581635p967079k67033O573862
10605B849607K023311p014112o232144L239472P311430J727768l610779l228869
$$ plain form
10663 6088257 638297 -2805615 -1868244 -1902930 -5532718 -7062270 -3466530 -1919949 -7563249
10654 -7563249 -12091398 -6015750 4137977 4395733 -4633866 -8823272 -2870824 3134302
10646 3134302 1865938 -492984 2842441 7459115 6462709 2051570 357688 1428581
10638 1428581 1960376 2386249 3647211 1892911 -5281460 -11131303 -7367609 2543481
10630 2543481 6865731 2056928 -3360624 -2779461 -313218 -1824318 -4954216 -4025919
10622 -4025919 423817 3342096 3081870 1911205 1095272 848943 3042152 8506039 13450671
10613 13450671 14001615 12313080 12184728 11091492 4509857 -3457222 -3724255 2849607
10605 2849607 4872918 -2141194 -8373338 -5133866 2177564 3905332 294553 -2934316
10597b934316k847254m849573k617847N331418R631765N264586J44405J292159
10589H415343L748648J095761l205673l280621q86462j78442k07955M81412n94002
10580E388009l613445l718990j2054J469550r68975m10349N698771R101933M425449
10571A7359899j450341j616935o8071j971832l652269j296121O63865j106120
10563F862075j587974J632119J601249m273007o129293J702986Q501029M011057
10555A2320241m590967n865908k352516j564629o07609M859377P526823P06986
10547A0431798o440520k655944N767213N705508j299076m698836l337746k136745
10539A335652L70889N314927M617587m878064j0060801j641280P527376L419306
$$ plain form
10597 -2934316 -5781570 -10631143 -13248990 -7917572 1714193 6978779 7123184 8415343
10589 8415343 12163991 13259752 10054079 6773458 5886996 5708554 5500599 5982011 5388009
10580 5388009 1774564 -1944426 -1956480 -486930 -1455905 -1866254 3832517 12934450 17359899
10571 17359899 15909558 14292623 14224552 12252720 8600451 7304330 7968195 6862075
10563 6862075 5274101 6906220 8507469 4234462 -1894831 -191845 8309184 12320241
10555 12320241 7729274 1863366 -489150 -2053779 -2661388 2197989 9724812 10431798
10547 10431798 3991278 1335334 7102547 12808055 11508979 6810143 3472397 1335652
10539 1335652 1706541 7021468 11639055 6760991 -3299810 -4941090 2586286 6005592
10531F005592m250458k56630P556547L520972n322444k327845O345706K784426
10523A4055866q061747o351698O350380J0364635L019876p11804R41525l570984
10515A6036049j1119901p131448M904543P547017P51403p33497K902362L60877
10507A3517405l328462L655490J0802572J757364r820771j180078J4234879Q513973
10499C8152372o351659N25601J6392744O551876j2899658O55067K7284964J1187387
10491H1498694k2936615O373094P3769585M0256240j23770476k38070909j46132544
10484c29012931N1548294J34093645O1210989j4265204N62869L5762574J9235593
10477d0864171j0206512q03975J8093436N527113j3002044j480853J7679076J0182169
$$ plain form
10531 6005592 1755134 1498504 9055051 12576023 7253579 4925734 11271440 14055866
10523 14055866 5994119 -357579 5992801 16357436 19377312 18665508 19607033 16036049
10515 16036049 4916148 -2215300 2689243 10236260 10987663 10254166 13156528 13517405
10507 13517405 10188943 13844433 24647005 26404369 16583598 15403520 29638399 38152372
10499 38152372 31800713 32326314 48719058 55270934 42371276 43026343 70311307 81498694
10491 81498694 58562079 64935173 138704758 178960998 55190522 -182880387 -329012931
10484 -329012931 -277464637 -143370992 -82160003 -96425207 -95862338 -60099764 -40864171
10477 -40864171 -51070683 -51874658 -33781222 -28254109 -41256153 -42737006 -25057930 -14875761
10469a4875761o875751k895647Q754349K079685r973352l416191R026786L528862
10461a4647020q700010m036583Q362129N471335n538568k309415R828941Q451510
10453c117681m720077q973528j920624J068665k292943r45258M376872L148447
10445a3376127k093467J68751P292836O437650j752399m898816j238300J1592
10437i448280k120801k12270M333012K351640n288663p511913j033413N550229
10429a3380459N925743K396134j448745m064542l272229R29475L393971J168614
10421h352038p48634J667658L354359n50408m692811k540164J819263J386144
10413h656631j163269N12945M298240M454035K458206K311712J303265l727977
$$ plain form
10469 -14875761 -21751512 -24647159 -15892810 -13813125 -23786477 -27202668 -18175882 -14647020
10461 -14647020 -23347030 -27383613 -19021484 -13550149 -19088717 -21398132 -11569191 -3117681
10453 -3117681 -7837758 -16811286 -18731910 -17663245 -19956188 -20901446 -16524574 -13376127
10445 -13376127 -15469594 -15300843 -8008007 -1570357 -3322756 -8221572 -9459872 -9448280
10437 -9448280 -11569081 -11781351 -7448339 -5096699 -10385362 -17897275 -18930688 -13380459
10429 -13380459 -7454716 -5058582 -6507327 -10571869 -13844098 -12914623 -9520652 -8352038
10421 -8352038 -9100672 -7433014 -4078655 -4629063 -9321874 -11862038 -10042775 -8656631
10413 -8656631 -9819900 -9306955 -5008715 -554680 1903526 4215238 5518503 1790526
10405A790526p387919m181345N44144k84151k129623K641926R159079P048372
10397G201009j478864m925562j169632J049394j974028m552679l167471q23414
10389i841247P73607L309599N461929L329412j996507m787962k907817M53148
10381f205838K480264K731406J201687o72863J35473K981175K469131k773035
10373B347400o133597l287927N12250m9175j295620J085639K730820r17435m599895
10364i607540k256851J348767n12081l208692R63257P474519O370610n16352l230492
10355c174855p07772o0563j994667j129747J470665J78026k658563q6311N152727
10346c011060M058502k069642l297854J271394K689270q00715j575107J409407
$$ plain form
10405 1790526 -5597393 -9778738 -9234594 -9518745 -11648368 -9006442 152637 7201009
10397 7201009 5722145 796583 -373049 676345 -1297683 -5850362 -9017833 -9841247
10389 -9841247 -9067640 -5758041 -296112 3033300 1036793 -3751169 -6658986 -6205838
10381 -6205838 -3725574 -994168 207519 -465344 -329871 2651304 5120435 2347400
10373 2347400 -3786197 -7074124 -6561874 -6611049 -7906669 -6821030 -4090210 -5007645 -9607540
10364 -9607540 -11864391 -10515624 -11027705 -14236397 -13273140 -5798621 571989 55637 -3174855
10355 -3174855 -3882627 -3943190 -5937857 -7067604 -5596939 -5418913 -8077476 -8163787 -3011060
10346 -3011060 1047442 -1022200 -4320054 -3048660 -359390 -1160105 -2735212 -1325805
10338a325805N88400l970575k783851M727364O609792j305517p373978l583720
10330h417890K088628J313978q27616K185022N329725K318639j915183o37468
10322A437835J963883q14997n029870l353503J046624J37623m406734m440436
10314a3459575J29936J955505j53182L80568N388557P979521L598484k746515
10306C073299l880573m51K665679J90411m588359n570055p50400M725942M545599
10297D11092n22392l899950k592505k86287J582M16575K688696L865971J586034
10288A668816j407024k232313k547625l773155k686861K654776P103251M998816
10280C778681q05921l155566j279575m02137k247290k985576o17579J898421K011702
$$ plain form
10338 -1325805 -737405 -4707980 -7491831 -2764467 3845325 2539808 -4834170 -8417890
10330 -8417890 -6329262 -5015284 -5842900 -3657878 1671847 3990486 2075303 1437835
10322 1437835 3401718 2586721 -2443149 -5796652 -4750028 -4612405 -9019139 -13459575
10314 -13459575 -13329639 -11374134 -11527316 -11146748 -5758191 2221330 5819814 3073299
10306 3073299 -807274 -807725 1857954 2048365 -2539994 -8110049 -8860449 -4134507 411092
10297 411092 -111300 -4011250 -6603755 -6890042 -6888460 -6471885 -3783189 82782 1668816
10288 1668816 261792 -1970521 -4518146 -8291301 -10978162 -8323386 -1220135 3778681
10280 3778681 2972760 -182806 -1462381 -1864518 -4111808 -7097384 -7714963 -5816542 -3804840
10271c804840J097104J094947J337042K56258k125015m361464m846807l003627
10263a4356402k48452J261891J748346L561790O587046P072536L317690j000958
10255G943487k401379k812450m908259n786648j203447O003731Q207358L379539
10247H421932k505237l858096j289100J584088K494234P31466k811611m661082
10239a893406j611379M220952O614726K792899l250058o072208m605729j620524
10231e424727l6565q55480k611538k313872J038675M111515L077844o96098k369006
10222f079252p94546M24798l92064k72990K522407M590830K599720j169600k240284
10213h10981n00004L84569j202580k911843k093671Q61373L088855K390401n1557
$$ plain form
10271 -3804840 -2707736 -1612789 -275747 -19489 -2144504 -6505968 -11352775 -14356402
10263 -14356402 -14604854 -13342963 -11594617 -8032827 -1445781 5626755 8944445 7943487
10255 7943487 5542108 2729658 -2178601 -7965249 -9168696 -3164965 5042393 8421932
10247 8421932 5916695 2058599 769499 2353587 4847821 5579287 2767676 -1893406
10239 -1893406 -3504785 716167 7330893 10123792 6873734 801526 -3804203 -5424727
10231 -5424727 -5461292 -6316772 -8928310 -11242182 -10203507 -6091992 -3014148 -3710246 -6079252
10222 -6079252 -6873798 -6449000 -6841064 -7114054 -4591647 -817 2598903 1429303 -810981
10213 -810981 -1310985 -926416 -2128996 -5040839 -7134510 -6273137 -3184282 -793881 -845438
10204h45438o77089J450782K192657j877471o728215n396555R15006L429236n68908
10195h105995k825384K423032Q105661N193908k522170m519941k45460J590266
10187i06083j303327j933654K070402L705200m46635l504609m43950K780880o2196
10178d3972l946446j133143M929993M766265j684573n391553k714392M90955j71575
10169d898441j757768j208610n02967j325068j119449J662207L546533J396979
10161d206584k010758j735370K497703O394929O274022J981305l584888o290020
10153f79661m082717K47347J773434k97116j894067n50622J082600J57349j599640
10144e843093j083821J073224K094268J765332J937282K529349J645180n91523
$$ plain form
10204 -845438 -1522527 -71745 2120912 243441 -6484774 -11881329 -10966323 -7537087 -8105995
10195 -8105995 -10931379 -8508347 -402686 4791222 2269052 -2250889 -2496349 -906083
10187 -906083 -2209410 -4143064 -2072662 1632538 1185903 -2318706 -2762656 18224 -43972
10178 -43972 -3990418 -5123561 -193568 4572697 2888124 -2503429 -5217821 -4726866 -4898441
10169 -4898441 -6656209 -7864819 -8367786 -9692854 -10812303 -9150096 -5603563 -4206584
10161 -4206584 -6217342 -7952712 -5455009 939920 7213942 9195247 5610359 -679661
10153 -679661 -4762378 -4515031 -2741597 -3038713 -4932780 -5483402 -4400802 -4243453 -5843093
10144 -5843093 -6926914 -5853690 -3759422 -1994090 -56808 2472541 4117721 3526198
10136C526198j562437j21388J433053N20418k103509l318105j751799M59695O54157
10127b263717n86684l48281J963704L267981J365614j507704k000933n87580k40578
10118i38178j604088k708856k427725j000705J685396M854274N344727J518918
10110D723763k751945k759612j53344R2988j633613r00574J662259R12734k719940
10101c527284k899479J023441J930167k112871l230007K374492O286172J607457
10093A452088m640606k914183K996045L243540j006504q78078L502286L337026
10085E091614k673322n731874j936497K134335J630827L22621J416460J407946
10077A662110j922279l944248j275645J632006j66771l938353m128809q05323
$$ plain form
10136 3526198 1963761 1842373 3275426 3795844 1692335 -1625770 -3377569 -2917874 -2263717
10127 -2263717 -2850401 -3198682 -1234978 2033003 3398617 1890913 -110020 -697600 -938178
10118 -938178 -2542266 -5251122 -7678847 -8679552 -6994156 -2139882 3204845 4723763
10110 4723763 1971818 -787794 -941138 -848150 -2481763 -3382337 -1720078 -807344 -3527284
10101 -3527284 -6426763 -5403322 -3473155 -5586026 -8816033 -6441541 -155369 1452088
10093 1452088 -3188518 -6102701 -3106656 136884 -869620 -1747698 1754588 5091614
10085 5091614 2418292 -3313582 -5250079 -3115744 -1484917 -1162296 254164 1662110
10077 1662110 -260169 -4204417 -5480062 -3848056 -4014827 -7953180 -12081989 -12887312
10069a2887312K026544K862798K791737K157210J041451N18395O15779j07220
10061i80618j035587M90652L634090L447054j293004m736510k243359K753953
10053C6671M474679K920249J469839L89863j860353l971084l795251k635929k689806
10044e661122k605099l55857J972687J421519j39234Q79019K895718J523766k225875
10035b294478k559794J947333N731305M170190o51532l814159l363342n94935
10027a429412K305593L309563J570717j403311l181565l142611k105816m3657
10019d120499L191577N500399M133893k28954l804335m243818k443597j92253
10011b207587J288394R43257r96228j925180N5500K606569K074009q66865k495010
$$ plain form
10069 -12887312 -10860768 -7997970 -5206233 -3049023 -2007572 -1489177 -873398 -980618
10061 -980618 -2016205 -1525553 2108537 5555591 4262587 -473923 -2717282 36671
10053 36671 4511350 7431599 8901438 9291301 7430948 3459864 -335387 -2971316 -5661122
10044 -5661122 -8266221 -8622078 -6649391 -5227872 -5367106 -4488087 -1592369 -68603 -2294478
10035 -2294478 -4854272 -2906939 2824366 6994556 6343024 2528865 -834477 -1429412
10027 -1429412 876181 4185744 5756461 4353150 1171585 -1971026 -4076842 -4120499
10019 -4120499 -928922 4571477 8705370 8476416 4672081 428263 -2015334 -2207587
10011 -2207587 -919193 24064 -972164 -2897344 -2841844 -235275 1838734 971869 -1523141
10002a523141k212104k554317l281790j228014K998960M242318R78633j582077
9994d161532R8282K021148j21597k869773n41482M364023L786730l346590q195000
9985h965791l698955N846030J0210498N424062k768916o574730m272200n6793
9977d856795K126162K356101K368890J882062n70876m191872o011532m611796
9969a1509656j569616J046271K437717K217200M19275j154780l64799J806218
9961f672170K071714j49590j758326r91883J38796j41504n97786n542P21871J279129
9951f105291K884005M508144K816227j638275l343487k54719K276258J99049k530930
9942a189019j342432Q84004p7161j380281J031424L342070J61565m393778k645546
$$ plain form
10002 -1523141 -3735245 -6289562 -9571352 -10799366 -7800406 -3558088 -2579455 -4161532
9994 -4161532 -4063250 -2042102 -2163699 -5033472 -5574954 -1210931 2575799 -770791 -8965791
9985 -8965791 -12664746 -6818716 3391782 8815844 6046928 -527802 -4800002 -4856795
9977 -4856795 -2730633 -374532 1994358 3876420 3305544 -886328 -6897860 -11509656
9969 -11509656 -13079272 -12033001 -9595284 -7378084 -6958809 -8113589 -8478388 -6672170
9961 -6672170 -4600456 -4750046 -6508372 -7500255 -7361459 -7502963 -8100749 -8106291 -7384420 -6105291
9951 -6105291 -3221286 1286858 4103085 2464810 -878677 -1133396 1142862 1341911 -1189019
9942 -1189019 -2531451 -1647447 -1724608 -3104889 -2073465 1268605 1430170 -2963608 -5609154
9933e609154K776986K750580k457362l654176J143808L969392J619244Q4194J617767
9924B241279N49872l902935l895464K312052M950423o34726m705232L42204O111582
9915C369055K106530o609268q127514k208589K507325L583629M614758M787622
9907D023548Q10626m055416m033984j206399j792364m889915m590832o30254K178490
9898a4186500K416049J779622j04439k904118k386054K362367M666355J062086
9890g294632j649101J198126K938155q13002j934318L660799M113304o644295
9882f424964j2040376k47432R751202p92255j1867989K427993J7746274r633406
9874a1080953n8603590n4188759J9611686Q0962436O0651555k605583k6903200
$$ plain form
9933 -5609154 -2832168 -81588 -2538950 -6193126 -5049318 -1079926 539318 623512 2241279
9924 2241279 2791151 -1111784 -5007248 -2695196 2255227 1620501 -3084731 -2742527 3369055
9915 3369055 5475585 -1133683 -9261197 -11469786 -8962461 -5378832 -764074 4023548
9907 4023548 4834174 778758 -3255226 -4461625 -6253989 -11143904 -15734736 -16364990 -14186500
9898 -14186500 -11770451 -9990829 -10095268 -12999386 -15385440 -13023073 -8356718 -7294632
9890 -7294632 -8943733 -7745607 -4807452 -5620454 -7554772 -3893973 219331 -6424964
9882 -6424964 -18465340 -18712772 -8961570 -9753825 -21621814 -19193821 -1447547 -11080953
9874 -11080953 -69684543 -123873302 -104261616 -23299180 37352375 34746792 7843592
9867G843592l719306J1641061j820274j0952745P24712P633583l436205q800637
9859h86219M505946J2443935k240472j7759572j0331242O840080Q617383j508604
9851c18765l349805M262323O199005p10912n388401l086024K91423J150542J121981
9842A71367m9790l256830m941135k137056J551951K167663K002447L488519L384898
9833B382034j68577k274081K5028J498090j608226m005034j301595J108741k056267
9824f399887n453255k184751M016936N575992L331629K302336J809254l50081
9816B648173n87551L291574M414326k401278q916216n159260L124347L007754
9808e78131m009983m704393L279905P847055L034189k170763l8064M162701L031564
$$ plain form
9867 7843592 4124286 15765347 13945073 2992328 3717040 11350623 7914418 -886219
9859 -886219 3619727 16063662 13823190 -3936382 -14267624 -7427544 1189839 -318765
9851 -318765 -3668570 593753 6792758 6081846 693445 -2392579 -2101156 -950614 171367
9842 171367 121577 -3135253 -8076388 -10213444 -8661493 -6493830 -4491383 -1002864 2382034
9833 2382034 2213457 -60624 -35596 1462494 -145732 -4150766 -5452361 -4343620 -6399887
9824 -6399887 -11853142 -14037893 -10020957 -4444965 -1113336 1189000 2998254 2648173
9816 2648173 2060622 5352196 9766522 7365244 -1550972 -6710232 -3585885 -578131
9808 -578131 -4588114 -9292507 -6012602 1834453 4868642 2697879 2659815 6822516 9854080
9799I854080j026186k044580o58391p85946j983652j717620j009286j928675k585968
9790c886224r415L911298M156864k79599m594945m019428O19104M111791L048846
9781C058292k79949j126707J276490L028470J702818k75046k24650M62406k99762
9772G322362r66077L88732J217578k028982p120586p996601l247394J956545K818441
9763g655982k0219k952585l651824j956349R95688L507172M507399M323873L691115
9754G88288K687586J281520j78887j446987j974758m29197K889226M026300K1833
9745G664924m859556l408985L340054O284220J811291k670340q61971K748611
9737A0048248J505873k275443k526856p6604K76419j062574n93663N79585o54728
$$ plain form
9799 9854080 8827894 6783314 6124923 5338977 3355325 1637705 628419 -1300256 -3886224
9790 -3886224 -3895639 15659 4172523 3892924 -702021 -4721449 -4102345 9446 3058292
9781 3058292 2778343 1651636 2928126 5956596 7659414 7384368 7159718 7622124 7322362
9772 7322362 6356285 6745017 7962595 5933613 -1186973 -9183574 -12430968 -10474423 -7655982
9763 -7655982 -7676201 -10628786 -14280610 -16236959 -15241271 -11734099 -7226700 -2902827 788288
9754 788288 3475874 4757394 4578507 3131520 1156762 727565 3616791 7643091 7664924
9745 7664924 2805368 -603617 2736437 9020657 10831948 8161608 7299637 10048248
9737 10048248 11554121 9278678 6751822 6675218 6951637 5889063 5295400 5874985 5220257
9728E220257k323167r27352J114480j62418j931551L27338K908916m46393n722249
9719a942139l494729M347263N666797k650799r114975n125054L243058O276357
9711b794221L821768J246311N4514r28120q47225R09354K171620J953462K468700
9702H056163L918227K593134k263952n301881k943423P92244Q32866j387336j703085
9693B592957l47384k68964j561888k320633k619235l477218l775418j754904J804228
9684a1728459M452423M794312K914446J081j585794l58861J628317J042030j722148
9675e62653l321877k929421k388453j295187K333768O200936N087105o22301m317179
9666a815262k792409J91854J811459M074994O959080N617834j133439o658893
$$ plain form
9728 5220257 2897090 1969738 3084218 2921800 990249 1317587 4226503 3780110 -1942139
9719 -1942139 -5436868 -1089605 4577192 1926393 -7188582 -12313636 -9070578 -2794221
9711 -2794221 1027547 2273858 2328372 1400252 553027 1462381 3634001 5587463 8056163
9702 8056163 11974390 14567524 12303572 7001691 4058268 4850512 5683378 4296042 2592957
9693 2592957 2245573 1976609 414721 -1905912 -4525147 -8002365 -11777783 -13532687 -11728459
9684 -11728459 -7276036 -2481724 432722 433803 -1151991 -1510852 117465 1159495 -562653
9675 -562653 -3884530 -6813951 -9202404 -10497591 -8163823 -1962887 3124218 2501917 -1815262
9666 -1815262 -4607671 -4415817 -2604358 1470636 8429716 14047550 12914111 6255218
9658F255218n726747j561095Q26615J644266J946676l69436m483566m094399K197769
9649c364699N344250j130474r338052p777305J612573P413093N638747K078817
9641D76950M73860q58087j641515Q68025M597661L751350j824296n821759m608764
9632d586575n65212L389978N803674M061156k715456q673869o945062r1656L088504
9623g234518Q28962l33376K242225L550640J147733m58612J309092K563838Q60160
9614D476144n58577j67565j647734n629521o061040j86676N244905L765343j263596
9605b028317k948100q02587J679153L692471N023666K763452l139908o193033
9597a953203k299636K608481J516677k088626n37967M278635L846252k481548
$$ plain form
9658 6255218 528471 -1032624 -206009 1438257 3384933 3015497 -1468069 -5562468 -3364699
9649 -3364699 1979551 849077 -8488975 -16266280 -14653707 -7240614 -1601867 476950
9641 476950 950810 92723 -1548792 -680767 3916894 7668244 5843948 22189 -4586575
9632 -4586575 -5151787 -1761809 4041865 8103021 5387565 -3286304 -10231366 -10323022 -7234518
9623 -7234518 -6405556 -6738932 -4496707 -946067 201666 -256946 1052146 3615984 4476144
9614 4476144 3917567 3750002 2102268 -3527253 -9588293 -9774969 -4530064 -764721 -2028317
9605 -2028317 -4976417 -5779004 -4099851 -407380 4616286 7379738 4239830 -1953203
9597 -1953203 -4252839 -1644358 -127681 -2216307 -2754274 1524361 5370613 2889065
9589B889065o526370m492510j045699O23742K955987O059869M954823j446449
9581C972458o445611m933093j25974K971445M388741N175804L047874k408774
9573E642870n604151k256675L258740M075326R87211m5217J917280K067032j404490
9564H637926m282690k991229N43896K139520L46565k746893l775083j289805J946011
9555a471782J485162k273922l204162J697033O344047L766557k861108m503479
9547a021654J1635K734198m85481m127726k556624J996305M724684N085801M036374
9538A0397512L34373n233340p034605j960669M270098M249658p42339l664902
9530F15786k462643j061647r84434P12354M405654N351597P55669n092487n929369
$$ plain form
9589 2889065 -3637305 -8129815 -9175514 -8551772 -5595785 464084 5418907 3972458
9581 3972458 -2473153 -7406246 -7532220 -4560775 -172034 5003770 8051644 5642870
9573 5642870 38719 -2217956 1040784 5116110 6103321 6058104 7975384 10042416 8637926
9564 8637926 4355236 1364007 1907903 4047423 4393988 1647095 -2127988 -3417793 -1471782
9555 -1471782 13380 -2260542 -5464704 -3767671 2576376 6342933 3481825 -1021654
9547 -1021654 -1010019 1724179 1238698 -2889028 -5445652 -3449347 1275337 6361138 10397512
9538 10397512 10731885 5498545 -1536060 -3496729 773369 5023027 4280688 615786
9530 615786 -1846857 -2908504 -3892938 -3180584 1225070 6576667 7332336 2239849 -3689520
9521c689520j436815K672116J926867j374294j197096L555635O062411P24863
9513G244167o858474n906987L222712P721548J080041o602554m598398J361907
9505c336038n01415p340615o111173M032328R448178L579793l823194l390179
9497g442315R67318K025038Q66742J211032J522915K68783Q31534L995912L620453
9488G867412k659649o644370k147219L515945P54959o325605o577637M95486N528059
9479f192619M689448K705322K118431N79230j611365j404150l65617k582962n393898
9470g458180k092479N729560Q699707L858965j588171k674175k796281m466341
9462b787395l883113O94926L869606J655029k138878k890782j741005p56111J365701
$$ plain form
9521 -3689520 -5126335 -2454219 -527352 -1901646 -3098742 456893 6519304 7244167
9513 7244167 385693 -5521294 -2298582 5422966 6503007 -99547 -4697945 -3336038
9505 -3336038 -3837453 -11178068 -17289241 -13256913 -3808735 -228942 -4052136 -7442315
9497 -7442315 -6474997 -4449959 -3583217 -2372185 -849270 -580487 251047 4246959 7867412
9488 7867412 5207763 -1436607 -3583826 -67881 687078 -5638527 -12216164 -11720678 -6192619
9479 -6192619 -1503171 1202151 3320582 3899812 2288447 884297 518680 -2064282 -7458180
9470 -7458180 -9550659 -3821099 4878608 8737573 7149402 4475227 1678946 -2787395
9462 -2787395 -6670508 -5975582 -2105976 -450947 -2589825 -5480607 -7221612 -7977723 -6612022
9453f612022M006652K511329l015873m378669K256607P775010K700445p488285
9445b244806r768460k576346L384750K059794r03023N97567M193990M934046L007678
9436B685190J242338j41627j963217k789671j398070k24533k258231n542120m736889
9427a5126830J302916O756388N663856k55495l486057l22889M508289M512436
9419C552614Q1794k777807j098266J664628J273991j772002l722223k152307K079401
9410b870177N610133M914199O958m218899l087400J586435L756332J593653p61289
9401F529945n01182P6629r55906j299892O13108J602091r56291l634635j727811
9392b53944L135573N118865K308831j739992l531760k743901o16867J199206P80739
$$ plain form
9453 -6612022 -2605370 -94041 -3109914 -7488583 -5231976 2543034 5243479 -2244806
9445 -2244806 -12013266 -14589612 -11204862 -9145068 -10048091 -9450524 -5256534 -322488 2685190
9436 2685190 3927528 3785901 1822684 -966987 -2365057 -2589590 -4847821 -10389941 -15126830
9427 -15126830 -13823914 -7067526 -1403670 -1659165 -5145222 -5468111 -959822 3552614
9419 3552614 3634408 856601 -241665 1422963 2696954 924952 -2797271 -4949578 -2870177
9410 -2870177 2739956 7654155 7661113 3442214 354814 1941249 5697581 7291234 6529945
9401 6529945 6028763 6105392 5149486 3849594 4462702 6064793 5108502 1473867 -253944
9392 -253944 2881629 8000494 10309325 8569333 5037573 2293672 1676805 2876011 3656750
9383C656750j970030l983473k568837N24230J410446l65890j579888l74496J256469
9374c994719O25786j731353k304061J093613N455254M890507j349820n837170
9366c151963k445499L518512K080987n195208n847457L890338J1215768N410013
9358I475491n512618p005961N78150M941840J659368k006572j456931j36975J31847
9349F67639K269286N049299K188055n881002r348419l171582M773977N375417
9341A922670O50935j813669n43429N85071L73816Q62994K239054K439336N27375
9332G244153k712915n702190n747411j057619N037783O052123R51385l688889
9324C76420k947104m3907O8198j399111m16961K619325M151327L093567P44835
$$ plain form
9383 3656750 1686720 -2296753 -4865590 -4341360 -2930914 -3296804 -4876692 -5251188 -3994719
9374 -3994719 -3368933 -5100286 -7404347 -6310734 -855480 4035027 2685207 -3151963
9366 -3151963 -5597462 -2078950 2037 -5193171 -11040628 -7150290 4065478 9475491
9358 9475491 3962873 -3043088 -2464938 2476902 4136270 2129698 672767 535792 667639
9349 667639 2936925 7986224 10174279 4293277 -5055142 -8226724 -3452747 1922670
9341 1922670 2573605 759936 216507 801578 1175394 2038388 4277442 6716778 7244153
9332 7244153 4531238 -1170952 -6918363 -7975982 -2938199 3113924 4065309 376420
9324 376420 -2570684 -2614591 -2546393 -3945504 -4362465 -1743140 2408187 5501754 6246589
9315F246589k212553m637863l939288k24583J858697l31671k748341j338460O82394
9306f645079j528881n028312k938224M058840Q001130N394789J258989J40857
9298B714109j31968k916999o186540n223416P95311P627591J0113766O432084
9290A3223938m81311n393501n686612l238792n97079K288375N156574M448673
9282I720265k054566r387135r764823k716928M193958N329769K889418J759478
9274c0564K940828M021763K817095j141345o009482p639325l364784L317606N416093
9265C27885J140046l674042l582487k39682J513435P97612J88212L45501m59639
9256c643159j980746j249729K666177O117928N248865J349823p83246M55282J442432
$$ plain form
9315 6246589 4034036 -603827 -4543115 -4767698 -2909001 -3240672 -5989013 -7327473 -6645079
9306 -6645079 -8173960 -13202272 -16140496 -12081656 -4080526 1314263 2573252 2714109
9298 2714109 2582141 -334858 -6521398 -11744814 -10949503 -3321912 6791854 13223938
9290 13223938 12742627 7349126 1662514 -1576278 -2173357 115018 5271592 9720265
9282 9720265 7665699 -1721436 -11486259 -14203187 -10009229 -4679460 -1790042 -30564
9274 -30564 2910264 6932027 9749122 8607777 2598295 -5041030 -8405814 -5088208 327885
9265 327885 1467931 -2206111 -5788598 -6028280 -4514845 -3717233 -3529021 -3183520 -3643159
9256 -3643159 -5623905 -6873634 -4207457 1910471 7159336 8509159 7725913 8181195 9623627
9247I623627p46195l414436k455750O93865J127619j236490j329060K087467L596486
9238G947133K84892k688411n86967K588585Q01574l684090m428770j906062j828967
9229c501083m282544l645041R17795L827804K842782J842650K342285R09263k499087
9220a245176k459845J913966L476993j371502n617635k556228L218554L376432
9212a264441j081451k713886K3054J851592M61287o19927R00678K438746J159112
9203A154764j919233l400574r04182M376322P066528K345621o314528q234763
9195e830045J278166J2604743J2558988R05172j0216532j1762594n976410L30565
9187f107947L617112L406261L31982k883518k545361J414663M567374L318260
$$ plain form
9247 9623627 8877432 5462996 3007246 3701111 4828730 3592240 2263180 4350647 7947133
9238 7947133 8232025 5543614 4956647 7545232 8346806 4662716 233946 -1672116 -3501083
9229 -3501083 -7783627 -11428668 -10510873 -6683069 -3840287 -1997637 344648 1253911 -1245176
9220 -1245176 -3705021 -1791055 1685938 314436 -5303199 -7859427 -4640873 -1264441
9212 -1264441 -2345892 -5059778 -5036724 -3185132 -2723845 -3343772 -2443094 -4348 1154764
9203 1154764 -764469 -4165043 -5069225 -692903 6373625 8719246 2404718 -5830045
9195 -5830045 -4551879 8052864 20611852 21517024 11300492 -462102 -6438512 -6107947
9187 -6107947 -2490835 915426 1247408 -1636110 -4181471 -2766808 1800566 5118826
9179E118826r93409m301703m296894k092380o75549j618143k731330o06643L704153
9170h493072M904065J506413p72271K144445N098272J454298n182200n436303
9162d776353J282588N936664L962606Q15701J062501J105334k594607n881601
9154I12833l780010O98373J321261j611558k680498n6688L051859M219255L901232
9145E976059K487890k54720l047640m005046l405645k611981j041460K456128
9137c446415N768321M845242m85901n048921m069618J301885N453780M480178
9129H798551p0068l594385l933426l262913l882143m045061p59766M252276N546792
9120i50143J674996k232791j603857J582208K722851J200388m85235j546605k749075
$$ plain form
9179 5118826 4125417 -176286 -4473180 -6565560 -7241109 -8859252 -11590582 -12197225 -8493072
9170 -8493072 -3589007 -2082594 -2854865 -710420 4387852 5842150 659950 -4776353
9162 -4776353 -3493765 2442899 6405505 7221206 8283707 9389041 6794434 912833
9154 912833 -2867177 -2168804 -847543 -2459101 -5139599 -5196287 -2144428 2074827 5976059
9145 5976059 8463949 8209229 5161589 1156543 -2249102 -4861083 -5902543 -3446415
9137 -3446415 2321906 7167148 6681247 1632326 -2437292 -1135407 4318373 8798551
9129 8798551 8728483 5134098 1200672 -2062241 -5944384 -9989445 -10749211 -6496935 -950143
9120 -950143 724853 -1507938 -3111795 -1529587 1193264 2393652 1908417 361812 -2387263
9111b387263l088101q58826K599717L958649K535845P40681J05158j16332n71679
9102B917849j068775k128890m140946m867136j322132M961726P989553M510901
9094F852150j429047l424082m20310K923039K627332l04055k119327j017386J312936
9085E001250K095611M57313k045332l273466k429300m51072R00841N32033p15373
9076G2505n98899J625916L254705J017892l893608o185507l097415J662107K697162
9067c445142k49288k905979k603443o95521P06524J315275J539186J316459Q87930
9058d133999Q52328Q67412J3914j235867j411926p44982r82860j688493K87394
9049h177079N573490R230281O397427l96814l665912q91018K130031k33879n202871
$$ plain form
9111 -2387263 -5475364 -6334190 -3734473 224176 2760021 3500702 3605860 3489528 2917849
9102 2917849 1849074 -279816 -4420762 -9287898 -10610030 -5648304 2341249 6852150
9094 6852150 5423103 1999021 1578711 4501750 7129082 6825027 4705700 3688314 5001250
9085 5001250 7096861 7554174 5508842 2235376 -193924 -644996 255845 787878 72505
9076 72505 -526394 1099522 4354227 5372119 1478511 -4706996 -7804411 -6142304 -3445142
9067 -3445142 -3694430 -6600409 -9203852 -9899373 -9192849 -7877574 -6338388 -5021929 -4133999
9058 -4133999 -3281671 -2414259 -2400345 -3636212 -5048138 -5793120 -6775980 -8464473 -8177079
9049 -8177079 -2603589 6626692 13024119 12627305 8961393 8070375 10200406 9966527 4763656
9040D763656n645857o14501L036973L44138m837155n505839j238222J940680N20579
9031g235548k073964j158117K666346N073980L980297J186431r24930j663817
9023a49322j131757N37368K312904K384355L11230j887905j943442j82431R77821
9014A228821L80529l07794P44957K241960R57605l474324o913173n398114k61157
9005a0800690L563630L798250K802629K900028K574017o18422n050996n889921
8997f721475j217901M861932O579717L010438j292219k061988O036J309410M88271
8988D962221o95963r44705r41107r06389J42588J408532P7429l546289m249003
8979d692686R22722O707548N889771m44869m657537l574805j359635j127105o07082
$$ plain form
9040 4763656 -882201 -1496702 1540271 1884409 -2952746 -8458585 -9696807 -7756127 -7235548
9031 -7235548 -9309512 -10467629 -7801283 -2727303 1252994 2439425 1514495 -149322
9023 -149322 -1281079 -743711 1569193 3953548 4264778 2376873 433431 251000 1228821
9014 1228821 1609350 1301556 2046513 4288473 5246078 1771754 -5141419 -10539533 -10800690
9005 -10800690 -7237060 -3438810 -636181 2263847 4837864 4219442 -831554 -6721475
8997 -6721475 -7939376 -3077444 3502273 6512711 5220492 3158504 3164540 4473950 4962221
8988 4962221 4266258 3321553 2380446 1474057 1616645 3025177 3102606 -443683 -4692686
8979 -4692686 -3769964 2937584 8827355 8382486 3724949 150144 -1209491 -2336596 -2943678
8970b943678J742586K705759k2433l211366l085912q10186Q35807K338548M828434
8961B377559O092065L835835K44379j196424j137589k265309l889890l246111
8953H14515p12931O52352j82525j705363k860616l154254j368305K266505M439655
8944a810967L019696Q13654J035641J631545q72800m402198m328095j628566j238646
8935g780736l135094k319426K113651N198079M524979L313141L187625J076469
8927F178688l656138n753517j995224K999760L543668Q58486m19031K52912K96551
8918B306155n00440m01908L10059o243j170680j994473k621377l142063j974061
8909i195031J298722L702678K779378M68230l56531o83665k458793l290667L87652
$$ plain form
8970 -2943678 -1201092 1504667 1482234 -1729132 -4815044 -5625230 -4789423 -2450875 2377559
8961 2377559 8469624 12305459 12549838 11353414 10215825 7950516 4060626 814515
8953 814515 101584 753936 571411 -1133952 -3994568 -7148822 -8517127 -6250622 -1810967
8944 -1810967 1208729 2022383 3058024 4689569 3816769 -585429 -4913524 -6542090 -7780736
8935 -7780736 -10915830 -13235256 -11121605 -5923526 -1398547 1914594 5102219 6178688
8927 6178688 2522550 -3230967 -5226191 -2226431 1317237 2175723 1756692 2009604 2306155
8918 2306155 1805715 1403807 1713866 1707623 536943 -1457530 -4078907 -7220970 -9195031
8909 -9195031 -7896309 -4193631 -1414253 -946023 -1302554 -1986219 -4445012 -7735679 -7348027
8900g348027N868292N929144j006917p726102p452104k098704J682838J663303
8892a0488277J374093L470345N738249M821440J297485j308234j617797j795351
8884A491953l334416m127245j730654K330958M262493K939958L62235j877924
8876C17358l290879k513538J131221M165777J904159m062416o186998p77776O993642
8867b319450J0236725P984240K999255k978794p743072p172928p91471M640683
8859D855188K819217l322353o058108l633170m46523J398675L489312M865433
8851C967671K196129k825382l696912Q72110L885438N48711m137863l106449K034213
8842b62334L760022l46272m961084m855546q54183K586303K634160Q6613j983212
$$ plain form
8900 -7348027 -1479735 4449409 3442492 -4283610 -11735714 -13834418 -12151580 -10488277
8892 -10488277 -9114184 -5643839 94410 4915850 6213335 4905101 3287304 1491953
8884 1491953 -1842463 -5969708 -7700362 -5369404 -1106911 1833047 2195282 317358
8876 317358 -2973521 -5487059 -4355838 -190061 1714098 -2348318 -8535316 -9313092 -2319450
8867 -2319450 7917275 15901515 18900770 15921976 8178904 1005976 214505 4855188
8859 4855188 7674405 4352052 -1706056 -5339226 -5785749 -4387074 -897762 3967671
8851 3967671 6163800 3338418 -358494 513616 4399054 4947765 809902 -2296547 -262334
8842 -262334 3497688 3151416 -1809668 -6665214 -7519397 -4933094 -2298934 -2212321 -4195533
8833d195533j096817J960709L577697J613447j440553j401921J895658M115035
8825E027722K136099j859902l433530j550136Q23213J189637J73433p98367j970047
8816b61878l601823l770412o99742L539036M829224K503347j27406j003431j339636
8807F7279j477761P81189N151540O475001J471102n316640p107509m153580k189625
8798f299004l051769k739446R80464M631167M367901J071818j784898k263087
8790e086854n33320J962351K958163J545212K43298J830827M108146K027264m164161
8781D890926p705304m360066J733768M232756K781145J353588J403113R17903
8773E247829j235323l786871n232474m784097j958143K296207M886357L554393
$$ plain form
8833 -4195533 -5292350 -3331641 246056 1859503 418950 -982971 912687 5027722
8825 5027722 7163821 5303919 1870389 320253 1143466 2333103 2506536 1708169 -261878
8816 -261878 -3863701 -7634113 -8333855 -4794819 34405 2537752 2410346 1406915 67279
8807 67279 -1410482 -629293 4522247 10997248 12468350 7151710 44201 -4109379 -6299004
8798 -6299004 -9350773 -12090219 -11109755 -6478588 -2110687 -1038869 -2823767 -5086854
8790 -5086854 -5620174 -3657823 -699660 845552 1088850 2919677 7027823 9055087 4890926
8781 4890926 -2814378 -7174444 -5440676 -1207920 1573225 2926813 4329926 5247829
8773 5247829 4012506 225635 -5006839 -9790936 -11749079 -9452872 -4566515 -1012122
8765a012122K08579r26029J517647M382907L726198o65768m716845m200378J35199
8756a550612K688042l3270m073573l109393K132244M598867J412896k386643k579223
8747b900665j676523k240921r45427M469826P951367L142891m993709n939472
8739c132633N48277M247246O39817k924842l96692L236727J351157k765363j742513
8730i38819L166902L868817j675690o338890m588637O8479J157636j593925k874654
8721i748781K68689M603012N265577K015619q58061n07572Q75384q3487k420698
8712e90318k339910M87039K219539J163067L34442J521380J248373l286072p777120
8703g019580n894215R28566M889666L022546P69188K461419M170726L98389o152559
$$ plain form
8765 -1012122 -803543 -1729572 -211925 4170982 7897180 7231412 2514567 -1685811 -1550612
8756 -1550612 1137430 1104160 -2969413 -6078806 -3946562 652305 2065201 -321442 -2900665
8747 -2900665 -4577188 -6818109 -7763536 -3293710 4657657 7800548 2806839 -3132633
8739 -3132633 -2584356 1662890 2302707 -622135 -1018827 2217900 3569057 803694 -938819
8730 -938819 2228083 6096900 4421210 -1917680 -6506317 -6437838 -5280202 -6874127 -9748781
8721 -9748781 -9480092 -4877080 388497 2404116 1546055 1038483 1913867 1830380 -590318
8712 -590318 -2930228 -2443189 -223650 939417 1273859 2795239 4043612 757540 -7019580
8703 -7019580 -12913795 -11985229 -7095563 -4073017 -3303829 -842410 3328316 3726705 -2425854
8694b425854p350638j034736N791624O112890J001898l471012m133358k454420
8686g963606m26439J503407K649859J759687m68001j221642M97012J986063P91858
8677h91802j412500j347130R88637K799259K823628K072595R31555r59710k116732
8668B887800l85575K766355L122879J9230k274498j154315N75142R2072n57622
8659E091468J321021L496870J965740k618053n941068n803202l212497L61728
8651e337993L152289K787551j97612j197857J657227K980820j591387o270971
8643d017933k699366N637987O970810n97047n737245j713406L575644J311458
8635B730902m307490m298412L19315J751331j102751k188028P43417L462109L182159
$$ plain form
8694 -2425854 -9776492 -10811228 -5019604 1093286 2095184 -1375828 -5509186 -7963606
8686 -7963606 -8390045 -6886638 -4236779 -2477092 -2945093 -4166735 -3669723 -1683660 -891802
8677 -891802 -2304302 -3651432 -2662795 136464 2960092 5032687 5964242 5004532 2887800
8668 2887800 2502225 5268580 8391459 8410689 6136191 4981876 5557018 5649090 5091468
8659 5091468 6412489 9909359 11875099 9257046 3315978 -2487224 -5699721 -5337993
8651 -5337993 -2185704 601847 404235 -793622 863605 3844425 2253038 -4017933
8643 -4017933 -6717299 -1079312 5891498 5294451 -442794 -2156200 1419444 2730902
8635 2730902 -1576588 -5875000 -5555685 -3804354 -4907105 -7095133 -6351716 -2889607 292552
8626B92552J904815J467661J058329J76869l99854o11918o03077O05455K596991
8617F487823K119342j805900m418501j846567K117424J747198j530502k628078
8609B42239j898626k617870k614054J827643O012557K079442o491338p823108
8601a1283115j41514N463702L482073J589542M667719N134750k268794q583134
8593a938771m694859K856004K708562k669102k746013K461220L884785K47922
8585A09748q95131J977690K163593j664290k623424J075474K138819k434553n153810
8576e305884p87834M458978L297792j239918k292863n87205j178524l297212j900088
8567h832758K727390M541895Q68746l866185m386998n27898L886207N300976K975756
$$ plain form
8626 292552 2197367 3665028 4723357 4900226 4500372 3888454 3285377 3890832 6487823
8617 6487823 8607165 6801265 2382764 536197 2653621 4400819 2870317 242239
8609 242239 -1656387 -4274257 -6888311 -5060668 951889 3031331 -3460007 -11283115
8601 -11283115 -11424629 -5960927 -2478854 -889312 3778407 8913157 6644363 -1938771
8593 -1938771 -6633630 -3777626 -1069064 -3738166 -6484179 -4022959 -138174 109748
8585 109748 -785383 1192307 3355900 1691610 -931814 143660 2282479 -152074 -5305884
8576 -5305884 -6093718 -1634740 1663052 423134 -1869729 -2456934 -3635458 -6932670 -8832758
8567 -8832758 -6105368 -1563473 -694727 -4560912 -8947910 -9475808 -5589601 -288625 2687131
8558B687131p78349k555260j180172J153925J744514L95674j241941k051600k045911
8549c871989j639520j287447j001942J02942K500992M478150L700401Q72969o17745
8540C236811M80177J409831k86429k944970l121634j10022L518847M697444K176843
8531I056898k468692n339589l518806J176097L624883J497497k206283l696013
8523a874008k886279j732663o91483O91305J583710J045373L19728J402692L827815
8514A686190M963483L285849j74228l257528m231679k537696N28353K302953J371162
8505C936859n44565o51634J115080J859300l44439l628651m528344k337387K58629
8496d865152J117948J347741K545459L052977K09767m051285m125409J216367
$$ plain form
8558 2687131 1908782 -646478 -1826650 -672725 1071789 1467463 225522 -1826078 -3871989
8549 -3871989 -5511509 -6798956 -7800898 -7697956 -5196964 -718814 2981587 3854556 3236811
8540 3236811 3716988 5126819 4840390 1895420 -1226214 -1336236 2182611 6880055 9056898
8531 9056898 6588206 1248617 -2270189 -1094092 2530791 4028288 1822005 -1874008
8523 -1874008 -4760287 -6492950 -7184433 -6493128 -4909418 -3864045 -3544317 -2141625 1686190
8514 1686190 6649673 9935522 9761294 6503766 2272087 -265609 262744 2565697 3936859
8505 3936859 3392294 2740660 3855740 5715040 5370601 1741950 -2786394 -5123781 -4865152
8496 -4865152 -3747204 -2399463 145996 3198973 3408740 -642545 -4767954 -3551587
8488c551587N783912L967202j589954m128891j868291J412758K746747K133230
8480D905126j42888l337756m439435j541791J933505J585753o28644M52844L772961
8471B559675L293290j274093l399146j006383n857l277834m919585o56933M025629
8462d661237K901037o12893J04999L365901K693558j643811l328726o17978J613949
8453a85201J51433k771108l993943k476232J645031O196536O494726J054059l832262
8444B283039j388296N081067O057081j21291m973732l031606O44499m55300m425605
8435c30144n215658k146687L64436J85723l96086P17964K418796K426060K99021
8426a676575k092065k369266r713K889168L735707K305792O71267M40727J150286
$$ plain form
8488 -3551587 2232325 6199527 4609573 480682 -1387609 25149 2771896 4905126
8480 4905126 4762238 1424482 -3014953 -4556744 -2623239 -1037486 -1666130 -1213286 2559675
8471 2559675 5852965 4578872 1179726 173343 167486 -3110348 -8029933 -8686866 -4661237
8462 -4661237 -1760200 -2373093 -2268094 1097807 3791365 2147554 -1181172 -1799150 -185201
8453 -185201 -33768 -2804876 -6798819 -9275051 -7630020 -1433484 5061242 6115301 2283039
8444 2283039 894743 5975810 12032891 11911600 6937868 3906262 4550761 4095461 -330144
8435 -330144 -5545802 -7692489 -7328053 -7142330 -7538416 -6820452 -4401656 -1975596 -1676575
8426 -1676575 -3768640 -6137906 -6147619 -3258451 477256 2783048 3454315 3895042 5045328
8417E045328J365458L79125j211867j982021j048560N74950P85494r45170k835782
8408A26955l220294k194678l65423J948246L517752K737281M12652p25948l01222
8399A935321o46889j779816o40369K585301K899907j243462l944542j102970K216228
8390B78709L01840k896257n86914M171013K982744l088020m585341N32066L592453
8381G02293k9434l642676j031562L867484M726035K557184J415479N34389k617706
8372F481486n881041n310791j655407J190446J862560J551282P81395j69509j6244
8363a165823J191005J034350j118474j983981M84446K971021J443685k734950
8355A21279m985297l643490o02777K205337L849721L582912J721123J6409o71148
$$ plain form
8417 5045328 6410786 6789911 5578044 3596023 2547463 3122413 3907907 2962737 126955
8408 126955 -3093339 -5288017 -5653440 -3705194 -187442 2549839 2962491 2236543 1935321
8399 1935321 1288432 -491384 -1131753 1453548 4353455 3109993 -834549 -1937519 278709
8390 278709 580549 -2315708 -2902622 1268391 4251135 1163115 -3422226 -2890160 702293
8381 702293 672859 -2969817 -4001379 -133895 4592140 7149324 8564803 9099192 6481486
8372 6481486 600445 -4710346 -6365753 -5175307 -3312747 -1761465 -980070 -1149579 -1165823
8363 -1165823 25182 1059532 -58942 -2042923 -1558477 1412544 2856229 121279
8355 121279 -4864018 -8507508 -9110285 -6904948 -3055227 527685 2248808 2265217 1594069
8346A594069j363558k461664k735769j852154q47977P37570M226058P324765N382972
8337A0004312j007328n242886m186890k400508l392256l279416J559843O721691
8329a223438O425783K908572J805131K312768k4946l858993l919839o75703K37645
8320C986980k291102l495516j248017J192760J473194O68380q68516l735817n261746
8311i579400j858938L740705M685284N45114j815427L23102J389344j827899l626374
8302h024489R19644O619624N681932k89600l533789k313874j765168l550739k842751
8293i099210K521727O622954L432730l712264n680470K96425O519115M544308
8285E445315l815320q538863l915298M743714Q576787O024155K531031J406729
$$ plain form
8346 1594069 230511 -2231153 -4966922 -6819076 -7667053 -6929483 -2703425 4621340 10004312
8337 10004312 8996984 3754098 -432792 -2833300 -6225556 -9504972 -7945129 -1223438
8329 -1223438 5202345 8110917 9916048 12228816 12203870 8344877 4425038 3749335 3986980
8320 3986980 1695878 -1799638 -3047655 -1854895 -381701 286679 -581837 -4317654 -9579400
8311 -9579400 -11438338 -7697633 -3012349 -2467235 -4282662 -3959560 -2570216 -4398115 -8024489
8302 -8024489 -7104845 -485221 5196711 4907111 1373322 -940552 -2705720 -6256459 -9099210
8293 -9099210 -6577483 45471 3478201 -234063 -5914533 -5618108 901007 5445315
8285 5445315 1629995 -6908868 -10824166 -6080452 2496335 8520490 11051521 12458250
8277A2458250K12408l184867n969164m595856m49444K087728J536633J55433l05317
8268A945804o30794j671491k342063j289705P98352J949218J557518J047043J637070
8259C000952K565187K473514J682725J367653Q37467j814377n617965o214434
8251a719278j701697L337283L058217j579177l913669q41152L123967K699071
8243B463565p70084j962258L70504K135093Q37701l03164K219735N445419L213659
8234A3650170m066893q199875m227467K055720K332729k124472l289577N13429
8226c356236K583444l53098k909442q42556J866176P95167j081897K61871J845060
8217a191511m87623l271827j024847L301883K781882j404294k343270o7374q63803
$$ plain form
8277 12458250 12670658 9485791 3516627 -1079229 -1528673 559055 2095688 2251121 1945804
8268 1945804 1315010 -356481 -2698544 -3988249 -3189897 -1240679 316839 1363882 3000952
8259 3000952 5566139 8039653 9722378 11090031 11927498 10113121 4495156 -1719278
8251 -1719278 -3420975 -83692 2974525 1395348 -2518321 -3359473 -235506 2463565
8243 2463565 1693481 -268777 101727 2236820 3074521 2771357 4991092 10436511 13650170
8234 13650170 9583277 1383402 -2844065 -788345 1544384 -580088 -3869665 -3356236
8226 -3356236 -772792 -1125890 -4035332 -4877888 -3011712 -2216545 -3298442 -3036571 -1191511
8217 -1191511 -1679134 -4950961 -5975808 -2673925 107957 -1296337 -3639607 -3706981 -4570784
8208d570784m108477j828894O163121Q800917Q65214p179735m359944M270060
8200a948522N852890j050515n719484j669609N406646O896048J820319l904611
8192E683162m956595j591323J430778N67220j962979j429297J602892J115441
8184D59299m760627r072066n194777L380042P747996N381417J566397N99592J294981
8175A402254J182104K15416o13919q62940j50779J317847J785787J0167k171972
8166B113965k058026k58670L43698o86558j044160j11192j23237k009821l181716
8157g015717j184603K479882M083925K325028l03109p91492P53156J611429M04010
8148B362509j071618j120926j368834l819722o015267l508530K740510O425958
$$ plain form
8208 -4570784 -8679261 -10508155 -4345034 4455883 5321097 -1858638 -6218582 -1948522
8200 -1948522 3904368 2853853 -2865631 -4535240 871406 7767454 9587773 5683162
8192 5683162 726567 -864756 566022 1133242 -829737 -2259034 -656142 459299
8184 459299 -4301328 -13373394 -18568171 -15188129 -7440133 -2058716 -492319 107273 1402254
8175 1402254 2584358 2799774 2185855 1322915 1172136 2489983 4275770 4285937 2113965
8166 2113965 55939 -202731 140967 -545591 -1589751 -1700943 -1824180 -3834001 -7015717
8157 -7015717 -8200320 -5720438 -1636513 688515 385406 -406086 347070 1958499 2362509
8148 2362509 1290891 169965 -1198869 -5018591 -11033858 -14542388 -11801878 -5375920
8140e375920M732741J962490J908853K060102o38648l341117k082238R39458J028077
8131A193798r40060o20273J660207J759649k95572k84452K074577J916884k367558
8122D097200n710058l747042J273119M380856L692231L71842l433943m824759
8114c900554j936594K732085M174507J528740o99134M72810K339594J304610j889959
8105D126105m239646m598872l205833J3672M003863N838748M029474Q34098o88324
8096F113285k34687O13064R18361O63367K03635L14384J013750L22292l152265
8087F775186o581785n510368l55818L681064L687592J734035J66614p15673J81224
8078C062071L821998O341565K436028m850927o129605l70859K185601l139390
$$ plain form
8140 -5375920 -643179 1319311 3228164 5288266 4649618 1308501 -773737 165721 1193798
8131 1193798 253738 -366535 1293672 3053321 2757749 2473297 4547874 6464758 4097200
8122 4097200 -1612858 -5359900 -4086781 294075 3986306 4358148 924205 -3900554
8114 -3900554 -5837148 -3105063 1069444 2598184 1899050 2371860 4711454 6016064 4126105
8105 4126105 -113541 -4712413 -7918246 -7904574 -3900711 1938037 5967511 6801609 6113285
8096 6113285 5878598 6491662 7410023 8073390 8277025 8591409 9605159 9927451 6775186
8087 6775186 193401 -5316967 -5672785 -1991721 1695871 3429906 3596520 2880847 3062071
8078 3062071 6884069 13225634 15661662 10810735 4681130 4310271 6495872 3356482
8070C356482o686513q97947N291106Q29462p498888n166407N390076P859114j182171
8061A294314o741497o4481Q062399N854814j851354m089036p83232J187082P14966
8052C583975Q97964P34672k046154m413993k778953j70349q60815k160750L77676
8043f836727L865108K875619m43308k96300J921109O36723k424681o40525M454376
8034C111394L872761l758422q669751m582266K787255N916364N353302M293981
8026H324618J251419n143217r781076o761848J553231P013788N535883K60594
8018B253392l634936l822931j478762O47192J309231K090994M026763M341301
8010E732244O08760l257336j497473L313084K650750l892092o288879J8753N467900
$$ plain form
8070 3356482 -3330031 -4227978 1063128 1892590 -5606298 -10772705 -5382629 2476485 1294314
8061 1294314 -5447183 -5511664 2550735 8405549 6554195 2465159 1681927 2869009 3583975
8052 3583975 4481939 5216611 3170457 -1243536 -4022489 -4192838 -5053653 -7214403 -6836727
8043 -6836727 -2971619 -96000 -539308 -835608 1085501 1722224 -702457 -1342982 3111394
8034 3111394 6984155 3225733 -5444018 -10026284 -7239029 -1322665 4030637 8324618
8026 8324618 9576037 4432820 -5348256 -12110104 -10556873 -3543085 1992798 2253392
8018 2253392 -1381544 -5204475 -6683237 -6036045 -4726814 -2635820 1390943 5732244
8010 5732244 6341004 3083668 1586195 4899279 7550029 3657937 -2630942 -2612189 2855711
8001B855711Q83599p541149p532611N82563N410603K020243k860923l019496l35360
7992i536820J535462K789494L891697K835357p75318l650023l470329j802007
7984h182487n66836M76895J068602n89157l908543m656956n08642M810260N840554
7975f216310K164765j770187k689248j830563j890380k492005p36273L492922
7967a1967279N407141J446550m078777l467736L031405O515249K377671k722709
7959c458485j557117K377223J419811l265598m182099l99053J470085j157170
7951h752403l216101j286503J365259J331975M5348l26741m06630p10049k7198
7942a1983043J493760K021965J806080K703466L632313J790279j383938j483421
$$ plain form
8001 2855711 3739310 -3801839 -11334450 -10751887 -5341284 -3321041 -6181964 -9201460 -9536820
7992 -9536820 -8001358 -5211864 -1320167 1515190 739872 -2910151 -6380480 -8182487
7984 -8182487 -8749323 -8272428 -7203826 -7792983 -11701526 -16358482 -16867124 -12056864 -6216310
7975 -6216310 -4051545 -5821732 -8510980 -10341543 -12231923 -14723928 -15460201 -11967279
7967 -11967279 -6560138 -5113588 -9192365 -12660101 -9628696 -3113447 -735776 -3458485
7959 -3458485 -5015602 -2638379 -1218568 -4484166 -8666265 -9065318 -7595233 -8752403
7951 -8752403 -11968504 -13255007 -11889748 -10557773 -10512425 -10839166 -11245796 -11955845 -11983043
7942 -11983043 -10489283 -8467318 -6661238 -3957772 -325459 1464820 80882 -1402539
7934a402539J215140J887431m30356j607985m35385j77552r53393Q75188L892732
7925B863281J807477m516238n581422J416162O466003K695617k104986R31008
7917C976902O114769K801587o271602r124896l276959K106666J539275o27693
7909b761951K0199J651782J496730J67497r76428j410374n6174K956884M083555
7900E171720Q55439l129757l069604n26256r5204j102071L29351L170303L172944
7891D776865R32860K54050O1096l268558o651137l291869M768394P340489J265118
$$ plain form
7934 -1402539 -187399 1700032 1269676 -338309 -773694 -951246 -1904639 -1029451 2863281
7925 2863281 4670758 154520 -5426902 -4010740 2455263 5150880 3045894 3976902
7917 3976902 10091671 12893258 6621656 -2503240 -5780199 -3673533 -2134258 -2761951
7909 -2761951 -2741752 -1089970 406760 574257 -402171 -1812545 -1868719 1088165 5171720
7900 5171720 6027159 2897402 -172202 -698458 -793662 -1895733 -1566382 1603921 4776865
7891 4776865 5709725 5963775 6024871 2756313 -3894824 -7186693 -2418299 4922190 6187308
$$ [...]
##END NTUPLES=NMR SPECTRUM
##END=
