##TITLE=31Pdec_SR 79 AcCl: Ac2O
 , 124 sc
 24.08.2021
##JCAMPDX= 6.0         $$ Bruker NMR JCAMP-DX V2.0
##DATA TYPE= NMR SPECTRUM
##DATA CLASS= NTUPLES
##ORIGIN= UXNMR, Bruker Analytische Messtechnik GmbH
##OWNER= root
$$ XWIN-NMR		Version 3.5
$$ Tue Aug 24 12:41:25 2021 Russian Standard Time (UT+4h)  she@DPX200
##.OBSERVE FREQUENCY= 81.013821
##.OBSERVE NUCLEUS= ^31P
##.ACQUISITION MODE= SIMULTANEOUS
##.ACQUISITION SCHEME= undefined
##.AVERAGES= 124
##.DIGITISER RES= 16
##SPECTROMETER/DATA SYSTEM= spect
##.PULSE SEQUENCE= zgpg30
##.SOLVENT NAME= CDCl3
##.SHIFT REFERENCE= (INTERNAL, CDCl3, 0, 248.564)
##AUDIT TRAIL= $$ (NUMBER, WHEN, WHO, WHERE, WHAT)
$$ ##TITLE= Audit trail, XWIN-NMR		Version 3.5
$$ ##JCAMPDX= 5.01
$$ ##ORIGIN= Bruker BioSpin GmbH
$$ ##OWNER= she
$$ F:/spectra/data/she/nmr/P31/1/pdata/1/auditp.txt
$$ ##AUDIT TRAIL=  $$ (NUMBER, WHEN, WHO, WHERE, WHAT)
(   1,<2021-08-24 12:39:15.21 +0400>,<she>,<DPX200>,
      <created by zg, POWCHK disabled, PULCHK disabled
       configuration hash MD5:
       00 E9 B6 7A A2 85 ED C7 34 08 36 98 17 FE 4E 26
       data hash MD5: 32K
       1D A6 F9 D3 40 A1 8A 17 5E AE 70 5A 5F A3 C9 64>)
(   2,<2021-08-24 12:39:17.70 +0400>,<she>,<DPX200>,
      <Start of raw data processing
       efp BC_mod = 2 LB = 1 FT_mod = 6 PKNL = 1 PHC0 = -7478.87 PHC1 = 658.0735 SI = 64K 
       data hash MD5: 64K
       A2 52 80 85 E9 31 02 89 82 ED FF E8 FA 4C 92 53>)
(   3,<2021-08-24 12:39:50.79 +0400>,<she>,<DPX200>,
      <pk PHC0 = -393.7179 PHC1 = 263.2 
       data hash MD5: 64K
       CE 5A D0 E4 DC 40 06 55 8F 5C AD 64 81 EC FF A9>)
(   4,<2021-08-24 12:40:11.09 +0400>,<she>,<DPX200>,
      <pk PHC0 = 157.3828 PHC1 = -1049.6 
       data hash MD5: 64K
       91 D8 00 13 CD 3D A4 CB 47 ED A5 7D C7 65 DF C2>)
(   5,<2021-08-24 12:40:14.01 +0400>,<she>,<DPX200>,
      <abs ABSG = 5 
       data hash MD5: 64K
       D9 B9 71 B8 9A F5 6C 6E DA B1 5F EE D4 4E 4F 20>)
(   6,<2021-08-24 12:40:40.56 +0400>,<she>,<DPX200>,
      <pk PHC0 = -13.56256 PHC1 = 110.8 
       data hash MD5: 64K
       89 3B DC 12 06 F5 7F B4 2C E9 E7 13 2F DA F2 35>)
(   7,<2021-08-24 12:40:44.42 +0400>,<she>,<DPX200>,
      <abs ABSG = 5 
       data hash MD5: 64K
       80 F4 CC B3 40 54 92 48 0D 2F B6 0A 5E CA CD D5>)
$$ ##END=
$$ 
$$ hash MD5
$$ 83 33 D4 E5 02 91 4D 82 3B 10 7E 66 BD 07 14 EB
##$RELAX= 
##$RELAX= 
##$RELAX= 
##$RELAX= 
##$RELAX= 
##$RELAX= 
##$RELAX= 
##$RELAX= 
$$ Bruker specific parameters
$$ --------------------------
##$DU= <F:/spectra>
##$EXPNO= 1
##$NAME= <P31>
##$PROCNO= 1
##$TYPE= <nmr>
##$USER= <she>
##$AMP= (0..31)
100 100 100 100 100 100 100 100 100 100 100 100 100 100 100 100 100 100 
100 100 100 100 100 100 100 100 100 100 100 100 100 100 
##$AQSEQ= 0
##$AQ_mod= 1
##$AUNM= <au_zg>
##$AUTOPOS= <>
##$BF1= 81.014009
##$BF2= 200.13
##$BF3= 200.13
##$BF4= 200.13
##$BF5= 200.13
##$BF6= 200.13
##$BF7= 200.13
##$BF8= 200.13
##$BYTORDA= 1
##$CFDGTYP= 0
##$CFRGTYP= 5
##$CHEMSTR= <none>
##$CNST= (0..31)
$$ [...]
##$SUBNAM3= <"">
##$SUBNAM4= <"">
##$SUBNAM5= <"">
##$SUBNAM6= <"">
##$SUBNAM7= <"">
##$SUBNAM8= <"">
##$SUBNAM9= <"">
##$SW= 501.771253377433
##$SWIBOX= (0..15)
0 1 3 0 0 0 0 0 0 0 0 0 0 0 0 0 
##$SW_h= 40650.406504065
##$TD= 32768
##$TD0= 1
##$TE= 0
##$TE2= 300
##$TE3= 300
##$TEG= 300
##$TL= (0..7)
0 120 53 12 22 120 120 120 
##$TP= (0..7)
150 150 150 150 150 150 150 150 
##$TP07= 0
##$TPNAME0= <>
##$TPNAME1= <>
##$TPNAME2= <>
##$TPNAME3= <>
##$TPNAME4= <>
##$TPNAME5= <>
##$TPNAME6= <>
##$TPNAME7= <>
##$TPOAL= (0..7)
0.5 0.5 0.5 0.5 0.5 0.5 0.5 0.5 
##$TPOFFS= (0..7)
0 0 0 0 0 0 0 0 
##$TUNHIN= 0
##$TUNHOUT= 0
##$TUNXOUT= 0
##$USERA1= <user>
##$USERA2= <user>
##$USERA3= <user>
##$USERA4= <user>
##$USERA5= <user>
##$V9= 5
##$VALIST= <valist>
##$VCLIST= <CCCCCCCCCCCCCCC>
##$VD= 0
##$VDLIST= <DDDDDDDDDDDDDDD>
##$VPLIST= <PPPPPPPPPPPPPPP>
##$VTLIST= <TTTTTTTTTTTTTTT>
##$WBST= 1024
##$WBSW= 4
##$XGAIN= (0..3)
0 0 0 0 
##$XL= 0
##$YL= 0
##$YMAX_a= 4717
##$YMIN_a= -7904
##$ZGOPTNS= <>
##$ZL1= 120
##$ZL2= 120
##$ZL3= 120
##$ZL4= 120
##$ABSF1= 248.5645
##$ABSF2= -253.2056
##$ABSG= 5
##$ABSL= 3
##$ALPHA= 0
##$AQORDER= 0
##$ASSFAC= 0
##$ASSFACI= 0
##$ASSFACX= 0
##$ASSWID= 0
##$AUNMP= <proc_1d>
##$AZFE= 0.1
##$AZFW= 0.5
##$BCFW= 0
##$BC_mod= 2
##$BYTORDP= 0
##$COROFFS= 0
##$CY= -3
##$DATMOD= 1
##$DC= 0
##$DFILT= <>
##$DTYPP= 0
##$F1P= 0
##$F2P= 0
##$FCOR= 1
##$FTSIZE= 65536
##$FT_mod= 6
##$GAMMA= 0
##$GB= 0
##$INTBC= 1
##$INTSCL= 5.30512e-09
##$ISEN= 30
##$LB= 1
##$LEV0= 0
##$LPBIN= 0
##$MAXI= 10000
##$MC2= 0
##$MEAN= 0
##$ME_mod= 0
##$MI= 50
##$NCOEF= 0
##$NC_proc= -7
##$NLEV= 6
##$NOISF1= 182.463
##$NOISF2= 159.3651
##$NSP= 0
##$NTH_PI= 0
##$NZP= 0
##$OFFSET= 248.5645
##$PC= 4
##$PHC0= -7728.768
##$PHC1= -17.5265
##$PH_mod= 1
##$PKNL= yes
##$PPARMOD= 0
##$PSCAL= 0
##$PSIGN= 0
##$REVERSE= no
##$SF= 81.014009
##$SI= 65536
##$SIGF1= 159.3651
##$SIGF2= -187.1042
##$SINO= 113.3802
##$SIOLD= 16384
##$SREGLST= <1H.CDCl3>
##$SSB= 0
##$STSI= 65536
##$STSR= 0
##$SW_p= 40650.406504065
##$SYMM= 0
##$S_DEV= 0
##$TDeff= 32768
##$TDoff= 0
##$TI= <>
##$TILT= no
##$TM1= 0
##$TM2= 0
##$TOPLEV= 0
##$USERP1= <user>
##$USERP2= <user>
##$USERP3= <user>
##$USERP4= <user>
##$USERP5= <user>
##$WDW= 1
##$XDIM= 65536
##$YMAX_p= 269828600
##$YMIN_p= -206715012
$$ End of Bruker specific parameters
$$ ---------------------------------
##NTUPLES= NMR SPECTRUM
##VAR_NAME=  FREQUENCY,     SPECTRUM/REAL,   SPECTRUM/IMAG
##SYMBOL=    X,             R,               I
##VAR_TYPE=  INDEPENDENT,   DEPENDENT,       DEPENDENT
##VAR_FORM=  AFFN,          ASDF,            ASDF
##VAR_DIM=   65536,         65536,           65536
##UNITS=     HZ,            ARBITRARY UNITS, ARBITRARY UNITS
##FACTOR=    0.620285442955139, 1,           1
##FIRST=     20137.2065510759, 0,            0
##LAST=      -20513.1999529892, 0,           0
##MIN=       -20513.1999529892, -206715012,  0
##MAX=       20137.2065510759, 269828600,    0
$$ Real data points
##PAGE= N=1
##DATA TABLE= (X++(R..R)), XYDATA
$$ [...]
58048a923563L935891K041709j036514N92898M148179L361465j365202l911210
58040E843653j706161J314452J163598j021261j806075o43354K49524l3267q3567
58031C277542L08210j243819n192232o739549j556913O221595P633070J527338
58023D235242k999453R841M369455J950753m106211m761294K45653K962672J009383
58014B916041K91484K946444L070285j928894n188224j334822M024945K682140
58006G479399l746537o853432l411573K023933M216790J850895k912264n436930
57998f789719j847651N113882P194738J711105l195661j7532O256900N382742
57990A3808804k636415q226210o707466k828614q31227Q80015L364853L717719
$$ y = [-1923563, 2012328, 4054037, 3017523, 3610421, 7758600, 11120065, 9754863, 5843653, 4137492, 5451944, 6615542, 5594281, 3788206, 3144852, 3394376, 3361109, 3277542, 3585752, 2341933, -2850299, -9589848, -11146761, -4925166, 2707904, 4235242, 1235789, 1245630, 5615085, 7565838, 3459627, -1301667, -1056014, 1906658, 2916041, 3207525, 6153969, 9224254, 7295360, 2107136, 772314, 4797259, 7479399, 3732862, -3120570, -6532143, -4508210, -291420, 1559475, -1352789, -6789719, -8637370, -3523488, 3671250, 5382355, 2186694, 2169162, 8426062, 13808804, 11172389, 2946179, -3761287, -6589901, -7421128, -6541113, -3176260, 541459]
57982E41459J099693o07135N34708J130178j039550k788471j453895J40398j208001
57973c650616l372429k575679P07572L451037M628296M533969K604878n59331
57965E767697j942123m01369P04773j200055l093691j076193K862058L735773
57957E356870J314755k54201L53074R3914k467689m380209l017549j46396P29185
57948b418246q20194j783757L31633M072140N124633J483757l145868l253705
57940d09607J185107M396949K632160j337828l280578l035502k233628o59218
57932b742145J245184L07331l913587n340405N68267P859539O811571j773710
57924C022045p281899m458119P52743K365506K504354M225363M219973p55655
$$ y = [541459, 1641152, 1034017, 1568725, 2698903, 1659353, -1129118, -2583013, -2442615, -3650616, -7023045, -9598724, -8891152, -5440115, -811819, 3722150, 6327028, 5767697, 3825574, 3424205, 4128978, 2928923, -164768, -1240961, 1621097, 5356870, 6671625, 6417424, 6770498, 6864412, 4396723, 16514, -3001035, -3147431, -2418246, -3238440, -5022197, -4690564, -618424, 4506209, 5989966, 2844098, -409607, 775500, 5172449, 7804609, 6466781, 3186203, 150701, -2082927, -2742145, -1496961, -1189630, -5103217, -10443622, -9875355, -2015816, 4795755, 3022045, -4259854, -8717973, -7965230, -5599724, -3095370, 1129993, 5349966, 4594311]
57916D594311n848387l994531L273742P785646N827062J154393k084211l492717
57908G215308l496180j778842K67563q3018k749363m491638l552418j340907J031095
57899h978400L954168O018530L952460j799825n497202l474524K89886K00626
57891e334281k123610o25581M712708O695773J728259m143643l751806J070620
57883a771561L056007M80805j572310k89732J030505j51585q73189J541112L653660
57874E103712J004589l974912m964548j355162J118807m84733k389905r53892
57866f896044J820677K487291J538336R40285l09389l811893p069818n741400
57858a7041955K160N214528O362617M613283K595309Q47392j348527l603104m382600
$$ y = [4594311, -1254076, -5248607, -1974865, 5810781, 11637843, 12792236, 10708025, 7215308, 3719128, 1940286, 2207849, 2124831, -624532, -5116170, -8668588, -10009495, -8978400, -5024232, 994298, 4946758, 3146933, -2350269, -5824793, -5534907, -5334281, -7457891, -8083472, -3370764, 3325009, 5053268, 909625, -2842181, -1771561, 1284446, 1765251, 192941, -96791, 933714, 782129, -91060, 1450052, 5103712, 6108301, 2133389, -2831159, -4186321, -3067514, -3552247, -5942152, -6896044, -5075367, -2588076, -1049740, -109455, -418844, -4230737, -11300555, -17041955, -17039795, -11825267, -5462650, -849367, 1745942, 2593334, 1244807, -2358297, -6740897]
57849f740897k736452N78282L569798M694148M063688K492122m6610l265810m499538
57840a891269j286355L298217K474852m382115q402519k621197O971573Q486076
57832B647263M75643o364228m341482J914982M084354J670629J58301J788587
57824B034049L462779K323495o69659k701921k412019j069572r79423k264876
57816b277147k091568J027632L598837J503771k976362l584647M13299L119415
57808a266770J548725l56492K28852M713l150320m564808l45180N027567N311904
57799B438191K056756N53422M86857j605240m025002k532082J080539J504389
57791d2170p17854q55111N82419o61570k748401K43972O247905O213528q80437
$$ y = [-6740897, -9477349, -8899067, -5329269, -635121, 3428567, 5920689, 5874079, 2608269, -1891269, -3177624, 120593, 2595445, -1786670, -10189189, -12810386, -5838813, 2647263, 3122906, -3241322, -7582804, -5667822, -1583468, 87161, 245462, 2034049, 5496828, 7820323, 7150664, 4448743, 2036724, 967152, -12271, -2277147, -4368715, -3341083, 257754, 1761525, -1214837, -4799484, -4386185, -1266770, 281955, -74537, 154315, 159028, -2991292, -7556100, -7901280, -2873713, 2438191, 4494947, 5048369, 5535226, 3929986, -95016, -2627098, -1546559, -42170, -760024, -1615135, -1032716, -1694286, -4442687, -4198715, 2049190, 8262718, 7382281]
57782G382281n211463j872743J649609q97393m117035j609274K342367R11392
57774a422259k743621j162675M185761N414677J121872k445044j837104L828K51844
57765A367279m05400r86039j565836j484514j95423R45685Q66773O36933K76983
57756e43559k492889o556062n484125L031434J0708630Q763352M25897m396814
57748C455864l305328j539037r84462R77290L073974Q84784l791539l995433Q82350
57739d341537L768921J562675q04791J25129J568553J595750K291913L110190
57731H876803k0403n554319n444716K060606P579621M138448k693324m583488
57723D359228k588880k092005k421804m443L217301K948742M18823n69598j013802
$$ y = [7382281, 2170818, 298075, 1947684, 1050291, -3066744, -4676018, -2333651, -1422259, -4165880, -5328555, -1142794, 4271883, 5393755, 2948711, 1111607, 1115435, 1367279, 961879, -24160, -1589996, -3074510, -3269933, -2324248, -1457475, -820542, -543559, -3036448, -9592510, -15076635, -12045201, -1336571, 7426781, 7852678, 3455864, 150536, -1388501, -2372963, -1395673, 1678301, 2563085, -1228454, -5223887, -4341537, -572616, 990059, 185268, 310397, 1878950, 3474700, 5766613, 8876803, 8856400, 3302081, -2142635, -82029, 7497592, 11636040, 8942716, 4359228, 1770348, -321657, -2743461, -2747904, 469397, 3418139, 3836962, 3267364, 2253562]
57714B253562l537701n107124j145057N244225O447159J736225k260019k077896
57706A553374q74574j052147p84887P15112J101088J20107J020128M101986M200772
57697A0100959j745029q586068q679642j673734N246360O309576L167697J151092
57689E291211J826127J807460j141269m014486l112864l23238l11603k343109
57681b321771q95333M466808O568496J525170m111804k766651K586964L387160
57673H439039j212364l943940j236846K340689K285085M7271j357399k105457
57665C256078l064843k691866K43612L304920K851120j005592m036205k731948
57657c874724J400767L348139Q79408k165540j276067J424242M5281m803783n271670
$$ y = [2253562, -1284139, -6391263, -7536320, -2292095, 4155064, 5891289, 3631270, 1553374, 678800, -373347, -1158234, -443122, 657966, 778073, 1798201, 5900187, 10100959, 8355930, -230138, -8909780, -10583514, -5337154, 972422, 4140119, 5291211, 7117338, 8924798, 7783529, 3769043, 656179, 332941, 21338, -2321771, -3217104, 1249704, 7818200, 9343370, 5231566, 2464915, 5051879, 8439039, 7226675, 3282735, 2045889, 4386578, 6671663, 6718934, 5361535, 3256078, 191235, -2500631, -2257019, 1047901, 3899021, 2893429, -1142776, -3874724, -2473957, 874182, 1753590, -411950, -1688017, -263775, -218494, -5022277, -10293947]
57648a0293947J402620O857169L566850l192383l220971K886459N164802j06483
57640C064116n486546m089352J522136M473293J987998l356024o657465m188021
57632a2729865K424821O067205K403582l365734l472425Q42362K047506r17629
57624f700177j696157J453462K569810p20653k440462J082169M474386K556412
57616E78790j218588j558899q3546p71794j969580K86950M736878O759896M960472
57607A1720579J117559l313284o440369n422787j049588J192392r47566k107327
57599e250391J967406O311787M007441k538972n128344j881189J722393K284559
57591A494690J673672J370168K57408j733362l087492l746583m293172l191164
$$ y = [-10293947, -8891327, -2034158, 1532692, -1659691, -4880662, -1994203, 3170599, 3064116, -2422430, -6511782, -4989646, -516353, 1471645, -1884379, -8541844, -12729865, -10305044, -4237839, -1834257, -5199991, -8672416, -7830054, -5782548, -6700177, -8396334, -6942872, -4373062, -5093715, -7534177, -6452008, -1977622, 578790, -639798, -2198697, -2282243, -3054037, -5023617, -4736667, 211, 6760107, 11720579, 12838138, 9524854, 3084485, -2338302, -3387890, -2195498, -3143064, -5250391, -3282985, 3028802, 7036243, 4497271, -631073, -2512262, -789869, 1494690, 3168362, 4538530, 4795938, 3062576, -24916, -3771499, -8064671, -11255835]
57583a1255835N78086L776453K887264O8455k43372J368523J363580L89157J489027
57574D21338L139545J824066J4182K816435P384758N462679k818867p913679n711462
57565D618995k966483m375545m963198r27896K160765l82940k895787P52084N392706
57556c587299L067590k617552k155503L636898N165647M10346k355200Q04100
57548B369027L487137Q20014k627459j727110M79012j094741m721215n343108
57540h358443k802285p75014k03744R88119L215540M586262M053134K128449m38174
57531B393844k285227j468841J596960L147389P74237k789104l519957j727350
57523c878049m36825j02292R40034K064455J103008p88219J89341M039901N586549
$$ y = [-11255835, -10677749, -6901296, -4014032, -3945577, -4188949, -2820426, -1456846, -1067689, 421338, 3560883, 5384949, 5399131, 8215566, 15600324, 21063003, 18244136, 10330457, 4618995, 1652512, -2723033, -7686231, -8614127, -6453362, -6836302, -9732089, -8980005, -3587299, -519709, -3137261, -5292764, -1655866, 3509781, 3920127, 1564927, 2369027, 5856164, 6676178, 4048719, 2321609, 2800621, 1705880, -3015335, -8358443, -11160728, -11935742, -12139486, -11151367, -7935827, -3349565, 703569, 2832018, 2393844, 108617, -1360224, 236736, 3384125, 4158362, 1369258, -2150699, -3878049, -4314874, -4417166, -3477132, -1412677, -309669, -1097888, -908547, 3131354, 8717903]
57514H717903J481169m719430o890877l618172J015058K556101L79488k492323
57506c571083k749704m03893J104137n31772k693577j079204L700402O240891
57498A6197L772714j67401j198222K09254J033416O36151N2710j253894l933251
57489h32326n470084k656176K972437O204903N047266K701834J737694L85716
57481A0091264l028418n540022l344728J685862L654014P13509k598113k291834
57473f58466l11780k88405j186552L41829K989272J886268k883797m896789j140982
57464f149402K585759P18238k688434n29200M869738M732973j519024m389300
57456b368652O57039N645431K704683l628356l983324J524283M885613L031084
$$ y = [8717903, 10199072, 5479642, -1411235, -5029407, -4014349, -1458248, -1078760, -3571083, -6320787, -6724680, -5620543, -6152315, -8845892, -9925096, -6224694, 16197, 3788911, 3621510, 2423288, 2632542, 3665958, 4302109, 4354819, 3100925, -832326, -6302410, -8958586, -5986149, 218754, 5266020, 7967854, 9705548, 10091264, 7062846, 1522824, -1821904, -136042, 3517972, 4231481, 1633368, -658466, -970246, -1258651, -2445203, -2103374, 885898, 2772166, -111631, -5008420, -6149402, -3563643, -2845405, -5533839, -6063039, -1193301, 3539672, 2020648, -2368652, -1711613, 3933818, 6638501, 3010145, -973179, 551104, 5436717, 8467801]
57448H467801O62071J041376J572998l73747l235795m597490m311897k803211
57440c577894J5182K771146K815023k07717l381442m098391k655643q32332K50288
57431h901780N58856Q71244J868836K570784J031104k150227l331248r28488J711962
57422f698957J369581j65523M9630O02934j038394k588874j41033M483884N711601
57413A584849K577823p34581j916045k226210j922690r7350J402508n2343k542365
57404c926404k314557o60129j207769j918925J790576O945783N839900p90875
57396C757600l923521r58917Q16515j932763l001407P88684L035264l51330l624296
57387e394171k164639k67459r05294R38940O368893O171786k939188p851793J427883
$$ y = [8467801, 9129872, 10171248, 11744246, 11370499, 8134704, 3537214, -774683, -3577894, -3562712, -791566, 2023457, 1815740, -1565702, -5664093, -8319736, -9152068, -8901780, -8342924, -7471680, -5602844, -3032060, -2000956, -4151183, -7482431, -8410919, -6698957, -5329376, -5494899, -5445269, -4842335, -5880729, -8469603, -8610636, -4126752, 1584849, 4162672, 3428091, 1512046, -714164, -2636854, -2734204, -1331696, -1384039, -3926404, -6240961, -6901090, -8108859, -10027784, -8237208, -1291425, 4548475, 3757600, -165921, -1124838, -308323, -2241086, -5242493, -4453809, -1418545, -1769875, -5394171, -7558810, -7826269, -8731563, -7792623, -1423730, 4748056, 1808868, -6042925, -4615042]
57378d615042J2769247R096943m159145p943271l43233K502078n000849r622432
57370g315704l018574N525719O604830M379459M538649K924164m147596r915862
57362d24915p724795k381575j397053k723858o05948L091528K939836K31893K43753
57353h751134K917337M079713K824605R44601j710184n036262n427502j049211
57345a1208037L250509K718276N53991J976850M324792J492569m444580n376838
57337f712468j82232L546148J746184o27309J184367M415107M315688J322584
57329I008069j269654k492580k816727j618922P38502J205285j687060m076586
57321c009673j498352L942106N674383J981126j412667J41049L180228J418676
$$ y = [-4615042, 8154205, 17251148, 13092003, 5148732, 4805499, 7307577, 2306728, -7315704, -10334278, -4808559, 1796271, 6175730, 10714379, 13638543, 9490947, -424915, -8149710, -10531285, -11928338, -14652196, -15258144, -12166616, -9226780, -8994887, -8751134, -5833797, -1754084, 1070521, 2015122, 304938, -4731324, -10158826, -11208037, -7957528, -5239252, -4685261, -2708411, 1616381, 3108950, -1335630, -6712468, -6894700, -3348552, -1602368, -2229677, -1045310, 3369797, 7685485, 9008069, 7738415, 5245835, 2429108, 810186, 1548688, 2753973, 1066913, -3009673, -4508025, -565919, 5108464, 7089590, 5676923, 5817972, 8998200, 10416876]
57313A0416876m305707o534291j849729M049213M411959N28838j270662Q64055
57305F310552K708873J132880j900083l226012k624002j794683j800548k422673
57297c615696k249342L31133M162056M797847L43162l999641k258904K817479
57289C28094L283069j252307k622566K231235N513852J171570m927646m372424
57281f47123P81756K794754J252051J775351M316038K788893l453436o982336
57273B625948l418622K195887L282008J24170k925798l775065k558068P87732
57265c661808N096653O851197M050586m84834k505250j644799q76761j823458
57257E001526l056342k608979l22215K195011K873072R08799j943868k567378
$$ y = [10416876, 6111169, -423122, -2272851, 1776362, 6188321, 6717159, 5446497, 6310552, 9019425, 10152305, 8252222, 5026210, 2402208, 607525, -1193023, -3615696, -5865038, -5533905, -1371849, 3425998, 3769160, -230481, -2489385, 328094, 3611163, 2358856, -263710, 1967525, 7481377, 8652947, 3725301, -647123, 134633, 2929387, 4181438, 5956789, 10272827, 13061720, 9608284, 2625948, -792674, 1403213, 4685221, 4809391, 1883593, -1891472, -4449540, -3661808, 1434845, 8286042, 12336628, 11851794, 9346544, 7701745, 6824984, 5001526, 1945184, -663795, -986010, 1209001, 4082073, 4990872, 3047004, 479626]
57249D79626m4646K692091K164608j069587k819868o36632K882557L584716J410188
57240H643053J8718P62009M90781k622059m614688j481918L019240J757792l850506
57231B122422m106727M096380J0554909N795529m641403q274754l701390n02595
57223A342371k793552l953884M14244M780193L689025O76010O92863Q97571k973513
57214B771328o646610l262468L936164N123268o54332l901511j37902L330007
57206E57944M02422l403308o24446N258557N528300L28240k505998n75357P39154
57197E705508j075333k042334l19113L93886j105467n79130K663392K463332l051122
57188C053619n701569k47584M993131O24135p434019o558747J868008M775507
$$ y = [479626, 434980, 3127071, 5291679, 4222092, 1402224, 765592, 3648149, 7232865, 8643053, 8661771, 9423780, 9914561, 7292502, 2677814, 1195896, 4215136, 5972928, 2122422, -1984305, 2112075, 12666984, 18462513, 13821110, 5546356, 1844966, 1342371, -1451181, -5405065, -4990821, -210628, 3478397, 4154407, 4847270, 5744841, 2771328, -3875282, -7137750, -3201586, 1921682, 1267350, -2634161, -2772063, 557944, 960366, -2442942, -3067388, 2191169, 7719469, 8047709, 5541711, 4966354, 5705508, 4630175, 2587841, 2268728, 2662614, 1557147, 978017, 3641409, 6104741, 3053619, -2647950, -2895534, 2097597, 2721732, -4712287, -11271034, -9403026, -4627519]
57180d627519o64743k819120L914822R281631M351951m198862n829867j946635
57172b538342j24160p57668k5413L08637k912154n106726l51714O423794N222397
57163A38651k726805o077329q34486M616234L799415P91131Q62661J805506j51100
57154B223878k939720k884711j281292j526169l142020k959605Q7657M281408
57146h140574P192331O839011L234327m23514j066854l09446j771456m292728
57138A261097l348007N20766J429348k095698m224738j593117J169742j40316
57130g020923k139264n18102K130562J470090n31283N44206L575045M475400L396357
57121E382088K657622P59922m156600p616211l827983M061406P146386L739552
$$ y = [-4627519, -5292262, -8111382, -4196560, 5085071, 9437022, 5238160, -591707, -2538342, -2662502, -3420170, -3445583, -3136946, -6049100, -11155826, -11507540, -5083746, 138651, -2588154, -8665483, -9499969, -4883735, -1084320, -293189, 569472, 2374978, 2223878, -715842, -3600553, -4881845, -6408014, -9550034, -12509639, -12421982, -8140574, -948243, 5890768, 9125095, 8701581, 7634727, 7325281, 5553825, 1261097, -2086910, -1566144, -136796, -2232494, -6457232, -8050349, -6880607, -7020923, -9160187, -9678289, -7547727, -6077637, -6608920, -6064714, -2489669, 1985731, 5382088, 8039710, 8799632, 4643032, -2973179, -6801162, -2739756, 4406630, 8146182]
57113H146182O27205R09257k50114n287962q443526m877304J407267M096093L443337
57104b29565K998571K208158j188630m522344k926517K332000M528824R20463
57096D120960l727086m310007j621974P15215J916340L352438M249149K029293
57088F724328k777518n335881k434375K257632K201352k889756n843985j805963
57080i904166M481753N079334K0948l293008j156271K039601J762801j53108j46677
57071a268793P43770l56534k350012j919977P91914K612774K194763N90716j709953
57062f71332m275568m452740j85030N307528O270330K064244k231519l197623
57054a371710k498238k175484j491827k88667p73356l171369l595205M40782N544225
$$ y = [8146182, 8773387, 9682644, 9432530, 4144568, -4298958, -9176262, -7768995, -3672902, -229565, 2769006, 4977164, 3788534, -733810, -3660327, -1328327, 3200497, 4120960, 393874, -3916133, -5538107, -4822892, -2906552, 445886, 4695035, 6724328, 3946810, -1389071, -3823446, -1565814, 635538, -2254218, -8098203, -9904166, -5422413, -343079, -322131, -3615139, -4771410, -2731809, -969008, -1122116, -1268793, -525023, -881557, -3231569, -5151546, -4359632, -1746858, 447905, 1038621, -671332, -4946900, -9399640, -9584670, -4277142, 1993188, 4057432, 1825913, -1371710, -3869948, -6045432, -7537259, -7825926, -8599282, -11770651, -15365856, -14925074, -9380849]
57045i380849O842980M305492J501054L99952N85476J471856K080916O44980k363743
57036F088114l042324M91138L789108J705214l495095m962391j447098J071139
57028A97805j311748m838929m033433P58394M546084M051739N99863k042188j353704
57019c426117J584629L137560J383491j455538k352591j672570j430117j133227
57011e364480P72948K572875J120370k350109l154940j29739L133930M205569
57003H06424L732051J321711m049404q539622n814563K475680O248427J153269
56995b666027m364185j913562M053649M034418j570330m411923j773781J036967
56987g574774N60755r95689j716157k328447k221901K45538L026354K245260q34492
$$ y = [-9380849, -2537869, 1767623, 3268677, 3668629, 4254105, 5725961, 7806877, 8451857, 6088114, 3045790, 3536928, 7326036, 9031250, 5536155, 573764, -873334, 197805, -1113943, -5952872, -9986305, -9227911, -4681827, -630088, -30225, -2072413, -3426117, -1841488, 1296072, 2679563, 1224025, -1128566, -2801136, -4231253, -5364480, -4591532, -2018657, -898287, -3248396, -6403336, -6533075, -3399145, 806424, 4538475, 5860186, 1810782, -6728840, -12543403, -10067723, -3819296, -2666027, -7030212, -8943774, -4890125, -855707, -2426037, -6837960, -8611741, -7574774, -7014019, -8009708, -9725865, -12054312, -14276213, -14030675, -11004321, -8759061, -9593553]
56978i593553j010926K200435L752138J946499J174383L637095N073570K208470
56970I388111j247687m19178K973549L146142j635326o934158p339162k225849
56962d293558L121292K614542l028012n907873j243791N067138M599095q64895
56954F3938k573621Q79664K143350j545027m024591j790892M49521j20027Q70237
56945e647448M682720M428727k325930o274664j085514M433503N28493o034339
56937g294452l023810N564950N644332k675684n034095K655410P767987L008880
56929F613518k307845j50726K767832o41053l788890P91541N842753J147097p299795
56920B974432n917427L383008N567454k897299q384431k396644N430748L627503
$$ y = [-9593553, -10604479, -8404044, -4651906, -2705407, -1531024, 2106071, 7179641, 9388111, 8140424, 7721246, 10694795, 13840937, 12205611, 5271453, -2067709, -4293558, -1172266, 1442276, -1585736, -7493609, -8737400, -3670262, 928833, 63938, -2509683, -1630019, 513331, -1031696, -5056287, -6847179, -6397658, -6517685, -5647448, -964728, 3463999, 1138069, -5136595, -6222109, -1788606, -1260113, -7294452, -10318262, -4753312, 891020, -1784664, -6818759, -4163349, 3604638, 6613518, 4305673, 4154947, 6922779, 6281726, 2492836, 3284377, 9127130, 10274227, 2974432, -2942995, 440013, 6007467, 3110168, -5274263, -7670907, -2240159, 1387344]
56912A387344l718054n305830k40503K958964N49199k795034k912509p41881J913252
56903h905052M642039N787045L084255j792808l862905j484420J452931J450438
56895C71523j11148k67298J016043J940841J834401O34341k152125n329262n175500
56886g238184j27681N283466N034576m68504m877570m312594j334463K68602N10782
56877g261570R19818Q60598n43869j310519P03482L337103K491115j239199k519169
56868d562210R42218M384903K449637k974830n003534r96492M136141M615144
56860B990977O97038l038825m042311l412382k148355M26754L562932L967554
56852i96618N25778k351037k5813M854071M959947r50594n073509j393950M943921
$$ y = [1387344, -2330710, -7636540, -7877043, -4918079, -4368880, -7163914, -10076423, -10818304, -8905052, -4263013, 1524032, 4608287, 2815479, -1047426, -2531846, -1078915, 371523, 260375, -6923, 1009120, 2949961, 4784362, 5418703, 3266578, -2062684, -7238184, -7365865, -2082399, 2952177, 2483673, -2393897, -6706491, -8040954, -7772352, -7261570, -6341752, -5481154, -6025023, -7335542, -6632060, -3294957, -803842, -2043041, -4562210, -3619992, 764911, 3214548, 239718, -4763816, -5760308, -1624167, 2990977, 3688015, 649190, -3393121, -6805503, -8953858, -8527104, -4964172, -996618, -470840, -2821877, -2847690, 2006381, 6966328, 6015734, 942225, -451725, 4492196]
56843D492196M419070l019936p475696l009589M367478N790628J525191j379165
56835E710177l80949K06942k017205l064132L80705M455446L289437k143614n361368
56826A075439l453982R3548J725395K031723K309287J581799l27274p11962J543661
56817E867634K674336n66362m745145l986485J060973L940926J898639q15802
56809E328714k42600J807835J820251m5168j393040j290092o8574J778490K402008
56800A0097824n74702n654565p312949l330727J088703M75233k650184j687750
56792i549117L735523O972102L772404k386823n385911l274367J058256L409251
56784a648682J842465j344174j628887J789751L709057j44804n832707n799850
$$ y = [4492196, 8911266, 5891330, -1584366, -4593955, -226477, 5564151, 7089342, 5710177, 5329228, 5536170, 3518965, 454833, 835538, 5290984, 8580421, 6436807, 1075439, -2378543, -2284995, -559600, 1472123, 3781410, 5363209, 5035935, 4323973, 5867634, 8541970, 7975608, 3230463, -756022, 304951, 4245877, 6144516, 5328714, 5086114, 6893949, 8714200, 8669032, 7275992, 5985900, 5917326, 7695816, 10097824, 9523122, 3868557, -3444392, -6775119, -5686416, -5211183, -7861367, -9549117, -5813594, 1158508, 4930912, 2544089, -2841822, -6116189, -5057933, -1648682, 193783, -1150391, -2779278, -989527, 2719530, 2574726, -3257981, -9057831]
56776i057831K56428N061844M479492J974723Q78097o59030l475858l140773K280223
56767a402685N768249L53654q719367r423570Q0406Q318401O244293j265693l751729
56758c798041N06243M249742K651563j053937j723715M57190J250807j262087
56750A277765m312574m424367j749924Q38948J938872K790753M095932M059069
56742D514474J245111k321658l301294j485129L17339M75292M7427n446l37547
56733h51431j058616o07464J625106L467896K624570j14423k041520j938755o84282
56724D21081O57941J508925J056411j136609l669734m149554k076058L51757J072291
56715e963549Q49940J938657M296661M624432L65889n895949q026747l291989
$$ y = [-9057831, -8801403, -3739559, 739933, 2714656, 3592753, 2933723, -542135, -3682908, -1402685, 4365564, 4719218, -4000149, -13423719, -13343313, -5024912, 1219381, -46312, -3798041, -3291798, 957944, 3609507, 2555570, 831855, 1289045, 2539852, 1277765, -3034809, -7459176, -9209100, -8370152, -6431280, -3640527, 455405, 4514474, 5759585, 3437927, 136633, -1348496, -1031157, -555865, -508438, -513884, -851431, -1910047, -2517511, -892405, 2575491, 5200061, 5085638, 3044118, 1105363, 421081, 1079022, 2587947, 3644358, 2507749, -1161985, -5311539, -7387597, -7035840, -5963549, -5113609, -3174952, 1121709, 5746141, 6112030, 216081, -7810666, -11102655]
56707a1102655L873498O858471M446938Q85473p58911j601732k794308k582054
56699b775280M6939K058857K32865l593767m657045j607188K408229M224946L310289
56690c51155P07060j694566j560223J151876K689989J24755l528417l005654J025038
56681d441297K569597n68268l761937l110711n55507R63568K173988L899057L684849
56672H53339L52347k086617Q0174L975274M231659P75310k455880m175566n630943
56663d080903n611639j686284L999010N921744K792311q62143j467500l61636
56655a357040m1220m65184m30715L92772J682610K411961R07868k400384l568787
56646b868119j96407L550628J827954l952773o696300l787181M45540K674003
$$ y = [-11102655, -7229157, -370686, 4076252, 4961725, 4202814, 2601082, -193226, -2775280, -2728341, -669484, -436619, -4030386, -8687431, -10294619, -7886390, -3661444, -351155, 355905, -1338661, -2898884, -1747008, 942981, 1067736, -2460681, -5466335, -4441297, -1871700, -2439968, -6201905, -9312616, -9868123, -8904555, -6730567, -2831510, 853339, 1205686, -880931, -800757, 3174517, 7406176, 8181486, 5725606, 1550040, -4080903, -9692542, -11378826, -7379816, -1458072, 1334239, 472096, -995404, -1357040, -1398260, -1863444, -2294159, -1901387, -218777, 2193184, 3101052, 700668, -2868119, -3064526, 486102, 2314056, -1638717, -8335017, -12122198, -11676658, -9002655]
56638i002655M223862N513159L884374m24090k631797q96244O32503m96928p06623
56629I5561K171706L662114J86051m030990l692374r06641l82361r07945J050817
56620b754062L309591J643009j435357q9571M359546M922026L27370l333697k623169
56611D325686m92651Q29044K803574M748155K721477k987673o155995l708421
56603B083196l18425m76670j986581j447690n06385j603298k290717M99450M029842
56594b017278L408706n70984k600814n18210K844714M466039L677325Q54161k565334
56585F978325l642595j207371J463468J014654l47906J603465M882989K802455
56577A3547484n178814j0386918o192954K425929N398938P77017l909941k685483
$$ y = [-9002655, -4778793, 734366, 4618740, 4194650, 1562853, 666609, 1299112, 802184, 95561, 2267267, 5929381, 6115432, 2084442, -1607932, -2514573, -2896934, -3804879, -2754062, 555529, 2198538, 763181, 673610, 5033156, 9955182, 10282552, 6948855, 4325686, 3833035, 4662079, 7465653, 12213808, 14935285, 11947612, 5791617, 2083196, 1764771, 1288101, -698480, -2146170, -2652555, -4255853, -6546570, -6047120, -2017278, 1391428, 820444, -1780370, -2298580, 546134, 5012173, 8689498, 9543659, 6978325, 3335730, 2128359, 3591827, 4606481, 4258575, 5862040, 10745029, 13547484, 8368670, -2018248, -8211202, -5785273, -386335, 390682, -3519259, -6204742]
56569f204742J642101K631966j062065m665290l517111J739993O124371N607972
56561B297195J233180k285730k150576m12417j59738n60011J249574M203849L726960
56552G142286q57738m052948k171038P11415p46397m146904k917860K843162N941177
56543A745155K842973j689984k569244j063238n73617q38014j22884P40734L34288
56534a193831m17162n25822r87727j611199K72663M368231N216765L49154l847312
56525A623760r41755M596818L478867l453563n854403k4902N179759K115181m277640
56516B442122m784968K81261K882846n3451l134836j802422J112378P76371j748061
56507d028760j283118K887433M853449M98439n431980n108643J025159M526538
$$ y = [-6204742, -4562641, -1930675, -2992740, -7658030, -11175141, -9435148, -3310777, 2297195, 3530375, 1244645, -905931, -1318348, -1478086, -2038097, -788523, 3415326, 7142286, 6284548, 2231600, 60562, 771977, 25580, -4121324, -7039184, -4196022, 1745155, 4588128, 2898144, 328900, -734338, -1307955, -2145969, -2268853, -1528119, -1193831, -1610993, -2136815, -3124542, -4735741, -4463078, -94847, 5121918, 5471072, 1623760, 682005, 5278823, 8757690, 5304127, -550276, -575178, 4604581, 6719762, 2442122, -2342846, -2061585, 821261, 767810, -2367026, -4169448, -3057070, -2280699, -4028760, -5311878, -2424445, 2429004, 2927443, -2504537, -7613180, -6588021, -2061483]
56499b061483J392265k308724n74769L165393K788401L57507K088906O464983
56491A1312479N753293j017998n889224m390890j419255j508940j439026K347203
56483C747642N804854L511861j688315k423879J968471M485688N53760o071109
56475I888973q544188m765170J280464M237962K474660j039732k573423j667371
56467g07825l89324L64585J406884K537940K337073R32942n0482o71079k440990
56458C319724m352270k973068K090948O376417O031870K231235j342014k652178
56450H730664j825250l08269k28341j741756j377391K937099O201569J994254
56442A4382579o253631p810567m88743N127263J723248l647305j707908L886014
$$ y = [-2061483, -669218, -2977942, -3552711, -387318, 2401083, 2758590, 4847496, 11312479, 17065772, 16047774, 10158550, 5767660, 4348405, 2839465, 1400439, 3747642, 9552496, 13064357, 11376042, 8952163, 10920634, 15406322, 15960082, 9888973, 1344785, -3420385, -2139921, 2098041, 4572701, 3532969, 959546, -707825, -1097149, -732564, 674320, 3212260, 5549333, 6482275, 6431793, 5760714, 3319724, -1032546, -4005614, -1914666, 4461751, 10493621, 12724856, 11382842, 8730664, 6905414, 6597145, 6368804, 4627048, 3249657, 6186756, 12388325, 14382579, 8128948, 318381, -170362, 4956901, 6680149, 3032844, 1324936, 5210950]
56434E210950L344114k828238n241264r82313L089772K256737l29687j103826
56426C416245j121562j542993q45769J142693J955494J062077P57351J215675
56418F039211k13504l526981n090534l460885r85758J488836N510021R015974
56410H776380O412743j951006p025062k796198M656797N711222M44353l341021
56402A0888208k364329p88684j729830k783388j252978J418555K402636J138278
56394F928468j222779l228870l181347o22704J690152M99327k675398k760038
56386d573189J230343M154156K632685L78422J777219M266204K603823k097198
56378A0372465m140842k672679k155041l349626j681045L301453M762021p06480
$$ y = [5210950, 8555064, 5726826, 485562, -496751, 2593021, 4849758, 4520071, 3416245, 2294683, 751690, -94079, 1048614, 3004108, 4066185, 4823536, 6039211, 5825707, 2298726, -2791808, -6252693, -7238451, -5749615, -239594, 8776380, 15189123, 13238117, 6213055, 3416857, 8073654, 13784876, 14229229, 10888208, 8523879, 7735195, 6005365, 3221977, 1968999, 3387554, 5790190, 6928468, 5705689, 2476819, -704528, -1327232, 362920, 862247, -1813151, -4573189, -3342846, 811310, 3443995, 3822417, 5599636, 9865840, 12469663, 10372465, 6231623, 3558944, 1403903, -1945723, -3626768, -325315, 4436706, 3730226]
56370C730226o138638m087734K071270L901807P48898j208166J2690P15385j9367
56361b73629R69842L309000K339440k310754m767101j960687J844426K233982
56353A384519M72436n32775o16497j29411J456030K526621L63454k994163k242311
56344c12097J847605K116964k886565m943767P43032O837456N137982p81408k471424
56335E287778j95085l60686l428387l786526K40426M393642N460336L756574J30811
56326A1498883l770050m463213j363735N27762j721389l075103P80819M129827
56318B543801p3634o793776n623920J992324M965727R87073r79494K077431K065723
56309A161255l513082m018801O420166J5254854P913109r409795j6559599o581899
$$ y = [3730226, -2408412, -6496146, -4424876, -523069, 225829, -982337, -969647, -254262, -273629, 696213, 4005213, 6344653, 4033899, -733202, -2693889, -849463, 1384519, 1856955, 1324180, 707683, 578272, 2034302, 4560923, 4924377, 1930214, -312097, 1535508, 3652472, 765907, -4177860, -3434828, 3402628, 8540610, 7759202, 5287778, 5092693, 4732007, 1303620, -2482906, -2242480, 2151162, 7611498, 11368072, 11498883, 7728833, 3265620, 1901885, 2429647, 708258, -2366845, -1586026, 2543801, 2470167, -4323609, -9947529, -7955205, -2989478, -2002405, -2981899, -904468, 1161255, -2351827, -6370628, 49538, 15304392, 23217501, 13807706, -2751893, -9333792]
56301i333792O136348O538509k321769o460014o87081O401327O079298Q98166
56293G250992j223705N11388K16493l000790k445578M290171R109489M970110
56285A9678570l017142n473262k203845O12809J664358L173070K643300k748731
56277A4329127o723093j645900O141972L192502q625225j2491589k721224N990344
56269b553086K310212m521211j848743N549530N350219j482993m426559j547711
56261c170342M52090M59890L251764P138671M653255l509570p105918j708931
56253D60909M474303L206615k316478l682745M76119L776705J282589m524625
56245C153392o896894k617964L836107N074283n2956m920341m231654p07360N89612
$$ y = [-9333792, -3197444, 3341065, 1019296, -5440718, -6127799, 273528, 6352826, 7250992, 6027287, 6538675, 6755168, 3754378, 1308800, 5598971, 14708460, 19678570, 16661428, 11188166, 8984321, 9597130, 11261488, 14434558, 17077858, 14329127, 7606034, 5960134, 12102106, 15294608, 6669383, -5822206, -8543430, -2553086, -242874, -4764085, -6612828, -1063298, 4286921, 2803928, -1622631, -3170342, -2718252, -2258362, 993402, 8132073, 12785328, 9275758, 2169840, 460909, 4935212, 8141827, 5825349, 2142604, 2618723, 6395428, 7678017, 3153392, -3743502, -6361466, -2525359, 2548924, 2495968, -2424373, -6656027, -7363387, -6773775]
56236f773775L79751K193511M423578K408126k485137l207548K128175O158226
56228E224907K337274n423091p592952j490602N371978M871447j772282n889000
56220d362321k324652M519045P026636L979073L74283p03562j143000k573033
56212D792469l213549j744346L7130P21144J598691L098990K780646k80877k689336
56203E100962j521325J110958J393800j007232l869451n669972n250396j399719
56195a1112375M146806O332640K832418k019888k592160R47138L817138K917249
56187E268966o08276l372529k644360Q67421K699827J19780k557755P33566P287682
56178G794322P632355k88341p109763n785588j068723o0146j289035j15031J927259
$$ y = [-6773775, -6394024, -4200513, 223065, 2631191, 146054, -3061494, -933319, 5224907, 7562181, 2139090, -5453862, -6944464, -1572486, 3298961, 1526679, -4362321, -6686973, -2167928, 4858708, 8837781, 9212064, 8508502, 7365502, 4792469, 1578920, -165426, -128296, 592848, 2191539, 5290529, 8071175, 7790298, 5100962, 3579637, 4690595, 6084395, 5077163, 1207712, -4462260, -9712656, -11112375, -6965569, -632929, 2199489, 179601, -2412559, -1465421, 2351717, 5268966, 4660690, 1288161, -1356199, -488778, 2211049, 2330829, -226926, 506640, 7794322, 15426677, 15138336, 8028573, 2242985, 1174262, 1114116, -174919, -289950, 1637309]
56169A637309J094816q23622n91879l75505k712042l617141Q62640N809959M239879
56160E524414j155774k571353j50256m38117l957609m619998q38384K323499K219187
56151c664391J399596J324893J023106J453595L609552L660413j634196o445372
56143G27196k665531N879731P103438r51191o963966l882299J791106K358610
56135C397094o5036p22489j206793m139451n888874k179335L710008N262601K275019
56126D42744K08729J734335L835536L001641J879j284607R91110L341804O02719
56117A2875890o240768r362357m236115L427685N632538L025976J452389J260777
56109G836015j533215n570674n043467o6833K752252Q64063j322644r44024k9529
$$ y = [1637309, 2732125, 1908503, 1316624, 941119, -1770923, -5388064, -4525424, 1284535, 5524414, 4368640, 1797287, 1647031, 1208914, -2748695, -7368693, -8207077, -5883578, -3664391, -2264795, -939902, 83204, 1536799, 5146351, 8806764, 7172568, 727196, -1938335, 3941396, 11044834, 10093643, 3129677, -752622, 1038484, 3397094, 3332058, 2609569, 1402776, -2736675, -8625549, -10804884, -7094876, -1832275, 442744, 651473, 2385808, 6221344, 9222985, 9224864, 7940257, 8931367, 12273171, 12875890, 6635122, -2727235, -6963350, -3535665, 2096873, 5122849, 6575238, 7836015, 6302800, 732126, -4311341, -4378174, -1625922, -761859, -2084503, -3028527, -3058056]
56100c058056O14864K776224M868518K599757k983788n785959m007876j442218
56092f418534Q52524N193876R003367N962623k754998q295124p226130m847591
56084h529987l610038M34163O705702P691509J996174j800762N44292K415716
56076E846769k42827j317427K552294L853105k063064o737923k439293M166345
56068C617979L330391j984740l191475p32040J83441J005772M772369O289934
56060A3291631J04137p324657o260077J86812J496853k614665l320537J140004
56052c300499L726738K091017J328081L016086K733643o24154k807550k149195
56044D014167j045581J15825K305803K622447j444667m598742n67675N644381
$$ y = [-3058056, -2443192, 333032, 5201550, 7801307, 4817519, -968440, -4976316, -6418534, -5566010, -372134, 8631233, 14593856, 11838858, 3543734, -3682396, -8529987, -12140025, -11705862, -5000160, 2691349, 4687523, 2886761, 3431053, 5846769, 5603942, 4286515, 6838809, 10691914, 8628850, 1890927, -548366, 3617979, 6948370, 4963630, 1772155, 1040115, 1223556, 2229328, 7001697, 13291631, 13395768, 6071111, -188966, -2154, 1494699, -1119966, -4440503, -3300499, 426239, 2517256, 3845337, 6861423, 9595066, 8970912, 6163362, 4014167, 2968586, 3084411, 5390214, 8012661, 6567994, 1969252, 1401577, 7045958]
56036G045958L716459m764785p519342q68093M892334K351090k780118l096901
56028a023398o38818m26875j288727K01699K673980K791193Q30427j040790k395747
56019c17056l164170k202713J41161J421559Q60410K40688k1848j564099l748200
56010h354268l194570O83861L827392L190063Q75593P06978L133360N094874L676050
56001I639333n28531l354149j749428J434610Q30969k870991l602992q15714j411966
55992b428859o547015o425301L711567J2181497P107060m016294n323877K636320
55984H95098N438995q17197n079255j770170J479175j09416n64117L180863L971184
55975F625160k232820p833993n803092j29682K774915L620982M599257L245711
$$ y = [7045958, 10762417, 5997632, -1521710, -2389803, 2502531, 4853621, 2073503, -1023398, -1662216, -2089091, -3377818, -3176119, -502139, 2289054, 3119481, 2078691, -317056, -3481226, -5683939, -5542778, -4121219, -3260809, -3020121, -3041969, -4606068, -8354268, -11548838, -10864977, -7037585, -3847522, -2971929, -2264951, 868409, 5963283, 9639333, 9110802, 5756653, 4007225, 5441835, 6272804, 3401813, -201179, -1016893, -2428859, -8975874, -15401175, -11689608, 491889, 7598949, 3582655, -1741222, 895098, 6334093, 5516896, 437641, -1332529, 146646, 37230, -526887, 2653976, 6625160, 4392340, -3441653, -9244745, -9374427, -6599512, -2978530, 1620727, 4866438]
55967D866438j292221l914947j746332P59814J10366o03188Q75059J314213m60668
55958i1466k40085K580605K321226j626199j574631M156377N517716k498293r213442
55949f68192m816176L374455L515456j357533n33540M949967N049006j256298
55941H257145m946042k302150J148716J394975K3138j838699m237114m086915
55933f586946R82699N932407M225446j315408k565510Q06952J911625r66490k631782
55924b07007j502734j878602m528332m240925R31173N681248N295236J496990
55916A047047j490922j875763k80256J199141K46133j863050j40130N936545Q225850
55907A1004595P29039r397681j0391370k539105L527127L344172K581880M595957
$$ y = [4866438, 3574217, -340730, -2087062, -1327248, -1216882, -1820070, -945011, 369202, -91466, -331551, 2249054, 4570280, 2944081, 1369450, 5525827, 11043543, 8545250, -668192, -5484368, -2109913, 1405543, 48010, -485530, 4464437, 9513443, 8257145, 3311103, 1008953, 2157669, 3552644, 3575782, 1737083, -2500031, -6586946, -5604247, 328160, 4553606, 3238198, 672688, 1479640, 3391265, 2424775, -207007, -1709741, -3588343, -8116675, -12357600, -11426427, -5745179, -449943, 1047047, -443875, -2319638, -2599894, -1400753, -1154620, -3017670, -3157800, 2778745, 11004595, 11733634, 2335953, -8055417, -10594522, -7067395, -3723223, -1141343, 3454614]
55899C454614N146880J642662k137597l412436l999028m080097q03279M240439
55891E2158M664468k88998l199323j28173L172864J169652k930675l790591k300461
55882c579079j617570p30486J985034L625255J264351k114980j847951J213638
55874a801788K844460K229692J761671K079147J800213P88008j17161j367210
55866H217032l397020m316253k151910J413354K446523l12613m000161n003573
55858g104621k454117J469531L827951L445487J287431j313926l467224l571070
55850g880558j23688M686918N541186J191256k367483k76663L202271J166745
55842E139984m417816n531446j085219J694874n27645k501637l47044K089938
$$ y = [3454614, 8601494, 10244156, 8106559, 4694123, 695095, -3385002, -4188281, 52158, 4716626, 4427628, 1228305, 1100132, 4272996, 5442648, 2511973, -1278618, -3579079, -5196649, -5927135, -3942101, -316846, 947505, -1167475, -3015426, -1801788, 1042672, 3272364, 5034035, 7113182, 8913395, 9701403, 9584242, 8217032, 4820012, 503759, -1648151, -234797, 2211726, 1899113, -2101048, -7104621, -9558738, -8089207, -4261256, -815769, 471662, -842264, -4309488, -7880558, -8004246, -3317328, 2223858, 3415114, 1047631, 770968, 3973239, 5139984, 722168, -4809278, -5894497, -4199623, -4727268, -7228905, -7575949, -5486011]
55834e486011Q39354j313096m05587J881007J920914J94150q41321j058227q80535
55825e149352J001920M294874N178089J635283k648804l406046j510936o8042
55817f73014O98301J724721J617077p47182k738441j384797J709325K692603J027107
55808C925700p07776j030849m94436K63415Q81746R83579J172286K378071L087736
55799A0459472L77088m714310o768723l415700Q95302J726229J107758K965972
55791B633088N744355M814045P2988l884886m106344j633066J521081L895503
55783I056764L765106M40890l602065m607696j712578K321107M053242K034674
55775A1749444k262016n261240m537549j735236j98999J33081K002664M920669
$$ y = [-5486011, -4646657, -5959753, -6365340, -4484333, -2563419, -2369269, -3210590, -4268817, -5149352, -4147432, 147442, 5325531, 6960814, 4312010, 905964, -604972, -673014, 25287, 1750008, 3367085, 2619903, -118538, -1503335, 205990, 2898593, 3925700, 3217924, 2187075, 1692639, 1956054, 2837800, 3821379, 4993665, 7371736, 10459472, 10836560, 6122250, -646473, -4062173, -3166871, -1440642, -332884, 2633088, 8377443, 13191488, 13264476, 9379590, 5273246, 3640180, 5161261, 9056764, 12821870, 13262760, 9660695, 5052999, 3340421, 5661528, 9714770, 11749444, 9487428, 4226188, -311361, -2046597, -2245596, -2112515, -109851, 4810818]
55767D810818M869336J212072j458846p56403l11932k871978n054445l318418
55759b879796j91392M07945l48906M47546J762396J623992J679451L079900K191430
55750G772566l012483o582008k499509M499334M905305j005469m181116j520731
55742a624111O05917j258234j905875K212977N608444K273988m535079o938068
55734e560041l017839K316343M539197L288136M97229j727657j977739n02583
55726b144954R78833J203197L12593r89875j675059l67797K518188L400286k96764
55717B938648n018120m572473O80610L215324r12144n610670l133866M530867
55709g881824P980742L082393l765649m244152J767501P217861O994273K873715
$$ y = [4810818, 9680154, 10892226, 9433380, 8676977, 8365045, 5493067, 438622, -2879796, -3071188, -2663243, -3012149, -2564603, -802207, 821785, 2501236, 5581136, 7772566, 4760083, -1821925, -4321434, 177900, 5083205, 4077736, -103380, -1624111, -1018194, -2276428, -4182303, -1969326, 3639118, 5913106, 1378027, -5560041, -8577880, -6261537, -1722340, 1565796, 2063025, 335368, -1642371, -2144954, -1166121, 37076, 349669, -640206, -2315265, -2683062, -164874, 3235412, 2938648, -2079472, -6651945, -5971335, -2756011, -3668155, -9278825, -12412691, -7881824, 98918, 3181311, -584338, -4828490, -3060989, 4156872, 11151145, 14024860]
55701A4024860m24988j134491q90936j290219k291397l167937k923758n16135
55693A384999L085405M099204K72480m803131n610992k523228r52624k490920
55685g538807k656386Q94594L966107K831029K81314O61453L301157M875334M307337
55676A0923132J840170k339643n290175k633416L540131M705966j278458n097546
55668D370161m52550M836390J717903m168677k064411M647810L849191l994993
55660H740824o399498o16084K085076k919908n163592K053311R142938O029193
55652A2952260j547040k481142K097658L238906k16951j874255L1923R60714r72153
55643A2189920k673814k159527p33273K20489o463k291610n309592m870868L16200
$$ y = [14024860, 13599872, 12465381, 11574445, 10284226, 7992829, 4824892, 1901134, 1384999, 4470404, 8569608, 8842088, 4038957, -1572035, -4095263, -5047887, -7538807, -10195193, -9300599, -5334492, -2503463, -2222149, -1560696, 1740461, 6615795, 10923132, 12763302, 10423659, 5133484, 2500068, 6040199, 10746165, 9467707, 4370161, 3917611, 8754001, 10471904, 6303227, 4238816, 8886626, 12735817, 8740824, 2341326, 1725242, 3810318, 890410, -4273182, -2219871, 6923067, 12952260, 11405220, 8924078, 11021736, 14260642, 14043691, 12169436, 12201359, 13162073, 12189920, 9516106, 7356579, 6623306, 6843795, 6837332, 4545722, -763870, -5634738, -5318538]
55634e318538N295108N490236L105111K225391J675766j238237l574003p04979
55626F955855M656496N018791o52739n224352l799234J91950J154097j195117
55618G105747l048396k158219J96010J579683J202854M49589P56435J339665L60585
55609G783953j710412k214985m04528J224003P64278n73138r44378k30604J072195
55600D766384K507866K662620Q69849q2158K530790N328822K568380l585154m564573
55591A3002826P01136K752020l001630p614127k757517N257925N396143j044218
55583A2692558m335848k315069o65892l42613K962148P683883O760691K95518
55575B2735376l076279J33403L064165K90744l945870l457307J014769M720317
$$ y = [-5318538, -23430, 5466806, 8571917, 10797308, 12473074, 11234837, 7660834, 6955855, 11612351, 16631142, 15978403, 10754051, 6954817, 7146767, 8300864, 7105747, 4057351, 1899132, 2095142, 3674825, 4877679, 5327268, 6083703, 7423368, 7783953, 6073541, 3858556, 3454028, 4678031, 5442309, 4869171, 3924793, 3694189, 4766384, 7274250, 9936870, 10806719, 10724561, 13255351, 18584173, 21152553, 17567399, 13002826, 13703962, 16455982, 13454352, 5840225, 3082708, 8340633, 13736776, 12692558, 8356710, 6041641, 5375749, 5033136, 7995284, 15679167, 22439858, 22735376, 19659097, 19792500, 22856665, 23147409, 19201539, 15744232, 16759001, 21479318]
55567B1479318N131353K226946k312769m203292l43625N145287N012280J11376
55559C2246874j279184K698676L724013k280262o619340j118227P989084Q935997
55551D4297631J921634k516640m8506K763132N52903l167791l055750J78409K644046
55542D3569068L477707M343661N361264M940399K674780O8044j389275j546701
55534F1498947j033953p8528J890499N294023Q928808J0105261P242392K250057
55526I6097506p53485K78880K878053K847358m03602k485450Q70629Q048503J2760169
55517A20138561J1111690N407962L75848j925779k053826o35583J618329L062877
55509A37100079K893954K629872L588539M288831K833300M04501m86534O089j17648
$$ y = [21479318, 26610671, 28837617, 26524848, 22321556, 21977931, 27123218, 32135498, 32246874, 30967690, 33666366, 37390379, 35110117, 28490777, 27372550, 35361634, 44297631, 46219265, 43702625, 43654119, 46417251, 46970154, 43802363, 40746613, 40925022, 43569068, 47046775, 51390436, 56751700, 61692099, 64366879, 64434923, 63045648, 61498947, 60464994, 60386466, 62276965, 67570988, 76499796, 86605057, 93847449, 96097506, 95344021, 95622901, 98500954, 101348312, 100944710, 98459260, 99329889, 107378392, 120138561, 131250251, 136658213, 137034061, 135108282, 133054456, 132418873, 134037202, 137100079, 139994033, 142623905, 146212444, 150501275, 153334575, 153739076, 153252542, 153258631, 153140983]
55500A53140983r44085r56025l86203j027379l029647m668972m863781l605794
55492A33659097j062901J242631K38746m484621q325022p342006m066184l195456
55484A06664284m022118k846694p24316j750896m703424m134687J0023J769921
55476I0262093o68617k173315k00548Q54917j839569m316155l362652k285737
55468G6270417m100374n454094l112795o87899k449875n414867m564839j876367
55460D8609307k681974n911448n638106r62463K822891K651905Q86152k56183
55452C9520081j668769l549789l451137j02164L883606M737483J427214l461088
55444C7335437n608594k653810K631270M450595Q32293l875086n136734l672608
$$ y = [153140983, 152196898, 151240873, 150854670, 149827291, 146797644, 142128672, 137264891, 133659097, 132596196, 133838827, 134077573, 129592952, 121267930, 113925924, 109859740, 106664284, 102642166, 99795472, 99071156, 97320260, 92616836, 88482149, 88492172, 90262093, 89593476, 87420161, 87219613, 88074530, 86234961, 81918806, 78556154, 76270417, 72170043, 66715949, 63603154, 62915255, 60465380, 55050513, 50485674, 48609307, 45927333, 40015885, 34377779, 33415316, 36238207, 38890112, 39776264, 39520081, 37851312, 34301523, 30850386, 30748222, 34631828, 39369311, 40796525, 37335437, 31726843, 29073033, 31704303, 36154898, 36987191, 33112105, 27975371, 24302763]
55436B4302763k131189k55375K421262K778749j276254n112064k853943K982019
55428B0855968M354710k13195l764476k069808P51885L47169j037049l0327J257445
55419B0452322m95508l091336k388798r868r69337m484082l974333K318439O996391
55410A4353890L630328l437592n040613m19160K389999m17508k487860J897590
55402A0469074P466753N226457l405029p905067l651597K355181K638916j116216
55394A2078472l242363k830761k278339j531279O84626K699513K166120O54225
55386H400214J319917L403559L450593J003617j064963j285698r40882j071935
55378A3214422j323605j389340j083591R7132J296043J10767l242814m299192
$$ y = [24302763, 22171574, 21916199, 24337461, 27116210, 25839956, 20727892, 17873949, 20855968, 25210678, 24997483, 21233007, 19163199, 19915084, 20262253, 19225204, 19194877, 20452322, 19956814, 16865478, 14476680, 14466812, 13497475, 9013393, 5039060, 7357499, 14353890, 17984218, 14546626, 9506013, 9086853, 11476852, 11059344, 8571484, 10469074, 17935827, 23162284, 19757255, 11852188, 8200591, 10555772, 13194688, 12078472, 8836109, 6005348, 3727009, 2195730, 2880356, 5579869, 7745989, 8400214, 9720131, 13123690, 16574283, 17577900, 16512937, 15227239, 14286357, 13214422, 11890817, 10501477, 9417886, 9515018, 10811061, 10921828, 7679014, 3379822]
55370C379822o83497K795496O30494m056482l295297L253500O831410K163934
55362A1019380m999634o260368j559780K457458K021591k91034p36558N94356
55354B245411Q71947j062329k927509k116726L66532J084931n30984r67179J708830
55345a327076M176406K873368j97221q49576K95863o65247l519835l705370K09624
55336b709064M134469M829265L900636L509850K401903r82203m604053n138659
55328E342144k455410N63079J554471L92113j622127k896607k475284p58139Q52256
55319a503504J183262J40318j067115m58706K578506N385049M423959L00191k436015
55310H545945j623273K1861M46961J485191L465247K255098l144208n635690J4866
$$ y = [3379822, 2696325, 5491821, 6122315, 2065833, -1229464, 2024036, 8855446, 11019380, 6019746, -240622, -1800402, 657056, 2678647, 2387613, 1651055, 2245411, 3117358, 2055029, -872480, -2989206, -2622674, -1537743, -2068727, -3035906, -1327076, 2849330, 5722698, 5525477, 4675901, 4971764, 4306517, 786682, -2918688, -2709064, 1425405, 6254670, 10155306, 13665156, 16067059, 15084856, 10480803, 5342144, 2886734, 3449813, 5004284, 5396397, 3774270, 877663, -1597621, -2355760, -1503504, -320242, -179924, -1247039, -1705745, 872761, 6257810, 10681769, 10981960, 8545945, 6922672, 6944533, 7391494, 8876685, 12341932, 14597030, 11452822, 5817132, 5831998]
55301E831998O911786M846288l805087p463178l195700L33382j435504k369320
55293c45335J569366M227344K70093m841613l516267J988315L876500M26847l523313
55284A31937m280326j918268J708286L224785l01934n874229n808614J323233
55276a1795130O624874L100899l836786m760371J96438L984063M441185M692802
55268B647974M820341K262331j094163j015021P20223j348559n946607n847762
55260d801243N6427M213017K146237j240596k94465L357440N058663L607074J1400
55251A2113954m934037q468253o457225J46890M278369K012880j857045j578867
55243d743334J143288J612910N08535J375032K975718J317535k260726k280980
$$ y = [5831998, 12743784, 17590072, 13784985, 6321807, 3126107, 3459489, 2023985, -345335, 1224031, 5451375, 5721468, 879855, -2636412, -648097, 3228403, 3655250, 131937, -4148389, -6066657, -4358371, -1133586, -1435520, -7309749, -13118363, -11795130, -5170256, -2069357, -5906143, -10666514, -10470076, -6486013, -2044828, 2647974, 7468315, 9730646, 8636483, 7621462, 8341685, 6993126, 1046519, -4801243, -4744816, -531799, 1614438, 373842, 79377, 3436817, 8495480, 12102554, 12113954, 7179917, -1288336, -7745561, -7598671, -3320302, -1307422, -3164467, -4743334, -3600046, -1987136, -1478601, -103569, 2872149, 4189684, 1928958, -352022]
55235c52022J651944L779904J542962o62377L86388J147483j854791m849131k515813
55226a725453K371759K118100l766700o791579j779189N230128N434742p29574
55218C62234n324925m224643q25404J131977K496184M599215N156055J941087
55210E311780k344953k956652K94990K930888K118823j49980q92265k82104k32652
55201C797875p51431k10625J247281J169094j358466l311214j386102K775170
55193A971582L899797K39169l459739k180347K337987L906346L38845l784054
55185C269586l363202Q91650L809709K013186k546181n053112l252245J14138
55177d116471J051396j87288R9835K476981K667524j158570l810425n51272M370484
$$ y = [-352022, 1299922, 5079826, 6622788, 5960411, 6346799, 7494282, 5639491, 790360, -1725453, 646306, 2764406, -1002294, -7793873, -9573062, -4342934, 1091808, 362234, -4962691, -9187334, -10012738, -8880761, -6384577, -1785362, 3370693, 5311780, 2966827, 10175, 305165, 3236053, 5354876, 5204896, 4312631, 4030527, 3797875, 3046444, 2835819, 4083100, 5252194, 3893728, 582514, -803588, 1971582, 5871379, 6110548, 2650809, 470462, 2808449, 6714795, 7053640, 3269586, -93616, 798034, 4607743, 6620929, 4074748, -978364, -4230609, -4116471, -3065075, -3252363, -3152528, -675547, 1991977, 833407, -2977018, -3528290, 842194]
55168H42194L287046k634150m459992Q63555N877743M153007o66099j666696J013681
55159F610289J974315p46827l796570l811368j020448J681780J454683j495543
55151H50311l202446o67416K889903J684820l430890n045073j71787M972842M435495
55142B315759R13651J21913J745829J452746j579231m376072n024688l586760
55134h016853m19371K941646L742106J792284L14197N91493k13621l257078m881392
55125g406589k573814J026599L466317N997670Q031288N086726k591522o737715
55117D298960k817164K192513J042788k381105j513294P95689r31914l039152
55109b352679K82585M390519J651743l704544k300218L200784K945436j425350
$$ y = [842194, 4129240, 1495090, -2964902, -2101347, 3776396, 7929403, 7263304, 5596608, 6610289, 8584604, 7837777, 4041207, 229839, -790609, 891171, 2345854, 850311, -2352135, -3019551, -129648, 1555172, -1875718, -6920791, -7092578, -2119736, 2315759, 3229410, 3351323, 5097152, 6549898, 4970667, 594595, -4430093, -8016853, -8436224, -5494578, -1752472, 39812, 354009, 945502, 731881, -2525197, -7406589, -9980403, -8953804, -5487487, 510183, 8541471, 13628197, 11036675, 4298960, 1481796, 3674309, 4717097, 2335992, 822698, 1618387, 686473, -2352679, -2070094, 2320425, 3972168, 267624, -2032594, 1168190, 4113626, 2688276]
55101B688276J91596O315614N079827l776653o867761l13090L782685n85369l339976
55092C175149J718738M953220o73758n793203j832362K847102j558452p452467
55084d616033k606011Q057950J0137060K489100l626849l600477k727587l258922
55076B48231j965210O46380N49079j227441k72904K464149K720577J285248J405982
55067E854091J104040k533978n132411j361676M096184K906349k784598m145446
55059a997445q44707j23334k527235j358562M111078P170666N516011L019424
55051A2965896J49275n291386q638926l101590N937252N932574k349591m997214
55043F06290J809043N623335k3155m588173j80235M208088m25119o500088l872043
$$ y = [2688276, 2879872, 9195486, 14275313, 10498660, 3630899, 3317809, 7100494, 6515125, 3175149, 4893887, 9847107, 9173349, 3380146, 1547784, 4394886, 2836434, -4616033, -7222044, 835906, 10972966, 13462066, 9835217, 6234740, 3507153, 248231, -1716979, -1070599, -521520, -1748961, -2021865, 442284, 3162861, 4448109, 5854091, 6958131, 4424153, -708258, -2069934, 2026250, 4932599, 2148001, -1997445, -2842152, -2965486, -5492721, -6851283, -2740205, 4430461, 9946472, 12965896, 13115171, 7823785, -815141, -3916731, 2020521, 7953095, 5603504, 606290, 2415333, 8038668, 8015513, 3427340, 3247105, 7455193, 7030074, 529986, -3342057]
55034c342057J630850q66261o979504m235769O033713J0229423L738178l866937
55026B341636m819136j809484M72362J694207J876532j86276k654178j880683
55018d965020J152960K060851O64625O64537K014235R49850k101041k163346J517825
55009b04524L425029N07874l192739l086644j24399K005601J740028j01984j678920
55000g10678q90663K257904M344636K913239Q58150J994135L957294J504827m134331
54991A2094513o249389l175424m68220j241392j784867N37551K046238o29619
54983A129391m354758m265690n53933L140467M471518K812084j098508l648412
54975b367841j081614M039232M562970l96202k919885J326802N380353J962504
$$ y = [-3342057, -1711207, -2577468, -9556972, -13792741, -7759028, 2470395, 6208573, 2341636, -2477500, -4286984, -3814622, -2120415, -243883, -430159, -3084337, -4965020, -3812060, -1751209, -1086584, -422047, 1592188, 2542038, 440997, -1722349, -204524, 3220505, 3728379, 535640, -2551004, -2675403, -669802, 1070226, 968242, -710678, -1601341, 656563, 5001199, 7914438, 8772588, 10766723, 14724017, 16228844, 12094513, 5845124, 2669700, 2201480, 960088, -824779, -287228, 1759010, 1129391, -3225367, -7491057, -8044990, -4904523, -433005, 2379079, 1280571, -2367841, -3449455, 589777, 5152747, 4756545, 1836660, 3163462, 8543815, 10506319]
54967A0506319m394960m598007N23417K634972n9974j477589L36879J87071l626190
54958C1938n127809q53080L588758J975406l423545o201386m663519j384534K303143
54949a3754628O112199P593849M358159j395052m636258l471953m10138J717534
54941c886288K352848K132177J595811R53677k16551k425392m571772m395203
54933h460693j837856K12262K66818P23643L453863N665775L945504L00868m77838
54924C792346J582472J731859j674721m416428k842312J140562L512592L220164
54916F046534J699347R1653r82560j136661j408695l424058n901373m920735K11680
54907i724868M465361L522882N4306l32053K492715L464283M93106k471759j665111
$$ y = [10506319, 6111359, 1513352, 2036769, 4671741, 4611767, 3134178, 3471057, 3658128, 31938, -5095871, -5948951, -2360193, -384787, -3808332, -10009718, -14673237, -16057771, -13754628, -7642429, -48580, 4309579, 2914527, -1721731, -5193684, -5603822, -3886288, -1533440, 598737, 2194548, 3148225, 2931674, 506282, -4065490, -8460693, -10298549, -10086287, -9819469, -9095826, -5641963, 23812, 3969316, 4270184, 3792346, 5374818, 7106677, 5431956, 1015528, -1826784, -686222, 2826370, 6046534, 7745881, 7837534, 6854974, 5718313, 4309618, 885560, -5015813, -9936548, -9724868, -5259507, -1736625, -1682319, -2014372, 478343, 3942626, 4435732, 1963973, 298862]
54898B98862J255813K499568J814586J844605L164161L152687J94141l410349
54890A0814074m244619k260058m92706o10044j129823q20571j075561k593078
54882b412386k335448K062158O414197M166943l237016o535360j628959L919046
54874D13175J974436m078356m967970N01574M966554M359408K140622J366640
54866F676083L36081j802077k025154P21571K369340R4775k973230l179194k011759
54857a793564k219919k419302l96875J656217N76794j619201n86190K943364M178024
54848C19348J963213L044K98742O12213n30622j087727L87859J782358R03705
54839D652133r49544j264407j24452M35405m51737j886208k978134l715833m154923
$$ y = [298862, 1554675, 4054243, 5868829, 7713434, 10877595, 14030282, 14224423, 10814074, 6569455, 4309397, 3816691, 3206647, 2076824, 1256253, 180692, -2412386, -4747834, -2685676, 3728521, 7895464, 4658448, -1876912, -3505871, 413175, 2387611, -1690745, -6658715, -6157141, -1190587, 3168821, 5309443, 6676083, 7012164, 5210087, 3184933, 3906504, 6275844, 6370619, 3397389, 218195, -1793564, -4013483, -6432785, -6829660, -5173443, -4596649, -6215850, -6802040, -3858676, 319348, 2282561, 2285605, 2584347, 3196560, 2665938, 1578211, 1966070, 3748428, 4652133, 3702589, 2438182, 2313730, 2749135, 2297398, 411190, -2566944, -6282777, -10437700]
54830a0437700l591061j073460K832170N247446L745037L42414L0681L637774
54822G33301N406864J071530m721685m306973J538171M570537J476389j797597
54814C970537j25603L117389K378011j498392l885315l517407k002633M58537
54806a104876L525737L650505j430966o750794m970185L018393Q282408N452897
54798I673119j235679m975389m409745k218344k613K022801K977798K251199J091407
54789E174554R32495J205650M84503j298358l091295m008370l381166r95545J700807
54780c276725K283406M56260j183668q06136M2569o97187j758135j33736M009623
54771a063729O494319M010839j438727m231414j465328L224620L606543j291389
$$ y = [-10437700, -14028761, -15102221, -12270051, -7022605, -3277568, -2935154, -2904473, 733301, 6140165, 7211695, 2490010, -1816963, -278792, 4291745, 5768134, 3970537, 3844934, 6962323, 9340334, 7841942, 3956627, 439220, -1563413, -1104876, 2420861, 6071366, 4640400, -2110394, -7080579, -4062186, 4220222, 9673119, 8437440, 3462051, -947694, -3166038, -3168651, -1145850, 1831948, 4083147, 5174554, 6107049, 7312699, 7797202, 6498844, 3407549, -600821, -3981987, -4977532, -3276725, -993319, -537059, -1720727, -2526863, -2484294, -3181481, -4939616, -5073352, -1063729, 5430590, 9441429, 8002702, 3771288, 2305960, 5530580, 9137123, 7845734]
54763G845734n546873m055882P20048K816674J323817K38144J003650R69520n01743
54754D813089o15202O86193m07459l837164l518704K784723P851424N116965j237233
54745A1636632l362892k017661l258434o395474n058048Q94637M300264K290463
54737i70513p686P80575J232847j222989l183770j594834J147987K261924L129831
54728A573372N050973N649841L309191N57375l06260m76390r08935n39121o23589
54719A3286457m355472r052341o567203L558580R620881L671082n641447n372906
54711h52369K723586O380052J928795k609223k203622j028584k770140m588649
54703c020154l351042k69287K815291N292289M895790j79448n467219m023910
$$ y = [7845734, 2298861, -1757021, -1036973, 1779701, 3103518, 3341662, 4345312, 5314832, 4813089, 4197887, 4884080, 4476621, 639457, -2879247, -94524, 7756900, 12873865, 11636632, 8273740, 6256079, 2997645, -3397829, -8455877, -7561240, -3260976, -970513, -978199, -197624, 1035223, -187766, -3371536, -4966370, -3818383, -1556459, 1573372, 6624345, 12274186, 15583377, 16140752, 15834492, 15358102, 14449167, 13910046, 13286457, 8930985, -121356, -6688559, -3129979, 6490902, 10161984, 4520537, -852369, 1871217, 8251269, 10180064, 7570841, 5367219, 4338635, 1568495, -3020154, -6371196, -6640483, -3825192, 1467097, 6362887, 6183439, 716220, -3307690]
54695c307690K728605N808926K044352j817092j095872k92261l566833o567880
54687f065745m317107m20862q19858l333989j478231M284837O955519L715050
54679a480386n07091p43774J864375L012185R68118k228357l853246l706720l927103
54670a0601999n288148n082917r62825M423203O344552M740553L403279K970776
54662e3526P70114k006769l14790N434335P668428K980299k145022j807371K26536
54653A0752234j765956n145542m129952m01391q157k885515l754436j515128n728
54644h859571m93250l81572J232562K689742L491500L610277J054389m258781
54636a914704o935283k981877K665757L010967L40596J722656N791296M866740
$$ y = [-3307690, -579085, 5229841, 7274193, 5457101, 4361229, 4068968, 502135, -6065745, -10382852, -10803714, -11623572, -14957561, -16435792, -12150955, -5195436, -1480386, -1987477, -2731251, -866876, 2145309, 3113427, 885070, -2968176, -6674896, -10601999, -15890147, -20973064, -21935889, -17512686, -11168134, -6427581, -3024302, -53526, 716588, -1290181, -1604971, 3829364, 11497792, 14478091, 12333069, 10525698, 10752234, 8986278, 3840736, -289216, -690607, -698764, -3584279, -7338715, -8853843, -8859571, -9352821, -9734393, -8501831, -5812089, -2320589, 1289688, 2344077, -1914704, -8849987, -11831864, -9166107, -6155140, -5814544, -4091888, 1699408, 6566148]
54628F566148p35453k543389Q49577R75961m698274o761134K23908P316857N229091
54619F423292r29540j158461K783268K015350k955296l069054L032637N665816
54611A1808012m73463p454803n874284J297876L357524k616005p695115l644710
54603a1294968N420405Q174698J325057n890542m635418J380834K344694k495239
54595e670479m293817J057039O898111O762589L316738J747319J144195j533633
54587I428062m373499l986162j925607j216668k35183L199309N219941J268756
54579G378949m505322l957941J935355L825956j363926n681824k864163K577844
54571b655072L781387K077590K649281M455699K076607m180330p217332l160666
$$ y = [6566148, 5830695, 3287306, 4136883, 5112844, 414570, -6346564, -6122656, 1194201, 6423292, 5493752, 4335291, 7118559, 9133909, 6178613, 3109559, 6142196, 11808012, 11334549, 3879746, -1994538, -696662, 2660862, 44857, -7650258, -11294968, -5874563, 2300135, 3625192, -2265350, -6900768, -5519934, -3175240, -5670479, -9964296, -8907257, -2009146, 4753443, 8070181, 9817500, 10961695, 9428062, 5054563, 1068401, -857206, -2073874, -2309057, 890252, 6110193, 7378949, 2873627, -1084314, 851041, 4676997, 3313071, -2368753, -5232916, -2655072, 1126315, 3203905, 5853186, 10308885, 12385492, 8205162, 987830, -2172836]
54563b172836K988137M153633J15599l370431k442896J103111L448194L071275
54555F893786P04904k314661l952147k038536K534955N026508K421695j758452
54547G518052k205832K3086m23543l431372k875236K356169M574748q13497o542609
54538a820034l609335M859580Q166390L582583j467967j964452j246219k906847
54530C593699m441826k456138J188905K261483k2342k888708l558099j275333
54522g598359K293957L975244K370537J33706N99979K921361L689155K327431
54514A0713011Q38261q00115l954319o545313m738709R1956K058218l69042k154386
54505d860438q3289K825094L632389L751275L677067K08069o332475q468494j590981
$$ y = [-2172836, 815301, 4968934, 5084533, 1714102, -728794, 374317, 3822511, 6893786, 7598690, 5284029, 1331882, -706654, 1828301, 6854809, 9276504, 7518052, 5312220, 5335306, 4911763, 1480391, -1394845, 961324, 5536072, 4722575, -1820034, -5429369, -569789, 7596601, 11179184, 9711217, 7746765, 6500546, 3593699, -848127, -3304265, -2115360, 146123, 123781, -2764927, -6323026, -7598359, -5304402, -1329158, 1041379, 1175085, 1775064, 4696425, 8385580, 10713011, 11551272, 10751157, 6796838, 251525, -4487184, -4395228, -2337010, -2706052, -4860438, -4943727, -2118633, 1513756, 5265031, 8942098, 9150167, 2817692, -5650802, -7241783]
54496g241783P319922Q238771J953830k174690k63835K174291K50368l710846
54488F546028n376089m477181l005056j267767J441917M407515N783202M432247
54480H484816Q78360k710830l847106k296376o46483r49136k026056j888397j158181
54471f159389j456144j890763n03748J686940J781432o4556n63504J291680K395763
54462c482289O01966j440997N2938M196664N882074K044805m160874o447968k466314
54453e219995L275117M504191M08163m141726n232844l824318k240246k32765
54445a2704423K987827N474098M663829J466711p65654o66201J59195k359j071308
54436d58285j650152k79889K671623L961910Q50941l839496m047646N43267L073254
$$ y = [-7241783, 78139, 8316910, 10270740, 8096050, 7832215, 10006506, 10256874, 6546028, 1169939, -3307242, -6312298, -7580065, -6138148, -1730633, 4052569, 8484816, 9363176, 6652346, 2805240, 508864, -137619, -1086755, -3112811, -5001208, -6159389, -7615533, -9506296, -10010044, -8323104, -6541672, -6606228, -7169732, -5878052, -3482289, -2880323, -4321320, -4268382, -71718, 5810356, 7855161, 3694287, -2753681, -5219995, -1944878, 2559313, 2967476, -1174250, -6407094, -10231412, -12471658, -12704423, -9716596, -4242498, 421331, 1888042, 1122388, 456187, 615382, 613023, -458285, -2108437, -2388326, 283297, 4245207, 5096148, 1256652, -2790994, -2247727, 825527]
54427H25527K08135j987582J461568M464878o54382q312634o071226N201414J0351495
54418E487193K025329q188151p019309J899055N627804J341554k305889m00791
54410a533205J882450p18012n083555m860382L78070N088499N251412K581770
54402B987047P80733K7757k136696m945404l623846K988522P952167M527391l423818
54393E133853n974065j276889K527639O27660j668926Q67329M216605K186911
54385F640117l169411n183364k745077l8314J199771K444803L039973O22317l428240
54376f17425m600625j767285J317103J459296n77227k272995j982263M59199L310787
54367e271435L847098J810070L92282J557824K730525R57093k335616m109407
$$ y = [825527, 1033662, -953920, 507648, 4972526, 4318144, -3994490, -10065716, -4864302, 5487193, 7512522, -675629, -7694938, -5795883, -168079, 1173475, -1132414, -1533205, 349245, -368767, -5452322, -10312704, -9934634, -4846135, 405277, 2987047, 3767780, 3795537, 1658841, -3286563, -6910409, -3921887, 4030280, 8557671, 5133853, -840212, -2117101, 410538, 1038198, -630728, 236601, 4453206, 6640117, 3470706, -1712658, -4457735, -4496049, -3296278, -851475, 2188498, 2810815, -617425, -5218050, -6985335, -5668232, -4208936, -4786163, -7059158, -9041421, -8582222, -5271435, -1424337, 385733, 778015, 2335839, 5066364, 6023457, 3687841, -421566]
54359d21566m347414m120232k257925J490829L335651R25292j284874J505357
54351e174882N598990L937667k076989m395113j154716J201326o55627k171704
54343d891048K37882L427417L691857K106248O86175r68994k582268k234309n58458
54334a085498l36657n91311K295936O259551M482354k775232o149476j198880
54326I00787M349241K989271j463638k198122q37832j954404k950952P08794N174784
54317D717929L444861k337720l978626o66016O53271k324707m064461j239408
54309e794877K384897K782305O43107j815097l283825k138150J660147L788474
54301a773019P84079k866317k15234O130231O336364j241883o460296k513688
$$ y = [-421566, -4768980, -8889212, -11147137, -9656308, -6320657, -5395365, -6680239, -5174882, 424108, 4361775, 2284786, -2110327, -3265043, -2063717, -2719344, -4891048, -4653166, -1225749, 2466108, 4572356, 5258531, 4289537, 1707269, -527040, -1085498, -1422155, -2013466, 282470, 6542021, 11024375, 8249143, 2099667, 900787, 5250028, 8239299, 6775661, 4577539, 3739707, 1785303, -1165649, -456855, 4717929, 8162790, 5825070, 1846444, 1180428, 1833699, -491008, -4555469, -5794877, -3409980, -627675, 15432, -1799665, -5083490, -7221640, -5561493, -1773019, -988940, -3855257, -4070491, 2059740, 8396104, 7154221, 693925, -1819763]
54293a819763M187062M490349n36045l632246k858145j924176k205098j281004
54285e579066J464067L191822K047877j66002n58658J297820K911345J698581
54277F307786j647961l533154k185434j83866j70096o26989M66553P47576k259809
54268c085394m586470r11651N252167N307545l99527k196115L247429P317099
54260I945083L782020j569414k064429j371909n027043q754377n516153J475907
54252i100315L499491L37895r65814J024027J109024j479767j326941K764039
54244d138361M783922J358010k894259k733626P11557K957153J936499q97639
54236A083256k137775P99393N418456M867700k580265q236006m092920M172231
$$ y = [-1819763, 2367299, 6857648, 6321603, 2689357, -168788, -2092964, -4298062, -5579066, -4114999, -923177, 1124700, 958698, 400040, 1697860, 4609205, 6307786, 4659825, 1126671, -1058763, -1242629, -1412725, -2039714, -1573161, -825585, -3085394, -7671864, -8583515, -3331348, 1976197, 1576670, -619445, 2627984, 9945083, 13727103, 12157689, 10093260, 8721351, 3694308, -5060069, -10576222, -9100315, -5600824, -5262929, -6228743, -5204716, -4095692, -5575459, -6902400, -4138361, 645561, 2003571, -890688, -3624314, -2912757, 44396, 1980895, 1083256, -1054519, -255126, 5163330, 10031030, 7450765, -785241, -4878161, -705930]
54228g05930M730566j967704l959618K556076P155719K674882l558483k863792
54220D061716R72110l828l983625l871926p2358J330627k89840l38768J527462
54211f68430J059318j947947k602840Q22579M089950L628596R10711q85745p48222
54202C657970K47963J85587j971856l771359p93090O142193Q890422K140460p540309
54193G187981r203262j924495N152820N756327K098682j794560m446742m073631
54185a246880O54052N364902L266475l984192o569875r51931M260590J943610
54177B736751k236831J18086N346332L241774n687188r473012k310123O548675
54169a715536N811118k539252o995989k411524M236295M265924j578164n414437
$$ y = [-705930, 4024636, 2056932, -1902686, 653390, 7809109, 10483991, 6925508, 4061716, 5033826, 5029998, 1046373, -2825553, -2897911, -1567284, -1857124, -2195892, -668430, 390888, -1557059, -4159899, -3337320, 752630, 4381226, 5291937, 4406192, 3657970, 3905933, 4091520, 2119664, -1651695, -2444785, 3697408, 12587830, 14728290, 7187981, -2015281, -3939776, 1213044, 6969371, 9068053, 7273493, 2826751, -1246880, -592828, 4772074, 8038549, 4054357, -2515518, -3467449, 793141, 2736751, 499920, 618006, 5964338, 9206112, 3518924, -5954088, -8264211, -1715536, 4095582, 1556330, -5439659, -7851183, -3614888, 651036, -927128, -6341565]
54161f341565l041592J787589L942701L460335L177061L251154J947071k13703
54153G969051j497060k750637n289841o163960j620761M892228N364692p30829
54145A72883m631021j443745K812131K064237Q0263K364074N174302J997570m027532
54136D563162m787220j336374j906911o514534n617710L607653J0992832Q262028
54128G262926P29795k218788o14178l94101k139668j561026J783426L714380K318613
54119H881379j37513j626231k201748k053880j411999j497450k453027j897548
54111d398017J221675L488134J715658j306671o10754K827018L183537j238618
54103D881962n453357n057927j464159J498840K285731J299843q11977k646038
$$ y = [-6341565, -9383157, -7595568, -3652867, -192532, 2984529, 6235683, 8182754, 7969051, 6471991, 3721354, -1568487, -7732447, -9353208, -4460980, 903712, 172883, -4458138, -5901883, -3089752, -1025515, -945252, 1418822, 6593124, 8590694, 4563162, -224058, -1560432, -3467343, -9981877, -15599587, -11991934, -999102, 7262926, 7992721, 5773933, 5159755, 4765654, 2625986, 1064960, 2848386, 6562766, 8881379, 8743866, 7117635, 4915887, 2862007, 1450008, -47442, -2500469, -4398017, -3176342, 311792, 2027450, 720779, 110025, 2937043, 6120580, 4881962, -571395, -5629322, -7093481, -5594641, -3308910, -2009067, -2821044, -5467082]
54095e467082k317468R3491K199229K411665J561381P43894l69910k110237l362874
54086f617911k522526Q49469N155123O862039L112010l870885p150401l133079
54078g316161K828629L377998k16507o41991K996187L323333k710332p532272
54070e891116m108756L135687N041488Q01673k749627k130401k83992K30139L73617
54061e581288P23748K40483k43670J541675M215860K987341l070581q123179o478106
54052a3787717N09044O579392P315892L072415k547990n354750l503847P12875
54044g004686L279981L084067K100199R88219j873079n727793o066403j046073
54036a2265568M152781L791564J52137K87183M790442N909547r84805r239087
$$ y = [-5467082, -7784550, -7691059, -5491830, -3080165, -1518784, -774890, -1144800, -3255037, -6617911, -9140437, -8290968, -3135845, 3726194, 6838204, 2967319, -4183082, -7316161, -4487532, -1109534, -1326041, -1968032, 1028155, 4351488, 1641156, -5891116, -9999872, -6864185, -1822697, -1021024, -3770651, -5901052, -6185044, -5954905, -5581288, -4857540, -4617057, -4860727, -3319052, 896808, 3884149, 813568, -7309611, -13787717, -13278673, -6699281, 616611, 3689026, 1141036, -4213714, -7717561, -7004686, -3724705, -640638, 1459561, 2447780, 574701, -5153092, -11219495, -12265568, -8112787, -4321223, -4169086, -3881903, 908539, 6818086, 5833281, -3405806]
54028c405806q858448O2651P354780O107656O25602j181323J182076J961129j048810
54019B799507l605172k202051J098907K971488L501237L637960J912326k330545
54011G783657n520170m331633j257019o65777j273442J371984N926160N963485
54003G997245M61676l745054k481879j67660j250883k415944P14043M538419K753506
53994F403469k628962l775571N53369L180819r335m189919l800778m36243J323869
53985c379282J235063J919213L162251K556753M52536k49439P78661K90013l223502
53976C542267o222130m405927J196161N058153M025406Q81679q7182J099927J215975
53967F304329o35583k098829k067266k086029k184185K80850N054543O627586
$$ y = [-3405806, -12264254, -12201603, -4846823, 1260833, 1886435, 705112, 1887188, 3848317, 2799507, -805665, -3007716, -1908809, 1062679, 4563916, 8201876, 10114202, 7783657, 2263487, -2068146, -3325165, -3990942, -5264384, -3892400, 2033760, 7997245, 8458921, 4713867, 2231988, 2064328, 813445, -1602499, -888456, 3649963, 6403469, 3774507, -1064, 552305, 3733124, 3723789, -466130, -4266908, -4703151, -3379282, -2144219, -225006, 2937245, 5493998, 5946534, 5697095, 6475756, 6765769, 3542267, -2679863, -7085790, -5889629, -831476, 3193930, 4075609, 3988427, 5088354, 6304329, 5668746, 3569917, 1502651, -583378, -2767563, -2486713, 2567830, 9195416]
53959I195416J708995m411715m381337P05457L444380J410970o35099N5496K42726
53950G335289k005372k952810O7557L128753J536833k911897n004289l232909
53942d038845J98705L382588M744763K388429k145319k796203L028005Q346862
53934A3108985M849003m671765r199990m438094K271657L148066n20401k716680
53926A830781j214351J656519L100498J741593j822298m213439j913085L361133
53918B527351N161976O23477m894470m607156P48779M381292K424622k150016
53910D215855m427863l398223j905481k187964k892301j177131K638173M584409
53902d550526K562374k2555P92414L037264J939903j684428k276474R00615J911541
$$ y = [9195416, 10904411, 6492696, 2111359, 2816816, 6261196, 7672166, 7037067, 7092563, 7335289, 5329917, 2377107, 2444664, 5573417, 7110250, 4198353, -805936, -4038845, -3840140, -457552, 4287211, 6675640, 4530321, 1734118, 4762123, 13108985, 17957988, 13286223, 4086233, -351861, 1919796, 5067862, 4547461, 1830781, 616430, 2272949, 5373447, 7115040, 5292742, 1079303, -833782, 2527351, 7689327, 8312804, 3418334, -1188822, -440043, 3941249, 6365871, 4215855, -212008, -3610231, -5515712, -7703676, -10595977, -11773108, -9134935, -4550526, -1988152, -2010707, -1218293, 1818971, 3758874, 2074446, -202028, 698587, 2610128]
53893B610128j893676m861266j962011L231168M573850K349221O54235J89541
53885D891190k94155O62334L731547M137861j966082r045542q259258n67364M500951
53876b208518K636704j065832j950733j219181j95207K361091M939008L320778
53868F618110j302851k180464J883577L542243q62595m629163j848454K941220
53860D161623L243252J307214K071945K852342j341805o958479o579754j460830
53852b704492O61493j494848k029857O05570J461432o83259o29323L368758N680579
53843D236053K568204j958719l145905k010975j263097l99886J372081K149856
53835A547612P78226p84521j244234j995565l221130k604856j02393J033582K27342
$$ y = [2610128, 716452, -4144814, -6106825, -2875657, 1698193, 4047414, 4701649, 4891190, 4597035, 5259369, 8990916, 13128777, 11162695, 2117153, -6142105, -6709469, -2208518, 428186, -637646, -2588379, -3807560, -4002767, -1641676, 3297332, 6618110, 5315259, 3134795, 5018372, 8560615, 7698020, 3068857, 1220403, 4161623, 7404875, 8712089, 10784034, 13636376, 12294571, 5336092, -1243662, -2704492, -2042999, -3537847, -5567704, -4962134, -3500702, -4183961, -4813284, -1444526, 4236053, 6804257, 4845538, 1699633, -311342, -1574439, -1974325, -602244, 1547612, 2325838, 1541317, 297083, -1698482, -4919612, -7524468, -7626861, -6593279, -6365937]
53826f365937R47591L513345L046897j579733l670675Q32436N206495J662591
53818C593010n627572n848787K473246R216015O369533k739402q923355p029094
53810h516406M13226O073065M468799j848355m463807K2224M794371K695925k875674
53801G63368l490063J097578L500102J193441m26707J675965L358452J369448
53793I041584j215846j298721j132796l044139m107146j108742L066013L110439
53785C310646j067606m812301n175640l100307l65644K136461L527762L108130
53777b438499J487299J2044o74281o39048q7003L80336r1315j440132k503483
53768e994082k376222j125240O59540J940401J573946O6929k46480J197160J380003
$$ y = [-6365937, -5418346, -1905001, 1141896, -437837, -4108512, -3276076, 1930419, 3593010, -2034562, -7883349, -5410103, 3805912, 10175445, 7436043, -1487312, -8516406, -8103180, -2030115, 2438684, 590329, -3873478, -3851254, 943117, 3639042, 763368, -2726695, -1629117, 1870985, 3064426, 2637719, 4313684, 7672136, 9041584, 7825738, 6527017, 5394221, 2350082, -1757064, -2865806, 200207, 3310646, 2243040, -2569261, -7744901, -10845208, -11210852, -9074391, -5546629, -2438499, -951200, -939156, -1613437, -2252485, -2339488, -1959152, -2050467, -3490599, -5994082, -8370304, -9495544, -8836004, -6895603, -5321657, -5254728, -5501208, -4304048, -2924045]
53759b924045j320951k746645J362862O976179N827959k073049p390612m705693
53751f993995N67994J754509J55335j94111m64296l116267m913105j298458N051663
53742i450731P137367L669317p4190o04296L41086M87050l1521o95315j406254
53733f27487j231212K03316Q11941r41572k571223j232371Q86480o8386k376731
53724g147245j083390K963704L372043j473207n197935l026143J572077L283833
53716f736263K572804K431090J950921j297648n026742m175590J259020N102845
53708c919563K787413k972156n836305l221136J671840M332257L716558K150436
53700a290656J651356J770134J052495p88708k730319l315139j302804K909970
$$ y = [-2924045, -4244996, -6991641, -5628779, 1347400, 7175359, 5102310, -2288302, -6993995, -6426001, -4671492, -4516157, -4710268, -5174564, -8290831, -13203936, -14502394, -9450731, -2313364, 1355953, 1281763, 677467, 1018553, 1505603, 1474082, 778767, -627487, -1858699, -1655383, -843442, -1785014, -4356237, -5588608, -4702128, -4770514, -7147245, -8230635, -5266931, -1894888, -3368095, -8566030, -11592173, -10020096, -6736263, -4163459, -1732369, 218552, -1079096, -6105838, -10281428, -9022408, -3919563, -1132150, -4104306, -9940611, -13161747, -11489907, -7157650, -3441092, -1290656, 360700, 2130834, 3183329, 2394621, -335698, -3650837, -4953641, -2043671]
53692b043671O019477M400645p23438l417189m54809M177616N043738K611641
53684A5614010R10908M22190j495453m438990m907508k443419n62266q05298p52166
53675A542008Q01352J308858r87556l832024m341053k661820o87978K93091k29150
53666h794272j499031r15257K842650O232545M580500m80822k413606M72040K423638
53657B448385m09365l841358k552558J761525L741878K289041L59845p10079j967663
53648A119651l122931k238357P67849L087546K218906p75547j726118K068236
53640A399235P224122O733442n32173o219657l410377K233705K04395p808358
53632a75666r137298K68782Q773227O290002j663364m188342p64356J545589J64156
$$ y = [-2043671, 3975806, 8376451, 7653013, 4235824, 3781015, 7958631, 13002369, 15614010, 16524918, 16947108, 15451655, 11012665, 6105157, 3661738, 3099472, 2294174, 1542008, 2343360, 3652218, 2664662, -1167362, -5508415, -8170235, -8858213, -8565122, -8794272, -10293303, -11208560, -8365910, -2133365, 2447135, 1966313, -447293, 24747, 2448385, 2039020, -1802338, -4354896, -2593371, 1148507, 3437548, 3797393, 3087314, 1119651, -2003280, -4241637, -3473788, -386242, 1832664, 1057117, -669001, 1399235, 8623357, 15356799, 14824626, 8604969, 5194592, 7428297, 7632692, -175666, -9312964, -9044182, -270955, 6019047, 4355683, 167341, -597015, 948574, 1112730]
53623A112730k138337l620046l482005p8578M390669L217806m070401p456888
53615a2125050j133745N534934K340852m382186k201210N952854O770573n73923
53607A83099l791295Q61208L652512J60862j946595Q38572J101522l847715n016222
53598g804052J683066O440881K633953q83024L986692Q675459K188399q771181
53590H150193r362634K91174O826910M563135K31792j337362k650075m478481
53582B234652l303598O12914K192222p4217k603864l689903m287083k719623K856023
53573h782477P570094M791457k303769l971451R56097L702114O43893j585097
53565A020861O81262J275278l822172p912448m460337J798344K901700J92779
$$ y = [1112730, -1025607, -4645653, -8127658, -8206236, -3815567, -597761, -4668162, -12125050, -13258795, -7723861, -5383009, -9765195, -11966405, -6013551, 757022, 183099, -3608196, -2746988, 905524, 1066386, -880209, -41637, 1059885, -2787830, -7804052, -6120986, 319895, 2953848, 2070824, 6057516, 14732975, 16921374, 8150193, -1212441, -921267, 5905643, 10468778, 10700570, 9363208, 6713133, 2234652, -1068946, -456032, 1736190, 1661973, -941891, -4631794, -8918877, -11638500, -8782477, -1212383, 3579074, 1275305, -2696146, -1740049, 1962065, 2605958, 1020861, 1702123, 2977401, -844771, -8757219, -13217556, -11419212, -8517512, -8324733]
53557h324733J16023K544996K378500l25242o06161K216956L297210K27080l898030
53548b373401n707472m887186k239025J201518L284828K953572K679968M683575
53540d03623N933178J939065n158937q026039m150973J136232K923731K487736
53532c319630K568829K122793o05479l648600l926540j753663O10232K580607
53524e371451M161987L587039j70863m224749m935039k941630j282300N4505L097044
53515h025457O293485N413734N65045l075792k970094k283136l008047j842911
53507h933173L010937O237547K535100m273980n980975j735282J955303J997306
53499e187217J896475L463906L067468j012313m195553k724609K36098L14066
$$ y = [-8324733, -8208710, -5663714, -3285214, -3610456, -4216617, -1999661, 1297549, 1524629, -2373401, -8080873, -12968059, -15207084, -14005566, -10720738, -7767166, -5087198, -403623, 5529555, 7468620, 2309683, -5716356, -9867329, -8731097, -5807366, -3319630, -750801, 1371992, 766513, -2882087, -6808627, -8562290, -7952058, -5371451, -1209464, 2377575, 2206712, -2018037, -6953076, -9894706, -11177006, -11122501, -8025457, -1731972, 3681762, 4246807, 1171015, -1799079, -4082215, -7090262, -8933173, -5922236, 315311, 2850411, -1423569, -7404544, -9139826, -7184523, -5187217, -3290742, 173164, 3240632, 2228319, -1967234, -4691843, -4455745, -4141679]
53491d141679q46637N64195L127316K715496K8395p26116M35217p17286m573795
53482d134894n804186j483645L886642M446342O36318k313212j377838J693511
53474d450962L684161L307206J478967j94114q63846q37933o52183j87324O10002
53465A893974P83704l66687j412385k21165K450338L099249M14593k092520p37153
53456C811948K370343J394531m620640q678903m287242M928380Q467759K297262
53448E683438n577898n558577J313944O008753L914444j075552m087275m608443
53440c987166l303929L21262M391332M182332j114630n523905m089458M23318
53432h700844K713678K671969K880602K317661j050988m106349k111501K798718
$$ y = [-4141679, -4988316, -4424121, -1296805, 1418691, 1447086, 720970, 1156187, 438901, -4134894, -9939080, -11422725, -7536083, -3089741, -2453423, -4766635, -6144473, -4450962, -766801, 2540405, 4019372, 3825258, 2961412, 2123479, 1471296, 1283972, 1893974, 2677678, 2310991, 898606, 677441, 3127779, 6227028, 6641621, 4549101, 3811948, 6182291, 7576822, 2956182, -5722721, -10009963, -5081583, 3386176, 5683438, 105540, -5453037, -4139093, 1869660, 5784104, 4708552, 621277, -3987166, -7291095, -6969833, -2578501, 1603831, 489201, -5034704, -9124162, -8700844, -5987166, -3315197, -434595, 1883066, 832078, -3274271, -5385772, -2587054]
53424b587054L734277l66417l106923o68878K890242K579323n87048k378944j156121
53415a647543J595059L573794K890150k89618k556357q81902K316617J813191
53407F813391k327854m387038k060831j58357k284007m341691j183234M222111
53399e707510M269135k051733o943382l703376M813750R532036N525354k649418
53391C084856o398640k977127K062756K942342J094746J420297L700293L077488
53383H007011j428149m686933l086807O02542K047481P52136j487614l446893
53375b727226l491549K24711N894495Q093617M477012r69263l817013m349378
53367C335406l974010j188352M364516P738594M325689k485603m901107j179040
$$ y = [-2587054, 1147223, 780806, -2326117, -2994995, -104753, 2474570, 1887522, -491422, -1647543, -52484, 3521310, 6411460, 6121842, 3565485, 2683583, 5000200, 6813391, 4485537, 98499, -1962332, -2120689, -4404696, -8746387, -9929621, -5707510, -1438375, -3490108, -10433490, -14136866, -9323116, 208920, 5734274, 3084856, -3313784, -6290911, -4228155, -1285813, -191067, 1229230, 4929523, 8007011, 6578862, 1891929, -1194878, -592336, 1455145, 2207281, 719667, -2727226, -6218775, -5994064, -99569, 7994048, 12471060, 11501797, 7684784, 3335406, -638604, -1826956, 2537560, 10276154, 14601843, 12116240, 7215133, 6036093]
53359F036093K522247R55389l822965o074757l553614N32207J648318j034699
53351b791781m157531m773883l786072k890998l35996N773669J1115402Q606823
53343F759633o93139o966362m687015L85299J181675o14156k36246Q12775j166391
53334e223927l313467l50643N090112N196445o46941m553487k053046K040482
53326c814472J733908k046396m132951j888848K914242O402455N657293J392749
53318F217980k355309k754770j202464k15869J27174K39053r71139k699645j018119
53309d633108M292970O313336P29476n432684k911896N450200Q830480M558202
53301A7196976j87807j743483l688818o354549m316150K399777N422680J085459
$$ y = [6036093, 8558340, 9513729, 5690764, -383993, -3937607, -3405400, -1757082, -2791781, -6949312, -11723195, -15509267, -18400265, -18736261, -12962592, -1847190, 6759633, 6066494, -899868, -5586883, -5201584, -4019909, -4634065, -4870311, -4057536, -5223927, -8537394, -8888037, -3797925, 1398520, 751579, -3801908, -5854954, -3814472, -2080564, -4126960, -8259911, -10148759, -7234517, -832062, 4825231, 6217980, 3862671, 1107901, -94563, -310432, -183258, 55795, -915344, -3614989, -4633108, -340138, 5973198, 6702674, 1269990, -1641906, 3808294, 12638774, 17196976, 17009169, 15265686, 11576868, 5222319, 906169, 3305946, 8728626, 9814085]
53293I814085l283692j574304J604371P1739l391989l088542l02522N21865P0157
53284D41168J097214J714533q20845l555940k416477Q4893r46142l792975k920608
53275a1115179J266772L008834N96365j747466j179025P31798K374504L991647
53267b071750M895892L585193Q73028j132096k667055m817619n476263j797968
53259h608638L827997N552319K153802j479192j644225j16239n7205j531573k481783
53250d384737j384527J754132M783648M249281l58151m215327k638761K093410
53242a01032L744927J132642j106939p43556r85963l753703n590767l291590Q37405
53233i858576K793988K545467K373376K337870J249747L53062J950328M745574
$$ y = [9814085, 6530393, 4956089, 6560460, 6632199, 3240210, 151668, -150854, 371011, 441168, 1538382, 3252915, 2432070, -1123870, -3540347, -3455454, -4401596, -8194571, -11115179, -9848407, -6839573, -6243208, -7990674, -9169699, -8437901, -6063397, -2071750, 2824142, 6409335, 7282363, 6150267, 3483212, -1334407, -6810670, -8608638, -4780641, 771678, 2925480, 1446288, -197937, -314176, -371381, -1902954, -4384737, -5769264, -4015132, 768516, 5017797, 4659646, 444319, -2194442, -101032, 3643895, 4776537, 3669598, 2926042, 1940079, -1813624, -7404391, -10695981, -9858576, -7064588, -4519121, -2145745, 192125, 1441872, 1794934, 3745262, 8490836]
53225H490836M230617j192417o886372o778511q38850M239345K771545k942164
53217A094029n599388k334103K164626K945870J356907J436394L005195K676602
53209F746132r0646k518428l224945l154049k431332n91122O36271n35259j401694
53200f565072K222111Q094598Q660301J780046n374793n850620j211892K817643
53192D572322M052278L202581J4071m911826p510507m613573Q22867L183107J438582
53183B49902r36686j730172j577917r09754O08517K004482J743397J45530j532479
53174a935180l131049l932341j262556N100508R238126N368990l049628o541145
53166a44275k271610K637513J901410j966185l359821j761804j12515P55839J448569
$$ y = [8490836, 12721453, 11529036, 4642664, -2135847, -2974697, 1264648, 4036193, 1094029, -4505359, -6839462, -4674836, -1728966, -372059, 1064335, 4069530, 6746132, 6655486, 4137058, 912113, -2241936, -4673268, -5264390, -4628119, -5163378, -6565072, -4342961, 3751637, 12411938, 14191984, 8817191, 2966571, 1754679, 4572322, 8624600, 11827181, 11841252, 6929426, -581081, -5194654, -4371787, -1188680, 249902, -686784, -2416956, -3994873, -4904627, -4296110, -2291628, -548231, -402701, -1935180, -5066229, -8998570, -10261126, -5160618, 4077508, 9446498, 6396870, -144275, -2415885, 221628, 2123038, 156853, -3202968, -4964772, -5077287, -4321448, -2872879]
53157b872879Q35651j789153l524009j373389K506399L439011J144611k94187
53149a927945J030168K640747K347022J192218P29171N71137j06256j067816j920271
53140C488175k412877j532617J265208L805022L161525K55365r47071L79739M68123
53131G930592k599495n050015k984402J523724L546199K170934M76232K66290
53123E280059O15185P30703P42636P6326j870382l730440l575175j898273o48218
53114d277579k9967R20648J453804J50501j659094j141179J356674K400833O46896
53105a78463j369575j174037Q69760L055178L736692J405999l253663n785531
53097b693640k688315K412895K514205k307697m357030j83891L768912J502264
$$ y = [-2872879, -2037228, -3826381, -7350390, -8723779, -6217380, -2778369, -1633758, -1927945, -897777, 1742970, 4089992, 5282210, 6011381, 6582518, 6476262, 5408446, 3488175, 1075298, -457319, 807889, 4612911, 7774436, 8029801, 7082730, 7462469, 7930592, 5331097, 281082, -2703320, -1179596, 2366603, 4537537, 5013769, 5280059, 5895244, 6625947, 7368583, 7444909, 5574527, 1844087, -1731088, -3629361, -4277579, -4307546, -3386898, -1933094, -1782593, -3441687, -4582866, -3226192, -825359, -178463, -1548038, -2722075, -1852315, 1202863, 4939555, 6345554, 3091891, -2693640, -5381955, -2969060, -454855, -2762552, -7119582, -7303473, -3534561, -2032297]
53089b032297k714027j170786M739414O236605J15802o746367o751326n87777
53081h910759M826850M457599l43871m044478k860411J271885L232295J126643
53073a244247j825331k180653k24794J960274L157762K376980q03766l610602
53065b394377k080935K251245K907631j375769l364618J136635N352259K206188
53057D638259l467995k806994J993827J849246k918634l299476J697880K631788
53049C17901l294944n992927P85102Q194065O093732j367827l758568q18839j43664
53040A4031k908249k977518J218287L882681J675635j634740j974343j63546J423850
53031a443912K277811K129726K32007k118740k043096M35476J701792j10646k132902
$$ y = [-2032297, -4746324, -5917110, -1177696, 5058909, 5174711, -1571656, -8322982, -8910759, -4083909, 373690, 29819, -4014659, -6875070, -5603185, -2370890, -1244247, -3069578, -5250231, -5475025, -3514751, -356989, 2019991, 1216225, -2394377, -4475312, -2224067, 683564, -692205, -4056823, -2920188, 2432071, 4638259, 1170264, -1636730, 357097, 2206343, -712291, -4011767, -2313887, 317901, -2977043, -8969970, -8184868, 9197, 6102929, 4735102, 976534, 157695, 14031, -2894218, -5871736, -4653449, -770768, 904867, -729873, -2704216, -2867762, -1443912, 833899, 2963625, 3195632, 1076892, -966204, -530728, 1171064, 1060418, -1072484]
53022a072484j003256K276662L821373J805952j837796m017129l480480j301344
53014d808502Q58738K350714L151092K745070R44531n13199M04634K333354J356731
53005H823163l068939o138246m098396J49392J187978j246339k613310m86181
52997g490878K755873L943282K515281k01549k372105k319540k18090J264724
52989b123002M13469m29404J661672M694345M005096k45837k794214j437555k41870
52980C502700k190663l735143r03378L173345K603252j528132k331451J870437
52972D60967M414728Q15838l595081j819066L143041K270879m802273p626180
52964f737147m59489P640143M908980n782745j0470322l620835N136988N770005
$$ y = [-1072484, -2075740, 200922, 4022295, 5828247, 3990451, -26678, -3507158, -4808502, -3949764, -1599050, 1552042, 4297112, 5241643, 4728444, 5133078, 7466432, 8823163, 5754224, -384022, -4482418, -4333026, -3145048, -4391387, -7004697, -7490878, -4735005, -791723, 1723558, 1522009, -850096, -3169636, -3387726, -2123002, -1709533, -2138937, -477265, 4217080, 8222176, 7976339, 5182125, 3744570, 3502700, 1312037, -2423106, -3326484, -153139, 2450113, 921981, -1409470, 460967, 4875695, 5691533, 2096452, 277386, 3420427, 5691306, 889033, -6737147, -7196636, 443507, 5352487, -430258, -10900580, -14521415, -9384427, -3614422]
52956c614422Q23742j189730J217231K864750J321204j032919k561300l687063
$$ y = [-3614422, -2790680, -3980410, -2763179, 101571, 1422775, 389856, -2171444, -5858507]
$$ [...]
##END NTUPLES=NMR SPECTRUM
##END=
