##TITLE=31Pdec_SR 78 AcCl:Ac2O
 , 124 sc
 24.08.2021
##JCAMPDX= 6.0         $$ Bruker NMR JCAMP-DX V2.0
##DATA TYPE= NMR SPECTRUM
##DATA CLASS= NTUPLES
##ORIGIN= UXNMR, Bruker Analytische Messtechnik GmbH
##OWNER= root
$$ XWIN-NMR		Version 3.5
$$ Tue Aug 24 13:33:20 2021 Russian Standard Time (UT+4h)  she@DPX200
##.OBSERVE FREQUENCY= 81.013821
##.OBSERVE NUCLEUS= ^31P
##.ACQUISITION MODE= SIMULTANEOUS
##.ACQUISITION SCHEME= undefined
##.AVERAGES= 124
##.DIGITISER RES= 16
##SPECTROMETER/DATA SYSTEM= spect
##.PULSE SEQUENCE= zgpg30
##.SOLVENT NAME= DMSO
##.SHIFT REFERENCE= (INTERNAL, DMSO, 0, 248.564)
##AUDIT TRAIL= $$ (NUMBER, WHEN, WHO, WHERE, WHAT)
$$ ##TITLE= Audit trail, XWIN-NMR		Version 3.5
$$ ##JCAMPDX= 5.01
$$ ##ORIGIN= Bruker BioSpin GmbH
$$ ##OWNER= she
$$ F:/spectra/data/she/nmr/P31/1/pdata/1/auditp.txt
$$ ##AUDIT TRAIL=  $$ (NUMBER, WHEN, WHO, WHERE, WHAT)
(   1,<2021-08-24 13:32:03.20 +0400>,<she>,<DPX200>,
      <continue with go, POWCHK disabled, PULCHK disabled
       configuration hash MD5:
       00 E9 B6 7A A2 85 ED C7 34 08 36 98 17 FE 4E 26
       data hash MD5: 32K
       29 FA D3 13 17 AB 23 28 E6 77 69 E4 E2 1C EF D9>)
(   2,<2021-08-24 13:32:06.84 +0400>,<she>,<DPX200>,
      <Start of raw data processing
       efp BC_mod = 2 LB = 1 FT_mod = 6 PKNL = 1 PHC0 = -7744.83 PHC1 = 107.4735 SI = 64K 
       data hash MD5: 64K
       7F AD 84 48 26 9C C0 1F 9B 8C 5C 90 AB 07 F3 F7>)
(   3,<2021-08-24 13:32:35.90 +0400>,<she>,<DPX200>,
      <pk PHC0 = -7.089185 PHC1 = 5.600001 
       data hash MD5: 64K
       9A 74 19 DF 33 5F 62 18 C3 5E 0C E5 FE 8A 07 AB>)
$$ ##END=
$$ 
$$ hash MD5
$$ 21 BD 5C 47 BA 73 C8 C5 56 2B C1 5B F9 4D A4 85
##$RELAX= 
##$RELAX= 
##$RELAX= 
##$RELAX= 
##$RELAX= 
##$RELAX= 
##$RELAX= 
##$RELAX= 
$$ Bruker specific parameters
$$ --------------------------
##$DU= <F:/spectra>
##$EXPNO= 1
##$NAME= <P31>
##$PROCNO= 1
##$TYPE= <nmr>
##$USER= <she>
##$AMP= (0..31)
100 100 100 100 100 100 100 100 100 100 100 100 100 100 100 100 100 100 
100 100 100 100 100 100 100 100 100 100 100 100 100 100 
##$AQSEQ= 0
##$AQ_mod= 1
##$AUNM= <au_zg>
##$AUTOPOS= <>
##$BF1= 81.014009
##$BF2= 200.13
##$BF3= 200.13
##$BF4= 200.13
##$BF5= 200.13
##$BF6= 200.13
##$BF7= 200.13
##$BF8= 200.13
##$BYTORDA= 1
##$CFDGTYP= 0
##$CFRGTYP= 5
##$CHEMSTR= <none>
##$CNST= (0..31)
1 1 145 1 1 1 1 1 1 1 1 1 1 1 1 1 1 1 1 1 1 1 1 1 1 1 1 1 1 1 1 1 
##$CPDPRG= <waltz16>
##$CPDPRG1= <>
##$CPDPRG2= <waltz16>
##$CPDPRG3= <>
##$CPDPRG4= <mlev>
##$CPDPRG5= <mlev>
##$CPDPRG6= <mlev>
##$CPDPRG7= <mlev>
##$CPDPRG8= <mlev>
##$CPDPRGB= <>
##$CPDPRGT= <>
##$D= (0..31)
0 1 0 0 0 0 0 0 0 0 0 0.03 2e-05 3e-06 0 0 0 0 0 0 0 0 0 0 0 0 0 0 0 0 
0 0 
##$DATE= 1629797354
##$DBL= (0..7)
120 120 120 11 120 120 24 19 
##$DBP= (0..7)
150 150 150 150 150 150 150 150 
##$DBP07= 0
##$DBPNAM0= <>
##$DBPNAM1= <>
##$DBPNAM2= <>
##$DBPNAM3= <>
##$DBPNAM4= <>
##$DBPNAM5= <>
##$DBPNAM6= <>
##$DBPNAM7= <>
##$DBPOAL= (0..7)
0.5 0.5 0.5 0.5 0.5 0.5 0.5 0.5 
##$DBPOFFS= (0..7)
$$ [...]
##$SUBNAM2= <"">
##$SUBNAM3= <"">
##$SUBNAM4= <"">
##$SUBNAM5= <"">
##$SUBNAM6= <"">
##$SUBNAM7= <"">
##$SUBNAM8= <"">
##$SUBNAM9= <"">
##$SW= 501.771253377433
##$SWIBOX= (0..15)
0 1 3 0 0 0 0 0 0 0 0 0 0 0 0 0 
##$SW_h= 40650.406504065
##$TD= 32768
##$TD0= 1
##$TE= 0
##$TE2= 300
##$TE3= 300
##$TEG= 300
##$TL= (0..7)
0 120 53 12 22 120 120 120 
##$TP= (0..7)
150 150 150 150 150 150 150 150 
##$TP07= 0
##$TPNAME0= <>
##$TPNAME1= <>
##$TPNAME2= <>
##$TPNAME3= <>
##$TPNAME4= <>
##$TPNAME5= <>
##$TPNAME6= <>
##$TPNAME7= <>
##$TPOAL= (0..7)
0.5 0.5 0.5 0.5 0.5 0.5 0.5 0.5 
##$TPOFFS= (0..7)
0 0 0 0 0 0 0 0 
##$TUNHIN= 0
##$TUNHOUT= 0
##$TUNXOUT= 0
##$USERA1= <user>
##$USERA2= <user>
##$USERA3= <user>
##$USERA4= <user>
##$USERA5= <user>
##$V9= 5
##$VALIST= <valist>
##$VCLIST= <CCCCCCCCCCCCCCC>
##$VD= 0
##$VDLIST= <DDDDDDDDDDDDDDD>
##$VPLIST= <PPPPPPPPPPPPPPP>
##$VTLIST= <TTTTTTTTTTTTTTT>
##$WBST= 1024
##$WBSW= 4
##$XGAIN= (0..3)
0 0 0 0 
##$XL= 0
##$YL= 0
##$YMAX_a= 3844
##$YMIN_a= -6499
##$ZGOPTNS= <>
##$ZL1= 120
##$ZL2= 120
##$ZL3= 120
##$ZL4= 120
##$ABSF1= 0
##$ABSF2= 0
##$ABSG= 0
##$ABSL= 0
##$ALPHA= 0
##$AQORDER= 0
##$ASSFAC= 0
##$ASSFACI= 0
##$ASSFACX= 0
##$ASSWID= 0
##$AUNMP= <proc_1d>
##$AZFE= 0.1
##$AZFW= 0.5
##$BCFW= 0
##$BC_mod= 2
##$BYTORDP= 0
##$COROFFS= 0
##$CY= -3
##$DATMOD= 1
##$DC= 0
##$DFILT= <>
##$DTYPP= 0
##$F1P= 0
##$F2P= 0
##$FCOR= 1
##$FTSIZE= 65536
##$FT_mod= 6
##$GAMMA= 0
##$GB= 0
##$INTBC= 1
##$INTSCL= 5.30512e-09
##$ISEN= 30
##$LB= 1
##$LEV0= 0
##$LPBIN= 0
##$MAXI= 10000
##$MC2= 0
##$MEAN= 0
##$ME_mod= 0
##$MI= 50
##$NCOEF= 0
##$NC_proc= -7
##$NLEV= 6
##$NOISF1= 182.463
##$NOISF2= 159.3651
##$NSP= 0
##$NTH_PI= 0
##$NZP= 0
##$OFFSET= 248.5645
##$PC= 4
##$PHC0= -7751.919
##$PHC1= 113.0735
##$PH_mod= 1
##$PKNL= yes
##$PPARMOD= 0
##$PSCAL= 0
##$PSIGN= 0
##$REVERSE= no
##$SF= 81.014009
##$SI= 65536
##$SIGF1= 159.3651
##$SIGF2= -187.1042
##$SINO= 113.3802
##$SIOLD= 16384
##$SREGLST= <1H.CDCl3>
##$SSB= 0
##$STSI= 65536
##$STSR= 0
##$SW_p= 40650.406504065
##$SYMM= 0
##$S_DEV= 0
##$TDeff= 32768
##$TDoff= 0
##$TI= <>
##$TILT= no
##$TM1= 0
##$TM2= 0
##$TOPLEV= 0
##$USERP1= <user>
##$USERP2= <user>
##$USERP3= <user>
##$USERP4= <user>
##$USERP5= <user>
##$WDW= 1
##$XDIM= 65536
##$YMAX_p= 532819558
##$YMIN_p= -54383714
$$ End of Bruker specific parameters
$$ ---------------------------------
##NTUPLES= NMR SPECTRUM
##VAR_NAME=  FREQUENCY,     SPECTRUM/REAL,   SPECTRUM/IMAG
##SYMBOL=    X,             R,               I
##VAR_TYPE=  INDEPENDENT,   DEPENDENT,       DEPENDENT
##VAR_FORM=  AFFN,          ASDF,            ASDF
##VAR_DIM=   65536,         65536,           65536
##UNITS=     HZ,            ARBITRARY UNITS, ARBITRARY UNITS
##FACTOR=    0.620285442955139, 1,           1
##FIRST=     20137.2065510759, 0,            0
##LAST=      -20513.1999529892, 0,           0
##MIN=       -20513.1999529892, -54383714,   0
##MAX=       20137.2065510759, 532819558,    0
$$ Real data points
##PAGE= N=1
##DATA TABLE= (X++(R..R)), XYDATA
$$ [...]
60104b589960l832429K91441N318881N721902K368018j94489j147215k096665
60096C839484k050077K39481K044407M33076k582018l646615l528484m077220
60088i327966l508400j58070K765043J958979R317O62050J836034p7733k527402
60079h368148q51584K836777K759395m65151r09057K586987N212505M501800K385902
60070I689426n15911m963861p832826m998692L34625Q83318k382910q08287O788251
60061c806867R919328K403992o889251o638957Q14198M481538R87560l150532
60053a878991l138611j241936m42977J20237J591071K297629O60715j730226k088727
60044e851816r3869J878504J834324O51435Q22092K560143K739040n26522l885701
$$ y = [-2589960, -6422389, -6130948, -812067, 4909835, 7277853, 7083364, 5936149, 3839484, 1789407, 2028888, 4073295, 4506371, 1924353, -1722262, -5250746, -9327966, -12836366, -12994436, -10229393, -8270414, -8261097, -7599047, -5763013, -5840746, -8368148, -9219732, -6382955, -3623560, -4088711, -4997768, -2410781, 2801724, 7303524, 9689426, 9173515, 4209654, -3623172, -8621864, -8287239, -7403921, -9786831, -10595118, -3806867, 6112461, 8516453, 1627202, -5011755, -4197557, 283981, 1271541, -1878991, -5017602, -6259538, -6702515, -6582278, -4991207, -2693578, -2032863, -3763089, -5851816, -5945685, -4067181, -2232857, -1581422, -759330, 1800813, 4539853, 4013331, 127630]
60035A27630k695458J961386M553112L263748J735771J880756Q75263k465176
60027I237032m376159k749646j288140k549063k513447K025509N811994K299023
60019E897103n236827p910729m305477r54433q79188m12948K052954K741468J10668
60010h897409j580740O79475M060194N063613L868090J313895k652195n279152
60002c424229k240610M327368N717596j182130q001501o317037R60424N547308
59994d612811N589891M547228L026043k62938k627059o42455K657289J582100
59986I257288k653840l853300j254710K4783j318165r62184K316350M139505K398299
59977H094026J40140j169515l581621n743842k488427N139014P950847J896997
$$ y = [127630, -2567828, -606442, 3946670, 7210418, 8946189, 10826945, 11702208, 9237032, 4860873, 2111227, 823087, -1725976, -4239423, -2213914, 3598080, 5897103, 660276, -7250453, -11555930, -12510363, -13389551, -13802499, -11749545, -9008077, -8897409, -10478149, -9798674, -5738480, -674867, 3193223, 4507118, 1854923, -3424229, -5664839, -1337471, 4380125, 3197995, -4803506, -11120543, -10160119, -4612811, 977080, 5524308, 8550351, 8287413, 5660354, 5017899, 7675188, 9257288, 6603448, 2750148, 1495438, 1520221, 202056, -760128, 1556222, 5695727, 8094026, 8234166, 7064651, 3483030, -2260812, -4749239, 389775, 8340622, 10237619]
59969A0237619m564335k856916K975420L762976k92235j712005J287731L296867
59961A2135122J721345l34116j116087k435446m073403k995915L00214R17303
59953D119017k719630n587839l268420J787105M117686K305655n98678j697784
59945a542888r40440p6703k57148n88161N68351K492770K180955q69624k469352
59936a502240N51044M700068M184274n67648l646654k329521J37244O30818j33310
59927B024075j002309k576465m226197l287756M95061L340147K574372M05072
59919b254000K83966J993270K568855M56359k821133m101127j435819L115785
59911b193844M412070L25620m463288m316939p60693K48413j785677j211803L819039
$$ y = [10237619, 5673284, 2816368, 5791788, 9554764, 9262529, 7550524, 8838255, 12135122, 13856467, 13522351, 12406264, 9970818, 5897415, 2901500, 3201714, 4119017, 1399387, -4188452, -7456872, -5669767, -1552081, 753574, 154896, -1542888, -2483328, -2560031, -2817179, -3405340, -2836989, -344219, 1836736, 967112, -1502240, -951196, 3748872, 7933146, 7365498, 3718844, 1389323, 1526567, 2157385, 2024075, 1021766, -1554699, -5780896, -9068652, -8573591, -5233444, -2659072, -2254000, -1970034, 23236, 2592091, 3048450, 227317, -3873810, -5309629, -2193844, 2218226, 2543846, -1919442, -6236381, -6997074, -6748661, -8534338, -9746141, -5927102]
59902e927102P515096N140199k60890l146814k694421j428167q47985j537044
59894c187128l807561n607668l712359Q42316L065950J741020J272525L378948
59886f013957L622402n1177k519653m40047J266180j405597l059217J662858O453834
59877d84374K142009o896775p401639K624089J0406764O839383k142828o200322
59869a113693l751891K45369K787294L740481K764952L2009k493371l365446l186551
59860d340847k533251j023081P64852J393665J065302J092171J135312K50639
59852b195238l47920L36815l75712m511419p499372l709468L283236M733636R78537
59843i306905J237969P127934Q123518r81890r383826o041019K931406L949776
$$ y = [-5927102, 1587994, 6728193, 6467303, 3320489, 626068, -802099, -1650084, -3187128, -6994689, -12602357, -16314716, -15472400, -12406450, -10665430, -9392905, -6013957, -2391555, -2442732, -4962385, -5402432, -4136252, -5541849, -8601066, -6938208, -484374, 1657635, -5239140, -12640779, -10016690, 390074, 7229457, 5086629, -1113693, -4865584, -4620215, -1832921, 1907560, 4672512, 4704521, 2211150, -1154296, -4340847, -6874098, -7897179, -7132327, -5738662, -4673360, -3581189, -2445877, -2195238, -2543158, -2206343, -2582055, -7093474, -14592846, -18302314, -15019078, -10285442, -9306905, -8068936, -941002, 7182516, 6200626, -3183200, -9224219, -6292813, -2343037]
59835b343037l139220o408418j181552M610941M627406K098085J014705n30225
59827a251315l670099l771650J843880P224672N476950p58608l166111R5055K834360
59818D857134J187672j026831M52007K955005J132599m090902n951515j313250
59810a798081M657517N101843l29070o305451q501274o547445k184730J950289
59802a3956402K756852k29133k554061L10492N874433O996395K149662j841533
59794d93295L79132N078929N411273J075596k742806l484140l072643k782904
59786f30858j348151J306478K527811O10007k571403m000149l009863j278147
59778h394275l34134K4505J005606K846926M063250L371486J813294J327740J494466
$$ y = [-2343037, -5482257, -11890675, -13072227, -8461286, -3833880, -1735795, -721090, -1251315, -4921414, -8693064, -6849184, 375488, 5852438, 5093830, 1927719, 2022774, 4857134, 6044806, 5017975, 5469982, 8424987, 9557586, 5466684, -484831, -1798081, 2859436, 7961279, 7632209, 1326758, -7174516, -13721961, -15906691, -13956402, -11199550, -11428683, -13982744, -13672252, -7797819, -801424, 1348238, -493295, -114163, 4964766, 10376039, 11451635, 8708829, 5224689, 2152046, -630858, -1979009, -672531, 1855280, 2465287, -106116, -4106265, -7116128, -8394275, -8728409, -8703904, -7698298, -4851372, -788122, 2583364, 4396658, 5724398, 7218864]
59769G218864J51512k432142l049067m19220K543170L176405K635559K508573
59761A2333654J143574k948002o620717n629530j283810J112026L3035p37892
59753b597662J134409K864505J492367j202514j561142M44517J574474K47095
59745B396049j679578k234760k054569k377199j897430J695464O864670Q008505
59737H721152K386154m931698o557794k158723J782722J301864q41374j265908
59729a563605r52730j513950j370240N53742J480897m15645j576730J322266M529094
59720D93099K386859k683916k691590L539011P790239M184046k772215n167506
59712E078027j930275J883881K772834J529881q2500j613358k986190l768506
$$ y = [7218864, 7370376, 4938234, 1889167, 1469947, 4013117, 7189522, 9825081, 12333654, 13477228, 10529226, 3908509, -1721021, -3004831, -1892805, -1859770, -2597662, -1463253, 1401252, 2893619, 1691105, 129963, 574480, 2148954, 2396049, 716471, -1518289, -3572858, -5950057, -7847487, -6152023, 712647, 8721152, 11107306, 6175608, -382186, -2540909, -758187, 543677, -297697, -1563605, -2516335, -4030285, -5400525, -4846783, -3365886, -3781531, -5358261, -4035995, 493099, 2879958, 196042, -2495548, 1043463, 8833702, 13017748, 10245533, 5078027, 3147752, 5031633, 7804467, 9334348, 9251848, 7638490, 4652300, 883794]
59704H83794l757273l017621j325201J382746L894965M051729J035747k777506
59696C71380l440671N7881L817650L468563K1436j601900K2093Q29644j744561
59687A801515m098370k171261J721661K398281j02437j051213J264948L309555
59679C072679K061910j040209k753211j748397P84646K182415M00253l028503
59671f8417l620074R3445L628710K979237R62843K107626M050813J062956n190446
59662F006693o611455j257099L107653P81823l780807l771099P0016K339907J377307
59653a737061k89715r56581p65500K12965J376074R01064j541037l370949k676697
59644h847437p92184P19850K516777M497361M064438P21890j153597J606370N056158
$$ y = [883794, -2873479, -5891100, -7216301, -5833555, -1938590, 2113139, 3148886, 371380, -3069291, -3011410, 806240, 4274803, 4296239, 2694339, 2716432, 3546076, 1801515, -2296855, -4468116, -2746455, -348174, -450611, -1501824, -236876, 3072679, 5134589, 4094380, 1341169, -407228, 377418, 2559833, 2960086, -68417, -3688491, -3595046, 33664, 3012901, 3975744, 6083370, 10134183, 11197139, 6006693, -604762, -1861861, 1245792, 2027615, -1753192, -5524291, -5454275, -3114368, -1737061, -2026776, -2983357, -3748857, -3535892, -2159818, -1258754, -2799791, -6170740, -8847437, -9639621, -8919771, -6402994, -1905633, 2158805, 2880695, 1727098, 3333468, 8389626]
59635H389626L203910l016354o914403n150878q60038J905506K233309P24300
59627E14978j740462k826585m65189K959515K114693l477814o866601k386370
59619a2173835N633460P555724J252688m830257l195698K686174M062507l54096
59611F36667l402264r04759K564439J696582j732400l270589l075071l336132
59603a0823527k404615J957659O217939N146065P17404l65367K712583M284273
59595G442414K125015O5487n4275r53242k951477k681659q44206k632556p504726
59586g989225p594250m29057N930751N621733L437931M099471K909186l957473
59578B029067q848059l663295N296323N944397p75186l573321M17561K819318
$$ y = [8389626, 11593536, 8577182, 1662779, -3488099, -4348137, -2442631, -209322, 514978, -1225484, -4052069, -4517258, -1557743, 556950, -2920864, -9787465, -12173835, -6540375, 1015349, 2268037, -2562220, -5757918, -3071744, 990763, 636667, -2765597, -3670356, -1105917, 590665, -1141735, -4412324, -7487395, -10823527, -13228142, -11270483, -5052544, 93521, 810925, 445558, 3158141, 7442414, 9567429, 9632916, 9578641, 8625399, 5673922, 2992263, 2148057, -484499, -7989225, -15583475, -16012532, -10081781, -4460048, -1022117, 3077354, 5986540, 2029067, -6818992, -10482287, -5185964, 758433, -16753, -3590074, -3172513, -353195]
59570c53195m09050l269933j424437J551439K427602L117801M146411K250197
59562H036835k115332l196074M53742K624784k66024l102723j067043K178016
59554C546181R84101l066873m304452j424688K327579M391599M070727J252327
59546G776501k473433m058934l162148k957084m383326l699281J027340N330726
59538f599639M519917P56778q11396N1480q0820j306883m56708K364937K736401
59529A174067j310413n408906l972169K681448Q267852P358823J262265l568085
59521F484882k910894P98521K499551J203175l6351K56120K04059j291628k420728
59512D786707j730201m57201j67964n93701r89834j312628j219231k81943L68575
$$ y = [-353195, -762245, -4032178, -5456615, -3905176, -1477574, 1640227, 5786638, 8036835, 5921503, 2725429, 3179171, 5803955, 5537931, 2435208, 1368165, 3546181, 4530282, 1463409, -2841043, -4265731, -1938152, 2453447, 6524174, 7776501, 5303068, 1244134, -1918014, -4875098, -9258424, -12957705, -11930365, -6599639, -2079722, -1322944, -2134340, -2082860, -2163680, -3470563, -3927271, -1562334, 1174067, -136346, -5545252, -9517421, -6835973, 1431879, 8790702, 10052967, 6484882, 3573988, 4372509, 6872060, 8075235, 8038884, 8295004, 8499063, 7207435, 4786707, 3056506, 2599305, 2431341, 1837640, 847806, -464822, -1684053, -1965996, -1597421]
59503a597421o80643k080795j240282J007691J184034j028983k219747j215912
59495g872058o51251j294353k30159L201214N142299L674715K107529K578241
59487F656177K077778j033171k438723P25817L305292k18787n850275n677686
59479b453578m51190J859145j087563l111297k67777L297859K810335q4911j260365
59470g49342n88645o91048k013701k614904j555122J3236O97857M09592K18955
59461f873122J105053K565354K726458N49332k409675l273369p82097L276849
59453c115217N191205K421124l015784n123691o55026N359631N009562j316512
59445D755292m694714n11205M761382L757786q46370j927415L04365J10903k874723
$$ y = [-1597421, -2278064, -4358859, -5599141, -4591450, -3407416, -4436399, -6656146, -7872058, -8523309, -9817662, -10047821, -6846607, -1704308, 1970407, 4077936, 6656177, 8733955, 7700784, 5262061, 5987878, 9293170, 9074383, 3224108, -2453578, -2904768, -1045623, -2133186, -5244483, -5512260, -2214401, 595934, 511023, -749342, -1337987, -2029035, -4042736, -6657640, -8212762, -8199526, -7501669, -7092077, -6873122, -5768069, -3202715, -476257, 73075, -2336600, -5609969, -6392066, -3115217, 2075988, 4497112, 1481328, -3642363, -4297389, 1062242, 6071804, 4755292, 60578, -450627, 4310755, 8068541, 7222171, 5294756, 5599121, 5710024, 2835301]
59436B835301l255903Q467J424040j551089m047358j650871K931533M367231J709307
59427B770658k041577m156144l504429m20124K662381K741537J5968j947605q04991
59418d684326J985585L722374L139697K98303l264317m111824j92883M909003
59410A801612M936939o77052n346055l923989R57977L297241J127073k880348
59402g06602n347556m322807J4470M484529M974686J398469j623909p80312J848919
59393f0113K668436J608356O84233J69765p35729j509949j602128k230132l806817
59384d814078l522343P66309N612900N265144k90642m683724l433213P23667K543718
59375a832262J422479R63697K689012L444868R7275n190823o741939k490127K853696
$$ y = [2835301, -420602, -412135, 1011905, -539184, -4586542, -6237413, -3305880, 1061351, 2770658, 729081, -3427063, -6931492, -7351616, -4689235, -1947698, -1931730, -3879335, -4684326, -2698741, 1023633, 4163330, 4461633, 1197316, -2914508, -3107391, 1801612, 6738551, 6061499, 715444, -3208545, -2250568, 1046673, 2173746, -706602, -6054158, -10376965, -10362495, -5877966, -903280, 495189, -1128720, -1909032, -60113, 2608323, 4216679, 4900912, 5070677, 4334948, 2824999, 1222871, -1007261, -4814078, -8336421, -7570112, -1957212, 3307932, 3017290, -1666434, -5099647, -4375980, -1832262, -409783, 553914, 3242926, 6687794, 6785069, 1594246, -5147693, -7637820, -4784124]
59366d784124L304752j061665m560563l277184N79394K356190P96817j225042
59358g871425o50032K356117M650256L459359l00387k749310j885658k20869o61691
59349c873640j564331N68872M517939N202489J482117j875824j558315j02545
59341B796762m31293q73565O87390K081504Q90832m79921R20777K394477j28594
59332G858369l950126k963347J780363K759072j902802n031148j893487K540622
59324h02484K455367M01245J090801J671972l066976r062176o803542L054547
59316a1061246Q134162J822739o709255o095727R17079L284991q92602l036352
59308a3636211Q96096M508473K511664r21348k55595K073591P70566k977212m172117
$$ y = [-4784124, -1479372, -2541037, -7101600, -10378784, -9799390, -7443200, -6646383, -7871425, -8521457, -6165340, -1515084, 1944275, 1643888, -1105422, -2991080, -3211949, -3873640, -5437971, -4869099, -351160, 4851329, 6333446, 4457622, 2899307, 2796762, 2365469, 1491904, 2179294, 4260798, 5151630, 4671709, 5592486, 7986963, 7858369, 3908243, 944896, 2725259, 5484331, 3581529, -1449619, -3343106, -802484, 1652883, 2054128, 3144929, 4816901, 1749925, -7312251, -14115793, -11061246, -2927084, -1104345, -7813600, -13909327, -12992248, -9707257, -10599859, -13636211, -12740115, -8231642, -5719978, -6641326, -6896921, -4823330, -4052764, -7029976, -11202093]
59299a1202093k571521j580130r79611J908452N146666M046235Q7726m689M503124
59290f45841O107394J095384l962820k683034J013673l4274m214359m225215O68936
59281f880156L861780K388009P48830K192456L157513k6451m037444l017040K435645
59272H23142N516685K228500l524599n102591j213823L191626L497270O49290
59264F065500j187063m59294N87015l6891j585885k642274l074602k952391j925052
59255g210937p93095j040437j501768J147842O393199Q229005L275198k908111
59247E590896k863446J823481L078548j046909l720689p77041K511015K88476
59239D884331m066138l215020K303312M587054L66114m151616k704623J915376
$$ y = [-11202093, -13773614, -15353744, -16333355, -14424903, -9278237, -5232002, -5144276, -5148965, -645841, 5461553, 6556937, 2594117, -88917, 924756, 890482, -3323877, -7549092, -6880156, -3018376, -630367, 118463, 2310919, 5468432, 5441981, 1404537, -1612503, 823142, 6339827, 8568327, 5043728, -58863, -1272686, 1918940, 5416210, 6065500, 4878437, 4419143, 5006158, 4969267, 3383382, 741108, -2333494, -5285885, -7210937, -8004032, -9044469, -10546237, -9398395, -3005196, 5223809, 8499007, 5590896, 2727450, 4550931, 7629479, 6582570, 2861881, 2084840, 4595855, 4884331, 818193, -2396827, -93515, 4493539, 4859653, 708037, -1996586, -81210]
59231h1210K487142j774656m378395j509350K423676J778817j751507k160148
59223d965631J211354K760761m9262k225335Q15568N424127M710522j213322n392060
59214A076722l774527J81153J313224r83997l668404l981563j019354L934738
59206f922008P250784N606182L23415l158881j750239J447685J659294j059131
59198C397101k381910l029L183049K820905j354700m911545l823525N96527L129578
59189F52451J119473k386944l163547j372345j63621l52166P5849J773745K998856
59180h18249K902130K385291J322536j367711m138068l406275O40259K863624
59172C83537L01411l128549k274802J817605L889339J953614j042355k155104
$$ y = [-81210, 2405932, 631276, -3747119, -5256469, -2832793, -1053976, -2805483, -4965631, -3754277, -993516, -1042778, -3268113, -2452545, 2971582, 7682104, 6468782, 1076722, -2697805, -2516652, -1203428, -2187425, -5855829, -9837392, -10856746, -6922008, 328776, 5934958, 6258373, 3099492, 1349253, 2796938, 4456232, 3397101, 1015191, 1012162, 4195211, 7016116, 5661416, 749871, -3073654, -2477127, 652451, 1771924, -615020, -3778567, -5150912, -5314533, -5666699, -5590850, -3817105, -818249, 2083881, 4469172, 5791708, 4423997, 285929, -3120346, -2480087, 383537, 684948, -2443601, -4718403, -2900798, 988541, 2942155, 1899800, -255304]
59164b55304j607536j030611j114545j473331j505302j161681j029673r45218
59156a0123201Q43843M829388P101579L098980m790952q294002m062042J718827
59148i677580K831690J583238K762255M342354J449587m038067o030052m259065
59140a1035640l337194l020039J213586P525430P764872Q27532l739473j75992
59132c976918M334713J500719m750962n258916n02980J143816k496009m565762
59124a4572299p08180M643001N781324L618853K868231M858496O187111L345234
59116A6021771k779384o998760n072401P88460L756113R27365l009399k983564
59108F50201p16199n75324j618171L30900M432290N250950J472863j934551j474139
$$ y = [-255304, -1862840, -2893451, -4007996, -5481327, -6986629, -8148310, -9177983, -10123201, -9279358, -4449970, 2651609, 5750589, 959637, -7334365, -11396407, -9677580, -6845890, -5262652, -2500397, 1841957, 3291544, -746523, -6776575, -11035640, -14372834, -17392873, -16179287, -8653857, -888985, -61453, -3800926, -3976918, 357795, 1858514, -2892448, -8151364, -8654344, -7510528, -10006537, -14572299, -15280479, -10637478, -4856154, -1237301, 1630930, 6489426, 12676537, 16021771, 13242387, 6243627, 1171226, 1959686, 5715799, 6643164, 3633765, 650201, -65998, -641322, -2259493, -1928593, 2503697, 7754647, 9227510, 7292959, 5818820]
59099E818820L80567K59658j287718k302604k656961k358121j70373L462472N093947
59090F239687K598623j394218k868874j589149o84601j997856l548414j781343
59082e026145L653308P642139M481020l647558o940859o87345O398566L444751
59074I317877o022554q473504p86124N280953J991924k990781r51485L107417
59066D73723N14577m569294j875438O213677O852540k565409r342708m467704
59058h766036M688027O444357Q54776l477351k691520j94238R88546J411849J493075
59049G51485K2996k862557m670010l513079k37341K837609L983271K771458L1329
59040h84839k360399k466485q1317K367867J838203j406219l085513l18045L264563
$$ y = [5818820, 6199387, 6459045, 5171327, 2868723, 211762, -2146359, -2316732, 1145740, 6239687, 8838310, 7444092, 4575218, 2986069, 2301468, 303612, -3244802, -5026145, -1372837, 6269302, 10750322, 7102764, 161905, -525440, 5873126, 9317877, 3295323, -5178181, -5964305, -683352, 1308572, -1682209, -2633694, 473723, 988300, -3580994, -5456432, 757245, 7609785, 5044376, -4298332, -8766036, -4078009, 2366348, 3221124, -256227, -2947747, -3141985, -2153439, -741590, 751485, 774481, -2088076, -6758086, -10271165, -10508506, -7670897, -3687626, -916168, -884839, -3245238, -5711723, -5793040, -3425173, -1586970, -2993189, -6078702, -6396747, -3132184]
59031c132184J677346m021691n797806l12653N256455L672177j339789j350747
59023e348892L282198M702393P55325k272024q64091O91925p75437j526168J504060
59014A49289M157819J807497k469286k727289K77236P81199k389689m053092q48649
59005e314965L589678L489504j510915n707888m037213J607684M214322M85699
58997c184094m350484l260165K897398O699115M445786k5252k223292k216057
58989a217045j463634J26764J557379J64963l416516m368272q05281K843655K843658
58980c734329J704303K838863M462809L411964P01988j505763m099722o966331
58972c186218n503880K180891Q694247N863522k811014o462290k219248K181774
$$ y = [-3132184, -1454838, -5476529, -11274335, -11586988, -6330533, -2658356, -3998145, -5348892, -2066694, 2635699, 3391024, 1119000, 254909, 946834, 171397, -1354771, 149289, 4307108, 6114605, 3645319, 918030, 1195266, 1976465, -413224, -4466316, -5314965, -1725287, 1764217, 253302, -5454586, -9491799, -7884115, -3669793, -3184094, -7534578, -10794743, -7897345, -1198230, 3247556, 3222304, 999012, -1217045, -2680679, -2553915, -996536, -831573, -4248089, -8616361, -9421642, -6577987, -3734329, -2030026, 808837, 5271646, 8683610, 9385598, 7879835, 3780113, -3186218, -8690098, -6509207, 2185040, 8048562, 5237548, -1224742, -3443990, -1262216]
58964a262216J070622k321211l280921k230996j060771Q49384L492401M107177
58956f36531J655551n25261K39065J641189L36293k515034l069264o60943J205893
58947b329042m06390l911444m607593q2492O112037P712953L326030j624189k232987
58938A956883l79136m72911k020400j347458J246433J881312M3151o55135J037992
58929A290731K294169J742960J271718J140307j062204m702728n005268n53426
58921c583741L222551J669606k376140l576617k029414j495839k360070j554414
58913a2084078J371980K776788L09692l288107l299272J170939N663839N034630
58905b343589m63669m948273l744769J057598L917494L111730J467799Q58082
$$ y = [-1262216, -191594, -2512805, -5793726, -8024722, -9085493, -8236109, -4743708, -636531, 1019020, 493759, 732824, 2374013, 2710306, 195272, -2873992, -3534935, -2329042, -2735432, -6646876, -11254469, -11336961, -5224924, 2488029, 5814059, 4189870, 1956883, 1577747, 1104836, -915564, -2263022, -1016589, 864723, 907874, 252739, 1290731, 3584900, 5327860, 6599578, 7739885, 6677681, 1974953, -3030315, -3583741, -361190, 1308416, -1067724, -4644341, -6673755, -8169594, -10529664, -12084078, -10712098, -7935310, -7625618, -10913725, -14212997, -13042058, -7378219, -2343589, -2807258, -7755531, -11500300, -10442702, -6525208, -3413478, -1945679, -1087597]
58897a087597L2830j943033l874588m546374l427186M42023O339954R249887M659817
58888E845733l709703o864164k445518K447342K242553o416K68343J643104J031804
58879D53078l08069n01420j593194m527751m640067R44444N860031K608237m977521
58870f682232o307673L54283O047909N120988J895961J185118Q04263k107500
58862C11117m267270j565285L263826M121234L25550l025693k281151J133855
58854a983817L652950K975478q97964n232164n680405p33741N009149M938457
58846B047943j472115p230788n948898N88222N102887L897118M34514l96326J251715
58837a725728J515261q95016k629758l51756M584333P404646N142146l41305m414041
$$ y = [-1087597, -1054767, -2997800, -6872388, -11418762, -14845948, -14403925, -8063971, 1185916, 5845733, 2136030, -4728134, -7173652, -4726310, -2483757, -2490173, -2221830, -578726, 453078, 145009, -356411, -1949605, -6477356, -11117423, -10172979, -4312948, -1704711, -6682232, -12989905, -12635622, -6587713, -1466725, 429236, 1614354, 2418617, 311117, -3956153, -5521438, -2257612, 1863622, 2189172, -836521, -3117672, -1983817, 1669133, 4644611, 3746647, -1485517, -7165922, -7899663, -2890514, 2047943, 575828, -6654960, -12603858, -12015636, -6912749, -3015631, -2581117, -2977443, -1725728, -210467, -1105483, -3735241, -4086997, 497336, 7901982, 13044128, 12702823, 8288782]
58828H288782m297764j441600Q01298J277611J512073K184583J552587j274101
58820H603469l889736l782759j932611m13999J359386M175155M974193N88220
58812I681318n563208o685616k616750L0238j167136q29927L855610O817511K656486
58803F178526l747712m310775o8380J418501j473856k695658R61336M989559M527503
58794E779044R78569j284295j055118n36173j512623l283762l811307k252696
58786f978361k28781K38399k03483M97433J430787m77383m133369l837064J864686
58777a1827136O249177L980273n53496o30068J813582N31804l226576k763744
58769f426184J695032K714251j643424m572502k236827N26402j46160n06663K616692
$$ y = [8288782, 3991018, 2549418, 3350716, 4628327, 6140400, 8324983, 9877570, 8603469, 4713733, 930974, -1001637, -1415636, -56250, 4118905, 9093098, 9681318, 4118110, -2567506, -5184256, -5154018, -6321154, -7151081, -3295471, 3522040, 6178526, 2430814, -1879961, -1948341, -529840, -2003696, -4699354, -3738018, 1251541, 5779044, 6757613, 5473318, 4418200, 3882027, 2369404, -914358, -4725665, -6978361, -7207142, -6968743, -7172226, -6674793, -5244006, -5721389, -9854758, -13691822, -11827136, -5577959, -1597686, -2151182, -2781250, -967668, -435864, -3662440, -6426184, -4731152, -2016901, -3660325, -8232827, -10469654, -9943252, -10089412, -10596075, -7979383]
58760g979383M722642J388081k978302j742591K756274K642445k861192o032350
58752a0084376k224737L672312M535011L54281k808950j222369K211854K524167
58744c042807l43610j618267R51971L226614J024471k707598k199567J508171
58736c200622K082834r82847q06627M875449Q285148L260730m642056o577979
58728B294030l466295k447773m087056k497017K969442N593494K259925j678236
58720a059486j521758j84172j644330l132409K37237O329567P843537K648916
58712I517102l203451l948889j255127l80191k222003l059523j256532J44759
58704e663855j056992j832883J538922O701650P432518K327995l093814l900213
$$ y = [-7979383, -3256741, -1868660, -4846962, -6589553, -3833279, -1190834, -4052026, -10084376, -12309113, -8636801, -4101790, -3747509, -6556459, -7778828, -5566974, -3042807, -3386417, -5004684, -4052713, -826099, 198372, -2509226, -4708793, -3200622, -1117788, -2100635, -2907262, 1968187, 10253335, 13514065, 8872009, 2294030, -1172265, -3620038, -7707094, -10204111, -7234669, -1641175, 618750, -1059486, -2581244, -2765416, -4409746, -7542155, -7304918, -975351, 6868186, 9517102, 6313651, 2364762, 1109635, 729444, -1492559, -4552082, -5808614, -5663855, -6720847, -8553730, -7014808, -313158, 7119360, 9447355, 6353541, 2453328]
58696B453328j297142J052283K348792L483491L673808J711259j363799l725192
58688H336828n089324n106069k046056L443679N873995J051943o615129q233762
58680h383895k009723M201502L231296k716299n925529k712551L414993O527418
58672d372788M200787o70628k994368p63803K898101L751014J571205n08195q60905
58663B250420p97341j279732j307882m08039n1266j214421k490007k015469N2782
58654g260955J985510K332061Q47042j256003j821687Q4613K584143L171516K149563
58645B815803J731694K133780J476043m21281j620235k023860l808599o485058
58637f201713n834072n14694M251348L561939K33216M14975L881180M419673l97013
$$ y = [2453328, 1156186, 2208469, 4557261, 8040752, 11714560, 13425819, 12062020, 8336828, 3247504, -1858565, -3904621, -460942, 5413053, 6464996, -150133, -8383895, -10393618, -6192116, -2960820, -5677119, -11602648, -14315199, -10900206, -4372788, -172001, -842629, -3836997, -4600800, -1702699, 2048315, 3619520, 3111325, 2250420, 1453079, 173347, -1134535, -1542574, -1593840, -2808261, -5298268, -7313737, -7260955, -5275445, -2943384, -2096342, -3352345, -5174032, -5089419, -2505276, 666240, 2815803, 4547497, 6681277, 8157320, 7736039, 6115804, 4091944, 283345, -6201713, -12035785, -12550479, -8299131, -4737192, -4503976, -4089001, -207821, 4211852, 3814839]
58628C814839n493382n743721k398808L30365J260557J601590J155323r10355
58620f383592k760623j330966K713183M832102K697247l05694P7219K493346J795752
58611C827974k765553n099959m47846O797621P720672P38212n947547n254494
58603d30920j18994J899015o04024k541147j084103J043319J386602J389063K278591
58594C217402K086624k33201j641154L11358K756928J702030j436931k197720
58586D565336l50979L79892q23160r04953P02118N38211k184698k859865J195447
58577B57349N322666L858557j453887m297046k835293q19129o96638p74983M80799
58568i57605J820512J981600J556120R15211o91741k754988k970950m88440K506295
$$ y = [3814839, -1678543, -7422264, -9821072, -9490707, -8230150, -6628560, -5473237, -6383592, -9144215, -10475181, -7761998, -2929896, -232649, -538343, -461124, 2032222, 3827974, 1062421, -4037538, -4485384, 2312237, 10032909, 10771121, 4823574, -430920, -549914, 1349101, 745077, -1796070, -2880173, -1836854, -450252, 938811, 3217402, 5304026, 5070825, 3429671, 3741029, 6497957, 8199987, 6763056, 4565336, 4214357, 4594249, 3771089, 2866136, 3568254, 4106465, 1921767, -938098, 257349, 5580015, 9438572, 7984685, 3687639, 852346, 33217, -663421, -1438404, -957605, 862907, 2844507, 4400627, 5315838, 4624097, 1869109, -1101841, -1590281, 916014]
58559I16014L609316K695747Q60904j070223k361255k785711l470170m887180
58551f492558m368432N83042O436137O331187K54387l314750O19922N690324L682652
58542I421911k940398n284127j664799J269321m8611k113654k486098l440187
58534g286642m979650k317606N245653R944464N924289j537798l808554j429706
58526b45550j248277m073993l959486P73537M427658L525445J848601K664606
58518C712541K659238j489031n671164l705566K693104N638961K063713k683855
58510C217941l036379j55727J505972R89792Q90977K318131L134704J415619j649891
58501H631139l324435k577587p43380L59547o7799j620872k730049j327988K679802
$$ y = [916014, 4525330, 7221077, 8081981, 7011758, 4650503, 1864792, -1605378, -6492558, -10860990, -10277948, -3841811, 2489376, 2743763, -570987, 48935, 5739259, 9421911, 6481513, 1197386, -467413, 801908, 753297, -1360357, -3846455, -7286642, -12266292, -14583898, -9338245, 606219, 6530508, 4992710, 1184156, -245550, -1493827, -5567820, -9527306, -8753769, -4326111, -800666, 1047935, 3712541, 6371779, 4882748, -788416, -4493982, -1800878, 3838083, 5901796, 3217941, 181562, 25835, 1531807, 2521599, 3412576, 5730707, 8865411, 10281030, 8631139, 5306704, 2729117, 1985737, 2345284, 2277485, 656613, -2073436, -3401424, -721622]
58492g21622N668443L578650k184171n107264j894775K572276K018449k121269
58484A808717l304074o2666K464457J294770n45221n84077q76730k327057j318143
58475c450024L346883N802116J487676m455424m298752K17225J033003k981411
58467c298708m720323q77202L234594K834359K82804l33289Q96925K236664L436081
58458C691905L560409P30293l342965l732111O1564K277869j68441k707683j036848
58449f66008J755307J019087j635192k019013n37132J17240N54729K097882K289119
58440B976019q58264l586168j769082J817407K324655J297743K618892L562577
58432H383779q39884p022160o858371j307211R86961j115407L77619O723728P897840
$$ y = [-721622, 4946821, 8525471, 6341300, 1234036, -660739, 1911537, 3929986, 1808717, -1495357, -1558023, 906434, 2201204, 1655983, 1071906, 195176, -2131881, -3450024, -103141, 5698975, 7186651, 2731227, -1567525, -1350300, -317297, -3298708, -8019031, -8896233, -5661639, -2827280, -2544476, -2877765, -1980840, 255824, 3691905, 7252314, 7982607, 4639642, 907531, 969095, 3246964, 3078523, 370840, -666008, 1089299, 2108386, 473194, -1545819, -2082951, -1965711, -1410982, 686900, 2976019, 2117755, -1468413, -3237495, -1420088, 904567, 2202310, 4821202, 8383779, 7543895, 521735, -6336636, -7643847, -6656886, -7772293, -7394674, -670946, 7226894]
58423G226894m17432p262860k602888O463264O462508k051313o613604k156590
58415i52021L294150K305699k402700m531733l052348r74067J54778J172945K909114
58406b076183M808823N146039K703002p56615j299532J760272L424411m72772
58398A3237445o153231o205591m64549L078999l03978n111322l629640K912117
58390b639750O296390L006494j510417j477434J085610N33000l037497l904015
58382a647619Q6085M004963L546664J254484J285834K107416k61919m448310n329482
58373E98116k279432L16357N22708P35028J757882J271996o92454r68966M91249
58364A752484q8747k772043k461793K056164M607993J346802k633363j580352
$$ y = [7226894, 6809462, -453398, -3056286, 3406978, 9869486, 7818173, 1204569, -952021, 2342129, 4647828, 2245128, -2286605, -5338953, -6313020, -6158242, -4985297, -2076183, 2732640, 7878679, 10581681, 9825066, 8525534, 10285806, 13710217, 13237445, 7084214, 878623, 414074, 3493073, 3189095, -1922227, -5551867, -2639750, 3656640, 6663134, 5152717, 3675283, 4760893, 5293893, 2256396, -1647619, -1561534, 2443429, 5990093, 7244577, 8530411, 10637827, 10375908, 5927598, 598116, -1681316, -1364959, -842251, -107223, 1650659, 2922655, 2230201, 1261235, 1752484, 1663737, -1108306, -3570099, -1513935, 3094058, 4440860, 1807497, 227145]
58356B27145J952225K278302m24759k374675k834168k428823N58166N686136O806896
58347I446445M56344o370349n058957J515840L657211j60107k833279j700501
58339a047353j494553l709742l336845J320795M652416L042327M08675O51165
58331D86885J501822J40623j123525N23300K906082K608800O03743L0572J063875
58322H742177J408018n8834k510662m372347m100340j663006N72921P99864P10697
58313d71512K066125K164626j822687n600065k368867N365975P312148O01416
58305G247159n484025l724848Q71768P74577k072710j368881K391661L940767
58297B575468K427551J020413K31842j350001k105854O344J949490l51268l992634
$$ y = [227145, 2179370, 4457672, 4032913, 1658238, -1175930, -3604753, -3046587, 2639549, 9446445, 9902789, 3532440, -1526517, -10677, 3646534, 3486427, 653148, -1047353, -2541906, -6251648, -9588493, -8267698, -3615282, -572955, -164280, 486885, 1988707, 2129330, 1005805, 1529105, 4435187, 7043987, 7647730, 7678302, 8742177, 10150195, 10091361, 7580699, 3208352, -891988, -2554994, -1982073, -1182209, -471512, 1594613, 3759239, 1936552, -3663513, -6032380, -666405, 6645743, 7247159, 1763134, -1961714, -1089946, -315369, -2388079, -3756960, -1365299, 2575468, 5003019, 6023432, 6255274, 4905273, 2799419, 2805763, 4755253, 4403985, 411351]
58288D11351k394731L814778O482629J543605n411988p213463l612354P15445
58280e664728K580962J938457o5911j971190k224582m13089K031841L027506J712541
58271I51807n44244j018751J293145L475765J827447k366526l513433L16839L929906
58262D351955K358633k004843l674233k433591k398143m461839m992965j927123
58254a5182149K126095L394119P94246l509498n312570j543305N336070Q286904
58246e610088M166442j431330j798297J501041K354978M85241Q30048L610528
58238D108563L168538k018991n758469l520914R41721K124018O53963L18276J320442
58229A337147J254353J67535J63305J273598J379654k73029k095148k460226j380320
$$ y = [411351, -1983380, 1831398, 8314027, 9857632, 4445644, -2767819, -6380173, -5664728, -3083766, -1145309, -1211220, -3182410, -5406992, -5820081, -3788240, -760734, 951807, 407563, -611188, 681957, 4157722, 5985169, 3618643, 105210, 422049, 4351955, 6710588, 4705745, 1031512, -1402079, -3800222, -8262061, -13255026, -15182149, -13056054, -9661935, -8867689, -12377187, -17689757, -19233062, -13896992, -5610088, -1443646, -2874976, -4673273, -3172232, -817254, -332013, 498035, 4108563, 7277101, 5258110, -500359, -4021273, -3079552, -955534, -301571, 16705, 1337147, 2591500, 2759035, 2922340, 4195938, 5575592, 5302563, 3207415, 747189, -633131]
58220f33131j76189j77798j055450n39313K592066N554731M217279j054813n222875
58211C504507m960144k119068J03380J007899R14439n58853k462540j982833J307717
58202e245496L409716J129968k891333l558663o0113L818592M877581L177591
58194D657843M91933j301757r34486R68073J919008N67625j345408j589522m88736
58185B944573N08562J473986K679146K305442j291976n883487p143655l977503
58177h384912N39808L239960L315311J210567j816536k989745j70330M472460
58169e83417N880297K371510k154423l643219k757813k196283j724164O72741
58161d134771L923933M240854R32752j855638j284997o05814m111501r055201
$$ y = [-633131, -809320, -987118, -2042568, -2581881, 10185, 5564916, 9782195, 8727382, 3504507, -1455637, -3574705, -3471325, -2463426, -1548987, -2107840, -4570380, -6553213, -5245496, -1835780, -705812, -3597145, -7155808, -7215921, -3397329, 1480252, 4657843, 5149776, 3848019, 2913533, 3881606, 5800614, 6368239, 5022831, 3433309, 2944573, 3453135, 4927121, 7606267, 9911709, 8619733, 2736246, -4407409, -8384912, -7845104, -4605144, -1289833, -79266, -1895802, -4885547, -5055877, -583417, 5296880, 7668390, 5513967, 1870748, -887065, -3083348, -4807512, -4134771, -210838, 4030016, 4962768, 3107130, 1822133, 1216319, -2895182, -11950383]
58153a1950383p820757R69506Q760079P853186J772156l40158K975100M545064
58145F763793N65113l858819l551450j028432j005996k364307j263234J341606
58137d401726J574204j19240j1528J642151R63802j784262j580661K491319M239409
58128C013468l18608o005220n652625m82988K222363J212j934021Q66475N495005
58119b794939N849794R38841l729155k906428K047555M887892K245314k278408
58111D260466l188757n09799R93415o26853j938579k70458J864879J258426o80152
58102A162588r05619j93652r96464j955599j05105K492455Q02790l892578l863991
58093g455175L030001Q043067L720795m136449m387753K708112N861261p0666
$$ y = [-11950383, -19771140, -18801634, -10041555, -2188369, -416213, -756371, 2218729, 6763793, 7328906, 3470087, -81363, -1109795, -2115791, -4480098, -5743332, -4401726, -2827522, -2946762, -2958290, -1316139, -352337, -2136599, -3717260, -1225941, 3013468, 2694860, -3310360, -8962985, -9445973, -7223610, -7222398, -9156419, -8289944, -2794939, 3054855, 3993696, 264541, -2641887, -594332, 4293560, 6538874, 4260466, 1071709, 561910, 1555325, 928472, -1010107, -1280565, 584314, 1842740, 1162588, 256969, 63317, -933147, -2888746, -2993851, -501396, 301394, -3591184, -7455175, -4425174, 3617893, 7338688, 3202239, -1185514, 1522598, 7383859, 7313193]
58085G313193o677002n257113O49841K292379n95367j304750J554696K163020
58077A38897j843339m925600k588992J646228K217461k45606j090541J215955
58069e475537M329947O003216N096194J014476m147802n520322j736060J484005
58061A048117q45799m472810k136653L731764L565324l579805o830748K3561Q111443
58052a385606O514007j437600m029260R29098M222191L87406m902830m794059
58044d496653q18102J502813J193055J219930K432105K639961Q11526j139973
58036C344662j093915M93741J261993R6028j028225N28656L711248M085460p1087
58027A1328561m606245n127381l213761k982361l649944j045673M323116O981740
$$ y = [7313193, 636191, -4620922, -3971081, -1678702, -2274069, -3578819, -2024123, 138897, -1704442, -6630042, -9219034, -7572806, -5355345, -5600951, -6691492, -5475537, -1145590, 4857626, 9953820, 10968296, 6820494, 1300172, -435888, 1048117, 202318, -4270492, -6407145, -2675381, 889943, -2689862, -9520610, -9497049, -1385606, 5128401, 3690801, -338459, 590639, 4812830, 5200236, 297406, -4496653, -5314755, -3811942, -2618887, -1398957, 1033148, 3673109, 4484635, 3344662, 2250747, 2744488, 4006481, 4102509, 3074284, 3602940, 7314188, 11399648, 11328561, 6722316, 1594935, -1618826, -4601187, -8251131, -9296804, -4973688, 2008052]
58019B008052M938438K260379J594623M25423k474229l308911l20140J324077
58011F447712k447656o547091l824095L129392N339824J113494k178641n26462
58003E06477J092613j422574l538007O9805N339640L996000l345201p061640k414602
57994f777489L569324K910626j283415l10865N387344N880414k284238q791235
57986a699534m366212M218563L721522m807903p139123J659374Q865140L705378
57978D157205o128316o846007J044835O135296M559127K572738K948643J418588
57970I862109k533329l029858J083300K786390j209003m332263j247419L201884
57962D581811K561762q65578j607028j023423l311494n787582k428566M736755
$$ y = [2008052, 6946490, 9206869, 10801492, 11226915, 8752686, 5443775, 5123635, 6447712, 4000056, -2547035, -6371130, -3241738, 2098086, 3211580, 1032939, 506477, 1599090, 176516, -3361491, -3291686, 2047954, 6043954, 2698753, -4362887, -6777489, -3208165, -297539, -1580954, -1891819, 3495525, 9375939, 7091701, -1699534, -6065746, -1847183, 1874339, -2933564, -10072687, -8413313, 451827, 4157205, -1971111, -8817118, -7772283, -1636987, 2922140, 5494878, 8443521, 9862109, 7328780, 4298922, 5382222, 8168612, 6959609, 2627346, 1379927, 4581811, 7143573, 6277995, 4670967, 3647544, 336050, -5451532, -7880098, -3143343]
57954c143343O772175Q43801n503159m886015J065342N671063N311650J156319
57946G287833l541396n428200k982527J440499L390720J553451o65405P6957K727353
57937C859285L757173J746545j566239l705530l525232j645221J5628k37838j887407
57928c188836k430648o13729J353161M24466k672643l577926j9972M505174M965904
57919a255049J602245o26034N47943J652779m39542l161570k406868Q49894K549821
57910f86381K194142K289010K322194n25121m428942l473861K737188O487506
57902F915735K657770l597113m695016j394201K02143j051964q67550K048691
57894B18495L713419J601094j643975k788586k424340k841722l937635l270645
$$ y = [-3143343, 3628832, 4472633, -1030526, -5916541, -4851199, 819864, 6131514, 7287833, 3746437, -1681763, -4664290, -3223791, 166929, 1720380, 1054975, 1131932, 3859285, 7616458, 9363003, 7796764, 4091234, 566002, -1079219, -1063591, -1301429, -3188836, -5619484, -6233213, -4880052, -4455586, -7128229, -10706155, -10726127, -6220953, -1255049, 347196, -278838, 269105, 1921884, 1482342, -1679228, -4086096, -3236202, -686381, 1507761, 3796771, 6118965, 5593844, 1164902, -2308959, 428229, 6915735, 9573505, 5976392, 1281376, -112825, 89318, -962646, -1830196, 218495, 3931914, 5533008, 3889033, 1100447, -1323893, -4165615, -8103250, -11373895]
57886a1373895M01409M629440N162239J366974j435341J593150O501632M370696
57878A1216304m860391r553462k414159P421725O648343k689429o609067l33648
57870a173784N795090L426502k100675k534030J08524r44369m685017m382254
57862f490013M41262K655025j319816n689275l288954M519135R258871N566890
57854E653125k440367n934600j641806M597264N411417Q16481l145433l037670
57846B78411j146347k73367j23132J2078o10623j476949l34091K296191K195872
57837H18043k043789n572652m078094m56930j24805k511142k578483P77778L407819
57828a2362255K758441R93083N23547P02887K76712k72158k22574K02592J123904
$$ y = [-11373895, -10972486, -6343046, -1180807, 186167, -1249174, 343976, 6845608, 11216304, 6355913, -3197549, -5611708, 1810017, 8458360, 5768931, -840136, -1173784, 4621306, 8047808, 5947133, 3413103, 3521627, 2577258, -2107759, -6490013, -6048751, -3393726, -4713542, -10402817, -13691771, -9172636, 86235, 5653125, 3212758, -2721842, -4363648, 233616, 5645033, 6461514, 3316081, 278411, -867936, -1141303, -1264435, -1252357, -1862980, -3339929, -3674020, -1377829, 818043, -1225746, -6798398, -10876492, -11333422, -11458227, -13969369, -16547852, -15770074, -12362255, -9603814, -8610731, -8087184, -7384297, -7107585, -7379743, -7602317, -7399725, -6275821]
57819f275821K845004L622061P37504m640347o731280j944009N539126P970425
57811A122663L137676l354370n036523j646566J746958J424760q62467r23098
57803d390967J778437K977067n09675n442113n398367P00600O404222N691476
57795A810680N70796k141675r6628K334294J106761k135994l429975k040015j8337
57786d040093J476027K322966J565618j120957l124680j811693Q73069Q61791
57778b997952j325829j374550R33017Q42496k318199k224695L810815Q039449
57770C384552L218604m966706n611673N34184K655398k271493m957854j4987M665510
57761c364465J211994m796945l269384M116119O706425J240269m286932l213954
$$ y = [-6275821, -3430817, 191244, 928748, -3711599, -10442879, -12386888, -6847762, 1122663, 4260339, 905969, -4130554, -5777120, -4030162, -2605402, -3467869, -4390967, -2612530, 364537, -145138, -5587251, -10985618, -10285018, -3880796, 1810680, 2381476, 239801, 143173, 2477467, 3584228, 1448234, -1981741, -4021756, -4040093, -2564066, -241100, 1324518, 203561, -2921119, -4732812, -3859743, -2997952, -4323781, -5698331, -4765314, -3922818, -6241017, -8465712, -4654897, 3384552, 6603156, 1636450, -3975223, -3441039, -785641, -3057134, -8014988, -8029975, -3364465, -2152471, -6949416, -10218800, -6102681, 603744, 1844013, -2442919, -5656873]
57753e656873J497143L405393R23144k788277l955273n85652N689710R246773
57745G776088N637470k145427o480932m800083j880362j483839j324627R47512
57737c754200K381735L6561k698854r93777K969812K930641j258041l239200n36309
57728d161632J541159j005950m023768k077862K403343K889278p49915k051584
57720g236931J813884N737373M527173K50581j469188O25596K710812J569171
57712H528471j941651m596439m087976j004735J456221O20192k275678l467611
57704f769206j920038m94276p28821q0616L009069N018131K594192r49406J62197
57695a58774M933403O483255K126749l196280m686753l512965k766794k302733
$$ y = [-5656873, -4159730, -754337, 168807, -2619470, -6574743, -7160395, -1470685, 7776088, 13413558, 11268131, 4787199, -12884, -1893246, -3377085, -4701712, -3754200, -1372465, -1335904, -4034758, -5028535, -2058723, 871918, -386123, -3625323, -4161632, -2620473, -3626423, -7650191, -9728053, -7324710, -4435432, -5185347, -7236931, -5423047, 314326, 4841499, 5092080, 3622892, 4248488, 6959300, 8528471, 6586820, 1990381, -2097595, -3102330, -1646109, -1025917, -3301595, -6769206, -8689244, -9183520, -9912341, -9992957, -6983888, -1965757, 628435, -320971, -158774, 4774629, 11257884, 13384633, 10188353, 5501600, 1988635, -778159, -3080892]
57687c080892o27626J461042K157674J384062J51348q22522o09768J293918K858232
57678D165468J236548k283990k963875L1301J450777j980018n780752m191209
57670a0315750J183407M135683K736343L22941p86524j426659k036261j641487
57662g828307m60649K69465R35024K480896L276539J165907j667148p12780L332724
57653G91671M211074n86113m921565k226237M732355P158964K025810m404672
57645F781287n573706k681918j056075j757525j397536P99019J375406m16808
57637c927856K15481N316148Q091594K057379o948486p078704J692505O531697
57629E949758J175044m604599j252836N099275L492721l325151m028253J931960
$$ y = [-3080892, -3708518, -2247476, -89802, 1294260, 1445608, 623086, 13318, 1307236, 4165468, 5402016, 3118026, 154151, 185452, 1636229, -343789, -6124541, -10315750, -9132343, -4996660, -2260317, -1937376, -2723900, -4150559, -6186820, -7828307, -8288956, -8019491, -7084467, -4603571, -1327032, -161125, -1828273, -2541053, 791671, 5002745, 4416632, -504933, -2731170, 2001185, 9160149, 11185959, 6781287, 1207581, -1474337, -2530412, -4287937, -5685473, -4886454, -3511048, -3927856, -3712375, 1603773, 9695367, 11752746, 4804260, -2274444, -581939, 5949758, 7124802, 2520203, 1267367, 6366642, 9859363, 6534212, 2505959, 4437919]
57621D437919M144501l42872k636480J330794L229874k761947r254162p943143
57613i795516k891455j807288j950404L720937J1578184J1313572L113548j778331
57605A1503247J158886L292824j857590p627868n462865J067016K505351j266649
57597C312352j937912K799708N524230J504234l478291k101067L579774N901921
57589A5104949K893172l24994k63485P22910j71221j564858r56079J129548K782621
57580A9352563L903760M951338M717166K629269J590836M642147R565945J1067434
57572F2420458Q708477Q496586J5060339K5772055L4481544L7416426L2694736
57565B25050621J8197575m546487k6158908l5531051l1421595k3264063j8964520
$$ y = [4437919, 8582420, 8239548, 5603068, 6933862, 10163736, 7401789, -1852373, -9795516, -12686971, -14494259, -16444663, -12723726, -1145542, 10168030, 13281578, 11503247, 12662133, 15954957, 14097367, 6469499, 1006634, 2073650, 4579001, 3312352, 1374440, 4174148, 9698378, 11202612, 7724321, 5623254, 9203028, 15104949, 17998121, 17673127, 17409642, 18132552, 17961331, 16396473, 15440394, 16569942, 19352563, 23256323, 28207661, 32924827, 35554096, 37144932, 41787079, 51353024, 62420458, 71128935, 79625521, 94685860, 120457915, 154939459, 192355885, 225050621, 243248196, 238701709, 212542801, 177011750, 145590155, 122326092, 103361572]
57558A03361572j6882073j2597146q036687p929374j0442223q869354k546173
57551C6058542J064900k608790q183229q018555k421482K314914K814568Q99249
57543B1920117q35664j256314J176J560380L18430l829446n746924k185375J789015
57534A1735395j31208m542861k895385L914261N573652j246793o973862m177538
57526A255661J301372J328986j118370Q93944M295938R11317o936483q130455
57518f198090m36495N168733J303893m703040k646247N058516P800768K791613
57510H139651k003759q60653J530001j560910p549232p722314m04608N820554
57502d611270M277540m85164p22291K035731O78226l780548k641214N086685Q644033
$$ y = [103361572, 86479499, 73882353, 65845666, 57916292, 47474069, 38604715, 36058542, 37123442, 34514652, 26331423, 18312868, 15891386, 18206300, 21020868, 21920117, 21084453, 19828139, 19829315, 21389695, 21708125, 17878679, 12131755, 9946380, 11735395, 11604187, 7061326, 4165941, 8080202, 13653854, 12407061, 5433199, 1255661, 2557033, 3886019, 2767649, 3661593, 7957531, 8868848, 1932365, -6198090, -6634585, -1465852, -161959, -4864999, -7511246, -2452730, 5348038, 8139651, 6135892, 5275239, 6805240, 5244330, -2304902, -10027216, -10431824, -4611270, -333730, -818894, -1541185, 494546, 1172772, -2607776, -5248990, -162305, 8481728]
57493H481728J781807o696077o136930L31637K701307K98255K41247L492772L765046
57484H260792p58626m780653n135406l872469j993965J381323L531360O13495
57476b754149l898551k352935M452973P174837K324498k780229k348240M1997
57468a39799j27195j000586k64519j73740j563931o21110L086108L234468k552710
57459a23014o409596j811658N548608O436515J577717j897175k188044k047703
57451i14350p23120L625417O446667J780767o426106p578560M15016P667705N762212
57442A0055648k224171p504500o115080j180105J903980P46608j900218j460036
57434g677874J889693K680882j271919l935100L15257O854936O517705r26513
$$ y = [8481728, 10263535, 3567458, -2569472, -2237835, 463472, 761727, 1002974, 4495746, 8260792, 7502166, 2721513, -2413893, -6286362, -8280327, -6899004, -3367644, -2754149, -6652700, -9005635, -4552662, 2622175, 4946673, 2166444, -181796, -139799, -266994, -1267580, -1532099, -1705839, -3269770, -3890880, -804772, 2429696, -123014, -6532610, -8344268, -2795660, 3640855, 5218572, 3321397, 1133353, -914350, -1637470, 1987947, 8434614, 10215381, 3789275, -3789285, -3374269, 4293436, 10055648, 7831477, 326977, -5788103, -6968208, -5064228, -4317620, -6217838, -7677874, -5788181, -3107299, -4379218, -8314318, -7999061, -1144125, 5373580, 4447067]
57426D447067o539783n085005q25376N53234p10392j289395R9099K628055M849915
57417a872581M933197K377930k85111n73995m4340j370293k834869r35443K505812
57408A900307K166235j749844l101742K82656L129989J663069n00091P77449K936091
57399G504119J244770l380604n993587m598978j340389J502181L105235L063585
57391A106332J866359J410312K592298L426574J608583k205491n482404o788980
57383b466417n882114k499063K467362N642111L806711j891510o191689m883698
57375a1898307R25636O002673O243675K570228p33456j353909j116251k045021
57367a404732k517825k5531L642652L774564m97656m337831l381598R09548L618938
$$ y = [4447067, -2092716, -7177721, -8003097, -7449863, -8160255, -9449650, -9350551, -6722496, -1872581, 3060616, 5438546, 5153435, 4579440, 4535100, 3164807, 329938, -605505, 1900307, 4066542, 2316698, -785044, -502388, 2627601, 4290670, 3790579, 4568028, 7504119, 8748889, 5368285, -625302, -5224280, -6564669, -5062488, -1957253, 1106332, 2972691, 4383003, 6975301, 10401875, 12010458, 9804967, 4322563, -2466417, -8348531, -10847594, -8380232, -2738121, 1068590, -822920, -7014609, -11898307, -10972671, -4969998, 1273677, 3843905, 3110449, 1756540, 640289, -1404732, -3922557, -3948088, -305436, 3469128, 2971472, -1366359, -4747957, -3838409, -219471]
57358b19471K165980j694039m275786l292556K20167K797860K238000J30402n93415
57349b522858K49693P08151N35751J167875K056596Q89989j744129j935976J414115
57340H19207L735768J051458l669649m175045L80213M198451K486123k730899
57332B095627n749485m187198p76664J264863K144324L371142L695496N60224
57324B418329m429964n585435p53372M673066M711763Q65483j091882j59827m09237
57315B38924l017195m077871j490360J393644J367957K50431J210736L551323
57307e72411M385084L313863K352956K324516J795739o39729m312658o655827
57299A991533n459219j651953R55193K88254p72121J570419N738032O219551J326970
$$ y = [-219471, 1946509, 252470, -4023316, -7315872, -7095705, -4297845, -2059845, -1929443, -2522858, -2273165, -1565014, -1029263, 138612, 2195208, 3085197, 1341068, -594908, 819207, 4554975, 5606433, 1936784, -2238261, -1858048, 2340403, 4826526, 2095627, -3653858, -7841056, -8617720, -7352857, -5208533, -1837391, 1858105, 2418329, -2011635, -7597070, -8350442, -3677376, 1034387, 1899870, 807988, 648161, 238924, -2778271, -6856142, -8346502, -6952858, -5584901, -5334470, -4123734, -572411, 3812673, 7126536, 9479492, 11804008, 13599747, 12960018, 8647360, 1991533, -3467686, -5119639, -4164446, -3876192, -4648313, -3077894, 2660138, 8879689, 10206659]
57290A0206659m311119n831253l295382J99827K249685J743123j152812m096148
57282d287420m133729j309084J419387K252334K089805K057090K402571L537698
57274D028652M836512L230296k621718p640867n507350J612216N043408J944705
57266D925854j647571j701535j804108m399981m850924M709M560273K781303j786638
57257c918618j870859K010033L575779J220267j083488j276949p37230K25374
57249a855691K169878L138434J176322j232275p20149Q25261n21965l278221k668330
57240b966736J175422L521203K606256Q00125p51413k477005k596094M62102L119499
57231B893359J211705j862006K73952N162246M000786l328788o332074k45960
$$ y = [10206659, 5895540, 64287, -3231095, -3031268, -781583, 961540, -191272, -4287420, -8421149, -9730233, -8310846, -6058512, -3968707, -1911617, 490954, 4028652, 8865164, 12095460, 9473742, 1832875, -3674475, -2062259, 2981149, 4925854, 3278283, 1576748, -227360, -4627341, -9478265, -9473556, -4913283, -2131980, -3918618, -5789477, -3779444, -203665, 1016602, -66886, -1343835, -2081065, -1855691, 314187, 3452621, 4628943, 3396668, 2676519, 3501780, 2979815, -298406, -2966736, -1791314, 1729889, 4336145, 5136270, 4384857, 1907852, -688242, -226140, 2893359, 4105064, 2243058, 2517010, 7679256, 11680042, 8351254, 2019180, 1773220]
57223A773220N847756K857460m919503p352434l023281J431506K252584J452183
57215C19491J111080J037054J023626Q68085p04652l594300m578820j499031K699755
57206c317712L644566J516439j60560j73026l92324j712688k540694j407170J009193
57197c533976K612806J901109j92256p03531J392416K457390j162752o301814
57189c530608n854906P11716N606095L754676m54657j159414K10555n20358k023435
57180c260336m22763K841442K985902o6630j867667p00682Q56937R32080L1864
57171A330147j419781k658900j037627M191938Q060911N375746j185019m389200
57163H268215k869739j629191k601282k231880N48894J638250l93501q75882K731636
$$ y = [1773220, 7620976, 10478436, 5558933, -1793501, -4816782, -3385276, -1132692, 319491, 1430571, 2467625, 3491251, 4359336, 3654684, 60384, -4518436, -6017467, -3317712, 326854, 1843293, 1682733, 1509707, 1117383, -595305, -3135999, -4543169, -3533976, -921170, 979939, 787683, 84152, 1476568, 3933958, 2771206, -3530608, -9385514, -8673798, -3067703, 686973, 232316, -927098, -716543, -1236901, -3260336, -3683099, -841657, 2144245, 2077615, 209948, -490734, 366203, 1298283, 1330147, -89634, -2748534, -3786161, 405777, 8466688, 13842434, 12657415, 8268215, 5398476, 3769285, 1168003, -1063877, -514983, 1123267, 729766, -146116, 2585520]
57154B585520N375590K035364l968946n601624j873806J902455J581075k141691
57146a06063n960132o637707l005375K112947L893082J688414M62211L282445
57138d270178N840269K795695l230172m726304l42692L047080K94665m990253
57130e581890n759219o57538M900840N372069Q37737l479046k684068K540987
57122d510128O440694M746780j16904k231989r899K002986j61969m226059m911729
57113b978217j188003K652382L059663J548668J476803K459885Q53339m229765
57105C654755q295379o695683q20465L369264K495519q14483j772279J252833
57097g625918N607138O931807K770611m584270q856955n739498J559452N340991
$$ y = [2585520, 7961110, 9996474, 6027528, 425904, -1447902, 454553, 2035628, -106063, -6066195, -12703902, -15709277, -13596330, -9703248, -8014834, -7552623, -4270178, 1570091, 4365786, 1135614, -3590690, -3933382, -886302, -591637, -5581890, -11341109, -11998647, -7097807, -1725738, -888001, -4367047, -7051115, -4510128, 1930566, 6677346, 6560442, 4328453, 4318554, 6321540, 6159571, 1933512, -2978217, -4166220, -1513838, 1545825, 3094493, 4571296, 7031181, 7884520, 3654755, -4640624, -11336307, -12156772, -8787508, -6291989, -7106472, -8878751, -7625918, -2018780, 4913027, 7683638, 3099368, -5757587, -11497085, -9937633, -4596642]
57089d596642K669634j517275j953286n6298l29617k678004k887322J71196K507277
57080h670337J206482j001898K82640M582572O748472L598991j842645m050485
57072H53792j864884N10753l05723k313914j828076M59937Q10022j044782j219950
57063e942825J708111L794059J528732k999983n356512m365002j884005N48253
57055a2969172K209760K405594J543243J174591J375689N71052p91397q1007K270145
57046b291502K036479j630305l666300j448490M11548j141512q18678N223074
57038c325686R216258K259871r166697r923201J495784J0338318P010603j276072
57030F629178m186149k093320k90567Q04200K413532K020507j595179m017942
$$ y = [-4596642, -1927008, -3444283, -5397569, -5453867, -5783484, -8461488, -11348810, -11177614, -8670337, -7463855, -8465753, -8183113, -3600541, 3147931, 6746922, 4904277, 853792, -1011092, -500339, -806062, -3119976, -4948052, -4488115, -3678093, -4722875, -5942825, -4234714, -440655, 1088077, -1911906, -7268418, -11633420, -13517425, -12969172, -10759412, -8353818, -6810575, -5635984, -4260295, -3689243, -4480640, -4561647, -2291502, -255023, -1885328, -5551628, -7000118, -6588570, -7730082, -8548760, -3325686, 5890572, 8150443, -1016254, -10939455, -9443671, 894647, 7905250, 6629178, 2443029, 349709, 59142, 863342, 3276874, 5297381, 3702202, -315740]
57022c15740k184027O5260q48600j784369L01059J693960q39260k579863J282486
57013e209094O135415N146336P66210n30399k00618l446146o803123k343250P044517
57004E59848R314049J437644n895133m642286L98475K014086J172005J238705
56996E597393N5937m701667q119237l977789M773540Q453083L090563m499320
56988F72503m985758K622153R632502P292330k628703r108382n159868L571605
56980A908382P096427M123129P21822q87327l672852o890784n419214M11406L278627
56971F69616J63507k984686j490784J099579P41444j83487R16340R46340k206385
56962b328516l669253N55629N334398L764094j783165l978502k119772j022072
$$ y = [-315740, -2499767, -2434507, -3283107, -5067476, -4766417, -3072457, -3911717, -6491580, -5209094, 926321, 6072657, 6838867, 6308468, 6107850, 2661704, -4141419, -6484669, 559848, 9873897, 11311541, 5416408, 774122, 1172597, 3186683, 4358688, 5597393, 5653330, 951663, -7167574, -11145363, -6371823, 2081260, 5171823, 672503, -4313255, -1691102, 7941400, 15233730, 12605027, 3496645, -1663223, 1908382, 9004809, 13127938, 13849760, 12962433, 9289581, 2398797, -3020417, -2609011, 669616, 833123, -2151563, -3642347, -2542768, -1801324, -1984811, -1068471, -122131, -2328516, -5997769, -5442140, -107742, 3656352, 1873187, -2105315, -4225087, -5247159]
56954e247159j165145J193206N290625N759492J524952k431366k854113j471194
56946E99298k4111J819035K921296J009354k450594l279684j432492j101143k803536
56937d742577j662730L920591P872724M753872k036218m945085k220419J319751
56929B259909J787553J74599j007617j489016k393363l451737k792777K81001
56921f631448L201917K266728k547774o356638m659993Q87362M053874J425031
56913h360941l554806m594176L12615O468075P372590K099405l244124k883576
56905f384938J050418J689165k204297m176287k46757M447794L511684q05471
56897c118689j631071J574314L068410P18263j268115j57598J238898K53559j331838
$$ y = [-5247159, -6412304, -5219098, 71527, 5831019, 7355971, 4924605, 2070492, 599298, 575187, 2394222, 5315518, 6324872, 3874278, 594594, -837898, -1939041, -4742577, -6405307, -2484716, 5388008, 10141880, 8105662, 3160577, 940158, 2259909, 4047462, 4222061, 3214444, 1725428, -667935, -4119672, -6912449, -6631448, -3429531, -1162803, -3710577, -10067215, -14727208, -13839846, -9785972, -8360941, -11915747, -16509923, -16197308, -9729233, -2356643, -257238, -3501362, -6384938, -5334520, -3645355, -5849652, -10025939, -10272696, -5824902, -2313218, -3118689, -4749760, -3175446, -107036, 611227, -656888, -814486, 424412, 677971, -653867]
56888f53867j239005m52392k58922N40508K418196K606162n81607l557351j698789
56879b877067L569212N988112K733652k053835l088265n20407J429256P85991
56871E966649k67639R9918J97847j781071l689367k315619R00827J383225j392422
56862h97652k972869j261867K39018j188294k740239j103085K151892M058533
56854c714563M997287N598823L179072l277942q290964o324200k71644K895791
56846e208340K424994K715763M025757K213002k747518n736833m612382k515807
56838i441364j354636M52726K888380L458195K473132L037632M778500L733385
56830A0025950n65038m057326m930055n019597m073354R6359M973460M795264
$$ y = [-653867, -1892872, -2345264, -2604186, -2063678, 354518, 2960680, 2379073, -1178278, -2877067, 692145, 6680257, 9413909, 7360074, 4271809, 3751402, 5180658, 5966649, 5699010, 5798928, 5996775, 4215704, 526337, -1789282, -888455, 494770, -897652, -3870521, -5132388, -4893370, -6081664, -8821903, -9924988, -7773096, -3714563, 1282724, 6881547, 10060619, 6782677, -1508287, -7832487, -8104131, -5208340, -2783346, -67583, 3958174, 6171176, 3423658, -2313175, -6925557, -9441364, -10796000, -10343274, -7454894, -3996699, -1523567, 1514065, 6292565, 10025950, 9460912, 5403586, 473531, -4546066, -8619420, -8523061, -3549601, 1245663]
56822A245663P0547k385000m18939J046812J30992P03909K628880L58648m877517
56813a496005l555128N497739R408384Q21662q742873o205510K962218N195069
56805C885556O57010o03179J841092k71587o152117n711350K233084O515944J425938
56796C820391m997523m685422m65260J548445J045408J1748j877732l658469j861864
56787a1120278K912954M808778J889362k86424J649580K735068j382429n825997
56779d619386l699163K611735M764325Q92812k212433O19101O000270P112366
56771A1469627K479887k963957m704128l910444m225073n078424k432891L298303
56763f067100N592859J283252l714961l280359n41388j417480l407029k22859
$$ y = [1245663, 1316210, -1068790, -1487729, -440917, -309925, 393984, 3022864, 3381512, -1496005, -5051133, 446606, 9854990, 10676652, 1933779, -4271731, -1309513, 3885556, 4542566, 3939387, 5780479, 5508892, -643225, -6354575, -4121491, 2394453, 3820391, -1177132, -5862554, -6327814, -4779369, -3733961, -3722213, -5599945, -9258414, -11120278, -8207324, -3398546, -1509184, -1795608, -146028, 2589040, 1206611, -4619386, -8318549, -5706814, -942489, -49677, -2262110, -1643009, 4357261, 11469627, 13949514, 10985557, 6281429, 2370985, -1854088, -6932512, -9365403, -6067100, -474241, 809011, -2905950, -6186309, -6727697, -8145177, -11552206, -11775065]
56755a1775065N398672M631542k216601m914956M92340N749262M101545l80850
56747A085889j888711j702640k196487p47824L676729N417052P33985m833842
56739d55849m667810q77000Q28955M53752Q68262R24598j168983k205347Q58485
56730e440937M239233L120861N5973J14706J658061L0714l024790k247402J347070
56721a46511K051305p88175k521140j365681M25511J944379L188974J563182l760222
56712E91622o832571k664553L105388K021193k600553o40529O671647P054868
56704F706512k808452j0906488p813265Q52727N445851N234761L869689J253151
56696A834486k752141m053020p74441K371374K044163J802835L878802L184262
$$ y = [-11775065, -6376393, -1744851, -3961452, -8876408, -8384068, -2634806, 1466739, 1085889, -802822, -2505462, -4701949, -5449773, -1773044, 3644008, 4377993, -455849, -5123659, -6000659, -5171704, -4717952, -3849690, -2925092, -4094075, -6299422, -5440937, -1201704, 1919157, 1975130, 2089836, 3747897, 3778611, 753821, -1493581, -146511, 1904794, 1116619, -1404521, -2770202, -2344691, -400312, 2788662, 4351844, 591622, -6240949, -8905502, -5800114, -3778921, -6379474, -7020003, -348356, 6706512, 3898060, -7008428, -14821693, -13968966, -8523115, -3288354, 581335, 1834486, -917655, -4970675, -5745116, -3373742, -1329579, 473256, 4352058, 7536320]
56688G536320l145069p699444l293324M453057M829720j858598n707050k148813
56680g033201L711583O285482M804096L46031n070074p156120l650029J135582
56672f626650J975086P10917J995039M096238K331062p81884J188469N978925
56664A0867202M282447m592254r660042m583136K865947L172696j538369l400205
56656b585714j592254j418047m376184o355560m219799J037520O602644R505253
56648c402141P569018K162541j691231j177158K12808k168398o663728o989991
56640a2148280p97011O883607R141378M169233l339515o649621l277704K529594
56632c488319M521683J695642j207997p12625J036286M52894j962613k869998
$$ y = [7536320, 4391251, -3308193, -6601517, -2148460, 2681260, 822662, -4884388, -7033201, -3321618, 2963864, 7767960, 8113991, 3043917, -4112203, -7762232, -6626650, -4651564, -3940647, -1945608, 2150630, 4481692, 3699808, 4888277, 10867202, 15149649, 10557395, 897353, -3685783, -819836, 2352860, 814491, -2585714, -4177968, -5596015, -9972199, -16327759, -20547558, -19510038, -12907394, -3402141, 4166877, 6329418, 4638187, 3461029, 3673837, 1505439, -5158289, -12148280, -12945291, -6061684, 3079694, 7248927, 3909412, -2740209, -6017913, -3488319, 1033364, 2729006, 1521009, 808384, 1844670, 2297564, 334951, -2535047]
56624b535047r79993J721637K574023N50830k882607m451434k324753R75393J470424
56615e881527k89763M5447L089267L890023P4068l328731j332461L059930L540253
56606B866506r7231k868824k700351j807512j303500k18225O00170p99166k706993
56597i035126j055358L815993O720503N004490J524844j006974l426861n633670
56589c092159m105170J977784O248154K324699o313711r201247k137970O974329
56581g325291P756405n7763o827070m971331K503257O676975L661927j803241
56573c86132l210139J75905L818693M002173J494439l43089K71907J683563J236279
56564H743599o22268m44399K633738L967032k72813n882643n487516m1405J797004
$$ y = [-2535047, -3515040, -1793403, 780620, 1331450, -1551157, -6002591, -8327344, -7351951, -5881527, -6171290, -6125843, -3036576, 853447, 927515, -2401216, -3733677, -673747, 2866506, 2769275, -99549, -2799900, -4607412, -5910912, -6129137, -5528967, -6328133, -9035126, -10090484, -6274491, 446012, 5450502, 6975346, 5968372, 2541511, -3092159, -7197329, -5219545, 1028609, 3353308, -2960403, -12161650, -14299620, -7325291, 431114, 373351, -6453719, -11425050, -8921793, -2244818, 1417109, -386132, -3596271, -3420366, 398327, 4400500, 5894939, 5551850, 5823757, 7507320, 8743599, 8121331, 7676932, 10310670, 14277702, 14004889, 8122246, 2634730, 2593325, 4390329]
56555D390329k757912n879767k015438K699616P40085m064416l088191K704828
56547g270866N053714K220354P0296N83944q2134j864346M6099M572706M147874
56538G477641j859344l855587K434206P280522J557449q346833r788778k348691
56530g449415L064219O49065m286123n114120j583915K983427N821058M989517
56522i26287O19281l164652j845186L214022N939544L538459n15122k254287k069452
56513B536320k127312k241693r21810J243351J896070L50854j189451n63524J298053
56504B80858J644468m4368j296419o80290j24104j249753k072522p04877J86014
56495d060993k519252n740372l950958J154719K190855j895101l525822R80484
$$ y = [4390329, 1632417, -4247350, -6262788, -3563172, -2823087, -6887503, -9975694, -7270866, -2217152, 3202, 73498, 657442, 575308, -1289038, -1242939, 3329767, 7477641, 5618297, 1762710, 4196916, 11477438, 13034887, 4688054, -5100724, -7449415, -4385196, -3736131, -8022254, -13136374, -14720289, -11736862, -5915804, -926287, -307006, -3471658, -5316844, -2102822, 3836722, 7375181, 6860059, 4605772, 2536320, 409008, -1832685, -2754495, -1511144, 384926, 735780, -453671, -1017195, 280858, 1925326, 1880958, 584539, -95751, -219855, -1469608, -3542130, -4247007, -4060993, -6580245, -12320617, -16271575, -15116856, -12926001, -14821102, -18346924, -17366440]
56487a7366440M913041K207415k497575j696857K943462M255680J283500o99027
56479f656801M68567J988411K329181K493803J828751j118984l955463k618002
56471e240537J791133L845676J705937q81274q45106O95051J720668J847307R96780
56462E635635p30587j575244K1066K108047J259838k126011l916080j791151J962311
56453H47824L143270n51206p112455j0299116n125974M694470R060477M330298
56445a012412j479887r10719J952300r7541m172567k576164K925903L752780n24980
56436b143287j993778R17600J002356l563179m935421M68616N112680L077664
56428b056749l99542J073585M144993K472122k483423n132461m884938m313491
$$ y = [-17366440, -12453399, -10245984, -12743559, -14440416, -11496954, -7241274, -5957774, -6656801, -6188234, -4199823, -1870642, 623161, 2451912, 1332928, -2622535, -5240537, -3449404, 396272, 2102209, 1220935, 375829, 1070880, 2791548, 4638855, 5635635, 4905048, 3329804, 3350870, 5458917, 6718755, 4592744, 676664, -1114487, 847824, 3991094, 3439888, -3672567, -13971683, -19097657, -14403187, -5342710, -1012412, -2492299, -3403018, -1450718, -1548259, -5720826, -8296990, -5371087, -1618307, -2143287, -4137065, -3219465, -2217109, -5780288, -10715709, -10247093, -5134413, -2056749, -2456291, -1382706, 2762287, 5234409, 2750986, -2381475, -7266413, -11579904]
56420a1579904k588602K147287O977330P138120K757246k018031m416082m007733
56412e590369j322654J146983K2618l744372m693514q98233K554429J561465p86475
56403a1750122j70239K101623K989348L298812M140398K890723j556208m284904
56395b340569j297792L302463L288493n22932l160262l364544k246277J428976
56387d912444P507428J0258082N637859j086605k927168k319303n608611j0152840
56379c603602p749646Q63214O107456M216474J225212J257715J089073j340531
56371B065365k537108q15162L10021n99002K1794L099424L975930P35803j878374
56362D378691q32628J53173j672307k608934p6329J375101j766629m036189P51750
$$ y = [-11579904, -14168506, -12021219, -5043889, 2094231, 4851477, 2833446, -1582636, -5590369, -6913023, -5766040, -5743422, -9487794, -14181308, -15079541, -12525112, -10963647, -11750122, -11920361, -9818738, -6829390, -3530578, 609820, 3500543, 1944335, -2340569, -3638361, -335898, 2952595, 2429663, -730599, -4095143, -6341420, -4912444, 2594984, 12853066, 18490925, 17404320, 14477152, 12157849, 6549238, -3603602, -11353248, -10490034, -4382578, -166104, 1059108, 2316823, 3405896, 2065365, -471743, -1286905, -976884, -1575886, -1554092, 1545332, 5521262, 6257065, 4378691, 3546063, 3699236, 2026929, -582005, -658334, 716767, -1049862, -5086051, -4334301]
56353d334301P864797P268601j199713p077535m038194K221026L106198j665106
56345B145773n521729m276756j41617K403222J781300k26375j521545j645456
56337g003183r67136L31563J653055J929921J439595J969952L501102K995957
56329E850826p44356l463343q90211L973148M271319o63792m437335l178265r2015
56320F25976J087455J417422K809092L741814K325083q8136j435457j994073k464323
56311F024853k192627j394296j640959k216099j49312L878917M523622j25714
56303F708385m358047k945595J141000K053710j06787j534651k145513m062247
56295e249745n191536j630994M448287O461031L231359M36661J030867Q57532
$$ y = [-4334301, 3530496, 10799097, 9599384, 2521849, -1516345, 704681, 3810879, 2145773, -3375956, -7652712, -7794329, -5391107, -3609807, -3836182, -5357727, -7003183, -7970319, -7638756, -5985701, -4055780, -2616185, -646233, 2854869, 5850826, 5106470, 1643127, 752916, 4726064, 8997383, 8333591, 3896256, 717991, 625976, 1713431, 3130853, 5939945, 9681759, 12006842, 11918706, 10483249, 8489176, 6024853, 3832226, 2437930, 796971, -1419128, -1568440, 2310477, 6834099, 6708385, 2350338, -595257, 545743, 2599453, 2492666, 958015, -1187498, -5249745, -10441281, -12072275, -7623988, -1162957, 2068402, 2505063, 3535930, 4393462]
56287D393462l309346p001926l973853M189675R046186N370505k776108o653090
56279g14495k304199N226725P363913J546689n984725p716471l180193K345877
56271c416879N333204O287742N368543Q21777o425910j0667509p344254P72451
56263i270835O404698N992607K476857K22652N2516K41786Q429k02086p42559
56254E184065k371926l806993k520772Q60253J852312j701175n196298k802358
56246a0502892M001670P950887N688725J013433k057887l908594n116154l422864
56238f353676J347828M237304J773917k248059k709464j241390k299426m258894
56230a1751860j909308L602465N440349K150308Q4458K644584M698826J620567
$$ y = [4393462, 1084116, -5917810, -9891663, -5701988, 3344198, 8714703, 5938595, -714495, -3018694, 2208031, 9571944, 11118633, 5133908, -2582563, -5762756, -3416879, 1916325, 8204067, 13572610, 14394387, 7968477, -2699032, -10043286, -9270835, -2866137, 3126470, 5603327, 5825979, 5878495, 6120281, 6128710, 5926624, 5184065, 2812139, -994854, -3515626, -2655373, -803061, -2504236, -7700534, -10502892, -6501222, 1449665, 7138390, 8151823, 6093936, 2185342, -2930812, -6353676, -5005848, -768544, 1005373, -1242686, -3952150, -5193540, -7492966, -11751860, -13661168, -10058703, -4618354, -2468046, -2383588, 260996, 4959822, 6580389]
56222F580389k701093k333016J120495J664602j392237l266302j873485j35794
56214b336441l6011J71486J464252J419250j378257l631347j355220M022445O829458
56205E169615M220442o15152l072216k745557k615082l915889m512110k641395
56197a0727344L24876K310914L582981N096439N466775K731208j614411l857746
56189C313692l433259l336958m402106l331988J386902N537015M700653Q19102
56181A253053j036232l53639o55238k365614k008028Q28273J631922j413793l303340
56172g422636J18934M708039M003804j47398j45805M631151N590487j822649r713934
56163b00007q239426K88977N085217K461392l36155K476960O740239N781566L90998
$$ y = [6580389, 3879296, 1546280, 2666775, 4331377, 2939140, -327162, -2200647, -2336441, -2372452, -2200966, -736714, 682536, -695721, -4327068, -5682288, -1659843, 5169615, 9390057, 8774905, 5702689, 2957132, 342050, -3573839, -8085949, -10727344, -10402468, -8091554, -4508573, 587866, 6054641, 8785849, 7171438, 3313692, -119567, -3456525, -7858631, -11190619, -9803717, -4266702, 433951, 1253053, 216821, -136818, -792056, -3157670, -5165698, -4337425, -2705503, -4119296, -7422636, -7303702, -2595663, 1408141, 1260743, 1114938, 5746089, 11336576, 9513927, -200007, -8439433, -8150456, -3065239, -603847, -940002, 1536958, 8277197, 14058763, 14449761]
56154A4449761l663882m175996l213064j919628j61293K33302k288795m102594
56146d842189N7738P898890J0224970L224617n615835p621268l987423j738439
56138b398939k567174k167360J052924L356404K365542O67852Q02651J087855
56130B199755q60999l561265l576957l78559L041464L694452J477765q42532k30511
56121I62613K923135M110920m0818o131978p021044j192108M782535M907362R99896
56112D300513j462978r79009L39588J638141L111649L036592L3663k993598k257985
56103D766576M20388o6299l598861m593501j019822K495718K484022J543900K440030
56094D872151K965007Q40991j233529n26554j10368l773001q091454o342775Q94202
$$ y = [14449761, 10785879, 6609883, 3396819, 1477191, 1315898, 1549200, -739595, -4842189, -4784451, 3114439, 13339409, 16564026, 10948191, 3326923, -660500, -2398939, -4966113, -7133473, -6080549, -2724145, -358603, 309249, 1111900, 2199755, 1338756, -2222509, -5799466, -6178025, -3136561, 557891, 2035656, 1193124, 962613, 3885748, 7996668, 7955850, 1823872, -5197172, -6389280, -1606745, 3300617, 4300513, 2837535, 1858526, 2198114, 3836255, 6947904, 9984496, 10018159, 7024561, 4766576, 5186964, 5120665, 1521804, -3071697, -4091519, -1595801, 888221, 2432121, 4872151, 7837158, 8678149, 7444620, 6918066, 6807698, 3034697, -5056757, -11399532, -10505330]
56085a0505330N668955L531453j344924l140979j364371J141873K815111L321862
56077A23650K087808l14833j436937l8891J676426J057639j057629j546062O13019
56068A164190L146673L488519J317116k045634n234823p030336o091844k187561
56060a3473700K312058L967570K256171M20401Q43352J458879o20731l712143
56052f548143l805434j125062O14909J208920L889725P305750N251829k307971
56044D484523o053407r92998M339362P57488o104771m287784M718759P734049
56036D595221P02316n585102l145245K293253L203243J921711K994069L167393
56028A0146859j674327o285492l004673M887329O788802M70935n001267k884737
$$ y = [-10505330, -4836375, -1304922, -2649846, -5790825, -7155196, -6013323, -3198212, 123650, 2211458, 1896625, 459688, 420797, 2097223, 3154862, 2097233, 551171, 1164190, 4310863, 7799382, 9116498, 7070864, 1836041, -5194295, -11286139, -13473700, -11161642, -7194072, -4937901, -4517500, -3674148, -2215269, -2836000, -6548143, -10353577, -11478639, -10863730, -9654810, -5765085, 1540665, 6792494, 4484523, -1568884, -2561882, 1777480, 2534968, -3569803, -7857587, -3138828, 4595221, 5297537, -287565, -3432810, -1139557, 2063686, 3985397, 6979466, 10146859, 8472532, 2187040, -817633, 4069696, 10858498, 11329433, 6328166, 3443429]
56020C443429K463165L096294j762427o014663m825794N07795M819943M470149
56012F197891N23427k939605l274630j375768L46676N83402l78032j076717K72783
56003a120573L377811M517549M07246o381246r104688m761933K649665P398376
55995c017793P333095L511640j608430m627288l549333n75524Q59897J491294
55987a82442L865637N430925J173319o262343p706367j349246L449280O35902
55979i45335l265145p65768M097850L309806j778889l999630k357851j075468
55971f780430l17362K756804O137094N097637O96948j819703j655549k032634
55963B082805k876285j542561P02508M33560j206212p58274N52449m46553j675194
$$ y = [3443429, 5906594, 9002888, 7240461, 1225798, -3599996, -3092201, 1727742, 6197891, 6721318, 3781713, 507083, -868685, -522009, 61393, -316639, -1393356, -1120573, 2257238, 6774787, 7182033, 800787, -8303901, -13065834, -10416169, -3017793, 4315302, 7826942, 6218512, 1591224, -1958109, -2533633, -1673736, -182442, 3683195, 9114120, 10287439, 4025096, -3681271, -5030517, -1581237, -945335, -4210480, -4976248, -878398, 2431408, 652519, -3347111, -5704962, -6780430, -7097792, -4340988, 1796106, 6893743, 7590691, 5770988, 4115439, 2082805, -793480, -2336041, -1633533, -1199973, -2406185, -3164459, -2612010, -3058563, -4733757]
55954d733757L31979K112801j545389o439342l965091L767069N690547p23501
55946e504684n676049k954523J861245K663721J672922K495108L595503L315149
55938A468392L272744K950704r95174o770187p564844k968124p20937l233574
55930a4561000k841552M200972R730745O726644M19058j692665j623141l681602
55922c322541m228880Q07840N380368J736201n773203o663471n01998L915222
55914h650462L270561K774592N067752O001790K748702j641052l479417k681612
55906C410854q71066M50861j54341k446269l708936k359183k54433J063758K808255
55897b060500M755333L573885p54656k554068N53004K537008r64843m156698o26997
$$ y = [-4733757, -4401778, -2288977, -3834366, -10273708, -14238799, -10471730, -4781183, -5504684, -11180733, -14135256, -12274011, -9610290, -7937368, -5442260, -1846757, 1468392, 4741136, 7691840, 6696666, -73521, -7638365, -10606489, -11327426, -14561000, -17402552, -13201580, -3470835, 3255809, 3674867, 1982202, 359061, -3322541, -7551421, -6743581, -1363213, 372988, -5400215, -12063686, -12565684, -8650462, -5379901, -2605309, 2462443, 8464233, 11212935, 9571883, 6092466, 3410854, 2539788, 2990649, 2836308, 390039, -3318897, -5678080, -5932513, -4868755, -2060500, 2694833, 6268718, 5514062, 2959994, 3512998, 6050006, 5085163, 928465, 301468]
55888C01468M884014L890254j690245l368396m73610K11662k959935m871255l455193
55879g531236j429379O22577L646936M390356K2810l709915K14318O811831N441610
55870H479908k068037l755248J834781K980238m239924q295841j836254N781835
55862a118542M438636r52289r82090K413073J968885j173625j147331J218799
55854D665516J277732L2381Q08379R07773l357920p097829k989724N286323O601761
55845F134392r39480o997940m115594K993202O029741L802003O30259q24481j205037
55836E507065j657154k254013k165451m77490K216150L475398J809687j031690
55828E422502k418468k374429k539196k732251j242062J888947M214558L651348
$$ y = [301468, 5185482, 9075736, 7385491, 4017095, 3543485, 3755147, 795212, -4076043, -7531236, -8960615, -8338038, -4691102, -300746, -277936, -3987851, -3773533, 3038298, 8479908, 6411871, 2656623, 4491404, 7471642, 3231718, -5064123, -6900377, -1118542, 3320094, 2367805, 1385715, 3798788, 5767673, 4594048, 3446717, 4665516, 5943248, 5975629, 6784008, 7691781, 4333861, -2763968, -5753692, -467369, 6134392, 5194912, -1803028, -5918622, -2925420, 3104321, 6906324, 7536583, 6712102, 5507065, 3849911, 1595898, -569553, -1047043, 1169107, 4644505, 6454192, 5422502, 3004034, 629605, -1909591, -4641842, -5883904, -3994957, 219601, 3870949]
55820C870949O29928k281646k371726O45385L746034L668635Q01024j919296l335411
55811C453876m241580l991644j368167J341700N31347j974753n69212M525289
55803b293144O404352K515570j291638j230334j494875m526555m466246K047702
55795d335168P072107L165416l261640j900959M011608L424062l193715m839944
55787A41767P24154L646490k11897k622557J382331M478625L78244n091825m306954
55778a481622m8965J153312L08874J736022L666416K077656p96710o34915K8180
55769F008248l968589r727914r006580r87872N962656O022586K356467M94326
55761b846672J265143K271023J820973m42573l524133m700236k054768K393093
$$ y = [3870949, 4500877, 2219231, -152495, 492890, 4238924, 7907559, 8708583, 6789287, 3453876, -787704, -4779348, -6147515, -4805815, -4274468, -6249221, -6818433, -2293144, 4111208, 6626778, 5335140, 4104806, 2609931, -1916624, -6382870, -4335168, 2736939, 5902355, 2640715, 739756, 4751364, 8175426, 4981711, 141767, 865921, 4512411, 4300514, 1677957, 3060288, 7538913, 7917157, 2825332, -1481622, -1530587, -377275, -68401, 1667621, 5334037, 7411693, 6614983, 5980068, 6008248, 2039659, -7688255, -16694835, -17682707, -11720051, -5697465, -3340998, -2846672, -1581529, 689494, 2510467, 2067894, -1456239, -6156475, -8211243, -5818150]
55753e818150M947487N052649M464811K768115j477901n550276m363564J320035
55745A343206M160054L33549m619311l752766J482655M064985J544993j732618
55737B824747j931039n36135o96496k164097k223346j33888J760791J464743J30216
55728a504504K83165K106180L216712K180631K63055j120617k535492m439988
55720a550858n048713k834363M22191K035497K476659L600871M233077K029606
55712E363967j095528r50201J381930M14469l826346m123840J986143O111320
55704E261914J320397n790442m323185L687947N950044j096149p089598m064669
55696f143741K149905K310071k268955l423561Q80874M757975L752184j00472
$$ y = [-5818150, -870663, 4181986, 8646797, 11414912, 9937011, 4386735, 23171, 1343206, 5503260, 5836809, 1217498, -2535268, -1052613, 3012372, 4557365, 2824747, 893708, 357573, -338923, -2503020, -4726366, -4860254, -3099463, -1634720, -1504504, -1221339, 884841, 4101553, 6282184, 6545239, 5424622, 2889130, -1550858, -6599571, -9433934, -9011743, -6976246, -4499587, -898716, 3334361, 5363967, 4268439, 3318238, 4700168, 5114637, 1288291, -2835549, -849406, 5261914, 6582311, 791869, -3531316, 156631, 6106675, 5010526, -2079072, -6143741, -3993836, -1683765, -3952720, -7376281, -6495407, -1737432, 2014752, 1914280]
55688A914280k335090j048634K151161L715798J525721j767824j143708L226709
55680F238413M647323n32139o272686n025203R78444L360467L44350j885737k07922
55671A645310J159471q38542k722379j036694J746370K047891J092249J534372
55663D628048K104238M27239j753194j185728R05278L73677l036639m910210k461516
55654d908807J967112M425622L593054O57690k696420m872690m409976j067963
55646g312378L189141N199364L380369l46550k240685r92242Q11032O32104k60900
55637B059255O01249K108381J186734j500573k068494L7869R80121p55871j850045
55628G98626m99971K50926j238838j311667K078572M062436N40773l626001j585770
$$ y = [1914280, -420810, -1469444, 681717, 4397515, 5923236, 4155412, 3011704, 6238413, 10885736, 10353597, 4080911, -944292, 34152, 3394619, 3738969, 1853232, 1645310, 2804781, 1966239, -756140, -1792834, -46464, 2001427, 3093676, 4628048, 6732286, 7159525, 5406331, 4220603, 5125881, 5499558, 2462919, -2447291, -4908807, -2941695, 1483927, 5076981, 5734671, 3038251, -1834439, -6244415, -7312378, -4123237, 1076127, 4456496, 4109946, 1869261, 877019, 1688051, 2320155, 2059255, 2660504, 4768885, 5955619, 4455046, 2386552, 2424421, 3404542, 2648671, 798626, 298655, 549581, -689257, -2000924, 77648, 4140084, 4680857, 1054856, -530914]
55619e30914M041480N277638J959749J041346L334425J722880n247433q686030
55611B913141l359815K877908J022629m867432m334893L092890P742830M414394
55603I501652j694199m192244l030114j030775P50504J613207L01202j756092
55595D63141p90575K935795L726991r17578m833397j696704M456353M156367l311268
55586D189125q218569m208505L271319N815595L327234J141312L99726j778768
55578C938469m646303l848085M46953K265517r91217l818408p37490N220327O785094
55569D614857K557482j960146k477638o93839l53805j689638j581009J648858
55561F5122N053614L959017j472734m747052j077593M750679L807098l732489
$$ y = [-530914, 3510566, 8788204, 10747953, 11789299, 15123724, 16846604, 11599171, 2913141, -446674, 2431234, 3453863, -1413569, -5748462, -2655572, 5087258, 9501652, 7807453, 3615209, 585095, -445680, 304824, 1918031, 2219233, 463141, -327434, 2608361, 6335352, 5417774, 584377, -1112327, 3344026, 7500393, 4189125, -4029444, -8237949, -4966630, 848965, 4176199, 5317511, 5717237, 3938469, -707834, -4555919, -4108966, -1843449, -2834666, -6653074, -7390564, -2170237, 4614857, 7172339, 5212193, 2734555, 2040716, 1686911, -2727, -1583736, 65122, 5118736, 9077753, 7605019, 2857967, 1780374, 6531053, 10338151, 6605662]
55553F605662p661583k575538L893412L169271q95392O63598O149643N816617
55545A5165690j240099m719341J14738M468233L35323o527634o061066J30552
55537A666396J956359k932750n867000q19305O774043Q158369K818232k369580
55529I384764k658319R3239J657196O31478j385481k518269j983562R8689K626487
55520E946222L789773L022553K179514K747186K554898j339796o369491n930167
55512F600692P22882N326200J763463m336799l583943L035591O063979K134992
55504A7727057k204717j846083M61687J290615J761230K102221r07941o290877
55496A2093192o483411J071438P067112L004320n180353n586729J663404N593617
$$ y = [6605662, -1055921, -3631459, 261953, 3431224, 2535832, 3199430, 9349073, 15165690, 13925591, 9206250, 9320988, 13789221, 14124544, 7596910, 1535844, 1666396, 3622755, 690005, -5176995, -5996300, 777743, 8936112, 11754344, 9384764, 6726445, 6819684, 8476880, 9108358, 7722877, 5204608, 3221046, 3319735, 5946222, 9735995, 12758548, 14938062, 17685248, 20240146, 18900350, 12530859, 6600692, 7323574, 12649774, 14413237, 10076438, 6492495, 9528086, 15592065, 17727057, 15522340, 13676257, 14137944, 15428559, 17189789, 19292010, 18384069, 12093192, 5609781, 6681219, 13748331, 16752651, 11572298, 5985569, 7648973, 13242590]
55488A3242590K022130j047826K491995P125985M752385l105453p572365l698382
55480A4211059M590345R429860O806063K71373k835343j4291L123261R54947l263068
55471C3274206j968927M554971P759768L670769j154469N9217M357141M680557
55463E5233233R59981o45638K485401O289180O532992L974197K123851K845310
55455G9798507N169110O670138N419794J782323j493899j879753K32362K117410
55447I7815992J881681M70413M36458K702957M712613K978217j767277l961377
55439A05269677k34221M639935K914311n369545j1637694r924630l859555j67850
55431H1630428l8042p97711j955438m219957n202470k126972K149593J679275
$$ y = [13242590, 15264720, 14216894, 16708889, 23834874, 28587259, 25481806, 17909441, 14211059, 18801404, 28231264, 35037327, 35308700, 32473357, 32459066, 35582327, 36537274, 33274206, 31305279, 35860250, 43620018, 47290787, 46136318, 46195535, 50552676, 55233233, 56193214, 55547576, 58032977, 64322157, 70855149, 74829346, 76953197, 79798507, 84967617, 91637755, 97057549, 98839872, 97345973, 95466220, 95698582, 97815992, 99697673, 100168086, 100604544, 103307501, 108020114, 110998331, 109231054, 105269677, 105035456, 109675391, 112589702, 107220157, 95582463, 85657833, 81798278, 81630428, 81592386, 80794675, 78839237, 74619280, 69416810, 67289838, 69439431, 71118706]
55423G1118706l691785p381793n330153j253740l37960j957660k098125o9948
55415D8997542J131583j42119k312883l570261m045009m499151m662292l659835
55407B7237575j316008J352567K724051J951790O0093r82127p38547r20055k694689
55398B6674650m424194l523459l4411L179737L655013J427462j829265m167859
55390B0957674l933978r62460K188621K091246j358959m229092l372260l41257
55382A1039535J350065J287071J699828K791317K037458j221476l753604k844055
55374A2386139l81037j08008k125015k718649M79758N133109O552692K644087
55366B1863076l683694o945128m485189M46209K126527r63933m616707m564521
$$ y = [71118706, 67426921, 60045128, 54714975, 53461235, 53123275, 51165615, 49067490, 48997542, 50129125, 49987006, 47674123, 44103862, 40058853, 35559702, 30897410, 27237575, 25921567, 27274134, 29998185, 31949975, 32010068, 31027941, 30289394, 29369339, 26674650, 22250456, 18726997, 18692586, 21872323, 25527336, 26954798, 25125533, 20957674, 17023696, 16061236, 18249857, 20341103, 18982144, 14753052, 11380792, 11039535, 12389600, 13676671, 15376499, 18167816, 20205274, 18983798, 15230194, 12386139, 12005102, 11897094, 9772079, 7053430, 7533188, 12666297, 19218989, 21863076, 18179382, 11234254, 6749065, 7195274, 9321801, 8357868, 3741161, -823360]
55358h23360j323111J938975L676286L727699J352089k951251n371515k710713
55350b484901K302480L794213P48135j993684j080398J509923L077201L965990
55342I838959M578017K962829j474312n260843n186032k644701o57661N56686
55334B712942J743615J493407q36393j888600R60666L840991J222695m763484
55326D485839o407823j869983K316361J663668k25210Q57504K603273J344328
55318D767957q96367m65138O98616j312809m049949j655657M518403O327685J415737
55309I348478k511876J55670L671154K79518o454924o427387R21251M938802r6634
55300C824052o108967l655550L667171N079342q23439m512373n64817M501914
$$ y = [-823360, -2146471, -207496, 3468790, 7196489, 8548578, 5597327, 225812, -2484901, -182421, 3611792, 4359927, 2366243, 1285845, 2795768, 5872969, 9838959, 14416976, 17379805, 15905493, 10644650, 5458618, 2813917, 2156256, 2712942, 4456557, 5949964, 5113571, 3224971, 4185637, 8026628, 9249323, 4485839, -1921984, -3791967, -1475606, 188062, -37148, 820356, 3423629, 4767957, 3871590, 3406452, 4105068, 2792259, -1257690, -2913347, 1605056, 7932741, 9348478, 6836602, 6992272, 10663426, 10942944, 4488020, -1939367, -1018116, 3920686, 3824052, -2284915, -5940465, -2273294, 2806048, 1982609, -2529764, -3094581, 1407333]
55292A407333K882151k898668m707522r28584K645489K346794P36558P84098J373234
55283C640883N67257o06549k07840J296656K104000J790293J036300l1391j531150
55274H058459k853655l322695k964760j813673K82969K442927L066593K323842
55266E220007K237355K987109J698080k887166p063984o666314k952194l00978
55258g728085L76760J448133K687360J050169k977268m299188p64744K968928
55250g237935K334151n19567r97244N59487P20835k78438O34300K776846J874292
55241a33273k563866n424256l322693Q39302L039289L715058M911797N236666
55233F298024J973990l403431o003275l646888Q30384L549969L366906J429302
$$ y = [1407333, 4289484, 1390816, -3316706, -4245290, -1599801, 746993, 1483551, 2267649, 3640883, 4208140, 3601591, 3393751, 4690407, 6794407, 8584700, 9621000, 9589609, 8058459, 5204804, 1882109, -1082651, -2896324, -2613355, -170428, 2896165, 5220007, 7457362, 10444471, 12142551, 9255385, 2191401, -4474913, -7427107, -7728085, -7351325, -5903192, -3215832, -2165663, -5142931, -9442119, -10206863, -7237935, -4903784, -5423351, -6420595, -5861108, -5140273, -5418711, -4784411, -2007565, -133273, -2697139, -8121395, -11444088, -10604786, -7565497, -3850439, 1061358, 6298024, 8272014, 4868583, -1134692, -4781580, -3951196, -401227, 2965679, 4394981]
55225D394981p05415j694227p74067J430451L051107K429062n86136m314247n949263
55216b717754l665828J051475M183225L452922Q80092j79655O89335J394200Q38550
55207E926562l38221j731287l230123l482976j215753J718897J619196j828181
55199b561886m283001k126639L057411O831616O830816L841269k12192l470264
55191G907130m586974l766389k614998j848433l29082K440849M435724L484160
55183E121987K78463k860376m958959n883538m165958J259593P176868P682573
55175C650653J448040n271738n550403k48664L505798J907649j102278n04227
55167b165170K111159J367318k906756m663628p55997L810137L045673j340267
$$ y = [4394981, 3689566, 1995339, 1221272, 2651723, 5702830, 8131892, 7545756, 3231509, -2717754, -6383582, -5332107, -1148882, 2304040, 3184132, 3004477, 3693812, 5088012, 5926562, 5588341, 3857054, 626931, -2856045, -4071798, -2352901, -733705, -2561886, -6844887, -8971526, -5914115, 917501, 7748317, 11589586, 11377394, 7907130, 3320156, -446233, -3061231, -4909664, -5238746, -2797897, 1637827, 5121987, 5400450, 2540074, -2418885, -8302423, -12468381, -11208788, -4031920, 3650653, 5098693, -173045, -5723448, -5972112, -2466314, -558665, -1660943, -2165170, -54011, 1313307, -1593449, -6257077, -7013074, -3202937, -157264, -1497531]
55159a497531l096026q43527J173784P37041J54284Q04321J009037O31629K015317
55150A088329M262657K573411l448240o735300k643990L361395L638112m39238
55142A657136j868590P32760K633091J826445R51820J027647K33215r72284O593
55133F227833K231726J845199j169904k853869k177827j706838j238596J793451
55125B951175M915150K239332m514349o029433j63319L099261k531993q370110
55117h404286l953059O247637R858047M996946L73081J08454J899j867370j947749
55108E413600J01487m51341l996446m225123J267123N938847M245612k24752j565260
55099F503747o27319j535762l657667l332265q95949k836j185587j374558L70305
$$ y = [-1497531, -4593557, -5437084, -4263300, -3526259, -3371975, -2567654, -1558617, -926988, 1088329, 5350986, 7924397, 4476157, -2259143, -4903133, -1541738, 2096374, 1657136, -211454, 521306, 3154397, 4980842, 5932662, 6960309, 7193524, 6221240, 6227833, 8459559, 10304758, 9134854, 6280985, 4103158, 2396320, 1157724, 2951175, 7866325, 10105657, 5591308, -438125, -601444, 2497817, -34176, -8404286, -12357345, -6109708, 3748339, 8745285, 9118366, 9226820, 9228719, 7361349, 5413600, 5515087, 5063746, 1067300, -3157823, -1890700, 4048147, 8293759, 8069007, 6503747, 5876428, 4340666, 682999, -2649266, -3545215, -3548051, -4733638, -6108196, -5737891]
55090e737891J249893l66276k095298j252705R95140J320444q63434k302504k51577
55081i304208L571951N034498K979512K34023r90486j669662k589220j868659
55073d602251J251201L256665J112374k135428j330302K683215M160185J087435
55065E483094k546296l200190j460576J068044L530835L946596O38117l743327
55057C716297m648592k523729j685973k096184O49079N802668O176510k01093
55049E188983n093155j927631M237835M852872J60132l538463m154888l983443
55041d257758l088926l1914K856238J822121j754987k989172p58954J707606K388182
55032d107564J876632M93219j533505k293188o25697J341453J647845J845348
$$ y = [-5737891, -4487998, -4854274, -6949572, -8202277, -7207137, -5886693, -6750127, -9052631, -9304208, -5732257, -697759, 2281753, 2515776, 1525290, -144372, -2733592, -4602251, -3351050, -94385, 1017989, -1117439, -2447741, 235474, 4395659, 5483094, 2936798, -263392, -1723968, -655924, 2874911, 6821507, 7459624, 3716297, -932295, -3456024, -5141997, -7238181, -6589102, -786434, 5390076, 5188983, 95828, -1831803, 2406032, 7258904, 7419036, 3880573, -274315, -4257758, -7346684, -7378598, -4522360, -2700239, -4455226, -7444398, -8203352, -6495746, -4107564, -2230932, -1737713, -3271218, -5564406, -6190103, -4848650, -3200805, -1355457]
$$ [...]
##END NTUPLES=NMR SPECTRUM
##END=
