##TITLE=31Pdec_SR 78 AcCl:Ac2O'
 , 124 sc
 25.08.2021
##JCAMPDX= 6.0         $$ Bruker NMR JCAMP-DX V2.0
##DATA TYPE= NMR SPECTRUM
##DATA CLASS= NTUPLES
##ORIGIN= UXNMR, Bruker Analytische Messtechnik GmbH
##OWNER= root
$$ XWIN-NMR		Version 3.5
$$ Wed Aug 25 08:47:35 2021 Russian Standard Time (UT+4h)  she@DPX200
##.OBSERVE FREQUENCY= 81.013821
##.OBSERVE NUCLEUS= ^31P
##.ACQUISITION MODE= SIMULTANEOUS
##.ACQUISITION SCHEME= undefined
##.AVERAGES= 124
##.DIGITISER RES= 16
##SPECTROMETER/DATA SYSTEM= spect
##.PULSE SEQUENCE= zgpg30
##.SOLVENT NAME= DMF
##.SHIFT REFERENCE= (INTERNAL, DMF, 0, 248.564)
##AUDIT TRAIL= $$ (NUMBER, WHEN, WHO, WHERE, WHAT)
$$ ##TITLE= Audit trail, XWIN-NMR		Version 3.5
$$ ##JCAMPDX= 5.01
$$ ##ORIGIN= Bruker BioSpin GmbH
$$ ##OWNER= she
$$ F:/spectra/data/she/nmr/P31/1/pdata/1/auditp.txt
$$ ##AUDIT TRAIL=  $$ (NUMBER, WHEN, WHO, WHERE, WHAT)
(   1,<2021-08-25 08:45:20.26 +0400>,<she>,<DPX200>,
      <created by zg, POWCHK disabled, PULCHK disabled
       configuration hash MD5:
       00 E9 B6 7A A2 85 ED C7 34 08 36 98 17 FE 4E 26
       data hash MD5: 32K
       99 81 B5 5C C2 72 10 CD C6 15 59 5C 57 48 AA F7>)
(   2,<2021-08-25 08:45:22.62 +0400>,<she>,<DPX200>,
      <Start of raw data processing
       efp BC_mod = 2 LB = 1 FT_mod = 6 PKNL = 1 PHC0 = -7751.919 PHC1 = 113.0735 SI = 64K 
       data hash MD5: 64K
       20 AC E1 59 43 79 70 B9 B2 37 10 66 BC ED BC 9E>)
(   3,<2021-08-25 08:45:43.45 +0400>,<she>,<DPX200>,
      <pk PHC0 = -48.20852 PHC1 = 92.59997 
       data hash MD5: 64K
       7B E1 8C D2 79 B3 B1 21 77 20 7B 75 6C F6 A5 CA>)
(   4,<2021-08-25 08:45:56.32 +0400>,<she>,<DPX200>,
      <abs ABSG = 5 
       data hash MD5: 64K
       07 F5 38 5F F6 CE BC FD 6E EA CC 5B 32 05 0A CF>)
$$ ##END=
$$ 
$$ hash MD5
$$ C7 12 7B 06 08 BF 8B E1 A6 89 35 7D 13 C3 12 67
##$RELAX= 
##$RELAX= 
##$RELAX= 
##$RELAX= 
##$RELAX= 
##$RELAX= 
##$RELAX= 
##$RELAX= 
$$ Bruker specific parameters
$$ --------------------------
##$DU= <F:/spectra>
##$EXPNO= 1
##$NAME= <P31>
##$PROCNO= 1
##$TYPE= <nmr>
##$USER= <she>
##$AMP= (0..31)
100 100 100 100 100 100 100 100 100 100 100 100 100 100 100 100 100 100 
100 100 100 100 100 100 100 100 100 100 100 100 100 100 
##$AQSEQ= 0
##$AQ_mod= 1
##$AUNM= <au_zg>
##$AUTOPOS= <>
##$BF1= 81.014009
##$BF2= 200.13
##$BF3= 200.13
##$BF4= 200.13
##$BF5= 200.13
##$BF6= 200.13
##$BF7= 200.13
##$BF8= 200.13
##$BYTORDA= 1
##$CFDGTYP= 0
##$CFRGTYP= 5
##$CHEMSTR= <none>
##$CNST= (0..31)
1 1 145 1 1 1 1 1 1 1 1 1 1 1 1 1 1 1 1 1 1 1 1 1 1 1 1 1 1 1 1 1 
##$CPDPRG= <waltz16>
##$CPDPRG1= <>
##$CPDPRG2= <waltz16>
##$CPDPRG3= <>
##$CPDPRG4= <mlev>
##$CPDPRG5= <mlev>
##$CPDPRG6= <mlev>
##$CPDPRG7= <mlev>
##$CPDPRG8= <mlev>
##$CPDPRGB= <>
##$CPDPRGT= <>
##$D= (0..31)
0 1 0 0 0 0 0 0 0 0 0 0.03 2e-05 3e-06 0 0 0 0 0 0 0 0 0 0 0 0 0 0 0 0 
0 0 
##$DATE= 1629866719
##$DBL= (0..7)
120 120 120 11 120 120 24 19 
##$DBP= (0..7)
150 150 150 150 150 150 150 150 
##$DBP07= 0
##$DBPNAM0= <>
##$DBPNAM1= <>
$$ [...]
##$SUBNAM3= <"">
##$SUBNAM4= <"">
##$SUBNAM5= <"">
##$SUBNAM6= <"">
##$SUBNAM7= <"">
##$SUBNAM8= <"">
##$SUBNAM9= <"">
##$SW= 501.771253377433
##$SWIBOX= (0..15)
0 1 3 0 0 0 0 0 0 0 0 0 0 0 0 0 
##$SW_h= 40650.406504065
##$TD= 32768
##$TD0= 1
##$TE= 0
##$TE2= 300
##$TE3= 300
##$TEG= 300
##$TL= (0..7)
0 120 53 12 22 120 120 120 
##$TP= (0..7)
150 150 150 150 150 150 150 150 
##$TP07= 0
##$TPNAME0= <>
##$TPNAME1= <>
##$TPNAME2= <>
##$TPNAME3= <>
##$TPNAME4= <>
##$TPNAME5= <>
##$TPNAME6= <>
##$TPNAME7= <>
##$TPOAL= (0..7)
0.5 0.5 0.5 0.5 0.5 0.5 0.5 0.5 
##$TPOFFS= (0..7)
0 0 0 0 0 0 0 0 
##$TUNHIN= 0
##$TUNHOUT= 0
##$TUNXOUT= 0
##$USERA1= <user>
##$USERA2= <user>
##$USERA3= <user>
##$USERA4= <user>
##$USERA5= <user>
##$V9= 5
##$VALIST= <valist>
##$VCLIST= <CCCCCCCCCCCCCCC>
##$VD= 0
##$VDLIST= <DDDDDDDDDDDDDDD>
##$VPLIST= <PPPPPPPPPPPPPPP>
##$VTLIST= <TTTTTTTTTTTTTTT>
##$WBST= 1024
##$WBSW= 4
##$XGAIN= (0..3)
0 0 0 0 
##$XL= 0
##$YL= 0
##$YMAX_a= 11114
##$YMIN_a= -10073
##$ZGOPTNS= <>
##$ZL1= 120
##$ZL2= 120
##$ZL3= 120
##$ZL4= 120
##$ABSF1= 248.5645
##$ABSF2= -253.2056
##$ABSG= 5
##$ABSL= 3
##$ALPHA= 0
##$AQORDER= 0
##$ASSFAC= 0
##$ASSFACI= 0
##$ASSFACX= 0
##$ASSWID= 0
##$AUNMP= <proc_1d>
##$AZFE= 0.1
##$AZFW= 0.5
##$BCFW= 0
##$BC_mod= 2
##$BYTORDP= 0
##$COROFFS= 0
##$CY= -3
##$DATMOD= 1
##$DC= 0
##$DFILT= <>
##$DTYPP= 0
##$F1P= 0
##$F2P= 0
##$FCOR= 1
##$FTSIZE= 65536
##$FT_mod= 6
##$GAMMA= 0
##$GB= 0
##$INTBC= 1
##$INTSCL= 5.30512e-09
##$ISEN= 30
##$LB= 1
##$LEV0= 0
##$LPBIN= 0
##$MAXI= 10000
##$MC2= 0
##$MEAN= 0
##$ME_mod= 0
##$MI= 50
##$NCOEF= 0
##$NC_proc= -7
##$NLEV= 6
##$NOISF1= 182.463
##$NOISF2= 159.3651
##$NSP= 0
##$NTH_PI= 0
##$NZP= 0
##$OFFSET= 248.5645
##$PC= 4
##$PHC0= -7800.127
##$PHC1= 205.6735
##$PH_mod= 1
##$PKNL= yes
##$PPARMOD= 0
##$PSCAL= 0
##$PSIGN= 0
##$REVERSE= no
##$SF= 81.014009
##$SI= 65536
##$SIGF1= 159.3651
##$SIGF2= -187.1042
##$SINO= 113.3802
##$SIOLD= 16384
##$SREGLST= <1H.CDCl3>
##$SSB= 0
##$STSI= 65536
##$STSR= 0
##$SW_p= 40650.406504065
##$SYMM= 0
##$S_DEV= 0
##$TDeff= 32768
##$TDoff= 0
##$TI= <>
##$TILT= no
##$TM1= 0
##$TM2= 0
##$TOPLEV= 0
##$USERP1= <user>
##$USERP2= <user>
##$USERP3= <user>
##$USERP4= <user>
##$USERP5= <user>
##$WDW= 1
##$XDIM= 65536
##$YMAX_p= 362950043
##$YMIN_p= -130753342
$$ End of Bruker specific parameters
$$ ---------------------------------
##NTUPLES= NMR SPECTRUM
##VAR_NAME=  FREQUENCY,     SPECTRUM/REAL,   SPECTRUM/IMAG
##SYMBOL=    X,             R,               I
##VAR_TYPE=  INDEPENDENT,   DEPENDENT,       DEPENDENT
##VAR_FORM=  AFFN,          ASDF,            ASDF
##VAR_DIM=   65536,         65536,           65536
##UNITS=     HZ,            ARBITRARY UNITS, ARBITRARY UNITS
##FACTOR=    0.620285442955139, 1,           1
##FIRST=     20137.2065510759, 0,            0
##LAST=      -20513.1999529892, 0,           0
##MIN=       -20513.1999529892, -130753342,  0
##MAX=       20137.2065510759, 362950043,    0
$$ Real data points
##PAGE= N=1
##DATA TABLE= (X++(R..R)), XYDATA
$$ [...]
$$ plain form
13016 932964 4422791 2810940 -1138158 -4764742 -6643747 -5576111 -1580518 2913655
13008 2913655 4993532 4214706 2704282 2618643 3832640 4012265 1452785 -2088246 -3026508
12999 -3026508 -1043520 -14323 -2378326 -5681805 -7026323 -7240939 -7164841 -4039865 3015262
12990 3015262 7699365 3831577 -4345041 -7046511 -3053772 -433391 -2917962 -4770990
12982 -4770990 -1763870 1363227 -950845 -6186732 -8296781 -6340322 -3655537 -2074001
12974 -2074001 -1309284 -1290570 -1612883 -1063970 -16868 -416467 -1852559 -1649588 -489701
12965 -489701 -2800123 -8925953 -12519271 -9597241 -4892126 -4405221 -6541528 -6349282 -4357868
12956 -4357868 -4518759 -6176310 -5038902 -855550 2238653 2577613 2322779 1865590 -1472424
$$ packed form
13016I32964L489827j611851l949098l626584j879005J067636L995593M494173
13008B913655K079877p78826j510424q5639J213997J79625k559480l541031r38262
12999c026508J982988J029197k364003l303479j344518k14616P6098L124976P055127
12990C015262M684103l867788q176618k701470L992739K620381k484571j853028
12982d770990L007120L127097k314072n235887k110049J956459K684785J581536
12974b074001P64717J8714l22313N48913J047102l99599j436092K02971J159887
12965d89701k310422o125830l593318K922030M705115M86905k136307J92246J991414
12956d357868j60891j657551J137408M183352L094203L38960k54834m57189l338014
$$ plain form
12947 -1472424 -7890137 -12908988 -12685399 -8368093 -3590020 -191450 1977810 2893909
12939 2893909 1843248 -1203001 -4419653 -4989499 -2250345 264147 -1606556 -6189452
12931 -6189452 -6278689 1614005 11050796 12447691 4619749 -4349577 -7273381 -4935633
12923 -4935633 -2351178 -1580279 -524879 2886505 7796963 11838854 13975804 14808304
12915 14808304 14433724 11804661 7330693 4447045 6087676 10211379 11641380 8476782
12907 8476782 4040400 2211596 3575116 6518425 9092366 9202237 6146646 2629329
12899 2629329 1803244 1844903 -1985637 -8630771 -10155034 -2648431 6794455 8809641 3858809
12890 3858809 125695 1567123 3941923 2502559 -1499925 -3527834 -1914664 524893
$$ packed form
12947a472424o417713n018851K23589M317306M778073L398570K169260R16099
12939B893909j050661l046249l216652n69846K739154K514492j870703m582896
12931f189452q9237P892694R436791J396895p827942q969326k923804K337748
12923d935633K584455P70899J055400L411384M910458M041891K136950Q32500
12915A4808304l74580k629063m473968k883648J640631M123703J430001l164598
12907H476782m436382j828804J363520K943309K573941J09871l055591l517317
12899B629329q26085M1659l830540o645134j524263P506603R442886K015186m950832
12890C858809l733114J441428K374800j439364m002484k027909J613170K439557
$$ plain form
12882 524893 133776 -3121324 -5159515 -2564744 2651199 5164517 3111447 -133547
12874 -133547 -1227892 -349236 1353256 3583450 4596404 1578272 -4199802 -6911903
12866 -6911903 -3785253 975008 2883987 3160258 4266809 4412875 1537134 -1500307
12858 -1500307 -1320975 63046 -490355 -807161 2226730 5262544 3055076 -2071221 -3546977
12849 -3546977 -1757832 -2998612 -7538912 -8253270 -2848255 1724526 565288 -1694873
12841 -1694873 372674 3812248 3088343 -138277 -36392 3612117 5474477 3415398
12833 3415398 1106937 1477970 2613355 1825484 50849 -313547 257578 -929752 -4437021
12824 -4437021 -7495140 -7669232 -5733308 -3715467 -1948132 -210390 -180557 -3227240 -6295068
$$ packed form
12882E24893l91117l255100k038191K594771N215943K513318k053070l244994
12874a33547j094345Q78656J702492K230194J012954l018132n778074k712101
12866f911903L126650M760261J908979K76271J106551J46066k875741l037441
12858a500307J79332J384021n53401l16806L033891L035814k207468n126297j475756
12849c546977J789145j240780m540300p14358N405015M572781j159238k260161
12841a694873K067547L439574p23905l226620J01885L648509J862360k059079
12833C415398k308461L71033J135385p87871j774635l64396N71125j187330l507269
12824d437021l058119j74092J935924K017841J767335J737742K9833l046683l067828
$$ plain form
12815 -6295068 -4398890 1851227 5780463 3855271 883231 2696839 7785246 10670553
12807 10670553 10168307 8889978 6976071 2423863 -3277877 -5672323 -3683495 -567918
12799 -567918 1634232 3810391 5604202 4636866 1318301 32636 3426276 8662585
12791 8662585 11164946 9737970 6748377 5128808 5781673 6390843 3340234 -3178769
12783 -3178769 -7398799 -4437155 2920330 7820375 8299979 7692731 7151740 4182039 -662586
12774 -662586 -2293541 998311 3671979 640646 -5414759 -8440307 -7546216 -6897219 -8809846
12765 -8809846 -10861602 -9699951 -5249887 -678016 1038907 398533 723598 3517460
12757 3517460 5959220 5146416 3146023 4197245 7829169 9236011 6564253 3107206
$$ packed form
12815f295068J896178O250117L929236j925192k972040J813608N088407K885307
12807A0670553n02246j278329j913907m552208n701740k394446J988828L115577
12799e67918K202150K176159J793811r67336l318565j285665L393640N236309
12791H662585K502361j426976k989593j619569O52865O09170l050609o519003
12783c178769m220030K961644P357485M900045M79604o07248n40991k969701m844625
12774f62586j630955L291852K673668l031333o055405l025548Q94091O48997j912627
12765h809846k051756J161651M450064M571871J716923o40374L25065K793862
12757C517460K441760q12804k000393J051222L631924J406842k671758l457047
$$ plain form
12749 3107206 1351852 -318582 -3038463 -3986927 -435861 5753647 10296921 10935762
12741 10935762 7995822 2981091 -1711326 -4011077 -4508010 -5376893 -6426473 -5401934
12733 -5401934 -2907738 -2862382 -6262256 -8627052 -6355532 -2067887 -476372 -1818058
12725 -1818058 -2648833 -964416 2471521 6085656 8084122 6713410 2467188 -1210026
12717 -1210026 -1484937 628852 1899749 358479 -3697595 -8212923 -10044649 -7443884
12709 -7443884 -2803286 -574510 -1842095 -3705873 -4242245 -4348367 -4279846 -3036071 -2130559
12700 -2130559 -4505328 -8040601 -6536927 -103121 2532499 -2991390 -8364358 -4512882
12692 -4512882 3905732 5068769 -2347454 -7999136 -5533244 190930 2900378 3317234
$$ packed form
12749C107206j755354j670434k719881r48464L551066O189508M543274O38841
12741A0935762k939940n014731m692417k299751m96933q68883j049580J024539
12733e401934K494196M5356l399874k364796K271520M287645J591515j341686
12725a818058q30775J684417L435937L614135J998466j370712m246222l677214
12717a210026k74911K113789J270897j541270m056074m515328j831726K600765
12709g443884M640598K228776j267585j863778n36372j06122O8521J243775R05512
12700b130559k374769l535273J503674O433806K635620n523889n372968L851476
12692d512882Q418614J163037p416223n651682K465892N724174K709448M16856
$$ plain form
12684 3317234 4517876 5640611 4442311 1697284 -552757 -1959468 -2506321 -1256791
12676 -1256791 1260365 2343800 975603 -295271 750762 2953750 4454684 5383207
12668 5383207 5638966 3275638 -1629959 -4226874 -275437 6995195 9711835 5066607
12660 5066607 -1543922 -3837137 -1599096 1450583 3683982 6094932 8058236 6570661
12652 6570661 1038126 -3883091 -2807768 3905943 10519747 12588410 11034359 9168168
12644 9168168 8034057 6289209 3308155 611509 476307 3831695 8884937 11591776
12636 11591776 9051211 3222739 -582486 -186290 629956 -2159302 -6569510 -7500470
12628 -7500470 -4494037 -2230171 -3188669 -4395294 -3144433 -1762395 -3415680 -6207995
$$ packed form
12684C317234J200642J122735j198300k745027k250041j406711n46853J249530
12676a256791K517156J083435j368197j270874J046033K202988J500934R28523
12668E383207K55759k363328m905597k596915L951437P270632K716640m645228
12660E066607o610529k293215K238041L049679K233399K410950J963304j487575
12652F570661n532535m921217J075323O713711O613804K068663j554051j866191
12644I168168j134111j744848k981054k696646j35202L355388N053242K706839
12636A1591776k540565n828472l805225L96196Q16246k789258m410208r30960
12628g500470L006433K263866r58498j206625J250861J382038j653285k792315
$$ plain form
12620 -6207995 -5840186 -2857280 -2499057 -6686177 -10329962 -7894929 -894117 3985789
12612 3985789 2774147 -2477111 -7440334 -9659529 -8824502 -5619938 -1543364 1626556
12604 1626556 3261355 4053817 4532779 4482687 3872876 2957875 1421740 -929182 -2653800
12595 -2653800 -1916767 661334 2714598 3655389 4494131 4219657 742114 -3551548 -2516362
12586 -2516362 4695279 10536653 9247430 5226998 5569767 8486367 6510145 -1223354
12578 -1223354 -7855758 -9314702 -8334053 -7491286 -5574046 -2559280 -1578292 -3399790 -4472597
12569 -4472597 -2929349 -1549701 -2379036 -3164702 -1637027 959678 2789511 3732507 3098189
12560 3098189 -366175 -4511764 -4852989 -1481180 360021 -1459411 -3019683 -2024184
$$ packed form
12620f207995L67809K982906L58223m187120l643785K435033P000812M879906
12612C985789j211642n251258m963223k219195Q35027L204564M076574L169920
12604A626556J634799P92462M78962n0092o09811r15001j536135k350922j724618
12595b653800P37033K578101K053264R40791Q38742k74474l477543m293662J035186
12586b516362P211641N841374j289223m020432L42769K916600j976222p733499
12578a223354o632404j458944R80649Q42767J917240L014766R80988j821498j072807
12569d472597J543248J379648q29335p85666J527675K596705J829833R42996o34318
12560C098189l464364m145589l41225L371809J841201j819432j560272R95499
$$ plain form
12552 -2024184 -1734165 -3765437 -3768176 1011754 6114939 7034450 6057396 6351646 5323695
12543 5323695 568036 -3218576 -1072694 2976595 1544262 -4783095 -9613831 -10860211
12535 -10860211 -10576921 -8060347 -2154305 2194490 -489380 -5648494 -3944358 3541526
12527 3541526 6269930 1279211 -2217826 1483317 5244362 1195956 -6768242 -9765489
12519 -9765489 -6680862 -2856067 -651665 1492493 3310778 2641073 314194 163305
12511 163305 3930821 9080994 11688713 10029106 5973737 3387423 3666765 3067777 -2642196
12502 -2642196 -10854473 -13589130 -7571263 1290743 5543234 4420222 1856119 -51530
12494 -51530 -1998114 -4163989 -5386009 -4818575 -2558931 424249 2163941 1210080 -1108685
$$ packed form
12552b024184K90019k031272k739M779930N103185R19511r77054K94250j027951
12543E323695m755659l786612K145882M049289j432333o327357m830736j246380
12535a0860211K83290K516574N906042M348795k683870n159114J704136P485884
12527C541526K728404m990719l497037L701143L761045m048406p964198k997247
12519i765489L084627L824795K204402K144158J818285o69705k326879j50889
12511A63305L767516N150173K607719j659607m055369k586314K79342n98988n709973
12502b642196q212277k734657O017867Q862006M252491j123012k564103j907649
12494e1530j946584k165875j222020N67434K259644K983180J739692r53861k318765
$$ plain form
12485 -1108685 -1987168 -1020830 -330587 -839984 -1501007 -2026844 -2627331 -1436375 2921800
12476 2921800 6492852 4080706 -1201626 -165990 8398069 14394145 11455538 6584154
12468 6584154 8043895 11845075 9771376 4551697 5419116 11764052 13282335 6183548
12460 6183548 -1834366 -4198132 -2761516 18938 6075869 14397699 17719523 12723596
12452 12723596 6464134 6065384 8084916 5405386 -404896 -2180156 511284 1256923
12444 1256923 -1643223 -2299902 2332356 6612980 4433704 -2039620 -6098286 -5526583
12436 -5526583 -3627472 -3083802 -2869027 -1137491 1745489 3867767 4016605 2562625 650016
12427 650016 -1059981 -2683472 -4064359 -3999888 -1431471 2757549 6149005 7016273 5347901
$$ packed form
12485a108685q78483R66338O90243n09397o61023n25837o00487J190956M358175
12476B921800L571052k412146n282332J035636Q564059N996076k938607m871384
12468F584154J459741L801180k073699n219679Q67419O344936J518283p098787
12460F183548q017914k363766J436616K780454O056931Q321830L321824m995927
12452A2723596o259462l98750K019532k679530n810282j775260K691440P45639
12444A256923k900146o56679M632258M280624k179276o473324m058666N71703
12436e526583J899111N43670K14775J731536K882980K122278J48838j453980j912609
12427F50016j709997j623491j380887O4471K568417M189020L391456Q67268j668372
$$ plain form
12418 5347901 2107920 -1171891 -2487590 -980931 1476327 2273197 1737862 2461093 4564863
12409 4564863 4613723 604035 -4710971 -7358315 -6545166 -3599209 554447 4045469 3194800
12400 3194800 -2849609 -8669932 -8445725 -3910106 -1277199 -1067874 2527874 10978529
12392 10978529 16842002 13714045 5772411 2231035 5077137 7645307 4508790 -2012048
12384 -2012048 -6006326 -5144355 -1939465 286819 660584 138346 -748841 -2080588 -2833759
12375 -2833759 -1415534 775825 -989215 -8408214 -15505360 -14924394 -7942000 -2800443
12367 -2800443 -2916275 -3122719 397720 3192325 69692 -5669091 -6463886 -1041624 4841310
12358 4841310 6656110 5327360 4032966 4638213 6795271 8004369 5876902 2210806
$$ packed form
12418E347901l239981l279811j315699J506659K457258P96870n35335P23231K103770
12409D564863M8860m009688n315006k647344Q13149K945957M153656L491022q50669
12400C194800o044409n820323K24207M535619K632907K09325L595748Q450655
12392A0978529N863473l127957p941634l541376K846102K568170l136517o520838
12384b012048l994278Q61971L204890K226284L73765n22238q87187j331747p53171
12375b833759J418225K191359j765040p418999p097146N80966O982394N141557
12367b800443j15832k06444L520439K794605l122633n738783p94795N422262N882934
12358D841310J814800j328750j294394O05247K157058J209098k127467l666096
$$ plain form
12350 2210806 1905900 5320277 5902426 -405099 -7856010 -8950139 -5920183 -6505633 -10721565
12341 -10721565 -10868919 -4685740 543013 -710626 -4585207 -5124263 -2901351 -2010400
12333 -2010400 -3190839 -4482606 -5532437 -7151015 -8518815 -8005857 -5633324 -2831443
12325 -2831443 -886452 -503720 -1366094 -1840717 -1005390 -556181 -2135072 -3742560 -2552359
12316 -2552359 -349595 -1187882 -3964934 -3379848 866423 2456062 -1617984 -6006383
12308 -6006383 -5631435 -3499564 -4948628 -8831892 -10177781 -8429871 -7263654 -7973523
12300 -7973523 -8231370 -6723664 -4856852 -4022342 -4092917 -4273031 -3518358 -1211360 1129229
12291 1129229 848204 -1588800 -2163467 825181 3788515 3454163 1788110 1699270 1515507
$$ packed form
12350B210806l04906L414377N82149o307525p450911j094129L029956n85450m215932
12341a0721565j47354O183179N228753j253639l874581n39056K222912Q90951
12333b010400j180439j291767j049831j618578j367800N12958K372533K801881
12325b831443J944991L82732q62374m74623Q35327M49209j578891j607488J190201
12316b552359K202764q38287k777052N85086M246271J589639m074046m388399
12308f006383L74948K131871j449064l883264j345889J747910J166217p09869
12300g973523k57847J507706J866812Q34510p0575j80114P54673K306998K340589
12291A129229k81025k437004n74667K988648K963334l34352j666053q8840j83763
$$ plain form
12282 1515507 -1428525 -4668083 -3771315 171878 2123826 1363415 2173409 5866487 7890376
12273 7890376 4781237 -509104 -2831689 -1410122 255091 -698593 -3571408 -5317242
12265 -5317242 -3796892 -175372 2200413 1932167 1447220 3454160 6943458 8574886
12257 8574886 6614029 1475301 -5631470 -11709862 -11987529 -5470075 777918 -1629167
12249 -1629167 -11031356 -16523649 -11817111 -3249042 -921067 -6009727 -11100785 -10532840
12241 -10532840 -5753804 -1249699 597923 5788 -1637238 -2356592 -760997 2112171
12233 2112171 3487291 2392293 1120819 1841677 3098219 1785613 -2052908 -4974580
12225 -4974580 -4814959 -2782198 -8527 4554994 10334853 12508128 7561299 -290889
$$ packed form
12282A515507k944032l239558Q96768L943193J951948p60411Q09994L693078K023889
12273G890376l109139n290341k322585J421567J665213r53684k872815j745834
12265e317242J520350L621520K375785k68246m84947K006940L489298J631428
12257H574886j960857n138728p106771o078392k77667O517454O247993k407085
12249a629167r402189n492293M706538Q568069K327975n088660n091058N67945
12241a0532840M779036M504105J847622n92135j643026p19354J595595K873168
12233B112171J375120j094998j271474P20858J256542j312606l838521k921672
12225d974580J59621K032761K773671M563521N779859K173275m946829p852188
$$ plain form
12217 -290889 -3342892 -594090 1704356 194863 -1095360 1137754 2964622 -401405
12209 -401405 -6110467 -7442058 -3677014 -359768 -572543 -1390329 475678 3922527 5616063
12200 5616063 4027331 535651 -1415832 1473785 8467713 13582280 11355191 3730021
12192 3730021 -1945821 -1823613 971335 2134782 1486857 807457 -151582 -2530342 -5016578
12183 -5016578 -4602622 -596667 3901493 5101960 2587395 -229000 -64386 2233547
12175 2233547 3035348 1319055 159732 1488526 2467906 238122 -2373675 -642277
12167 -642277 3916904 4916438 940648 -1968766 211917 3219150 1695592 -1960747
12159 -1960747 -1597245 2453596 3638727 -379018 -3710368 -1053092 4069656 3874466
$$ packed form
12217b90889l052003K748802K298446j509493j290223K233114J826868l366027
12209d01405n709062j331591L765044L317246k12775q17786J866007L446849J693536
12200E616063j588732l491680j951483K889617O993928N114567k227089p625170
12192C730021n675842J22208K794948J163447o47925o79400r59039k378760k486236
12183e016578M13956M005955M498160J200467k514565k816395J64614K297933
12175B233547Q01801j716293j159323J328794R79380k229784k611797J731398
12167f42277M559181R99534l975790k909414K180683L007233j523558l656339
12159a960747L63502M050841J185131m017745l331350K657276N122748j95190
$$ plain form
12151 3874466 -3153971 -10477798 -11806892 -7465252 -1816541 2039781 2872505 -245436
12143 -245436 -6141873 -9518540 -5448732 3336434 7970271 4385650 -1080739 -393462
12135 -393462 5037391 6906425 2378974 -1867001 745303 7868055 12209205 11367655
12127 11367655 9617742 10609151 12206231 10190224 4767639 530574 140787 994478
12119 994478 -170524 -1812967 -238181 3352815 3271391 -2038212 -6584239 -5121632 -809233
12110 -809233 -45939 -2637473 -2861620 947140 4037290 2971314 109532 -1273581 -1460616
12101 -1460616 -1583751 -780397 1075216 1515699 -376919 -1123497 2291236 7368444 9748541
12092 9748541 9622384 10110747 10929755 8774808 3618862 -538733 -1982729 -3378452 -5734745
$$ packed form
12151C874466p028437p323827j329094M341640N648711L856322Q32724l117941
12143b45436n896437l376667M069808Q785166M633837l584621n466389O87277
12135c93462N430853J869034m527451m245975K612304P122752M341150q41550
12127A1367655j749913R91409J597080k016007n422585m237065l89787Q53691
12119I94478j165002j642443J574786L590996q1424n309603m546027J462607M312399
12110h09233P63294k591534k24147L808760L090150j065976k861782j383113j87035
12101a460616j23135Q03354J855613M40483j892618p46578L414733N077208K380097
12092I748541j26157M88363Q19008k154947n155946m157595j443996j395723k356293
$$ plain form
12083 -5734745 -5096808 1236397 8776202 10614240 6218406 1054411 -1455703 -2696293
12075 -2696293 -3461416 -1205440 4821213 9834610 8866150 3742368 814803 2527041
12067 2527041 4899193 3717100 54619 -1862239 -510261 1040866 -883256 -5448817
12059 -5448817 -7330450 -3050562 3566258 5260480 992472 -2538249 -1185822 -41268
12051 -41268 -4782749 -10717349 -8376238 1586852 7972940 4620543 -2087377 -4317581
12043 -4317581 -3334691 -3878456 -4820408 -2321811 2093518 3649433 2024073 814356 1078359
12034 1078359 1086330 1197597 3403542 6448664 6402357 2396846 -2003763 -3340122 -1387878
12025 -1387878 1619620 2477789 -782216 -5621374 -6193936 -897260 4060059 2508692
$$ packed form
12083e734745O37937O333205P539805J838038m395834n163995k510114j240590
12075b696293p65123K255976O026653N013397r68460n123782k927565J712238
12067B527041K372152j182093l662481j916858J351978J551127j924122m565561
12059e448817j881633M279888O616820J694222m268008l530721J352427J144554
12051d1268m741481n934600K341111R963090O386088l352397o707920k230204
12043d317581R82890n43765r41952K498597M415329J555915j625360j209717K64003
12034A078359P971J11267K205945L045122m6307m005511m400609j336359J952244
12025a387878L007498Q58169l260005m839158n72562N296676M957319j551367
$$ plain form
12017 2508692 -3150561 -5881796 -3705497 -157719 2402863 3901128 2889601 -1685825
12009 -1685825 -6121443 -5685775 -1972230 -392720 -1334956 -592728 2097424 2508497 267635
12000 267635 247488 4329162 8542689 9754316 8874150 6602578 2748713 416652 3335935
11991 3335935 8097107 7266701 1498479 -743626 2318919 2141769 -5059367 -10499410
11983 -10499410 -6993288 -1212766 -2835225 -8986222 -9336155 -1652398 6951937 10754921
11975 10754921 9353530 4074691 -2029124 -3569111 759965 4150188 716571 -5079776
11967 -5079776 -5268061 -724440 1744941 1467896 3529717 7900537 8584060 3947352 -497579
11958 -497579 -632703 2057185 5462347 9231049 11509489 9856684 6295257 5517532 7563366
$$ packed form
12017B508692n659253k731235K176299L547778K560582J498265j011527m575426
12009a685825m435618M35668L713545J579510r42236P42228K690152M11073k240862
12000B67635k0147M081674M213527J211627q80166k271572l853865k332061K919283
11991C335935M761172q30406n768222k242105L062545j77150p201136n440043
11983a0499410L506122N780522j622459o150997l49933P683757Q604335L802984
11975A0754921j401391n278839o103815j539987M329076L390223l433617n796347
11967e079776j88285M543621K469381k77045K061821M370820O83523m636708m444931
11958d97579j35124K689888L405162L768702K278440j652805l561427p77725K045834
$$ plain form
11949 7563366 8063064 5783676 3753677 2864165 848424 -2190342 -3839670 -4981712
11941 -4981712 -8239938 -10878570 -7427523 -108281 2362798 -1679354 -3893044 235849
11933 235849 4306359 2811114 527091 2743779 4347721 -1728076 -10695804 -11137208
11925 -11137208 -1753150 6988140 8175344 6839601 10615787 18453597 22510627 18037330
11917 18037330 8165512 64886 -1778247 1246306 4482853 5295146 5109359 6329322
11909 6329322 8711060 9654111 7265876 2606389 -670475 565295 5099647 7768703
11901 7768703 5530130 1755357 1729067 5291134 7599289 6065181 2222835 -2332476
11893 -2332476 -6684757 -7785453 -2960104 4263624 7025011 4829980 3887233 6485730
$$ packed form
11949G563366M99698k279388k029999q89512k015741l038766j649328j142042
11941d981712l258226k638632L451047P319242K471079m042152k213690M128893
11933B35849M070510j495245k284023K216688J603942o075797q967728m41404
11925a1137208R384058Q741290J187204j335743L776186P837810M057030m473297
11917A8037330r871818q100626j843133L024553L236547Q12293j85787J219963
11909F329322K381738R43051k388235m659487l276864J235770M534352K669056
11901G768703k238573l774773k6290L562067K308155j534108l842346m555311
11893b332476m352281j100696M825349P223728K761387k195031r42747K598497
$$ plain form
11885 6485730 7595929 4642566 2578160 4858195 6989096 4669113 1360932 1282425
11877 1282425 1464502 -1582954 -3276817 1886149 9032530 8702928 1508461 -2777058
11869 -2777058 35676 3936895 3385325 287041 -1275475 -448616 1956986 4873298
11861 4873298 5830669 3506758 1538731 4314120 9278250 9778950 5533167 3066282
11853 3066282 4814026 5404515 1179676 -3621900 -3641659 445921 4989818 8371011 9543357
11844 9543357 6529735 343784 -3464418 -878150 5869328 12081379 15655109 16135009
11836 16135009 12745711 6371649 329783 -3304791 -5288060 -5830711 -3693445 -154273
11828 -154273 962523 -669808 -899974 1500971 2294721 -185969 -902679 3250533 6847619
$$ packed form
11885F485730J110199k953363k064406K280035K130901k319983l308181p8507
11877A282425J82077l047456j693863N162966P146381l29602p194467m285519
11869b777058K812734L901219n51570l098284j562516Q26859K405602K916312
11861D873298R57371k323911j968027K775389M964130N00700m245783k466885
11853C066282J747744N90489m224839m801576j9759M087580M543897L381193J172346
11844I543357l013622o185951l808202K586268O747478O212051L573730M79900
11836A6135009l389298o374062o041866l634574j983269n42651K137266L539172
11828a54273J116796j632331k30166K400945P93750k480690p16710M153212L597086
$$ plain form
11819 6847619 4170706 -1103719 -1520636 2801479 5799028 5481174 4784610 4396074 2271456
11810 2271456 -521858 -417956 2474269 4947760 6795519 9962534 12250357 9036532
11802 9036532 1794685 -2033801 953370 6363876 9396888 9689066 7526436 2182686
11794 2182686 -3580589 -4158597 467954 3278676 837650 -1210727 1882321 5002577
11786 5002577 1036880 -7176112 -10693325 -7440595 -3364137 -1917919 -485836 2142521
11778 2142521 2396831 -1371948 -4941135 -4616209 -3051296 -4674696 -8628206 -10564010
11770 -10564010 -9345937 -7546599 -6276130 -4014319 -920399 -63057 -2621383 -5278669
11762 -5278669 -5065280 -4142914 -6160745 -9602883 -9517713 -5780974 -4225422 -7398314 -9329829
$$ packed form
11819F847619k676913n274425m16917M322115K997549l17854o96564l88536k124618
11810B271456k793314J03902K892225K473491J847759L167015K287823l213825
11802I036532p241847l828486K987171N410506L033012K92178k162630n343750
11794B182686n763275n78008M626551K810722k441026k048377L093048L120256
11786E002577l965697q212992l517213L252730M076458J446218J432083K628357
11778B142521K54310l768779l569187L24926J564913j623400l953510j935804
11770a0564010J218073J799338J270469K261811L093920Q57342k558326k657286
11762e278669K13389R22366k017831l442138Q5170L736739J555552l172892j931515
$$ plain form
11753 -9329829 -4006864 4602997 7121381 1841699 -3461788 -3359907 -1597431 -3272199
11745 -3272199 -6272257 -5606746 -2163376 -902987 -2197825 -1411407 2713626 5335450
11737 5335450 3306217 633006 2344939 6240202 5655783 -538796 -5620333 -3986899
11729 -3986899 1279779 2711110 -1633227 -6065068 -5092700 -233680 2535133 220212
11721 220212 -4395915 -6689272 -5057305 -1863755 -862738 -3794134 -8551865 -10736281
11713 -10736281 -7938400 -2432998 1213239 980850 -1101202 -1964730 -777071 766961
11705 766961 362778 -2668371 -6211163 -6821269 -3424061 1011548 2761558 1506507 -434819
11696 -434819 -1890142 -3221882 -3665953 -1757279 1305512 2286575 877429 425070 2122062
$$ packed form
11753i329829N322965Q609861K518384n279682n303487J01881J762476j674768
11745c272199l000058O65511L443370J260389j294838P86418M125033K621824
11737E335450k029233k673211J711933L895263n84419o194579n081537J633434
11729c986899N266678J431331m344337m431841R72368M859020K768813k314921
11721B20212m616127k293357J631967L193550J001017k931396m757731k184416
11713a0736281K797881N505402L646237k32389k082052q63528J187659J544032
11705G66961m04183l031149l542792o10106L397208M435609J750010j255051j941326
11696d34819j455323j331740m44071J908674L062791R81063j409146m52359J696992
$$ plain form
11687 2122062 2341188 -1509529 -6075478 -6906681 -5414420 -6129173 -8728721 -8493174 -4661253
11678 -4661253 -2397362 -4516588 -6603004 -4103504 -241267 -1712437 -8524671 -13727349
11670 -13727349 -13214387 -10392441 -9461158 -9100511 -6436596 -3425004 -4005666 -6640523 -5527738
11661 -5527738 354315 4897006 3524306 -601871 -2191925 -1506078 -2034690 -3523104
11653 -3523104 -2731507 30347 509356 -2926957 -6773110 -7511373 -5630655 -3240091 -781109
11644 -781109 2269598 5589309 8147390 8792235 6748799 3361291 2423244 5762460 9430564
11635 9430564 8419445 4644972 4857764 9874996 12012504 5971871 -3156005 -6773297
11627 -6773297 -3415799 1888358 5489286 7545914 8860350 9903909 11786329 14510432
$$ packed form
11687B122062K19126l850717m565949q31203J492261p14753k599548K35547L831921
11678d661253K263891k119226k086416K499500L862237j471170o812234n202678
11670a3727349N12962K821946R31283L60647K663915L011592n80662k634857J112785
11661e527738N882053M542691j372700m126177j590054O85847n28612j488414
11653c523104P91597K761854M79009l436313l846153p38263J880718K390564K458982
11644g81109L050707L319711K558081O44845k043436l387508r38047L339216L668104
11635I430564j011119l774473K12792N017232K137508o040633r127876l617292
11627f773297L357498N304157L600928K056628J314436J043559J882420K724103
$$ plain form
11619 14510432 15372304 12148083 6545992 1932529 -393810 -172838 3508340 9245888
11611 9245888 11774546 8186763 3365532 4029442 9146751 11774338 9119226 4874173
11603 4874173 2231471 799164 541794 2313506 3421800 -853316 -9134455 -13352923
11595 -13352923 -9341955 -2713350 -607575 -2571782 -4107680 -4850435 -7300108 -9973216
11587 -9973216 -8210876 -1668649 4225542 5377033 3606109 2489004 1835450 -1004337
11579 -1004337 -5888986 -8929021 -7227120 -2606949 806985 1669814 1945789 2489636 1048203
11570 1048203 -3620805 -8149361 -8213396 -4527194 -1691588 -1440127 -818822 2192744 4883987
11561 4883987 3569621 -1327210 -6021983 -7650973 -6166360 -3242626 -857155 -239313
$$ packed form
11619A4510432Q61872l224221n602091m613463k326339K20972L681178N737548
11611I245888K528658l587783m821231O63910N117309K627587k655112m245053
11603D874173k642702j432307k57370J771712J108294m275116q281139m218468
11595a3352923M010968O628605K105775j964207j535898p42755k449673k673108
11587i973216J762340O542227N894191J151491j770924j117105o53554k839787
11579a004337m884649l040035J701901M620171L413934Q62829K75975N43847j441433
11570A048203m669008m528556o4035L686202K835606K51461O21305L011566K691243
11561D883987j314366m896831m694773j628990J484613K923734K385471O17842
$$ plain form
11553 -239313 -1201079 -2857702 -4874565 -6782618 -6542029 -2288809 3991878 7223071 5072730
11544 5072730 870275 -921050 -116846 394512 -398274 -692462 524096 1538474 436925
11535 436925 -1898327 -2570072 -186729 3388740 5377558 5559172 6071134 7676510 8156460
11526 8156460 5582462 1422934 -1444568 -2330530 -2220635 -1305125 103765 -323695 -4048409
11517 -4048409 -7543246 -5448754 1727383 7278353 6698560 2412736 -1144002 -2770671
11509 -2770671 -2658719 240558 5400082 8541776 6389305 1710976 101415 3174628
11501 3174628 7920575 11102668 11102653 7179901 742890 -3763559 -3196165 -330346 -241994
11492 -241994 -2601782 -2215304 2340287 5838722 4407464 1785345 3663777 8891217
$$ packed form
11553b39313r61766j656623k016863j908053K40589M253220O280687L231193k150341
11544E072730m202455j791325Q04204N11358p92786k94188J216558J014378j101549
11535D36925k335252o71745K383343L575469J988818J81614N11962J605376M79950
11526H156460k573998m159528k867502q85962J09895R15510J408890m27460l724714
11517d048409l494837K094492P176137N550970n79793m285824l556738j626669
11509b770671J11952K899277N159524L141694k152471m678329j609561L073213
11501C174628M745947L182093j5l922752o437011m506449N67394K865819Q8352
11492b41994k359788L86478M555591L498435j431258k622119J878432N227440
$$ plain form
11484 8891217 11209065 8576539 5781236 7063968 10434451 11394610 9098877 5997790
11476 5997790 3605915 1890562 1443312 2635950 3274295 1004521 -1965991 -1004837 3169301
11467 3169301 3917474 -1554794 -6892193 -5417203 -24022 1686796 -744275 -830021 3757270
11458 3757270 7809058 7396685 5039770 3540704 1090285 -3534039 -6290444 -3498499
11450 -3498499 1637254 3454017 2237902 2868722 6559306 9344520 8704933 6852236
11442 6852236 6326773 6099323 3832068 -432467 -4575120 -6936350 -7174236 -5480180 -2226763
11433 -2226763 1567511 4083015 3781946 1220844 -763544 25589 2259203 2961603 2387326
11424 2387326 4350652 10350111 15939366 15522650 9326349 2941320 620268 1513181
$$ packed form
11484H891217K317848k632526k795303J282732L370483R60159k295733l101087
11476E997790k391875j715353m47250J192638O38345k269774k970512R61154M174138
11467C169301P48173n472268n337399J474990N393181J710818k431071q5746M587291
11458C757270M051788m12373k356915j499066k450419m624324k756405K791945
11450c498499N135753J816763j216115O30820L690584K785214o39587j852697
11442F852236n25463k27450k267255m264535m142653k361230k37886J694056L253417
11433b226763L794274K515504l01069k561102j984388P89133K233614P02400n74277
11424B387326J963326N999459N589255m16716o196301o385029k321052Q92913
$$ plain form
11416 1513181 2351254 1479366 -297637 -1200848 -170743 1864971 2172978 -1138699 -6212812
11407 -6212812 -8406905 -5245451 179003 2145094 -1092350 -5029997 -4474959 -264259
11399 -264259 1965358 -409010 -3644119 -3511543 -1277854 -853243 -2473973 -3152989 -1899649
11390 -1899649 -182217 1954908 5522144 8478126 7095815 2310039 -315381 1414030
11382 1414030 3286347 1936776 91409 1022916 2310900 46231 -3777644 -3510749
11374 -3510749 1707277 6516306 6329428 2073829 -2378410 -4503685 -4099948 -2108591
11366 -2108591 439178 2959109 5144034 6494865 6888691 7340440 8471243 8399873 4821800
11357 4821800 -445187 -2361208 530428 3531313 2019709 -2925216 -7494345 -10350508
$$ packed form
11416A513181Q38073q71888j777003r03211J030105K035714L08007l311677n074113
11407f212812k194093L161454N424454J966091l237444l937647N55038M210700
11399b64259K229617k374368l235109J32576K233689M24611j620730o79016J253340
11390a899649J717432K137125L567236K955982j382311m785776k625420J729411
11382A414030J872317j349571j845367R31507J287984k264669l823875K66895
11374c510749N218026M809029j86878m255599m452239k125275M03737J991357
11366b108591K547769K519931K184925J350831L93826M51749J130803p1370l578073
11357D821800n266987j916021K891636L000885j511604m944925m569129k856163
$$ plain form
11349 -10350508 -11485366 -8858054 -812711 9253712 14826288 13122109 7340393 2134028
11341 2134028 -825704 -2611707 -4250684 -4932962 -2841657 1984273 6320949 7060990
11333 7060990 5392765 5029415 6436147 6327510 3368962 397309 -138221 1071402 3112782
11324 3112782 5883739 6850659 2466272 -4662393 -6187483 534209 7456394 7223832
11316 7223832 3540171 3865845 7297293 7698900 4937252 4169125 5975882 5831165 2907585
11307 2907585 1580727 3647896 5789243 5637731 4665498 4338425 4330106 4729884 5619565
11298 5619565 5262942 3237557 3374767 7909240 11230119 6895833 -1003297 -2262831
11290 -2262831 4286981 9486435 8274399 5400120 4651406 2781953 -1599451 -2809512
$$ packed form
11349a0350508j134858K627312Q045343J0066423N572576j704179n781716n206365
11341B134028k959732j786003j638977o82278K091305M825930M336676P40041
11333G060990j668225l63350J406732j08637k958548k971653n35530J209623K041380
11324C112782K770957R66920m384387p128665j525090O721692O922185k32562
11316G223832l683661L25674L431448M01607k761648p68127J806757j44717k923580
11307B907585j326858K067169K141347j51512r72233l27073q319L99778Q89681
11298E619565l56623k025385J37210M534473L320879m334286p899130j259534
11290b262831O549812N199454j212036k874279p48714j869453m381404j210061
$$ plain form
11282 -2809512 2164422 6839259 5015803 586996 371845 3106186 3539592 2787054 5883004
11273 5883004 11774752 14279734 12076229 10148606 11110442 11810870 9693668 6805673
11265 6805673 5561783 4940978 3115174 743329 -412098 -110149 633086 907608 -110356
11256 -110356 -3215181 -7896646 -11520639 -10968484 -5754698 571960 3093891 497785
11248 497785 -3323509 -3920725 -1613608 -46878 -223295 753562 4592830 8854744 10506922
11239 10506922 9657624 7938478 5501331 1814123 -2019005 -3725955 -2166931 1519975
11231 1519975 4259115 2725255 -3430774 -9981427 -11954864 -9265801 -6172263 -5145998
11223 -5145998 -4395109 -1989584 1009855 2885251 3796121 4608824 5765666 8251545 12741837
$$ packed form
11282b809512M973934M674837j823456m428807k15151K734341M33406p52538L095950
11273E883004N891748K504982k203505j927623R61836P00428k117202k887995
11265F805673j243890o20805j825804k371845j155427L01949P43235K74522j017964
11256a10356l104825m681465l623993N52155N213786O326658K521931k596106
11248D97785l821294n97216K307117J566730j76417R76857L839268M261914J652178
11239A0506922q49298j719146k437147l687208l833128j706950J559024L686906
11231A519975K739140j533860o156029o550653j973437K689063L093538J026265
11223e145998P50889K405525K999439J875396R10870Q12703J156842K485879M490292
$$ plain form
11214 12741837 16844610 16583305 12029568 8094015 8086752 9844871 10006955 8600123 7178246
11205 7178246 5711829 3771889 1989264 365417 -1879031 -3289478 -1004357 3426153
11197 3426153 3798819 -1972412 -7399053 -5795183 861841 5774690 6231631 3958145
11189 3958145 366227 -2930840 -2032181 4525498 11085470 11126175 6516672 4195345 5133771
11180 5133771 3921791 -869338 -3606650 -539181 4826369 7784334 8199898 7461458
11172 7461458 4873660 547147 -2309123 -1612121 245324 363263 -381537 -87835 142924
11163 142924 -1503329 -3637551 -3794388 -2745206 -2994841 -4206812 -3840854 -1701650 -183191
11154 -183191 53241 1208557 4430515 7655056 8473954 6819640 3571389 -1291367 -7277490
$$ packed form
11214A2741837M102773k61305m553737l935553p263J758119J62084j406832j421877
11205G178246j466417j939940j782625j623847k244448j410447K285121M430510
11197C426153L72666n771231n426641J603870O657024M912849M56941k273486
11189C958145l591918l297067Q98659O557679O559972M0705m609503k321327R38426
11180E133771j211980m791129k737312L067469N365550K957965M15564p38440
11172G461458k587798m326513k856270O97002J857445J17939p44800K93702K30759
11163A42924j646253k134222j56837J049182k49635j211971L65958K139204J518459
11154a83191K36432J155316L221958L224541Q18898j654314l248251m862756n986123
$$ plain form
11145 -7277490 -11693341 -11750070 -8085475 -4336584 -2930669 -2691274 -1177389 1815193 4274878
11136 4274878 4938199 4585973 3784794 846251 -5921808 -14046286 -17467527 -13002680 -4794074
11127 -4794074 27823 -465216 -1759413 131624 3635718 4880591 3062504 193098
11119 193098 -2313921 -3975134 -3818151 -1775638 -339452 -1573636 -3419586 -2428504 784803
11110 784803 2874656 3724518 6022488 8905485 7881417 2466592 -1851945 -1533981 670018
11101 670018 1891929 3633227 6469514 6599405 2777784 756314 4476827 8163858
11093 8163858 4621274 -3112082 -6697356 -5367130 -4683260 -5169879 -2372351 2785654
11085 2785654 4064203 763971 -1355198 -938627 -2563698 -5652862 -3025048 5617870
$$ packed form
11145g277490m415851n6729L664595L748891J405915K39395J513885K992582K459685
11136D274878O63321l52226q01179k938543o768059q124478l421241M464847Q208606
11127d794074M821897m93039j294197J891037L504094J244873j818087k869406
11119A93098k507019j661213J56983K042513J436186j234184j845950R91082L213307
11110G84803K089853Q49862K297970K882997j024068n414825m318537L17964K203999
11101F70018J221911J741298K836287J29891l821621k021470L720513L687031
11093H163858l542584p733356l585274J330226O83870m86619K797528N158005
11085B785654J278549l300232k119169M16571j625071l089164K627814Q642918
$$ plain form
11077 5617870 9773024 3793170 -3348889 -1580288 5378739 7462687 3823600 1114538
11069 1114538 853279 -1253197 -5363247 -6234297 -2080472 2550590 3542310 1421669 -1577975
11060 -1577975 -4057226 -4803863 -3486782 -2166406 -3180926 -5904330 -7805720 -7432907
11052 -7432907 -4476125 617537 4818920 3788296 -1844080 -5340923 -3016064 -254763
11044 -254763 -3061582 -7823138 -6646257 -44353 3860015 1783825 -1231664 -1269313 -512514
11035 -512514 -634746 1552713 7851647 13294208 11755643 4242917 -2267344 -2947443 689846
11026 689846 4068286 4869898 4526878 5012333 5412888 3538254 667805 1080136 5118411
11017 5118411 6840818 2381741 -3001862 -1838880 3965622 5290120 -805821 -6819471
$$ packed form
11077E617870M155154n979854p142059J768601O959027K083948l639087k709062
11069A114538k61259k106476m110050q71050M153825M631062R91720k120641k999644
11060a577975k479251p46637J317081J320376j014520k723404j901390L72813
11052g432907K956782N093662M201383j030624n632376l496843K324859K761301
11044b54763k806819m761556J176881O601904L904368k076190l015489l7649P56799
11035e12514j22232K187459O298934N442561j538565p512726o510261o80099L637289
11026F89846L378440Q01612l43020M85455M00555j874634k870449M12331M038275
11017E118411J722407m459077n383603J162982N804502J324498o095941o013650
$$ plain form
11009 -6819471 -5544212 1072829 6695727 9085122 9826815 9203255 6028297 1260017
11001 1260017 -2058964 -2625809 -2366438 -3637217 -6058625 -6590249 -2714913 4310739 9774171
10992 9774171 9789967 5007153 -534513 -3486167 -3219750 -967345 1223817 1163709 -2005302
10983 -2005302 -6831012 -10998862 -13417084 -14151047 -13324591 -11318647 -9146907 -7419101
10975 -7419101 -5823013 -4491280 -4376984 -5199025 -4945851 -2910876 -1160963 -1262227 -1826754
10966 -1826754 -1297639 -520296 -39455 2136373 6583961 9185006 6409000 1854800 2319910
10957 2319910 8214815 12988766 12061321 7580152 3820328 2287503 2381241 3060962 2671470
10948 2671470 313789 -1811408 -526288 3449286 6299219 7305403 9963420 15314855
$$ packed form
11009f819471J275259O617041N622898K389395P41693o23560l174958m768280
11001A260017l318981n66845K59371j270779k421408n31624L875336P025652N463432
10992I774171J5796m782814n541666k951654K66417K252405K191162o0108l169011
10983b005302m825710m167850k418222p33963Q26456K005944K171740J727806
10975g419101J596088J331733J14296q22041K53174K034975J749913j01264n64527
10966a826754N29115P77343M80841K175828M447588K601045k776006m554200M65110
10957B319910N894905M773951r27445m481169l759824j532825R3738O79721l89492
10948B671470k357681k125197J285120L975574K849933J006184K658017N351435
$$ plain form
10940 15314855 18485048 15109287 8371904 5786588 9831187 14947166 14379884 8087456
10932 8087456 2461560 2404473 5210773 4146720 -2251523 -7635220 -6229219 -503309
10924 -503309 3063430 3435516 5102367 9321429 11017024 6247335 -1708702 -6634994
10916 -6634994 -6700189 -4467834 -1929611 828917 2937710 2377647 -903980 -3903809 -3894672
10907 -3894672 -1518412 569510 977568 8386 -2236746 -5860059 -9227455 -9536508 -6269369
10898 -6269369 -1881014 1917756 5714247 8731915 7530637 1659567 -3207156 -2563408
10890 -2563408 -105785 -1504597 -4381965 -2402626 2798893 3443109 -951686 -2654226
10882 -2654226 90380 -555262 -7338372 -11174418 -5875832 868312 160 -4453122
$$ packed form
10940A5314855L170193l375761o737383k585316M044599N115979n67282o292428
10932H087456n625896n7087K806300j064053o398243n383697J406001N725910
10924e03309L566739L72086J666851M219062J695595m769689p956037m926292
10916f634994o5195K232355K538223K758528K108793n60063l281627k999829R137
10907c894672K376260K087922M08058r69182k245132l623313l367396l09053L267139
10898f269369M388355L798770L796491L017668j201278n871070m866723O43748
10890b563408K457623j398812k877368J979339N201519O44216m394795j702540
10882b654226K744606o45642o783110l836046N298586O744144q68152m453282
$$ plain form
10874 -4453122 -3512736 1737733 4311114 4405584 6684297 9132088 6635927 2346358 3284159
10865 3284159 6840314 4125990 -4158491 -7847976 -3874843 -359851 -2160717 -4105829
10857 -4105829 -1965410 642909 569980 709245 2613274 2265503 -1866026 -4449595 -1968752
10848 -1968752 1379427 1294337 -44791 6264 -1195385 -5517656 -8284005 -5043632 440998
10839 440998 1243273 -2945341 -6541774 -6026041 -2541984 1206787 2695327 330102 -4019803
10830 -4019803 -5141891 -171837 7431658 11867401 11245902 8154356 5822383 5134476
10822 5134476 4019514 -410031 -7380430 -11396659 -8971768 -4716228 -5649881 -10582759
10814 -10582759 -11515077 -5574874 1385963 4173512 4176045 3912357 2599456 192468 -297651
$$ packed form
10874d453122R40386N250469K573381R4470K278713K447791k496161m289569R37801
10865C284159L556155k714324q284481l689485L973133L514992j800866j945112
10857d105829K140419K608319p2929J39265J904029l47771m131529k583569K480843
10848a968752L348179q5090j339128N1055j201649m322271k766349L240373N484630
10839D40998Q02275m188614l596433N15733L484057L748771J488540k365225m349905
10830d019803j122088M970054P603495M435743o21499l091546k331973o87907
10822E134476j114962m429545o970399m016229K424891M255540r33653m932878
10814a0582759r32318N940203O960837K787549K533k63688j312901k406988m90119
$$ plain form
10805 -297651 2101542 4160642 4189695 4635789 6367613 6120486 2683905 -31160 558747
10796 558747 1617816 597614 -358215 783440 2017349 1816242 2535463 5674944 8438683
10787 8438683 8206081 5746209 1642972 -4671445 -9901236 -8016301 -29911 4688183
10779 4688183 1448558 -2789499 -922065 3386024 3299778 618988 1670608 6223639
10771 6223639 8727037 7298734 4245911 563900 -3409314 -4610575 -868242 4427957
10763 4427957 6637503 6031960 4865284 2328449 -1904141 -3298939 1715618 8835910
10755 8835910 11146671 8273752 4498657 1504192 -730150 104334 4651637 7582209
10747 7582209 4702365 758429 2308235 6472562 5600648 92343 -2952980 -1692852
$$ packed form
10805b97651K399193K059100K9053M46094J731824k47127l436581k715065N89907
10796E58747J059069j020202r55829J141655J233909k01107P19221L139481K763739
10787H438683k32602k459872m103237o314417n229791J884935P986390M718094
10779D688183l239625m238057J867434M308089q6246k680790J051620M553031
10771F223639K503398j428303l052823l682011l973214j201261L742333N296199
10763D427957K209546o05543j166676k536835m232590j394798N014557P120292
10755H835910K310761k872919l775095k994465k234342Q34484M547303K930572
10747G582209k879844l943936J549806M164327q71914n508305l045323J260128
$$ plain form
10739 -1692852 -316097 544217 3735466 6552266 2882989 -4545991 -5089157 3804964
10731 3804964 11591032 9652270 2261127 -2293013 -3263344 -4162697 -4712153 -2901989 -617137
10722 -617137 -916837 -2451990 -1610516 1805668 4933069 5970959 4859491 1897501 -1528810
10713 -1528810 -2869538 -1594282 -486534 -1558846 -2856730 -1613991 1587729 4261459
10705 4261459 5611417 6081061 5050808 1897269 -1678777 -3127497 -2375674 -1288499
10697 -1288499 -146242 2675606 6993018 9443242 7781634 4912111 5613680 9288234
10689 9288234 9535391 3008657 -4483347 -4868474 933927 4220293 1238696 -1566357
10681 -1566357 2130986 8682248 10079155 5625844 1741968 1713415 2015268 -546325 -3486083
$$ packed form
10739a692852J376755Q60314L191249K816800l669277p428980n43166Q894121
10731C804964P786068j938762p391143m554140r70331q99353n49456J810164K284852
10722f17137k99700j535153Q41474L416184L127401J037890j111468k961990l426311
10713a528810j340728J275256J107748j072312j297884J242739L201720K673730
10705D261459J349958M69644j030253l153539l576046j448720P51823J087175
10697a288499J142257K821848M317412K450224j661608k869523P01569L674554
10689I288234K47157o526734p492004l85127N802401L286366k981597k805053
10681a566357L697343O551262J396907m453311l883876k8553L01853k561593k939758
$$ plain form
10672 -3486083 -2799947 1018480 3947017 3801118 2256657 1839157 2647135 2953171 2424227
10663 2424227 3002397 5569479 7454328 5817993 2542097 2131474 4680306 5220392 1528327
10654 1528327 -1805873 -176267 3621963 2948980 -3399951 -9528697 -9877554 -5179349
10646 -5179349 -251590 2046650 3039077 4778466 6238088 5029748 2364415 2496496
10638 2496496 5659116 6019895 390823 -5431103 -4668159 19560 1497517 279345
10630 279345 2330993 6552177 5524146 -621357 -2692849 2281299 5643348 1878604
10622 1878604 -1918632 1927582 9499578 12843503 11834381 10469731 8096655 2686451
10614 2686451 -2442067 -2949479 -337089 1700046 3043080 3907861 1853740 -2153579
$$ packed form
10672c486083O86136L818427K928537j45899j544461m17500Q07978L06036n28944
10663B424227N78170K567082J884849j636335l275896m10623K548832N40086l692065
10654A528327l334200J629606L798230o72983o348931o128746l48857M698205
10646e179349M927759K298240R92427J739389J459622j208340k665333J32081
10638B496496L162620L60779n629072n821926P62944M687719J477957j218172
10630B79345K051648M221184j028031o145503k071492M974148L362049l764744
10622A878604l797236L846214P571996L343925j009122j364650k373076n410204
10614B686451n128518n07412K612390K037135J343034Q64781k054121m007319
$$ plain form
10606 -2153579 -1490120 5624281 10467758 6330291 -301431 365299 6922449 11294784
10598 11294784 11549673 10432574 7021977 515400 -2599197 3693505 13577349 16277333
10590 16277333 11042810 5298674 1541114 -3148242 -7490866 -7034187 -3192598 -1408254
10582 -1408254 -1973365 -1637156 -1623766 -4678739 -7211754 -4201563 1223278 3042454 3351347
10573 3351347 7260124 10938575 7180915 -365937 -1783688 2686070 4451196 2882238
10565 2882238 5031350 9675898 7471267 -1106657 -3412496 5573780 14867083 14352764
10557 14352764 8060665 4424973 3551577 1146282 -2330925 -2879993 913644 6528944
10549 6528944 9409820 6135454 -715201 -3163698 1904782 7189722 5987804 3060086
$$ packed form
10606b153579O63459P114401M843477m137467o631722O66730O557150M372335
10598A1294784K54889j117099l410597o506577l114597O292702R883844K699984
10590A6277333n234523n744136l757560m689356m342624M56679L841589J784344
10582a408254n65111L36209J3390l054973k533015L010191N424841J819176L08893
10573C351347L908777L678451l757660p546852j417751M469758J765126j568958
10565B882238K149112M644548k204631q577924k305839Q986276R293303n14319
10557A4352764o292099l635692q73396k405295l477207n49068L793637N615300
10549F528944K880876l274366o850655k448497N068480N284940j201918k927718
$$ plain form
10541 3060086 5915551 11501043 12504511 11119009 13919468 18048636 16162932 10862399
10533 10862399 10068014 12145899 10342780 7647505 11275416 16529733 13329687 5154828
10525 5154828 3551084 7404125 6760807 3556162 7578592 14841936 12681706 4542709
10517 4542709 5748135 15359557 17370557 10194680 8602703 14791510 14975160 7605943
10509 7605943 6812327 14025973 15116728 9739469 13128202 24599544 26908536 21086827
10501 21086827 25926665 38324538 35118225 20545166 24822455 46169315 48637278 32092230
10493 32092230 40527469 77351342 88714693 73107717 120082867 261871217 362950043
10486 362950043 271013801 38577731 -127001324 -125351013 -56323010 -39447666 -62369311
$$ packed form
10541C060086K855465N585492J003468j385502K800459M129168j885704n300533
10533A0862399p94385K077885j803119k695275L627911N254317l200046q174859
10525E154828j603744L853041o43318l204645M022430P263344k160230q138997
10517D542709J205426R611422K011000p175877j591977O188807J83650p369217
10509G605943p93616P213646J090755n377259L388733J1471342K308992n821709
10501B1086827M839838J2397873l206313j4573059M277289K1346860K467963j6545048
10493C2092230Q435239L6823873J1363351j5606976M6975150J41788350J01078826
10486C62950043r1936242k32436070j65579055J650311O9028003J6875344k2921645
$$ plain form
10479 -62369311 -58570077 -32943647 -31028945 -47406298 -43992403 -23922442 -20153888 -32638019
10471 -32638019 -33765570 -21700543 -19009838 -27760328 -28741910 -19234431 -14640769 -17039905
10463 -17039905 -14462271 -7717278 -8908831 -16184945 -15879375 -7147351 -1448381 -918030
10455 -918030 1209296 2639467 -4408662 -15100787 -17370098 -12303080 -10711916 -13156705
10447 -13156705 -11650630 -7359437 -8094140 -11432470 -8590981 -2358791 -3120537 -9246784
10439 -9246784 -9496896 -3563805 -2217100 -7116780 -8053740 -1688875 3263032 1964462
10431 1964462 -40990 1030626 1483070 -964313 -3835636 -6729609 -10960744 -12670698
10423 -12670698 -7429538 -702871 -1725782 -8162615 -9879218 -6747562 -7837627 -12673533
$$ packed form
10479f2369311L799234K5626430J914702j6377353L413895K0069961L768554j2484131
10471c2638019j127551J2065027K690705q750490r81582R507479M593662k399136
10463a7039905K577634O744993j191553p276114L05570Q732024N698970N30351
10455i18030K127326J430171p048129j0692125k269311N067018J591164k444789
10447a3156705J506075M291193p34703l338330K841489O232190p61746o126247
10439i246784k50112N933091J346705m899680r36960O364865M951907j298570
10431A964462k005452J071616M52444k447383k871323k893973m231135j709954
10423a2670698N241160O726667j022911o436833j716603L131656j090065m835906
$$ plain form
10415 -12673533 -9676319 3349263 12812244 9268908 161173 -4237173 -5515045 -9763868
10407 -9763868 -15483768 -17404067 -15321973 -12020725 -8115300 -4520349 -4442222 -8105476
10399 -8105476 -10918979 -10883819 -11914559 -15795965 -17177734 -11542640 -2782228 2189566
10391 2189566 1994280 -371404 -3008092 -5174145 -5611648 -4801334 -5795293 -9622292 -12985994
10382 -12985994 -13177928 -11849202 -11382531 -11191429 -10310695 -10017128 -10966474 -11038491 -8910013
10373 -8910013 -6803550 -7021686 -8477853 -8968228 -8137852 -6233174 -3086492 -507153 -2237997
10364 -2237997 -8677917 -14587781 -15123254 -11748659 -9096844 -8041588 -5355963 685785
10356 685785 7425896 10751192 9297069 5564041 3469207 4618611 6957853 7370086
$$ packed form
10415a2673533K997214J3025582R462981l543336r107735m398346j277872m248823
10407i763868n719900j920299K082094L301248L905425L594951P8127l663254
10399h105476k813503L5160j030740l881406j381769N635094Q760412M971794
10391B189566j95286k365684k636688k166053m37503Q10314r93959l826999l363702
10382a2985994j91934J328726M66671J91102Q80734K93567r49346p2017K128478
10373h910013K106463k18136j456167m90375Q30376J904678L146682K579339j730844
10364b237997o439920n909864n35473L374595K651815J055256K685625O041748
10356F85785O740111L325296j454123l733028k094834J149404K339242M12233
$$ plain form
10348 7370086 4733785 -363092 -7022813 -12926700 -13800748 -7739884 691872 4461018
10340 4461018 1867182 -3191654 -7772495 -11703508 -13083664 -8403759 667117 6420289
10332 6420289 4752764 1102207 2359564 6618493 6453873 292149 -5460152 -5661710
10324 -5661710 -2462895 -388911 198244 1300549 1614398 -2493951 -9988449 -13581985
10316 -13581985 -8209048 1432238 5906251 2662951 -1985259 -2721269 -1548812 -2038611
10308 -2038611 -2750676 -792757 2266181 3391506 3854106 6159226 7675855 3978293
10300 3978293 -2801039 -5939181 -4083589 -2156513 -2038342 -143456 4023254 5046750
10292 5046750 1106569 -998670 4233530 11692461 12327897 5158882 -3219724 -7937290
$$ packed form
10348G370086k636301n096877o659721n903887q74048O060864Q431756L769146
10340D461018k593836n058836m580841l931013j380156M679905R070876N753172
10332F420289j667525l650557J257357M258929j64620o161724n752301k01558
10324e661710L198815K073984N87155J102305L13849m108349p494498l593536
10316a3581985N372937R641286M474013l243300m648210p36010J172457m89799
10308b038611p12065J957919L058938J125325M62600K305120J516629l697562
10300C978293o779332l138142J855592J927076J18171J894886M166710J023496
10292E046750l940181k105239N232200P458931O35436p169015q378606m717566
$$ plain form
10284 -7937290 -8774737 -6327759 -1571625 1822926 579201 -2845285 -2919054 919487 3553994
10275 3553994 1843911 -1697870 -3863252 -4928974 -6082905 -6467595 -5173231 -3385218
10267 -3385218 -2322994 -1442429 -793850 -2532228 -7072541 -9834506 -5894732 2544859
10259 2544859 7364158 4323912 -1543971 -2396336 2895736 8448175 9377005 6969959
10251 6969959 5650562 7410846 10352704 11058955 7353860 51256 -7046083 -10048671
10243 -10048671 -8740684 -6323175 -4972209 -3637335 -1283337 253808 -948601 -3177211
10235 -3177211 -3254945 -1463769 -1076782 -3144842 -4793600 -3295537 546231 3868319 4895619
10226 4895619 4092851 3469899 4825514 7580468 8954532 7670913 6212105 7144603 8624272
$$ packed form
10284g937290q37447K446978M756134L394551j243725l424486p3769L838541K634507
10275C553994j710083l541781k165382j065722j153931l84690J294364J788013
10267c385218J062224Q80565O48579j738378m540313k761965L939774Q439591
10259B544859M819299l040246n867883q52365N292072N552439R28830k407046
10251F969959j319397J760284K941858P06251l705095p302604p097339l002588
10243a0048671J307987K417509J350966J334874K353998J537145j202409k228610
10235c177211p7734J791176L86987k068060j648758J498063L841768L322088J027300
10226D895619q02768o22952J355615K754954J374064j283619j458808R32498J479669
$$ plain form
10217 8624272 6924259 2634322 282864 1649157 3681141 4011052 4223980 5662319
10209 5662319 5953883 2805949 -1538833 -2978227 -1014803 1429167 2608340 3578896
10201 3578896 5384384 6689892 4880813 -904531 -7917634 -11505922 -9567107 -4620553
10193 -4620553 -283291 2689541 4521250 2989531 -3301336 -9422079 -8291994 -1231675
10185 -1231675 2226504 -2531274 -8769865 -8895171 -5113968 -4226471 -7018575 -9289376
10177 -9289376 -9566714 -9154269 -7511118 -4206662 -2759044 -5561379 -7551923 -2819288
10169 -2819288 4437105 4505830 -2999582 -8636408 -8269173 -8277633 -12583103 -14881627 -9704968
10160 -9704968 -2511851 -1137047 -3735295 -3452177 -205432 912740 -146986 1248985
$$ packed form
10217H624272j700013m289937k351458J366293K031984L29911K12928J438339
10209E662319K91564l147934m344782j439394J963424K443970J179173R70556
10201C578896J805488J305508j809079n785344p013103l588288J938815M946554
10193d620553M337262K972832J831709j531719o290867o120743J130085P060319
10185a231675L458179m757778o238591j25306L781203Q87497k792104k270801
10177i289376k77338M12445J643151L304456J447618k802335j990544M732635
10169b819288P256393O8725p505412n636826L67235q460m305470k298524N176659
10160i704968P193117J374804k598248K83118L246745J118172j059726J395971
$$ plain form
10152 1248985 4839646 4638413 -1326992 -7253676 -7526950 -3419444 71921 220169 -2145472
10143 -2145472 -4281346 -3473026 92872 2316399 -107450 -4518966 -5544829 -2966127
10135 -2966127 -1561336 -2894978 -2933039 397734 3023815 1623926 -204472 2276307
10127 2276307 6322791 4852823 -2825877 -9022961 -7264261 316031 6675316 7704017
10119 7704017 4479480 232842 -2422776 -2484741 -1088039 -728269 -2367474 -3685126 -1916827
10110 -1916827 1763741 2964910 12430 -3038190 -1402090 3736486 6340832 3302678
10102 3302678 -1703808 -3246189 -721614 1964840 1880418 40256 -700241 964234 3579054
10093 3579054 4149016 789179 -4976660 -8882869 -7831329 -3177036 317773 -1139299
$$ packed form
10152A248985L590661k01233n965405n926684k73274M107506L491365J48248k365641
10143b145472k135874Q08320L565898K223527k423849m411516j025863K578702
10135b966127J404791j333642l8061L330773K626081j399889j828398K480779
10127B276307M046484j469968p678700o197084J758700P580292O359285J028701
10119G704017l224537m246638k655618o1965J396702L59770j639205j317652J768299
10110a916827L680568J201169k952480l050620J636100N138576K604346l038154
10102C302678n006486j542381K524575K686454q4422j840162p40497J664475K614820
10093C579054N69962l359837n765839l906209J051540M654293L494809j457072
$$ plain form
10085 -1139299 -6656384 -10656767 -7424247 2548443 11325457 11347816 4393181 -818280
10077 -818280 -405572 224877 -4012406 -9357056 -9351141 -5464154 -4897569 -9585497 -14103222
10068 -14103222 -14263523 -11464391 -7869052 -3496793 180886 -395773 -5023762 -7962911
10060 -7962911 -5241967 -7885 2424443 1387806 -457351 -2066345 -3936525 -5382646
10052 -5382646 -5575076 -5937721 -8330634 -11626108 -12598805 -9736689 -4557595 8672 1386708
10043 1386708 -1062851 -4878906 -6290258 -4284643 -1414724 107957 873768 1872582
10035 1872582 2304869 1355624 -282322 -2208763 -5068876 -7891985 -7648403 -3739506 -238623
10026 -238623 -1098957 -5408344 -9669273 -12160586 -12465362 -9564823 -3860738 1073763 2281880
$$ packed form
10085a139299n517085m000383L232520R972690Q777014K2359o954635n211461
10077h18280M12708O30449m237283n344650N915L886987N66585m687928m517725
10068a4103222j60301K799132L595339M372259L677679n76659m627989k939149
10060g962911K720944N234082K432328j036637j845157j608994j870180j446121
10052e382646j92430l62645k392913l295474r72697K862116N179094M566267J378036
10043A386708k449559l816055j411352K005615K869919J522681P65811R98814
10035A872582M32287r49245j637946j926441k860113k823109K43582L908897L500883
10026b38623q60334m309387m260929k491313l04776K900539N704085M934501J208117
$$ plain form
10017 2281880 1339153 1361756 1952707 678688 -1884371 -2472704 -58793 2706172 2910842
10008 2910842 117377 -3751807 -5605259 -3513117 528261 1967506 -475489 -2866501
10000 -2866501 -2079678 -545222 -1715560 -4002351 -3732722 -1784065 -2105269 -4754684 -5427760
9991 -5427760 -1879011 3233367 6021871 4773518 304378 -4000238 -3677430 1761892
9983 1761892 6563394 5332018 383276 -1964583 -838083 -855441 -3387341 -4310921 -1608529
9974 -1608529 992512 538525 -283908 1557370 3336437 361536 -6089074 -9127402 -4880650
9965 -4880650 2265689 4705921 742528 -3569139 -2566598 1338328 1476931 -2628378
9957 -2628378 -4119737 244213 3995096 409083 -6674129 -7953727 -1979573 3461220
$$ packed form
10017B281880r42727K2603N90951j274019k563059n88333K413911K764965K04670
10008B910842k793465l869184j853452K092142M041378J439245k442995k391012
10000b866501P86823J534456j170338k286791K69629J948657l21204k649415o73076
9991e427760L548749N112378K788504j248353m469140m304616L22808N439322
9983A761892M801502j231376m948742k347859J126500j7358k531900r23580K702392
9974a608529K601041m53987q22433J841278J779067k974901o450610l038328M246752
9965d880650P146339K440232l963393m311667J002541L904926J38603m105309
9957b628378j491359M363950L750883l586013p083212j279598N974154N440793
$$ plain form
9949 3461220 2425209 -2973223 -7493635 -8302325 -5130857 -70480 2191372 -1186225
9941 -1186225 -5965413 -5073845 1152654 4431588 -13480 -6737405 -7808473 -3117768
9933 -3117768 784264 -244283 -3634153 -4384347 -1330239 1727146 1018073 -2030044 -2639927
9924 -2639927 263587 2383434 1053374 -347398 1646301 4400412 3855052 1891618
9916 1891618 3152302 7049627 9155559 8647934 8003198 6812204 2650048 -2741721 -4874084
9907 -4874084 -3849178 -3944033 -6011865 -6473744 -3898877 -741570 1395076 2756186 2332492
9898 2332492 -740896 -3782989 -4075314 -3938909 -6535483 -9425087 -8938598 -7403734 -8307298
9889 -8307298 -8438909 -3854863 942661 83368 -2577116 -1098820 154563 -4160157 -6326235
$$ packed form
9949C461220j036011n398432m520412q08690L171468N060377K261852l377597
9941a186225m779188Q91568O226499L278934m445068o723925j071068M690705
9933c117768L902032j028547l389870p50194L054108L057385p09073l048117o09883
9924b639927K903514K119847j330060j400772J993699K754111n45360j963434
9916A891618J260684L897325K105932n07625o44736j190994m162156n391769k132363
9907d874084J024906r4855k067832m61879K574867L157307K136646J361110m23694
9898B332492l073388l042093k92325J36405k596574k889604M86489J534864r03564
9889h307298j31611M584046M797524q59293k660484J478296J253383m314720k166078
$$ plain form
9880 -6326235 1119506 6460644 -3057564 -12319632 -405689 11524395 -22100974 -94097588
9872 -94097588 -130753342 -83994645 -92761 41759501 30364977 16173187 24017273
9865 24017273 27342523 8295160 -9543118 -4356304 8688292 7627572 -808440 552141
9857 552141 7766426 6290262 -2098601 -4888507 -1337816 -167367 -1730763 504090
9849 504090 5336861 5669079 2063044 1587102 4926316 5818931 2387018 -585174 -374004
9840 -374004 664193 686673 462285 150057 -663927 -436789 2125436 4463871 3221699
9831 3221699 -230880 -1408005 1220990 5294584 8408038 9661310 8759475 6615556
9823 6615556 5570923 6478810 7010919 4871010 728275 -3773214 -8117090 -10912499 -9222253
$$ packed form
9880f326235P445741N341138r518208r262068J1913943J1930084l3625369p1996614
9872i4097588l6655754M6758697Q3901884M1852262j1394524j4191790P844086
9865B4017273L325250j9047363j7838278N186814J3044596j060720q436012J360581
9857E52141P214285j476164q388863k789906L550691J170449j563396K234853
9849E04090M832771L32218l606035m75942L339214Q92615l431913k972192K11170
9840c74004J038197K2480k24388l12228q13984K27138K562225K338435j242172
9831C221699l452579j177125K628995M073594L113454J253272r01835k143919
9823F615556j044633R07887N32109k139909m142735m501489m343876k795409J690246
$$ plain form
9814 -9222253 -3069975 2385172 2854219 644923 585810 2501265 2295850 -674523 -2183071
9805 -2183071 398806 4063368 4191244 352394 -3618425 -4427039 -2830062 -2105939 -3624459
9796 -3624459 -4975795 -3100024 1642408 5767968 6454631 3736861 -371504 -3374525
9788 -3374525 -3617887 -1834345 -638556 -902035 -86733 3560838 7073848 6563946 3574060
9779 3574060 3190654 6138524 7481288 4059464 -1064948 -3238262 -1783486 1015386
9771 1015386 3791613 6884069 10756813 14824800 16934009 14293199 6695826 -1779286
9763 -1779286 -6582452 -7463140 -6802853 -4551204 1015398 7891142 10600706 7186030 2090938
9754 2090938 479470 2830246 6562135 9811116 11654865 11227116 8952281 7193803
$$ packed form
9814i222253O152278N455147M69047k209296n9113J915455k05415k970373j508548
9805b183071K581877L664562J27876l838850l970819q08614J596977P24123j518520
9796c624459j351336J875771M742432M125560O86663k717770m108365l003021
9788c374525k43362J783542J195789k63479Q15302L647571L513010n09902k989886
9779C574060l83406K947870J342764l421824n124412k173314J454776K798872
9771A015386K776227L092456L872744M067987K109209k640810p597373q475112
9763a779286m803166q80688O60287K251649N566602O875744K709564l414676n095092
9754B090938j611468K350776L731889L248981J843749m27749k274835j758478
$$ plain form
9746 7193803 7811641 9754515 10181981 7693013 4006496 2327053 3663448 5249388 4124806
9737 4124806 1645305 1425653 3053316 2509201 -205191 265090 5699273 10330023 9868535
9728 9868535 7894383 7771609 5373491 -2348268 -8339471 -5162705 1580215 1241143 -4328905
9719 -4328905 -4404154 1441515 2363554 -4600459 -9046273 -4737731 810689 153389 -2604639
9710 -2604639 -1418696 837220 -626574 -2820916 -570658 4502437 7942515 9893098
9702 9893098 12053594 12593888 10279744 8389738 8660672 6919148 808785 -4091120 -2898157
9693 -2898157 -608435 -4549783 -11920702 -13406981 -6755945 1127784 4374394 3664592
9685 3664592 2231295 2100195 4112000 7237729 8108912 4388863 -2106630 -7519171 -9240418
$$ packed form
9746G193803O17838J942874M27466k488968l686517j679443J336395J585940j124582
9737D124806k479501k19652J627663n44115k714392M70281N434183M630750m61488
9728I868535j974152j22774k398118p721759n991203L176766O742920l39072n570048
9719d328905p5249N845669R22039o964013m445814M308542N548420o57300k758028
9710b604639J185943K255916j463794k194342K250258N073095L440078J950583
9702I893098K160496N40294k314144j890006K70934j741524o110363m899905J192963
9693b898157K289722l941348p370919j486279O651036P883729L246610p09802
9685C664592j433297j31100K011805L125729Q71183l720049o495493n412541j721247
$$ plain form
9676 -9240418 -6022847 1342416 7648923 6334506 -2343954 -10800706 -14122439 -14845915
9668 -14845915 -15083970 -11344720 -2175223 6081098 7629555 5540875 5339591 6004751 4216499
9659 4216499 1919722 2018311 1696366 -1861838 -3953749 610695 7147256 7163539 1589727
9650 1589727 -1514310 8513 1199659 41777 -734173 -863065 -2478379 -3573247 -448829
9641 -448829 3924464 3132957 -1376654 -1778941 2827844 4438755 -695762 -6286472 -6400381
9632 -6400381 -3385258 -1859530 -1872469 -1679013 -1423258 -1018951 445765 1233039 -1583534
9623 -1583534 -5807371 -5623247 -1003806 1418169 -823124 -1798897 2641447 7560261 6614266
9614 6614266 1308970 -2416158 -2254779 295278 3568268 5271655 2499033 -3450272
$$ packed form
9676i240418L217571P365263O306507j314417q678460q456752l321733p23476
9668a4845915k38055L739250R169497Q256321J548457k088680k01284O65160j788252
9659D216499k296777R8589l21945l558204k091911M564444O536561J6283n573812
9650A589727l104037J522823J191146j157882p75950j28892j615314j094868L124418
9641d48829M373293p91507m509611m02287M606785J610911n134517n590710j13909
9632f400381L015123J525728j2939J93456K55755M04307J464716P87274k816573
9623a583534m223837J84124M619441K421975k241293r75773M440344M918814r45995
9614F614266n305296l725128J61379K550057L272990J703387k772622n949305
$$ plain form
9606 -3450272 -6060231 -1789223 4265735 5379474 2486811 1441004 3700573 5297502
9598 5297502 3796039 1062810 -911859 -2735060 -5340326 -7910338 -9100769 -8716070
9590 -8716070 -7456226 -5687903 -2782068 2041275 7638191 10629834 9083897 5887376
9582 5887376 5648366 8289777 9055655 5471027 595029 -2072526 -3162345 -4481079 -4771514
9573 -4771514 -1900313 2541872 4251575 1445529 -3139402 -5376758 -3664008 -122544
9565 -122544 1408427 -710107 -3753730 -3644099 -185164 2701866 2371791 492316 -569213
9556 -569213 -1745102 -5200418 -9901602 -12231149 -10951809 -9186996 -10399789 -13520927
9548 -13520927 -13554306 -7397806 1897554 7917243 7630211 3642261 -350144 -3637918 -6578167
$$ packed form
9606c450272k609959M271008O054958J113739k892663j045807K259569J596929
9598E297502j501463k733229j974669j823201k605266k570012j190431L84699
9590h716070J259844J768323K905835M823343N596916K991643j545937l196521
9582E887376k39010K641411P65878l584628m875998k667555j089819j318734k90435
9573d771514K871201M442185J709703k806046m584931k237356J712750L541464
9565a22544J530971k118534l043623J09631L458935K887030l30075j879475j061529
9556e69213j175889l455316m701184k329547J279340J764813j212793l121138
9548a3520927l3379O156500R295360O019689k87032l987950l992405l287774k940249
$$ plain form
9539 -6578167 -7497041 -4845725 -1185714 -1512049 -7294822 -14305797 -16569665 -11458539 -1926524
9530 -1926524 5044425 4135590 -2129530 -5019622 99300 7676885 9513608 5392780
9522 5392780 1374745 72937 -903456 -1847216 440142 5879560 9544817 9104191 8090186
9513 8090186 8935028 8070932 1781429 -7232702 -13290073 -14816781 -14254530 -13240512 -11524380
9504 -11524380 -9106710 -6277229 -2614970 1533407 3794155 2494402 -266502 -690578
9496 -690578 1957700 4638267 4540719 2240297 353265 -224466 -1725417 -6218572 -11319939
9487 -11319939 -11736718 -6544813 -2071121 -4205276 -10024735 -11700130 -7570554 -3705637
9479 -3705637 -4123458 -5522350 -3947131 -1207027 -904789 -2203859 -2067952 -1156006 -2873759
$$ packed form
9539f578167r18874K651316L660011l26335n782773p010975k263868N111126R532015
9530a926524O970949r08835o265120k890092N118922P577585J836723m120828
9522E392780m018035j301808r76393r43760K287358N439418L665257m40626j014005
9513H090186Q44842q64096o289503r014131o057371j526708N62251J014018J716132
9504a1524380K417670K829481L662259M148377K260748j299753k760904m24076
9496f90578K648278K680567r7548k300422j887032n77731j500951m493155n101367
9487a1319939m16779N191905M473692k134155n819459j675395M129576L864917
9479c705637m17821j398892J575219K740104L02238j299070J35907R11946j717753
$$ plain form
9470 -2873759 -7455089 -10832686 -9690715 -5213116 -1374698 -910252 -3228042 -5559525
9462 -5559525 -5904953 -4607668 -2843482 -807363 1258063 1785785 179953 -884114 1168124
9453 1168124 4116994 3913095 1856447 3341290 8487994 10058224 3641123 -5389856
9445 -5389856 -9261076 -7766071 -5846764 -4758715 -1907313 2141219 3155571 490802
9437 490802 -834200 2258114 5377761 2271318 -6246197 -12694449 -11934751 -6610979 -2666428
9428 -2666428 -2085064 -2422679 -1948728 -1696623 -2132754 -1420148 1094830 2585245 725645
9419 725645 -2175812 -2279401 -29898 505533 -2653358 -7367225 -10316794 -9228356 -3492673
9410 -3492673 4017759 7051071 2053451 -6476491 -10719678 -8880782 -5483192 -3401801
$$ packed form
9470b873759m581330l377597J141971M477599L838418M64446k317790k331483
9462e559525l45428J297285J764186K036119K065426N27722j605832j064067K052238
9453A168124K948870k03899k056648J484843N146704J570230o417101r030979
9445e389856l871220J495005J919307J088049K851402M048532J014352k664769
9437D90802j325002L092314L119647l106443q517515o448252P59698N323772L944551
9428b666428N81364l37615M73951K52105m36131P12606K514978J490415j859600
9419G25645k901457j03589K249503N35431l158891m713867k949569J088438N735683
9410c492673P510432L033312m997620q529942m243187J838896L397590K081391
$$ plain form
9402 -3401801 -1294076 972134 588333 -2823071 -5518894 -5479118 -5208092 -6554854 -7310639
9393 -7310639 -5384566 -2201977 424331 2846572 4787676 4064483 583859 -2078274
9385 -2078274 -1399756 1114912 3117876 3593550 899115 -5994271 -12580712 -11331771 -2173778
9376 -2173778 5471723 4709505 -662021 -3922352 -4796622 -5652842 -4696649 -170055 3301230
9367 3301230 159708 -7228202 -11788569 -11102732 -7553930 -2502659 2898960 4201765
9359 4201765 -1442866 -8893220 -10686652 -7167554 -3882415 -1405608 3746779 9842186
9351 9842186 11245178 8850493 9368229 13067143 12355345 5489007 1770930 7869791 17136505
9342 17136505 18879234 12081296 3615212 -2051677 -4845285 -4761178 -2232341 -507375
$$ packed form
9402c401801K107725K266210l83801l411404k695823L9776K71026j346762p55785
9393g310639J926073L182589K626308K422241J941104p23193l480624k662133
9385b078274O78518K514668K002964M75674k694435o893386o586441J248941R157993
9376b173778P645501p62218n371526l260331q74270q56220R56193M526594L471285
9367C301230l141522p387910m560367O85837L548802N051271N401619J302805
9359D201765n644631p450354j793432L519098L285139K476807N152387O095407
9351I842186J402992k394685N17736L698914p11798o866338l718077O098861R266714
9342A7136505J742729o797938q466084n666889k793608Q4107K528837J724966
$$ plain form
9334 -507375 -1973838 -3844870 -2360901 766624 1307247 101006 1705930 5938898 6932796
9325 6932796 2028850 -3560003 -3723125 431003 2735454 488529 -2386738 -772825
9317 -772825 5174229 10176690 9922763 5724756 2348026 2082343 2800231 1960392 130416
9308 130416 -877817 -1324829 -2580533 -3952271 -3205162 -146949 2662218 3073121 1204098
9299 1204098 -2060661 -6013632 -8822170 -7940624 -3599253 214628 480166 -886186 -389179
9290 -389179 1393814 1215935 -622253 -139253 3416831 5248864 2006109 -3001297 -5020553
9281 -5020553 -4738338 -5384507 -5647027 -1315887 6710663 11836965 10204302 5147212 1899585
9272 1899585 1835796 3416132 5098298 5551981 4160428 2663462 3048394 3018722 -1920331
$$ packed form
9334e07375j466463j871032J483969L127525N40623j206241J604924M232968R93898
9325F932796m903946n588853j63122M154128K304451k246925k875267J613913
9317g72825N947054N002461k53927m198007l376730k65683P17888q39839j829976
9308A30416j008233m47012j255704j371738P47109L058213K809167M10903j869023
9299A204098l264759l952971k808538Q81546M341371L813881K65538j366352M97007
9290c89179J782993j77879j838188M83000L556084J832033l242755n007406k019256
9281e020553K82215o46169k62520M331140Q026550N126302j632663n057090l247627
9272A899585o3789J580336J682166M53683j391553j496966L84932k9672m939053
$$ plain form
9263 -1920331 -10203649 -13317842 -6569622 3861489 8910078 7676895 5532042 4694924
9255 4694924 2951114 -47399 -1642920 -1314468 -1559585 -3038297 -3456274 -2039464 -780030
9246 -780030 -152854 2251519 7168408 11384538 12102390 10606130 9353866 7938964 4550163
9237 4550163 -227689 -3727533 -4611990 -3874762 -2773255 -1629732 -807637 -1190775 -2847195
9228 -2847195 -4263965 -4129815 -3408257 -4050804 -5459934 -4311863 619600 5260113 4465893
9219 4465893 -1386876 -6951457 -8784043 -8489046 -8675870 -9181132 -8574936 -6693434 -4411511
9210 -4411511 -3102814 -4651114 -8948836 -11319668 -6887752 1523082 5106547 854889
9202 854889 -3912149 -2150577 3421587 6217580 5828629 5748083 5148677 537922 -6398829
$$ packed form
9263a920331q283318l114193O748220J0431111N048589j233183k144853q37118
9255D694924j743810k998513j595521L28452k45117j478712m17977J416810J259434
9246g80030O27176K404373M916889M216130P17852j496260j252264j414902l388801
9237D550163m777852l499844q84457P37228J101507J143523Q22095l83138j656420
9228b847195j416770J34150P21558o42547j409130J148071M931463M640513p94220
9219D465893n852769n564581j832586K94997j86824n05262O06196J881502K281923
9210d411511J308697j548300m297722k370832M431916Q410834L583465m251658
9202H54889m767038J761572N572164K795993l88951q0546n99406m610755o936751
$$ plain form
9193 -6398829 -9888586 -8322647 -5127174 -2049083 2034525 5745084 5239673 765258
9185 765258 -2334647 -565933 4169470 8580154 11088692 10717944 7734797 5769723 8362780
9176 8362780 13056122 13984559 10384613 6761818 4629082 1273306 -2169192 287935
9168 287935 9040104 15204213 12477291 6216670 4749739 7165284 6799368 2939103 1363403
9159 1363403 4865188 10032683 13138705 13608479 11559492 7024347 2499401 2080005 6562280
9150 6562280 11999604 14009495 11735648 7606034 5092630 6379663 10286735 12941562
9142 12941562 12237394 10510481 10560546 10561584 6487012 -987549 -6090508 -5245516 -1139798
9133 -1139798 2024431 3945194 6157156 7144976 3700093 -3124533 -7447967 -5734148
$$ packed form
9193f398829l489757J565939L195473L078091M083608L710559n05411m474415
9185G65258l099905J768714M735403M410684K508538l70748k983147j965074K593057
9176H362780M693342R28437l599946l622795k132736l355776l442498K457127
9168B87935Q752169O164109k726922o260621j466931K415545l65916l860265j575700
9159A363403L501785N167495L106022M69774k048987m535145m524946m19396M482275
9150F562280N437324K009891k273847m129614k513404J287033L907072K654827
9142A2941562p04168j726913N0065J038m074572p474561n102959Q44992M105718
9133a139798L164229J920763K211962R87820l444883o824626m323434J713819
$$ plain form
9125 -5734148 -1707150 -1166741 -3575596 -2877942 3201167 9252493 9868528 7255086 7018251
9116 7018251 9005790 7870945 2212252 -2563456 -2006287 1457570 2954224 1990042 1819652
9107 1819652 4292707 8172251 11240358 11973485 10221507 7677850 6463799 6370424 5289857
9098 5289857 3060743 2236894 3831661 5401693 5283519 5478590 7633105 9393478 8406522
9089 8406522 7073988 8667253 10733850 7940039 960961 -3258814 -1289007 1976654
9081 1976654 816977 -3338342 -5140538 -3568548 -2349822 -3145340 -2989291 250971 3417552
9072 3417552 1957004 -3161016 -5574874 -1131355 6836892 11189502 8571576 1723014
9064 1723014 -4734577 -8426968 -9122011 -7080521 -3139073 676798 2292526 1514204 281212
$$ packed form
9125e734148M026998N40409k408855O97654O079109O051326O16035k613442k36835
9116G018251J987539j134845n658693m775708N57169L463857J496654r64182j70390
9107A819652K473055L879544L068107P33127j751978k543657j214051r3375j080567
9098E289857k229114q23849J594767J570032j18174J95071K154515J760373r86956
9089H406522j332534J593265K066597k793811o979078m219775J969807L265661
9081A976654j159677m155319j802196J571990J218726p95518J56049L240262L166581
9072C417552j460548n118020k413858M443519P968247M352610k617926o848562
9064A723014o457591l692391o95043K041490L941448L815871J615728p78322j232992
$$ plain form
9055 281212 810232 3301333 5372716 4441872 1178716 -542498 1629046 5106990 5735604
9046 5735604 3447015 1571680 1064961 -631199 -4153374 -5749254 -2656361 2142554
9038 2142554 3634137 1291755 -1148249 -1149868 339378 1492437 1869262 1994242 2390592
9029 2390592 3050422 2964512 989740 -1923399 -2980366 -1543659 -874280 -3325263 -5612356
9020 -5612356 -2664388 4372811 8178875 4325213 -3234806 -7680830 -7524045 -6498691
9012 -6498691 -6925931 -6643038 -2957758 2812093 6337190 5028275 550568 -3318767 -4379493
9003 -4379493 -3207801 -1466575 -25972 1141277 1962345 1864876 549194 -1055784 -1234212
8994 -1234212 390279 1471577 -847876 -5837875 -9044959 -7729046 -4869984 -5360455
$$ packed form
9055B81212N29020K491101K071383r30844l263156j721214K171544L477944O28614
9046E735604k288589j875335n06719j696160l522175j595880L092893M798915
9038B142554J491583k342382k440004j619J489246J153059L76825J24980L96350
9029B390592O59830q5910j974772k913139j056967J436707O69379k450983k287093
9020e612356K947968P037199L806064l853662p560019m446024J56785J025354
9012f498691m27240K82893L685280N769851L525097j308915m477707l869335j060726
9003d379493J171692J741226J440603J167249Q21068r7469j315682j604978j78428
8994a234212J624491J081298k319453m989999l207084J315913K859062m90471
$$ plain form
8986 -5360455 -9133375 -11106863 -8046227 -2429575 1422132 2257037 1348012 -576996 -3528767
8977 -3528767 -6603498 -8259016 -7953243 -6364642 -4409034 -2739727 -1564206 -452102
8969 -452102 883899 1461742 25194 -2516076 -3331196 -1141736 1991058 3142062 1555064
8960 1555064 -1212140 -2714322 -1037457 3285143 6647331 6024163 3290862 2740722 4128402
8951 4128402 2751943 -1992213 -3549069 2398244 10013125 10397580 3789034 -1523038
8943 -1523038 -1173497 852459 156148 -1922482 -2349768 -1755821 -2467136 -4249163 -5217179
8934 -5217179 -5166328 -5168854 -4859505 -2653559 1389409 4745018 5122819 3246621 2124985
8925 2124985 3271948 4323620 1752066 -4013849 -8184821 -7368725 -3650275 -1098359
$$ packed form
8986e360455l772920j973488L060636N616652L851707Q34905r09025j925008k951771
8977c528767l074731j655518L05773J588601J955608J669307J175521J112104
8969d52102J336001N77843j436548k541270q15120K189460L132794J151004j586998
8960A555064k767204j502182J676865M322600L362188o23168k733301n50140J387680
8951D128402j376459m744156j556856N947313P614881L84455o608546n312072
8943a523038L49541K025956o96311k078630m27286N93947p11315j782027r68016
8934e217179N0851k526L09349K205946M042968L355609L77801j876198j121636
8925B124985J146963J051672k571554n765915m170972Q16096L718450K551916
$$ plain form
8917 -1098359 -335589 526290 1197141 -583707 -4391157 -6554941 -5157371 -2452872 -1065113
8908 -1065113 -484330 1015349 3026576 3363299 676455 -4293419 -9070623 -10613275 -7526118
8899 -7526118 -1661203 3615351 6735131 8097532 7645941 5041672 2255093 2521831 5536433
8890 5536433 6920149 4322855 1034869 1055353 3375741 4532617 4703683 6977554 11236321
8881 11236321 13185503 10456551 6129515 4245019 4359286 3147815 28840 -1823895
8873 -1823895 -273591 2557483 3368784 2392098 2733971 5478736 8133028 8666248 8312084
8864 8312084 8383375 6925795 2050550 -3035812 -3036701 1333423 3207045 -807048 -5509486
8855 -5509486 -4730076 -165854 1674150 -1307343 -5469252 -7908635 -9262279 -10192238 -9672882
$$ packed form
8917a098359P62770Q61879O70851j780848l807450k163784J397570K704499J387759
8908a065113N80783J499679K011227L36723k686844m969874m777204j542652L087157
8899g526118N864915N276554L119780J362401m51591k604269k786579K66738L014602
8890E536433J383716k597294l287986K0484K320388J156876J71066K273871M258767
8881A1236321J949182k728952m327036j884496J14267j211471l118975j852735
8873a823895J550304K831074Q11301r76686L41873K744765K654292N33220l54164
8864H312084P1291j457580m875245n086362q89M370124J873622m014093m702438
8855e509486P79410M564222J840004k981493m161909k439383j353644r29959N19356
$$ plain form
8846 -9672882 -7523117 -4849763 -1251847 4673181 11142605 13445141 9917572 4131036
8838 4131036 -346086 -3492677 -5443307 -4292742 -480294 1083238 -2392766 -6634129
8830 -6634129 -6803823 -5172187 -6184187 -7381503 -3432347 2662003 2247565 -4258966 -5711902
8821 -5711902 2769905 10811620 7558051 -2366277 -6425260 -2229607 1904105 1525769
8813 1525769 717735 2196245 2513909 -281822 -2039838 658461 4844693 6128727 4835170
8804 4835170 3735645 3455081 3401967 4019713 5063104 4493123 1840785 -69790 673317
8795 673317 1963277 1448600 565407 1672209 3468647 2519259 -2076500 -7912921 -11738197
8786 -11738197 -11172584 -6260074 -844213 431037 -1947110 -2950734 -1154934 -1310301
$$ packed form
8846i672882K149765K673354L597916N925028O469424K302536l527569n786536
8838D131036m477122l146591j950630J150565L812448J563532l476004m241363
8830f634129j69694J631636j012000j197316L949156O094350m14438o506531j452936
8821e711902Q481807Q041715l253569r924328m058983M195653M133712l78336
8813A525769q08034J478510L17664k795731j758016K698299M186232J284034j293557
8804D835170j099525k80564n3114O17746J043391n69981k652338j910575P43107
8795F73317J289960n14677q83193J106802J796438r49388m595759n836421l825276
8786a1738197N65613M912510N415861J275250k378147j003624J795800j55367
$$ plain form
8778 -1310301 -5705273 -8688279 -5183197 219850 -377316 -6198368 -9787133 -8691963
8770 -8691963 -6954609 -5927961 -2316961 3766167 7044802 5635974 4088887 5043603
8762 5043603 4680363 98266 -4986806 -6229739 -4949187 -3863593 -1587629 3245428
8754 3245428 6635341 4237626 -939383 -2019385 1923932 5173065 3998372 810424
8746 810424 -734970 -395548 39751 -362972 -1343215 -1945471 -810650 2416731 5951077
8737 5951077 7621250 7447308 7117898 7664684 9078167 10992280 11929201 9417882 3452189
8728 3452189 -1402543 -463511 4998571 9057465 8280820 4745967 1948972 698675 -256342
8719 -256342 -1976315 -4606656 -7164489 -7625973 -4916410 -973092 990961 383569 -459628
$$ packed form
8778a310301m394972k983006L505082N403047n97166n821052l588765J095170
8770h691963J737354J026648L611000O083128L278635j408828j547087R54716
8762E043603l63240m582097n085072j242933J280552J085594K275964M833057
8754C245428L389913k397715n177009j080002L943317L249133j174693l187948
8746H10424j545394L39422M35299m02723r80243o02256J134821L227381L534346
8737E951077J670173j73942l29410N46786J413483J914113R36921k511319n965693
8728C452189m854732R39032N462082M058894p76645l534853k796995j250297r55017
8719b56342j719973k630341k557833m61484K709563L943318J964053o07392q43197
$$ plain form
8710 -459628 192245 1718791 2844985 2639047 -195317 -5984652 -11365460 -11251750 -5365172
8701 -5365172 -63257 -1169238 -6892979 -10552305 -9041271 -5662455 -4864888 -6941135
8693 -6941135 -8740997 -7831722 -4751658 -1923703 -1320223 -3061652 -5671976 -7380851 -7272478
8684 -7272478 -5577706 -3265699 -1335035 -180708 478638 1073659 1748481 2345586 2400098
8675 2400098 1410236 51895 780966 5258037 10738418 11644605 6434221 386227 -1181308
8666 -1181308 -194636 -2348586 -7682093 -9620953 -3977422 5548151 12279483 13166845 8972206
8657 8972206 1975813 -3933585 -4490654 200453 4559430 4186663 1348730 842977 2981236
8648 2981236 4571327 4818457 5587578 6686340 5636691 2449357 447020 1289069 2580184
$$ packed form
8710d59628O51873J526546J126194k05938k834364n789335n380808J13710N886578
8701e365172N301915j105981n723741l659326J511034L378816P97567k076247
8693f941135j799862R09275L080064K827955O03480j741429k610324j708875J08373
8684g272478J694772K312007J930664J154327O59346N95021O74822N97105N4512
8675B400098r89862j358341P29071M477071N480381R06187n210384o047994j567535
8666a181308R86672k153950n333507j938860N643531R525573O731332Q87362m194639
8657H972206o996393n909398n57069M691107M358977l72767k837933n05753K138259
8648B981236J590091K47130P69121J098762j049649l187334k002337Q42049J291115
$$ plain form
8639 2580184 1743301 -507001 -1976007 -2043172 -1431099 -467470 1142157 3563462 6327210
8630 6327210 8095253 7503824 5163251 3607635 3733766 3017316 -292356 -3160334 -1670886
8621 -1670886 2404466 3506340 308154 -3044881 -3944627 -4329951 -5638700 -6198784 -5699419
8612 -5699419 -6977388 -10481666 -11918492 -8831305 -4750942 -2863955 -464709 5254610
8604 5254610 10500767 10299155 7049363 6592930 8274027 6645366 1726840 -737620 557670
8595 557670 490132 -2544198 -2952759 2128806 6517025 3789740 -3212900 -7480953 -8082576
8586 -8082576 -9054484 -11128067 -11399295 -10095226 -11092633 -14918955 -16542711 -12019827 -3692917
8577 -3692917 3047508 5369249 3620535 -1118664 -7477353 -12724536 -13764644 -10163723
$$ packed form
8639B580184q36883k250302j469006o7165O12073R63629J609627K421305K763748
8630F327210J768043n91429k340573j555616J26131p16450l309672k867978J489448
8621a670886M075352J101874l198186l353035q99746l85324j308749n60084M99365
8612e699419j277969l504278j436826L087187M080363J886987K399246N719319
8604E254610N246157k01612l249792m56433J681097j628661m918526k464460J295290
8595E57670o7538l034330m08561N081565M388219k727285p002640m268053o01623
8586h082576r71908k073583k71228J304069r97407l826322j623756M522884Q326910
8577c692917O740425K321741j748714m739199o358689n247183j040108L600921
$$ plain form
8569 -10163723 -5446985 -4124906 -6713739 -8611348 -5660546 -355880 533203 -4572320
8561 -4572320 -8723387 -5527345 1657766 4411558 1369613 -397076 3413948 7968118
8553 7968118 7029718 2062129 -894142 -220820 493118 -851796 -2450170 -2892068 -3452758
8544 -3452758 -5016804 -6145026 -5608395 -4265074 -3250158 -2567966 -2269791 -2447832 -1278680
8535 -1278680 3730037 11107868 15440750 14189296 11121223 10168546 9462636 5525830 243014
8526 243014 -1678533 -300255 273784 -654326 294620 3590422 5193940 3209547 553681
8517 553681 -630380 -1546164 -1639818 2830417 11464243 16676964 12904318 4365907 -1438413
8508 -1438413 -3861707 -6983442 -10891369 -11920104 -9849262 -8302938 -8354533 -7305459 -3899216
$$ packed form
8569a0163723M716738J322079k588833j897609K950802N304666Q89083n105523
8561d572320m151067L196042P185111K753792l041945j766689L811024M554170
8553G968118r38400m967589k956271O73322P13938j344914j598374m41898n60690
8544c452758j564046j128222N36631J343321J014916O82192K98175j78041J169152
8535a278680N008717P377831M332882j251454l068073r52677p05910l936806n282816
8526B43014j921547J378278N74039r28110R48946L295802J603518j984393k655866
8517E53681j184061r15784r3654M470235Q633826N212721l772646q538411n804320
8508a438413k423294l121735l907927j028735K070842J546324n1595J049074L406243
$$ plain form
8499 -3899216 -37342 2683226 4001007 3068423 -285184 -3066426 -2233171 571668 1915517
8490 1915517 2839923 6650018 11428894 11379963 5951271 1019903 -143148 -527443 -2188384
8481 -2188384 -2126034 1396194 4238913 2283121 -2263310 -4252268 -2016617 2513007 6761258
8472 6761258 7949876 4119340 -2501351 -6360855 -5267834 -2915109 -2661383 -2823792 -832967
8463 -832967 2033568 3373512 3560901 3753016 3401555 2674188 3623646 5879958 5275594
8454 5275594 294904 -4327158 -4409086 -2325623 -1675571 -718304 2927245 5329505 1496998
8445 1496998 -5011642 -5692365 504753 5876784 5340116 1957336 -263768 -2310636 -5975938
8436 -5975938 -9161101 -9332273 -8210602 -9101513 -11381952 -11053677 -6302467 -22385 3569322
$$ packed form
8499c899216L861874K720568J317781r32584l353607k781242Q33255K804839J343849
8490A915517R24406L810095M778876m8931n428692m931368j163051l84295j660941
8481b188384O2350L522228K842719j955792m546431j988958K235651M529624M248251
8472F761258J188618l830536o620691l859504J093021K352725K53726j62409J990825
8463h32967K866535J339944J87389J92115l51461p27367R49458K256312o04364
8454E275594m980690m622062q1928K083463O50052R57267L645549K402260l832507
8445A496998o508640o80723O197118N372031n36668l382780k221104k046868l665302
8436e975938l185163j71172J121671q90911k280439L28275M751210O280082L591707
$$ plain form
8427 3569322 3303143 1153894 -1198131 -4071502 -7373692 -8628339 -5967392 -1856170
8419 -1856170 -428165 -1705546 -2536378 -2970935 -6232160 -11223389 -11276359 -3567842 5548529
8410 5548529 8658102 6223816 3281310 1657991 271753 -718797 -1097834 -2587909 -5045473
8401 -5045473 -4367652 972832 5414354 3813369 -690276 -2337553 -1906533 -3229984 -4826968
8392 -4826968 -3130698 -471259 -993195 -1683567 2819583 8860511 7983075 1451848 -772389
8383 -772389 4013291 7758320 5810046 3042494 2656461 180758 -6358096 -10459701 -7401117
8374 -7401117 -1763772 1244513 3652508 7646018 8976660 4858742 929207 2232949
8366 2232949 4068678 519635 -4347312 -3910430 -2244720 -8134016 -18712811 -21601790
$$ packed form
8427C569322k66179k149249k352025k873371l302190j254647K660947M111222
8419a856170J428005j277381q30832m34557l261225m991229n2970P708517R116371
8410E548529L109573k434286k942506j623319j386238r90550l79037j490075k457564
8401e045473O77821N340484M441522j600985m503645j647277M31020j323451j596984
8392d826968J696270K659439n21936o90372M503150O040928q77436o531227k224237
8383g72389M785680L745029j948274k767552l86033k475703o538854m101605L058584
8374g401117N637345L008285K407995L993510J330642m117918l929535J303742
8366B232949J835729l549043m866947M36882J665710n889296j0578795k888979
$$ plain form
8358 -21601790 -13605088 -5535838 -5678699 -8896126 -7082726 -1761431 572058 -427767
8350 -427767 -311459 979460 -684348 -4682634 -4459725 2264455 8037195 5128931 -3131236
8341 -3131236 -6306395 -834612 6239641 8201411 6661465 5618051 3962680 -528911
8333 -528911 -4645841 -4230079 -1981917 -3184325 -5909339 -4063662 761819 70357 -7752096
8324 -7752096 -13943921 -12698143 -9089198 -9178767 -10371938 -7773792 -3638967 -3494114 -7175202
8315 -7175202 -10048651 -10066656 -8374572 -5719640 -2799795 -1486247 -1959230 -1742538 -680146
8306 -680146 -2517550 -7850030 -10602521 -6440728 137306 2681331 2152595 3110857 4800788
8297 4800788 3467231 719841 1933328 7439816 11828107 11482198 7649159 3071891
$$ packed form
8358b1601790P996702Q069250j42861l217427J813400N321295K333489r99825
8350d27767J16308J290919j663808l998286K22909O724180N772740k908264q260167
8341c131236l175159N471783P074253J961770j539946j043414j655371m491591
8333e28911m116930M15762K248162j202408k725014J845677M825481o91462p822453
8324g752096o191825J245778L608945q9569j193171K598146M134825J44853l681088
8315g175202k873449j8005J692084K654932K919845J313548m72983K16692J062392
8306f80146j837404n332480k752491M161793O578034K544025n28736R58262J689931
8297D800788j333557k747390J213487N506488M388291l45909l833039m577268
$$ plain form
8289 3071891 186289 912919 3682230 3070467 -2796876 -7605741 -5272174 380183 1159919
8280 1159919 -3257421 -6394967 -6070522 -5880431 -6522410 -4425380 288389 2427920 -121488
8271 -121488 -3457790 -4042747 -2061661 1946232 7342966 9968166 5526409 -2642208 -6066971
8262 -6066971 -2500936 2077587 3582608 4126346 4725149 2265178 -3137126 -5749594 -3248613
8253 -3248613 -1014930 -3250393 -6662537 -7422066 -7506247 -8963346 -8515642 -3878730 502011
8244 502011 463243 -582275 1743373 3970997 446024 -6254571 -9136543 -8360811 -10106607
8235 -10106607 -14911169 -15959584 -9920799 -1877893 2510317 3438759 3214436 1651953
8227 1651953 -1660877 -4608710 -5280581 -4812766 -5073534 -5673028 -5307970 -4210754 -3287069
$$ packed form
8289C071891k885602P26630K769311o11763n867343m808865K333567N652357P79736
8280A159919m417340l137546L24445J90091o41979K097030M713769K139531k549408
8271a21488l336302n84957J981086M007893N396734K625200m441757q168617l424763
8262f066971L566035M578523J505021N43738N98803k459971n402304k612468K500981
8253c248613K233683k235463l412144p59529q4181j457099M47704M636912M380741
8244E02011l8768j045518K325648K227624l524973o700595k881972P75732j745796
8235a0106607m804562j048415O038785Q042906M388210R28442k24323j562483
8227A651953l312830k947833o71871M67815k60768n99494L65058J097216R23685
$$ plain form
8218 -3287069 -2138530 220758 3233534 4695371 2937566 -1089591 -3998279 -2857859
8210 -2857859 1685523 6010688 7657485 7497134 7164603 6497094 5111960 4297939 4868246
8201 4868246 4909916 2444835 -1254509 -4061068 -7021288 -12075130 -16955296 -17185018 -13217884
8192 -13217884 -10633866 -11953173 -12849608 -8841544 -2015852 1783981 -178672 -5962936
8184 -5962936 -11757904 -13821946 -10165735 -3228005 1136208 123129 -2593405 -2668756 -1580284
8175 -1580284 -3232784 -6502878 -6774746 -4011865 -3176924 -5977880 -8260225 -7495466 -6932208
8166 -6932208 -9105923 -10791304 -8980853 -7030911 -8959573 -11367637 -8117549 -949965
8158 -949965 2287357 -311796 -2288506 105112 2096137 -791636 -4688144 -3458743
$$ packed form
8218c287069J148539K359288L012776J461837j757805m027157k908688J140420
8210b857859M543382M325165J646797j60351l32531o67509j385134q14021N70307
8201D868246M1670k465081l699344k806559k960220n053842m880166k29722L967134
8192a3217884K584018j319307q96435M008064O825692L799833j962653n784264
8184e962936n794968k064042L656211O937730M364213j013079k716534p5351J088472
8175a580284j652500l270094k71868K762881Q34941k800956k282345P64759N63258
8166f932208k173715j685381J810451J949942j928662k408064L250088P167584
8158i49965L237322k599153j976710K393618J991025k887773l896508J229401
$$ plain form
8150 -3458743 1608232 3898221 743750 -4423331 -7541486 -7026839 -2696558 3816718
8142 3816718 7923923 5551788 -1621934 -7352297 -7662257 -4200910 -924871 -12458 -1291022
8133 -1291022 -3355245 -4542537 -4168466 -3050402 -2101233 -1202424 -451270 -1060426 -3362585
8124 -3362585 -5406465 -5559756 -5079277 -5868733 -7164471 -7000746 -5605476 -4598310 -4069898
8115 -4069898 -3268300 -2819958 -3176904 -2310205 1435167 5400497 5545540 2522335 637230
8106 637230 1224311 1418504 -538204 -3163793 -5119758 -6349727 -5547398 -1197826 4128472
8097 4128472 5388697 2175586 -625131 -628824 -952800 -3161287 -3086117 2179948 7919490
8088 7919490 7668633 2354561 -1645044 -1575067 -345327 -502116 -1158050 -1390097 -2599000
$$ packed form
8150c458743N066975K289989l154471n167081l118155N14647M330281O513276
8142C816718M107205k372135p173722n730363l09960L461347L276039R12413j278564
8133a291022k064223j187292L74071J118064R49169Q98809P51154o09156k302159
8124c362585k043880j53291M80479p89456j295738J63725J395270J007166N28412
8115d069898Q01598M48342l56946Q66699L745372L965330J45043l023205j885105
8106F37230N87081J94193j956708k625589j955965j229969Q02329M349572N326298
8097D128472J260225l213111k800717l693l23976k208487P5170N266065N739542
8088G919490k50857n314072l999605O9977J229740j56789o55934k32047j208903
$$ plain form
8079 -2599000 -5808428 -8930611 -8526240 -3799863 1893765 3817629 486293 -4786008
8071 -4786008 -7703237 -7417619 -5522130 -2226812 2804468 6509945 4459819 -2013094
8063 -2013094 -5933505 -4339280 -2544138 -5050318 -7554640 -3869055 3206337 5296478
8055 5296478 827095 -3770243 -5133187 -7168211 -11839044 -13279927 -6360428 3751800
8047 3751800 7007888 1581763 -4269322 -3496038 1606228 4147863 1625488 -2697629
8039 -2697629 -5100829 -4814184 -2899914 -812871 -361415 -2450778 -5012800 -4627867 -1522020
8030 -1522020 -447541 -4425412 -9825048 -10688035 -6391274 -1454064 1354260 3532337
8022 3532337 6297617 7838047 6704150 4594162 3749290 4041843 4347356 4424883 3697604
$$ packed form
8079b599000l209428l122183M04371M726377N693628J923864l331336n272301
8071d786008k917229K85618J895489L295318N031280L705477k050126o472913
8063b013094l920411J594225J795142k506180k504322L685585P075392K090141
8055E296478m469383m597338j362944k035024m670833j440883O919499J0112228
8047C751800L256088n426125n851085P73284N102266K541635k522375m323117
8039b697629k403200K86645J914270K087043M51456k089363k562022L84933L105847
8030a522020J074479l977871n399636q62987M296761M937210K808324K178077
8022C532337K765280J540430j133897k109988q44872K92553L05513P7527p27279
$$ plain form
8013 3697604 586049 -4747173 -8929575 -9015900 -6305244 -4444687 -4645603 -4625280 -1895952
8004 -1895952 3057129 6733708 5787449 1106634 -2017768 172949 4594165 5082618 1067542
7995 1067542 -1738314 104192 3304064 3726997 1964117 212280 -1941004 -4957042
7987 -4957042 -6431068 -4798261 -2617699 -2081970 -730609 3652844 7344388 5746493
7979 5746493 1564274 1350156 5255612 6938271 3435504 -1325602 -3408542 -3127716 -1383551
7970 -1383551 2212963 5691579 4825466 -577954 -5361905 -6489043 -6913154 -9068333 -9633655
7961 -9633655 -5022333 2226710 7494166 10965008 14794608 16158333 10193997 -532655
7953 -532655 -6605983 -3901019 576242 -1446792 -8087236 -10537479 -5394545 1544580
$$ packed form
8013C697604l111555n333222m182402q6325K710656J860557k00916K0323K729328
8004a895952M953081L676579r46259m680815l124402K190717M421216M88453m015076
7995A067542k805856J842506L199872M22933j762880j751837k153284l016038
7987d957042j474026J632807K180562N35729J351361M383453L691544j597895
7979E746493m182219k14118L905456J682659l502767m761106k082940K80826J744165
7970a383551L596514L478616q66113n403420m783951j127138m24111k155179n65322
7961i633655M611322P249043N267456L470842L829600J363725n964336j0726652
7953e32655o073328K704964M477261k023034o640444k450243N142934O939125
$$ plain form
7945 1544580 3649949 746317 -3394540 -6542880 -8007608 -6427687 -1894396 1366082
7937 1366082 -713573 -5189641 -4498755 3046057 9931461 9184387 3166005 -1021013 -1231753
7928 -1231753 -557642 -507122 330585 1722822 1647644 1133003 3850047 9407722 12003020
7919 12003020 8260066 2307011 -39780 1228976 2209517 1801056 2250079 4293685 6074527
7910 6074527 6886627 8082186 9290645 7426874 1924075 -1706561 2521182 12239175
7902 12239175 17421754 11796308 886271 -4359267 -526922 5426682 6160366 2412092
7894 2412092 -348889 68807 1418397 1706640 1183499 276991 -1200621 -2589458 -2389204
$$ packed form
7945A544580K105369k903632m140857l148340j464728J579921M533291L260478
7937A366082k079655m476068O90886P544812O885404p47074o018382m187018k10740
7928a231753O74111N0520Q37707J392237p5178n14641K717044N557675K595298
7919A2003020l742954n953055k346791J268756R80541m08461M49023K043606J780842
7910F074527Q12100J195559J208459j863771n502799l630636M227743R717993
7902A2239175N182579n625446j0910037n245538L832345N953604P33684l748274
7894B412092k760981M17696J349590K88243n23141r06508j477612j388837K00254
$$ [...]
##END NTUPLES=NMR SPECTRUM
##END=
