##TITLE=31Pdec_SR 76_mat
 CDCl3, 24 sc
 24.08.2021
##JCAMPDX= 6.0         $$ Bruker NMR JCAMP-DX V2.0
##DATA TYPE= NMR SPECTRUM
##DATA CLASS= NTUPLES
##ORIGIN= UXNMR, Bruker Analytische Messtechnik GmbH
##OWNER= root
$$ XWIN-NMR		Version 3.5
$$ Tue Aug 24 12:57:16 2021 Russian Standard Time (UT+4h)  she@DPX200
##.OBSERVE FREQUENCY= 81.013821
##.OBSERVE NUCLEUS= ^31P
##.ACQUISITION MODE= SIMULTANEOUS
##.ACQUISITION SCHEME= undefined
##.AVERAGES= 24
##.DIGITISER RES= 16
##SPECTROMETER/DATA SYSTEM= spect
##.PULSE SEQUENCE= zgpg30
##.SOLVENT NAME= CDCl3
##.SHIFT REFERENCE= (INTERNAL, CDCl3, 0, 248.564)
##AUDIT TRAIL= $$ (NUMBER, WHEN, WHO, WHERE, WHAT)
$$ ##TITLE= Audit trail, XWIN-NMR		Version 3.5
$$ ##JCAMPDX= 5.01
$$ ##ORIGIN= Bruker BioSpin GmbH
$$ ##OWNER= she
$$ F:/spectra/data/she/nmr/P31/1/pdata/1/auditp.txt
$$ ##AUDIT TRAIL=  $$ (NUMBER, WHEN, WHO, WHERE, WHAT)
(   1,<2021-08-24 12:55:41.76 +0400>,<she>,<DPX200>,
      <created by zg, POWCHK disabled, PULCHK disabled
       configuration hash MD5:
       00 E9 B6 7A A2 85 ED C7 34 08 36 98 17 FE 4E 26
       data hash MD5: 32K
       68 F5 DA CA FE 55 E7 D8 52 BA 54 3A 4C 0B 22 59>)
(   2,<2021-08-24 12:56:23.96 +0400>,<she>,<DPX200>,
      <Start of raw data processing
       efp BC_mod = 2 LB = 1 FT_mod = 6 PKNL = 1 PHC0 = -7728.768 PHC1 = -17.52652 SI = 64K 
       data hash MD5: 64K
       F0 63 66 A4 B1 01 4E 46 0C 8F D2 1D 00 D6 9E 09>)
(   3,<2021-08-24 12:56:47.07 +0400>,<she>,<DPX200>,
      <pk PHC0 = 99.65969 PHC1 = -163.4 
       data hash MD5: 64K
       D2 70 B5 DB AC 59 13 E7 65 A7 CE 66 40 FC D3 17>)
(   4,<2021-08-24 12:56:50.76 +0400>,<she>,<DPX200>,
      <abs ABSG = 5 
       data hash MD5: 64K
       CD 62 1B 0D 02 E4 3E 9D 59 06 99 E8 2A 11 33 11>)
$$ ##END=
$$ 
$$ hash MD5
$$ E0 72 E5 35 E7 CF C2 FD 0E A6 E4 E6 9C C9 75 F2
##$RELAX= 
##$RELAX= 
##$RELAX= 
##$RELAX= 
##$RELAX= 
##$RELAX= 
##$RELAX= 
##$RELAX= 
$$ Bruker specific parameters
$$ --------------------------
##$DU= <F:/spectra>
##$EXPNO= 1
##$NAME= <P31>
##$PROCNO= 1
##$TYPE= <nmr>
##$USER= <she>
##$AMP= (0..31)
100 100 100 100 100 100 100 100 100 100 100 100 100 100 100 100 100 100 
100 100 100 100 100 100 100 100 100 100 100 100 100 100 
##$AQSEQ= 0
##$AQ_mod= 1
##$AUNM= <au_zg>
##$AUTOPOS= <>
##$BF1= 81.014009
##$BF2= 200.13
##$BF3= 200.13
##$BF4= 200.13
##$BF5= 200.13
##$BF6= 200.13
##$BF7= 200.13
##$BF8= 200.13
##$BYTORDA= 1
##$CFDGTYP= 0
##$CFRGTYP= 5
##$CHEMSTR= <none>
##$CNST= (0..31)
1 1 145 1 1 1 1 1 1 1 1 1 1 1 1 1 1 1 1 1 1 1 1 1 1 1 1 1 1 1 1 1 
##$CPDPRG= <waltz16>
##$CPDPRG1= <>
##$CPDPRG2= <waltz16>
##$CPDPRG3= <>
##$CPDPRG4= <mlev>
##$CPDPRG5= <mlev>
##$CPDPRG6= <mlev>
##$CPDPRG7= <mlev>
##$CPDPRG8= <mlev>
##$CPDPRGB= <>
##$CPDPRGT= <>
##$D= (0..31)
0 1 0 0 0 0 0 0 0 0 0 0.03 2e-05 3e-06 0 0 0 0 0 0 0 0 0 0 0 0 0 0 0 0 
0 0 
##$DATE= 1629795341
##$DBL= (0..7)
120 120 120 11 120 120 24 19 
##$DBP= (0..7)
150 150 150 150 150 150 150 150 
##$DBP07= 0
##$DBPNAM0= <>
##$DBPNAM1= <>
##$DBPNAM2= <>
$$ [...]
##$SUBNAM3= <"">
##$SUBNAM4= <"">
##$SUBNAM5= <"">
##$SUBNAM6= <"">
##$SUBNAM7= <"">
##$SUBNAM8= <"">
##$SUBNAM9= <"">
##$SW= 501.771253377433
##$SWIBOX= (0..15)
0 1 3 0 0 0 0 0 0 0 0 0 0 0 0 0 
##$SW_h= 40650.406504065
##$TD= 32768
##$TD0= 1
##$TE= 0
##$TE2= 300
##$TE3= 300
##$TEG= 300
##$TL= (0..7)
0 120 53 12 22 120 120 120 
##$TP= (0..7)
150 150 150 150 150 150 150 150 
##$TP07= 0
##$TPNAME0= <>
##$TPNAME1= <>
##$TPNAME2= <>
##$TPNAME3= <>
##$TPNAME4= <>
##$TPNAME5= <>
##$TPNAME6= <>
##$TPNAME7= <>
##$TPOAL= (0..7)
0.5 0.5 0.5 0.5 0.5 0.5 0.5 0.5 
##$TPOFFS= (0..7)
0 0 0 0 0 0 0 0 
##$TUNHIN= 0
##$TUNHOUT= 0
##$TUNXOUT= 0
##$USERA1= <user>
##$USERA2= <user>
##$USERA3= <user>
##$USERA4= <user>
##$USERA5= <user>
##$V9= 5
##$VALIST= <valist>
##$VCLIST= <CCCCCCCCCCCCCCC>
##$VD= 0
##$VDLIST= <DDDDDDDDDDDDDDD>
##$VPLIST= <PPPPPPPPPPPPPPP>
##$VTLIST= <TTTTTTTTTTTTTTT>
##$WBST= 1024
##$WBSW= 4
##$XGAIN= (0..3)
0 0 0 0 
##$XL= 0
##$YL= 0
##$YMAX_a= 1217
##$YMIN_a= -1224
##$ZGOPTNS= <>
##$ZL1= 120
##$ZL2= 120
##$ZL3= 120
##$ZL4= 120
##$ABSF1= 248.5645
##$ABSF2= -253.2056
##$ABSG= 5
##$ABSL= 3
##$ALPHA= 0
##$AQORDER= 0
##$ASSFAC= 0
##$ASSFACI= 0
##$ASSFACX= 0
##$ASSWID= 0
##$AUNMP= <proc_1d>
##$AZFE= 0.1
##$AZFW= 0.5
##$BCFW= 0
##$BC_mod= 2
##$BYTORDP= 0
##$COROFFS= 0
##$CY= -3
##$DATMOD= 1
##$DC= 0
##$DFILT= <>
##$DTYPP= 0
##$F1P= 0
##$F2P= 0
##$FCOR= 1
##$FTSIZE= 65536
##$FT_mod= 6
##$GAMMA= 0
##$GB= 0
##$INTBC= 1
##$INTSCL= 5.30512e-09
##$ISEN= 30
##$LB= 1
##$LEV0= 0
##$LPBIN= 0
##$MAXI= 10000
##$MC2= 0
##$MEAN= 0
##$ME_mod= 0
##$MI= 50
##$NCOEF= 0
##$NC_proc= -8
##$NLEV= 6
##$NOISF1= 182.463
##$NOISF2= 159.3651
##$NSP= 0
##$NTH_PI= 0
##$NZP= 0
##$OFFSET= 248.5645
##$PC= 4
##$PHC0= -7629.108
##$PHC1= -180.9265
##$PH_mod= 1
##$PKNL= yes
##$PPARMOD= 0
##$PSCAL= 0
##$PSIGN= 0
##$REVERSE= no
##$SF= 81.014009
##$SI= 65536
##$SIGF1= 159.3651
##$SIGF2= -187.1042
##$SINO= 113.3802
##$SIOLD= 16384
##$SREGLST= <1H.CDCl3>
##$SSB= 0
##$STSI= 65536
##$STSR= 0
##$SW_p= 40650.406504065
##$SYMM= 0
##$S_DEV= 0
##$TDeff= 32768
##$TDoff= 0
##$TI= <>
##$TILT= no
##$TM1= 0
##$TM2= 0
##$TOPLEV= 0
##$USERP1= <user>
##$USERP2= <user>
##$USERP3= <user>
##$USERP4= <user>
##$USERP5= <user>
##$WDW= 1
##$XDIM= 65536
##$YMAX_p= 511931916
##$YMIN_p= -22314140
$$ End of Bruker specific parameters
$$ ---------------------------------
##NTUPLES= NMR SPECTRUM
##VAR_NAME=  FREQUENCY,     SPECTRUM/REAL,   SPECTRUM/IMAG
##SYMBOL=    X,             R,               I
##VAR_TYPE=  INDEPENDENT,   DEPENDENT,       DEPENDENT
##VAR_FORM=  AFFN,          ASDF,            ASDF
##VAR_DIM=   65536,         65536,           65536
##UNITS=     HZ,            ARBITRARY UNITS, ARBITRARY UNITS
##FACTOR=    0.620285442955139, 1,           1
##FIRST=     20137.2065510759, 0,            0
##LAST=      -20513.1999529892, 0,           0
##MIN=       -20513.1999529892, -22314140,   0
##MAX=       20137.2065510759, 511931916,    0
$$ Real data points
##PAGE= N=1
##DATA TABLE= (X++(R..R)), XYDATA
$$ [...]
##PAGE= N=2
##DATA TABLE= (X++(I..I)), XYDATA
13039C278818o182192n074130K24913M813342M078288L5304j198220J342401J925025
13030C243549k179551n384037k471078K699334L280646K71730l6243K895282L334456
13021E654088n38348l616550k354354M05699J176313N84582J5523j153475k319078
13012b145600p66850K942601L666119o15018m504715k939540J150566K084280
13004a128157M27530M75191J639779j96913l780017k872562L207626O813532K927602
12995G513611l239839m118582m21906J657395N67012J82516J726429J643423j429756
12986D080303l514299j779246N95801k01520k025436k74381M188917N826593K625802
12977I522534j410934k614250j979457j659740j276727j27534L66256o93601j368026
$$ plain form
13039 3278818 -2903374 -7977504 -7752591 -2939249 1139039 1174343 -23877 1318524 3243549
13030 3243549 1063998 -4320039 -6791117 -4091783 -811137 -539407 -575650 2319632 5654088
13021 5654088 5115740 1499190 -855164 -449465 726848 1311430 1326953 173478 -2145600
13012 -2145600 -2912450 30151 3696270 3081252 -1423463 -4363003 -3212437 -1128157
13004 -1128157 -700627 -225436 1414343 1217430 -2562587 -5435149 -2227523 4586009 7513611
12995 7513611 4273772 155190 -266716 1390679 1957691 2140207 3866636 5510059 4080303
12986 4080303 566004 -1213242 -617441 -818961 -2844397 -3118778 1070139 6896732 9522534
12977 9522534 8111600 5497350 3517893 1858153 581426 453892 820148 126547 -1241479
12968a241479k67104K78214k055172m829802l945356j21770K111591J338655O91440
12959h040783K138042L716105L515892K474672J627963P5434k365223l494864
12951c52762j903026O45914K013939K586660L379156L559045K162353K79858q31719
12942A1539418j985259l960663m946779k896156Q99996L409070L926234L705889
12934I691750K637672k59570l391458l306123L58347L564096K718987j277253
12926A0736448m841747n693463m009871j269810Q65598J629297J921361L003806
12918B341619M064734K669227j550796n303342n155476j569215K016466L300658
12910H13875K709591J404657k81080j957437k407165j002540Q46208J049028m37929
$$ plain form
12968 -1241479 -1508583 -1230369 -3285541 -8115343 -12060699 -12182469 -10070878 -8732223 -8040783
12959 -8040783 -5902741 -2186636 1329256 3803928 5431891 5507325 3142102 -352762
12951 -352762 -2255788 -1609874 404065 2990725 6369881 9928926 12091279 12371137 11539418
12942 11539418 9554159 5593496 646717 -2249439 -1349443 2059627 5985861 9691750
12934 9691750 12329422 12069852 8678394 5372271 5730618 9294714 12013701 10736448
12926 10736448 5894701 201238 -3808633 -5078443 -4212845 -2583548 -662187 2341619
12918 2341619 6406353 9075580 7524784 2221442 -2934034 -4503249 -2486783 813875
12910 813875 3523466 4928123 4647043 2689606 282441 -720099 126109 1175137 737208
12901G37208j541038j030209j19676j52435j28844J512711L503104K872371k61037
12892E392155j942029J57370L035372K389995j454455m351592l983267j889651
12884b646102l36318O6810l85516j021684l40107K414570M869428L545654r24256
12875E242479l631327j957990P42721M51690j395467p89606J736980J696084j666645
12866D28919l264089J66696M431712L690548p23476k223888R41511L015463p5796
12857F387600l918455k299351K632411K931282l123172p949966n417845R38450
12849i819046M003494K787956J141162J85292j774871l413826j219264L469247
12841d639856M647715O54714k829991j543698J113861N56617j245243M9919K868182
$$ plain form
12901 737208 -803830 -1834039 -1953715 -2106150 -2234994 -722283 2780821 5653192 5392155
12892 5392155 3450126 3607496 6642868 9032863 7578408 3226816 -756451 -2646102
12884 -2646102 -2982420 -2915610 -3301126 -4322810 -4662917 -2248347 2621081 6166735 5242479
12875 5242479 1611152 -346838 395883 847573 -547894 -1337500 399480 2095564 428919
12866 428919 -2835170 -2668474 1763238 5453786 4730310 2506422 3447933 6463396 6387600
12857 6387600 2469145 169794 2802205 5733487 2610315 -5339651 -10757496 -9819046
12849 -9819046 -5815552 -3027596 -1886434 -1701142 -3476013 -6889839 -8109103 -4639856
12841 -4639856 7859 662573 -2167418 -3711116 -2597255 -2040638 -3285881 -3235962 -367780
12832c67780K087037k070574m020371j518157J613790K251956J874979K085464
12824A936344J484845m29708r32500J031929J649079j971532n965199m454082
12816g650824J716372N780348L931190q81848l910015l383184j02276L822150
12808f78087N039272J479069l919271n374018j634412K142637J658480r41527
12800b227857j332490N72203K037702K519339K955774K147468j201643l996525
12792A473971j809509L524914N055684P70442l105101j528194J914812J257952
12784G554971k329255k948357K86024J946759j227680n667595o237279k538546
12776a1160958J874033M138660M137763L276014K621569J915949K18067k166836
$$ plain form
12832 -367780 1719257 -351317 -4371688 -5889845 -4276055 -2024099 -149120 1936344
12824 1936344 3421189 2991481 2058981 3090910 4739989 2768457 -3196742 -7650824
12816 -7650824 -5934452 -154104 3777086 2895238 -1014777 -4397961 -4500237 -678087
12808 -678087 4361185 5840254 1920983 -3453035 -5087447 -2944810 -1286330 -2227857
12800 -2227857 -3560347 -2988144 -950442 1568897 4524671 6672139 5470496 1473971
12792 1473971 -335538 3189376 8245060 9015502 5910401 4382207 6297019 7554971
12784 7554971 5225716 2277359 2563383 4510142 3282462 -2385133 -8622412 -11160958
12776 -11160958 -9286925 -5148265 -1010502 2265512 4887081 6803030 7021097 4854261
12768D854261l246882j825904O68554K183007K470306J880421k55590l419413
12760C308760m242149p83926L249651L055980J10409l97930J416916M14551l783814
12751B348448m871579l02388L650348J589818k673450k895710K7321J454717J232826
12742d39649J627560R56718l039728o319647l260567L286880M982652N81486k742652
12733d366947j169129R86844N7252j266062J2504K133562K832231K808940K086568
12724D115763j166031n197801m346564K144597P094578N412739J199139J00288
12716I356708O51735r81513l273045l061893k219163l485791l935348k26360L473994
12707c700676J325110l404962k632970L266307O175139L656761J625401K717435
$$ plain form
12768 4854261 1607379 -218525 450029 2633036 5103342 6983763 6728173 3308760
12760 3308760 -933389 -1717315 1532336 4588316 4698725 4300795 5717711 6132262 2348448
12751 2348448 -2523131 -2825519 824829 2414647 -258803 -3154513 -3127192 -1672475 -439649
12742 -439649 1187911 2144629 -895099 -7214746 -10475313 -7188433 -2205781 -1624295 -4366947
12733 -4366947 -5536076 -4549232 -4491980 -5758042 -5745538 -3611976 -779745 2029195 4115763
12724 4115763 2949732 -2248069 -6594633 -4450036 2644542 8057281 9256420 9356708
12716 9356708 10008443 9026930 5753885 2691992 472829 -3012962 -6948310 -7174670 -3700676
12707 -3700676 -2375566 -5780528 -8413498 -5147191 1027948 4684709 6310110 9027545
12699I027545K189023j855606l771807k84862L304203K091216n89260k10541N71510
12690A0471421k542103o703009o040399j116539K742247L991754M882017M832004
12682A0517393J095833m285572n189435m12076L760120K191118k347841l765296
12674A564244q07397K383610K256546k89331j958542j373616l81980j005127k128743
12665a740336r34843K436979M102442J423276l399740o222978n376304j697972
12657a1409476L194315O485140M945352o28264m272624j963597K414009K658207
12649A423062l74056q17455J937938K201575j772593l891547j21571M054700J692152
12640D332205m436644n493725M39613N824685M520530p86985m062982l956679
$$ plain form
12699 9027545 11216568 9360962 5589155 5304293 8608496 10699712 10110452 9899911 10471421
12690 10471421 7929318 1226309 -4814090 -5930629 -3188382 803372 5685389 10517393
12682 10517393 11613226 7327654 2138219 1726143 5486263 7677381 5329540 1564244
12674 1564244 756847 3140457 5397003 5107672 3149130 1775514 1393534 388407 -1740336
12665 -1740336 -2675179 -238200 3864242 5287518 1887778 -4335200 -9711504 -11409476
12657 -11409476 -8215161 -1730021 3215331 2587067 -1685557 -3649154 -1235145 1423062
12649 1423062 1049006 231551 2169489 4371064 2598471 -1293076 -1414647 2640053 4332205
12640 4332205 -104439 -5598164 -5158551 666134 5186664 4399679 336697 -3619982
12632c619982k955622j893556L60949L074440L619211J511838o39878r32754l19644
12623a794998r6658J51223O58408L6182k092895l055761m85783L620117N111594
12614B051429L089080J79869j821164l221534l715022k261011j21854j07518j675116
12605g602841o90468M055982P793552N922789K85382l645685l512332j091336
12597A515043J400320K838550K322414k47195l212167m731979m620552l431098
12589h166664j289016J016493J820264J134737J259988L099692M308936L030605
12581F215035P32899p88036k051505l099300j904758J106261J189899l443478
12573b042983o588052k315220M972246N959278N3378m131441j726722K527064
$$ plain form
12632 -3619982 -6575604 -8469160 -8108211 -5033771 -1414560 97278 -542600 -1475354 -1794998
12623 -1794998 -1891656 -1740433 -1082025 -1045843 -3138738 -6194499 -6680282 -3060165 2051429
12614 2051429 5140509 5320378 3499214 277680 -3437342 -5698353 -5820207 -5927725 -7602841
12605 -7602841 -8293309 -4237327 3556225 9479014 9764396 6118711 2606379 1515043
12597 1515043 2915363 5753913 8076327 7829132 4616965 -115014 -4735566 -8166664
12589 -8166664 -9455680 -8439187 -6618923 -5484186 -4224198 -1124506 3184430 6215035
12581 6215035 6947934 6159898 4108393 1009093 -895665 210596 1400495 -2042983
12573 -2042983 -8631035 -10946255 -5974009 -14731 38647 -4092794 -5819516 -3292452
12565c292452K764049k88755k537045k310768l33439K300717M097759L950310
12557D350376K831705K136713R18445j773229l222580o47162K737779J317201
12549H649248l762598n733568k665538M56381R75283J999486M534110M243516
12541H696320m14950m197319l411443j491015j796863j576066J675829M167783
12533A652276K172847r99091o31361J558464J445954l3764J80360R13366k07362
12524F051689j145451M85355J456214j839340n529915l475634K153348L715487
12516A871753J32666k091292L34349L338365K906787M3318k793126m678267m793274
12507e728721k726256m22438L63951J552120M932880O862259L042365k999528
$$ plain form
12565 -3292452 -528403 -817158 -3354203 -5664971 -5998410 -3697693 400066 4350376
12557 4350376 7182081 9318794 10237239 8464010 5241430 4594268 7332047 8649248
12549 8649248 4886650 -846918 -3512456 -3056075 -2080792 -81306 4452804 8696320
12541 8696320 8281370 4084051 672608 -818407 -2615270 -4191336 -2515507 1652276
12533 1652276 3825123 2826032 2194671 3753135 5199089 5165325 5345685 6259051 6051689
12524 6051689 4906238 5391593 6847807 5008467 -521448 -3997082 -1843734 1871753
12516 1871753 2004419 -86873 247476 3585841 6492628 6535946 3742820 -935447 -5728721
12507 -5728721 -8454977 -8877415 -8513464 -6961344 -2028464 4833795 7876160 4876632
12499D876632l652698J158653L973587J638404j101956j066057j187808l083768
12491A554989l228807k15330J569081k11165j147710J940399M708086K528899
12483G498442j527986k111856l57994p03259k525533j771389J324409K640623
12475B465457J142104k72605k38394j11032j62116N53306Q22090j350736l881715
12466a033641k188295L346372O350509L016306k492490m164212k319498j699954
12458a184903l380915l420118J61368L550479K702367l78799o32811K250195L437061
12449C103924O56593k245062j474329J009527J321896k6004K2516J090477K07688
12440C667226k411386l499617k471738k013477k521000j132681K383039L868968
$$ plain form
12499 4876632 1223934 2382587 6356174 7994578 6892622 5826565 4638757 1554989
12491 1554989 -1673818 -1889148 -320067 -531232 -1678942 261457 4969543 7498442
12483 7498442 5970456 3858600 3500606 2797347 271814 -1499575 -175166 2465457
12475 2465457 3607561 3334956 3096562 2985530 2823414 3376720 4198810 2848074 -1033641
12466 -1033641 -3221936 124436 6474945 9491251 6998761 2834549 515051 -1184903
12458 -1184903 -4565818 -7985936 -7824568 -4274089 -1571722 -1950521 -2583332 -333137 3103924
12449 3103924 3760517 1515455 41126 1050653 2372549 2346545 2369061 3459538 3667226
12440 3667226 1255840 -2243777 -4715515 -6728992 -9249992 -10382673 -7999634 -4130666
12432d130666J238945j748757j110871J655059K655006J332099j69750r18681
12424a197616j197227m65773J574637L207357K643940O81934o88786j077510j132544
12415B348412o48262N96407J320504K22640j821713k725452j576548J044480L827201
12406B587669M789221K474621j423064k690950J69484L243336K099887k249677
12398I000527n040589m256004k353054j712470j361503P18183L881085N054887
12390C931062K475828j839899m141585l316057j920114k153414k563595p71757
12382a0299531K005990K359858J78486p84470J560062M690293N175442K760806
12374G646936l38571k094450j853841p32847r15899k639929k849656K24223K790160
$$ plain form
12432 -4130666 -2891721 -4640478 -5751349 -4096290 -1441284 -109185 -278935 -1197616
12424 -1197616 -2394843 -2860616 -1285979 1921378 4565318 5247252 4558466 3480956 2348412
12415 2348412 1700150 2296557 3617061 3839701 2017988 -707464 -2284012 -1239532 2587669
12406 2587669 7376890 9851511 8428447 5737497 5906981 9150317 11250204 9000527
12398 9000527 3959938 -296066 -2649120 -4361590 -5723093 -5004910 -1123825 3931062
12390 3931062 6406890 4566991 425406 -2890651 -4810765 -6964179 -9527774 -10299531
12382 -10299531 -8293541 -5933683 -5755197 -6539667 -4979605 -289312 4886130 7646936
12374 7646936 7308365 5213915 3360074 2627227 1711328 -928601 -3778257 -3554034 -763874
12365g63874M02905m187338m261133J73004K313962J37942m35537L173941M650234
12356A204106k59186n397227l865627Q71944J660747m46715k4173J821205M14626
12347d020300k101744j16129L828687K224758l106379k159816N979868R425267
12339I954212J794537p099504o214294M24802J757489k705468m077134L50386
12331e814974L523998R83128k315033o06817L633083L696008j569164o170622
12323d640393m580874J755753O326256N044198O03504j426006J04266R38838j807203
12314B318339n013909m196520m63073J096498p01041j325684K083638N578091
12306f23661L874463j559238m218833j721363J335947Q02069j151419n50731J532859
$$ plain form
12365 -763874 -360969 -4548307 -8809440 -8636436 -6322474 -6184532 -6620069 -3446128 1204106
12356 1204106 944920 -4452307 -8317934 -7445990 -5785243 -6231958 -6256131 -4434926 -4020300
12347 -4020300 -6122044 -6238173 -2409486 -184728 -3291107 -5450923 528945 9954212
12339 9954212 11748749 4649245 -1565049 -1140247 617242 -2088226 -6165360 -5814974
12331 -5814974 -2290976 -1307848 -3622881 -4229698 -596615 3099393 1530229 -4640393
12323 -4640393 -9221267 -7465514 -1139258 3904940 4508444 3082438 3186704 4125542 2318339
12314 2318339 -2695570 -6892090 -7355163 -6258665 -6959706 -8285390 -6201752 -623661
12306 -623661 3250802 1691564 -2527269 -4248632 -2912685 -2110616 -3262035 -3812766 -2279907
12297b279907J216489j115330j370355R43099J605997r17097k492831l34963K116459
12288b628439J255075k53952J586989M091140J439389n059468p260905j801764
12280h631935M679335M746814m4613k541688l77091J703311l43266l734489k798181
12271g341803K699800O395935L485973k549863m321692l82575L425003K835731
12263D246509O05376P66329J941746O30240j983802j773085J169879K386342J70974
12254H160508j837712m25563K465650K686033o49819m434314n330609l067155
12246b432981q0588J583041K091242J883554k37909m189293n447633j25267O997975
12237D2141O572593j327681n495481j92401N370589J652249n415505m158338L369163
$$ plain form
12297 -2279907 -1063418 -2178748 -3549103 -2606004 -1000007 -1917104 -4409935 -4744898 -2628439
12288 -2628439 -1373364 -1627316 -40327 4050813 5490202 430734 -6830171 -8631935
12280 -8631935 -3952600 794214 749601 -1792087 -2169178 -465867 -809133 -4543622 -7341803
12271 -7341803 -4642003 1753932 5239905 2690042 -1631650 -2014225 1410778 4246509
12263 4246509 4851885 5618214 7559960 8190200 6206398 4433313 5603192 7989534 8160508
12254 8160508 6322796 5897233 8362883 11048916 10399097 5964783 634174 -2432981
12246 -2432981 -2513569 -930528 1160714 3044268 2806359 -1382934 -6830567 -6955834 42141
12237 42141 6614734 5287053 -208428 -400829 4969760 6622009 1206504 -2951834 417329
12228D17329N000993j259388m854052j016967K485905J73348k522502p21036J295867
12219a000503m56975j666761J398141L878082J176027k068909l42375K466160
12211C382887J96521m314387m637995k189393k277310l122050N35225O001028
12203f425474N808422N31169k459110k004410l537004o349142k848963O790201
12195a0494311J1258337M724896l526444l072469K664847L789936k57457j801575
12187C285760J689933M552273K547603j876561m570545m363273j991571J211007
12179D84626K876023J565286m46752J50294K188701J250131k964252n002896j429219
12170a328058L733990M472270Q10980k336686k448019j281330k36240J516893
$$ plain form
12228 417329 5418322 4158934 -695118 -1712085 773820 947168 -1575334 -2296370 -1000503
12219 -1000503 -1457478 -3124239 -1726098 2151984 3328011 1259102 916727 3382887
12211 3382887 3579408 -734979 -5372974 -7562367 -9839677 -12961727 -12426502 -6425474
12203 -6425474 -617052 -85883 -2544993 -4549403 -8086407 -14435549 -17284512 -10494311
12195 -10494311 764026 5488922 1962478 -1109991 1554856 5344792 5087335 3285760
12187 3285760 4975693 9527966 12075569 10199008 5628463 1265190 -726381 484626
12179 484626 3360649 4925935 4479183 4629477 6818178 8068309 5104057 101161 -1328058
12170 -1328058 2405932 6878202 7689182 5352496 2904477 1623147 1386907 2903800
12162B903800L412007K444952j784230m574290k260074J715795J336587k803839
12154C90708m135585j45116L789926K690938r39209j998851o90973n96182j522933
12145c157277j23315L189293L854781N93361k092307r87636Q23719p32719l906479
12136b538579l736848M39811M229602M332505J880197m50336j467473r96311P47903
12127B440471K156610J009354k247406m038316k207705Q23255J595740O13637
12119A45640Q65752K418750K249899k66798j633120L13577K586451J474052j740543
12110F413660k989788j800892j433130k939535l220153j72547L575165M139836
12102A572616J356036j861579l534897l743862k715824k89593K571082L719462
$$ plain form
12162 2903800 6315807 8760759 6976529 2402239 142165 1857960 3194547 390708
12154 390708 -3744877 -3889993 -100067 2590871 1651662 -347189 -1038162 -1634344 -3157277
12145 -3157277 -3280592 -91299 3763482 4356843 2264536 1276900 2100619 1367900 -2538579
12136 -2538579 -6275427 -5835616 -1606014 2726491 4606688 4156352 2688879 1692568 2440471
12127 2440471 4597081 5606435 3359029 -679287 -2886992 -2063737 -467997 145640
12119 145640 1011392 3430142 5680041 5413243 3780123 4093700 6680151 8154203 6413660
12110 6413660 3423872 1622980 189850 -2749685 -5969838 -6142385 -2567220 1572616
12102 1572616 2928652 1067073 -2467824 -6211686 -8927510 -9217103 -6646021 -2926559
12094b926559K271604J26787q3633J678845K734138J309691q79971j026344O17927
12085C822485J220094q5505j067881o76928r38449k384377j378977L937402Q155329
12076A0603193M813138l413249p312332m017841l10760j326687l242033j258465
12068e465036J645724K48537l120440j827559L972441O930916L403431j818848
12060C969166l319463j962259j171845r05594O43278K234792J081303j760593
12052a191215j814911K190395N603295L871473j068041l500098j951665o41263
12044A497970k321583l887465j843118J414966J345523q48018J64090M683998
12036B06363O761229L703746O14654J957090M064163J268109m500755o530963
$$ plain form
12094 -2926559 -654955 -528168 -611801 1067044 3801182 5110873 4230902 3204558 3822485
12085 3822485 5042579 4957074 3889193 3212265 2273816 -110561 -1489538 2447864 10603193
12076 10603193 15416331 12003082 4690750 672909 362149 -964538 -4206571 -5465036
12068 -5465036 -3819312 -3570775 -6691215 -8518774 -4546333 2384583 5788014 3969166
12060 3969166 649703 -1312556 -2484401 -3389995 -2746717 -511925 569378 -1191215
12052 -1191215 -3006126 -815731 4787564 8659037 7590996 4090898 2139233 1497970
12044 1497970 -823613 -4711078 -6554196 -5139230 -3793707 -4641725 -4477635 206363
12036 206363 6967592 10671338 11285992 13243082 17307245 18575354 14074599 7543636
12028G543636l626133j115132k016104l361024k341799o01157j75674K84544K137557
12019c271286L020731L08219l610839l495151J477670N895499M679400o98405
12011D305838m358384l291447j84429J253561J235604K138500L543488K514023
12003G156754j176441l795656l054229j365162j270925p84498K848936O878101
11995E436880N587407r74548n717549l693544J325243K333424j456807m349289
11987a508783k466148J461228K580181K92811k082192k320429j041485R96926
11979d087891L858577N807039L450204k823086o628757k956452M030040N434651
11971F084325n99848o675199o381475j624868K169152L382653L617679L447944
$$ plain form
12028 7543636 3917503 2802371 786267 -2574757 -4916556 -5517713 -5693387 -5408843 -3271286
12019 -3271286 -250555 57664 -3553175 -7048326 -5570656 324843 5004243 4305838
12011 4305838 -52546 -3343993 -3528422 -2274861 -1039257 1099243 4642731 7156754
12003 7156754 5980313 2184657 -869572 -2234734 -3505659 -4290157 -1441221 5436880
11995 5436880 11024287 10049739 4332190 638646 1963889 4297313 2840506 -1508783
11987 -1508783 -3974931 -2513703 66478 359289 -1722903 -4043332 -5084817 -4087891
11979 -4087891 -229314 5577725 9027929 6204843 -423914 -3380366 649674 6084325
11971 6084325 5484477 -1190722 -7572197 -9197065 -7027913 -3645260 -27581 3420363
11963C420363K365317P93778o11052j966236k792291j943922j62000L48640k0984
11954e68387J297630L310133J637811l141765l957072J557811N231981M00967
11946E769109o464358n014548K738306N812583J376984k614506j591702L6737
11938D8605o69845J28425L973423N248683Q14131l529560k357280N13847o69838
11929C500591l340363j558185L025700L681418r8521k159533j93216J192829o93710
11920C357010j888077P94090L259632J84206n706031o339942J36734O090777M755656
11911D644055o67547k393958M76449J830712q92465l058627j654442o27835l032835
11902e376493m355699k59726M441025K988484j161404N24043O509721O622646
$$ plain form
11963 3420363 5785680 6579458 5968406 4002170 1209879 -734043 -896043 -547403 -568387
11954 -568387 729243 4039376 5677187 2535422 -1421650 136161 5368142 5769109
11946 5769109 -695249 -5709797 -2971491 2841092 4218076 1603570 11868 48605
11938 48605 -621240 -492815 3480608 8729291 9543422 6013862 3656582 4170429 3500591
11929 3500591 160228 -1397957 1627743 5309161 5210640 3051107 2857891 4050720 3357010
11920 3357010 1468933 2263023 5522655 5706861 830 -6339112 -6202378 -111601 4644055
11911 4644055 3976508 1582550 2058999 3889711 2997246 -61381 -1715823 -2343658 -5376493
11902 -5376493 -9732192 -9991918 -5550893 -2562409 -3723813 -3199770 3309951 9932597
11894I932597j003169o294772l490419N17214p31367k665758M20392M278420K633840
11885C596978j219567o60299K173845Q86975k900232k547904J118255J300172
11877A748223k054406k085516K039222K948571j873208n070972j601579K950390
11869b999275J842659k124703j947439K400770M794706K369452j622900l291088
11861e77818k055244N16140K621708K970850J623064N1335n44360l74804j55088
11852D075783k69990j020031k117126j989947L21536K729503K278882j75086p82319
11843C051205J261804K293770J93653k119769j679318m35449j729716m287813
11835c451633l864426O2167L158204K282905l47716n52516J988713L428781J259416
$$ plain form
11894 9932597 8929428 2634656 -855763 -338549 -1069916 -3735674 -3315282 963138 3596978
11885 3596978 2377411 1717112 3890957 4777932 1877700 -670204 448051 1748223
11877 1748223 -306183 -2391699 -352477 2596094 722886 -4348086 -5949665 -2999275
11869 -2999275 -1156616 -3281319 -5228758 -2827988 1966718 4336170 2713270 -577818
11861 -577818 -2633062 -2116922 504786 3475636 5098700 5150035 4605675 4230871 4075783
11852 4075783 3805793 2785762 668636 -1321311 -999775 1729728 4008610 3833524 3051205
11843 3051205 4313009 6606779 6800432 4680663 3001345 2565896 836180 -3451633
11835 -3451633 -7316059 -7253892 -4095688 -1812783 -2160499 -2713015 -724302 2704479 3963895
11826C963895j884300j732543J270631K279414n99035l009439r79565K660875
11818A969933K669645n29277k431063k178078k443215k620051N32356M992060
11810c7690M182865k181737n816538k146727K699041K274741r9177J462538M431610
11801D768926K754570j636960j757986K118017K614505k377000o288096m319719
11793d123743K68023K611860K587555J987036O94792j413185k820651k908546
11785c116859k812201k584508j166436L08927k98726j145570J927439P530046
11777a357888Q635743K790573l518894m051164q72396P09007R1760m36276r31690
11768A058775j962133j257719K358169M757095J835983l338926m385487q63442
$$ plain form
11826 3963895 2079595 347052 1617683 3897097 3298062 288623 -690942 1969933
11818 1969933 4639578 4110301 1679238 -498840 -2942055 -5562106 -5029750 -37690
11810 -37690 4145175 1963438 -3853100 -5999827 -3300786 -1026045 -1125222 337316 4768926
11801 4768926 7523496 5886536 4128550 6246567 8861072 6484072 195976 -4123743
11793 -4123743 -3855720 -1243860 1343695 3330731 4025523 2612338 -208313 -3116859
11785 -3116859 -5929060 -8513568 -9680004 -9371077 -9669803 -10815373 -8887934 -1357888
11777 -1357888 7277855 10068428 6549534 2498370 1625974 2334981 2426741 1990465 1058775
11768 1058775 -903358 -2161077 197092 4954187 6790170 3451244 -934243 -1797685
11760a797685J920106J197085p07001j602012j903015j662039J30496K611972
11752a812093L335881K057010Q77406M96179k97935j395050j195815K8204k5655
11743B068132j934279l457680k629877K79817L609483N004567K491891k427165
11735C004889m465634q97254L594900K863208j560513k765571R54367M036310
11727D764702K560293r18438k835436l231059k897376j020486J971650L515297
11719A909147K856068J923384J092279j211172l586367k104271K413480L790168
11711G082716K8538k950522r54673J581766m18928l772995k775391Q14303J026590
11702c38596k009088k522034J392474N386740N709731K942707r62351m549759
$$ plain form
11760 -1797685 122421 1319506 612505 -989507 -2892522 -4554561 -4424065 -1812093
11752 -1812093 1523788 3580798 4458204 4954383 4656448 3261398 2065583 2093787 2068132
11743 2068132 133853 -3323827 -5953704 -5673887 -2064404 2940163 5432054 3004889
11735 3004889 -1460745 -2357999 1236901 4100109 2539596 -225975 728392 4764702
11727 4764702 7324995 6406557 3571121 340062 -2557314 -3577800 -1606150 1909147
11719 1909147 4765215 6688599 7780878 6569706 2983339 879068 3292548 7082716
11711 7082716 7111254 4160732 3206059 4787825 4368897 595902 -2179489 -1365186 -338596
11702 -338596 -2347684 -4869718 -3477244 1909496 7619227 10561934 9599583 5049824
11694E049824n847420l746918l94895J137005Q62199N96398M51633J03152J145069
11685f43953L813452L989537j059195o280251m739305J562452M109685P51157
11677A503579j730533Q94512M144187L128031N1307q37601k37406q79115j813627
11668D223334o59415J275687R20635j204945j820331k06613R74346Q8541j134302
11659B456937k66780K428906L919892J483279l863208p351030n205900O73596
11651e724308M543161L448044k6357j944230j481491k58299M30633K32994o77736
11642a457589j290070m74421R73658P14134j504255k412143P14215N719707P426838
11633H410074L719950j820611l965486j708937R83196N12297j669525j570886
$$ plain form
11694 5049824 -797596 -4544514 -4939409 -3802404 -2940205 -2343807 -1892174 -1789022 -643953
11685 -643953 3169499 7159036 6099841 -180410 -4919715 -3357263 752422 1503579
11677 1503579 -226954 667558 4811745 7939776 7991083 7153482 6916076 6036961 4223334
11668 4223334 3563919 4839606 5760241 4555296 2734965 2528352 3502698 3591239 2456937
11659 2456937 2190157 4619063 8538955 10022234 6159026 -1192004 -6397904 -5724308
11651 -5724308 -1181147 2266897 2240540 296310 -1185181 -1443480 -1012847 -779853 -1457589
11642 -1457589 -2747659 -3222080 -2248422 -1534288 -3038543 -5450686 -4736471 983236 8410074
11633 8410074 12130024 10309413 6343927 4634990 5618186 6130483 4460958 2890072
11625B890072R17446J556397j285904l192010k97610L961132L342207j856381
11617F035349n229176l550659l09180P30622L87972N95844M57212j316192k993226
11608e191434j928527J400936L754746K870401l43478k813814k191533N78997
11600c863706K034975N60390j255496m03637K046391K934292J890408Q18577l8265
11591D723929j469108j984032J81866K614849J426142k087414l044023r71333
11583f09124L734r20865j92415K202710J603781k306680l398809M93656L165013
11574D1001P37543j441864J136677L240752o46017m998755j672009N415695N551534
11565G364557j469818n234852j599859K038639L14234k268816j095136O42291
$$ plain form
11625 2890072 3807518 5363915 4078011 886001 588391 4549523 7891730 6035349
11617 6035349 806173 -2744486 -3053666 -2323044 -1935072 -1339228 -882016 -2198208 -5191434
11608 -5191434 -7119961 -5719025 -1964279 906122 562644 -2251170 -4442703 -3863706
11600 -3863706 -1828731 -1268341 -2523837 -2927474 -881083 2053209 3943617 4762194 4723929
11591 4723929 3254821 1270789 1452655 4067504 5493646 3406232 362209 -609124
11583 -609124 -605390 -1526255 -1718670 484040 2087821 -218859 -3617668 -3124012 41001
11574 41001 778544 -663320 473357 3714109 3068092 -1930663 -3602672 1813023 7364557
11565 7364557 5894739 659887 -939972 1098667 1412901 -855915 -1951051 -1308760
11557a308760n90958j338836J985398N213488K761694k677095m246839j566588
11549a768496L01313M69903K666066O197616M789787l045298r403802p082484
11541f875395N65595M707065K599408j058189k204882j316176J77338K028895
11533a376341L021155J346123j557617j839848N43984J015119k031922l900446
11525d779793j441796R78528j146816l676394N3876P077539P730049N46326m906957
11516D34562k333882K629410K346994j489195k508475l22689M45681j191021j714781
11507c703396J16685J434233N07734o62818J08505K258753L944737M186997K953308
11498A1144738P85112j210273k063250j817592j235759r61684j148214j245854
$$ plain form
11557 -1308760 -1899718 -3238554 -1253156 3960332 6722026 4044931 -201908 -1768496
11549 -1768496 -1467183 -997280 1668786 7866402 12656189 9610891 207089 -6875395
11541 -6875395 -6309800 -1602735 996673 -61516 -2266398 -3582574 -3405236 -1376341
11533 -1376341 1644814 2990937 1433320 -406528 137456 1152575 -879347 -4779793
11525 -4779793 -6221589 -5243061 -6389877 -10066271 -10012395 -2934856 4795193 5341519 434562
11516 434562 -1899320 730090 3077084 1587889 -920586 -1243275 -797594 -1988615 -3703396
11507 -3703396 -3586711 -2152478 -1644744 -2307562 -2199057 59696 4004433 8191430 11144738
11498 11144738 11929850 10719577 8656327 6838735 5602976 4641292 3493078 2247224
11490B247224l93631R14051M36488k499840m459005j977373K612304L789119J096842
11481A766179m81897Q80864J003237k363486m942687k964651P44885K122773K266461
11472a968322L491872L731033O71651k486129j646106J041741R83038p84493n5410
11463B978875K271752J554499k188373m185778k757873q38070L3401J036566J653021
11454d41980J62152j546619M0249L299501L286440L69516k49592J694299L96425
11445G010391n221824p841921k874146L932140N026432J296130j564473j870559
11437b107830j418670k28036K240041L513362J358224j581216j504110K37056
11429E08821k38395k173073j374413K166503L696461J283005j295977p69285R87975
$$ plain form
11490 2247224 1853593 2767644 3204132 704292 -3754713 -5732086 -3119782 669337 1766179
11481 1766179 1284282 2165146 3168383 804897 -4137790 -7102441 -6357556 -4234783 -1968322
11472 -1968322 1523550 5254583 5926234 3440105 1793999 2835740 3818778 3034285 2978875
11463 2978875 5250627 6805126 4616753 430975 -2326898 -3164968 -3131567 -2095001 -441980
11454 -441980 -279828 -1826447 -1786198 1513303 4799743 5169259 4919667 6613966 7010391
11445 7010391 1788567 -6053354 -8927500 -4995360 31072 1327202 -237271 -2107830
11437 -2107830 -3526500 -3754536 -1514495 1998867 3357091 1775875 271765 508821
11429 508821 270426 -1902647 -3277060 -1110557 2585904 3868909 2572932 1803647 2791622
11420B791622P97056q23106j260035j48180O40486J81153o15350q31199n57165
11411A75282k39751k11215o97447j309411q37643J222984L049191J975559j754202
11402A373347m192221k067438K914900N956696N015739K619567J452766O04175
11394A3677531k022320n270313n485494j750481J959818J257355k930931m866891
11386e431726r33243N125649N992896P2833n704433m428102J826223N210381K843057
11377D573535n61826r14455p9784q88261j777769o8567K877900L640807J591425
11368H393005j400723l911226m892119l306571n89612l06406k337616j460411
11360i811679M174704P864112L726192k969918k901503K649996L834300j602313
$$ plain form
11420 2791622 3588678 2765572 1505537 1357357 1997843 2178996 1563646 732447 175282
11411 175282 -64469 -275684 -973131 -2282542 -3120185 -1897201 1151990 3127549 1373347
11402 1373347 -2818874 -4886312 -1971412 3985284 9001023 11620590 13073356 13677531
11394 13677531 11655211 6384898 899404 -851077 1108741 2366096 -564835 -5431726
11386 -5431726 -6364969 -1239320 4753576 4826409 -878024 -5306126 -3479903 1730478 4573535
11377 4573535 4011709 3097254 3017470 2129209 351440 282873 3160773 6801580 8393005
11368 8393005 6992282 3081056 -1811063 -5117634 -5707246 -6013652 -8351268 -9811679
11360 -9811679 -5636975 2227137 5953329 2983411 81908 2731904 6566204 4963891
11352D963891m657100r9757M743879J806981m815989n264600J378413O516823
11344D572541M499666j083345l982663k980342j111075l62152K32522J930740
11336A715892L702060L368051P39565k028414l515720m351386m502070k231946
11328g103968J924326L477090J64704l187431j221551L044242K516643k307525
11320b693470m020343p37403J130452j258876j879608K843764O137098J660021
11312A181635m671294k913250M990403P553499R12099n841609m134969K990636
11304F7150O608146L338831k714224o131434m913692q60262K342296K288746K81731
11295C07288l53893J342472K976032K572423J146410M34850P6449j245165l112382
$$ plain form
11352 4963891 306791 207034 4950913 6757894 1941905 -3322695 -1944282 4572541
11344 4572541 9072207 7988862 4006199 1025857 -85218 -447370 -214848 1715892
11336 1715892 5417952 8786003 9525568 7497154 3981434 -369952 -4872022 -7103968
11328 -7103968 -5179642 -1702552 -1537848 -4725279 -5946830 -2902588 -385945 -2693470
11320 -2693470 -6713813 -7451216 -6320764 -7579640 -9459248 -6615484 -478386 1181635
11312 1181635 -3489659 -6402909 -1412506 6140993 7053092 1211483 -2923486 67150
11304 67150 6675296 10014127 7299903 1168469 -3745223 -4605485 -2263189 25557 307288
11295 307288 -46605 1295867 4271899 6844322 7990732 8425582 8502031 7256866 4144484
11286D144484l661865k150455R6775J202388L96037j534272k665514j264481K191371
11277c245532M570866L172560m78819j691819J465793N078214M277206j62426
11269A2986043l180329k786495k076772l133056l373169o09359K178176J248252
11261A253291j456729j186180J797080K591873l10616k642979j176253J673818
11253E43305K105887K11174j318272j112255K81818J640116J423141j008712l465925
11244f99723k721783O87413K462398Q18703p09476Q65487K838882J219247k400598
11235B360550k984226J96554K690617J787815j68519n59614n19593j780863k656992
11226a634271o59299K581947K930758P9186j554377O54466L620585L390976Q84004
$$ plain form
11286 4144484 482619 -1667836 -1571061 -368673 27364 -1506908 -4172422 -5436903 -3245532
11277 -3245532 1325334 4497894 4019075 2327256 3793049 8871263 13148469 12986043
11269 12986043 9805714 7019219 4942447 1809391 -1563778 -2173137 5039 1253291
11261 1253291 -203438 -1389618 407462 2999335 2688719 45740 -1130513 543305
11253 543305 2649192 2860366 1542094 429839 711657 2351773 3774914 2766202 -699723
11244 -699723 -3421506 -2734093 -271695 547008 -162468 703019 3541901 4761148 2360550
11235 2360550 -623676 -427122 2263495 4051310 3882791 3323177 2803584 1022721 -1634271
11226 -1634271 -2293570 288377 3219135 3298321 1743944 2398410 6018995 9409971 10293975
11217A0293975n25463q03270k276166m213547l540399q22386q000j283350j15148
11208c293754M434875O650421L103948j262015j071607Q41033q86543m328313
11200D188045l733391K75762K052701O84554K63325J279696J8111l313216l943417
11191b227830r31439J502508K030119L553885N175918J824771n354567p533968
11183a960603j604491L767360J383570l359242k006209L315592M627006J357984
11175E520967n52074K80534j48045k278807j980781J183184K361824n41459l632433
11166B12910l586432j957967r51918J95915K093795K580115L62646j624641J15193
11157b560384M079049N040156Q95839m238339n080213j933698J2693j712430l189200
$$ plain form
11217 10293975 9768512 8965242 6689076 2475529 -1064870 -1887256 -1895256 -3178606 -3293754
11208 -3293754 1141121 7791542 10895490 9633475 8561868 9402901 8516358 4188045
11200 4188045 454654 730416 2783117 3467671 3730996 5010692 5028803 1715587 -2227830
11191 -2227830 -3159269 -1656761 373358 3927243 9103161 10927932 5573365 -1960603
11183 -1960603 -3565094 202266 1585836 -1773406 -3779615 -464023 4162983 5520967
11175 5520967 4968893 5249427 5101382 2822575 841794 2024978 4386802 3845343 212910
11166 212910 -3373522 -5331489 -6283407 -6087492 -3993697 -1413582 -1050936 -2675577 -2560384
11157 -2560384 1518665 6558821 7454660 3216321 -1863892 -3797590 -3784897 -5497327 -8686527
11148h686527m51486L521821K979005j023496j696534K337947M310696N73649
11140A865075k748811K30131M786586K751238m194576p005038l067847J244283
11132f138959J746907J578459L295725L718721M49026k713266j647073J276715
11124A566255J232704j324393j963020M86776K692849K189004L5686j835761k625481
11115D54619j839025N25996K505684J648920j288205k664646r03554J367497J374168
11106A181454q8385p50698l79187L4680N69820J292773P40672j557440k830749
11097a787060q75660J530834L42238k902472l094720J66510K182619J273314Q30108
11088b334289K090162J804428o53366j110582J237235J095228l102905m617442
$$ plain form
11148 -8686527 -9138013 -5616192 -2637187 -3660683 -5357217 -3019270 1291426 1865075
11140 1865075 -883736 -653605 4132981 6884219 2689643 -4315395 -7383242 -6138959
11132 -6138959 -4392052 -2813593 482132 4200853 4649879 1936613 289540 1566255
11124 1566255 2798959 1474566 -488454 -1678 2691171 4880175 4915861 3080100 454619
11115 454619 -1384406 -858410 1647274 3296194 2007989 -656657 -1560211 -192714 1181454
11106 1181454 1093069 342371 -36816 -2136 567684 1860457 2601129 1043689 -1787060
11097 -1787060 -2662720 -1131886 -789648 -3692120 -6786840 -6620330 -4437711 -3164397 -2334289
11088 -2334289 -244127 1560301 906935 -203647 1033588 2128816 -974089 -5591531
11080e591531M23693N259050L399265m82943L09332K023043j584449n423618q92963
11071b561121O983506N577277l987883p536371p88510M511944J016626l248754
11063c3286o49743L344010J690883j663617k50746L145821K560564o44704j893024
11054E606158j704756k270247j736991J024407J990938r13858k544175Q73171
11046C24647M402362K783325n43667m93832L29024k087407m007295o51730L523721
11037C579148J542672l541342l421294J386601K963141m01305k417697j65841
11029d75917K185271J632255L46666M50405J149056J668236J995397J096490j256042
11020H791817k441660r12911N86405p402M0274K335520K512946k048442n215418
$$ plain form
11080 -5591531 -5167838 91212 3490477 3007534 3316866 5339909 3755460 -1668158 -2561121
11071 -2561121 4422385 9999662 6011779 -1524592 -2313102 2198842 3215468 -33286
11063 -33286 -683029 2660981 4351864 2688247 2437501 5583322 8143886 7499182 5606158
11054 5606158 3901402 1631155 -105836 918571 2909509 1995651 -548524 324647
11046 324647 4727009 7510334 6966667 6472835 6801859 4714452 707157 55427 3579148
11037 3579148 5121820 1580478 -1840816 -454215 2508926 2107621 -310076 -475917
11029 -475917 1709354 3341609 3688275 4138680 5287736 6955972 8951369 10047859 8791817
11020 8791817 6350157 5437246 6023651 6016249 6056523 8392043 10904989 8856547 3641129
11011C641129j229898M179675J810966n658442p309084r13415M834467M499575
11003C854973J763881M54089o09377k274585k794946k297363k612082k453731
10995f969141M47420L308118J855550j457844j060884J559276O22314k490826
10987d186017j193028L460483L451704j866310m023823j94247K171850j023874
10979c403262l729228j254921K084298K173258J901082L050603J279396m222384
10971b121158n633401J183171P925626O043923K5821r43839J967798J088631l470600
10962F065972m487270o25840J571809j076783l946245l012993o44052m33435j442282
10953h031119o13074K110320L735317K219440r26204k191995l05825J771980P20361
$$ plain form
11011 3641129 2411231 6590906 8401872 2743430 -4565654 -5479069 -644602 3854973
11003 3854973 5618854 6072943 5463566 3188981 394035 -1903328 -4515410 -6969141
10995 -6969141 -6521721 -3213603 -1358053 -2815897 -3876781 -2317505 -1695191 -4186017
10987 -4186017 -5379045 -1918562 1533142 -333168 -4356991 -4551238 -2379388 -3403262
10979 -3403262 -7132490 -8387411 -6303113 -4129855 -2228773 821830 2101226 -2121158
10971 -2121158 -7754559 -6571388 1354238 7398161 7423982 6480143 8447941 9536572 6065972
10962 6065972 1578702 952862 2524671 1447888 -2498357 -5511350 -6155402 -6588837 -8031119
10953 -8031119 -8644193 -6533873 -2798556 -579116 -1505320 -3697315 -4003140 -2231160 -1510799
10944a510799j871760j258082L082692N811378L208607j568771l426080k153265
10936C13920q97058n12069N26804K049671K006294J24990j389816j170064l62228
10927F90444m33101j078701j174950o30323j33726M74210K137988M426368M928479
10918I206688K344485r86080j970811j256702j654913k778961j672955J128592
10910B359343J631941l71199l22072K554030K749514j624994l977647o6950L716958
10901F648924O74513m307591k798754K635297K991795j674346l137091L00808
10893A333555J882095p81351k326939l62305J021753L14047J029798K878320O17202
10884E606175n246380o553765l44942N587914M656229N12351r64237q25404k328773
$$ plain form
10944 -1510799 -3382559 -4640641 -1557949 4253429 7462036 5893265 2467185 313920
10936 313920 -583138 -1095207 -568403 1481268 3487562 3612552 2222736 1052672 690444
10927 690444 257343 -821358 -1996308 -2626631 -2760357 -2286147 -148159 4278209 9206688
10918 9206688 11551173 10565093 8594282 7337580 5682667 2903706 1230751 2359343
10910 2359343 3991284 3620085 3298013 5852043 8601557 6976563 2998916 2931966 6648924
10901 6648924 7323437 3015846 217092 2852389 5844184 4169838 1032747 1333555
10893 1333555 3215650 2434299 107360 -254945 766808 1080855 2110653 4988973 5606175
10884 5606175 359795 -6193970 -6538912 -950998 3705231 4217582 3253345 2427941 99168
10875I9168l693682j807319J630551K958642J864895P6850j561826j982022Q0398
10866b334345K848641K672430j34004j558911q36883j139578k506657j229017
10858d218324K157421K077178k259600m050416M49868N700578N529178J686598
10850G072481n73552j37820O49098L9695k339490n002877m396518K28251L167181
10841a293551J19631k946904J607686Q208886M794979o262523r580161j407124
10833f759081M103155j083711n837653j30476P677179O097502n27251k036134
10825A503530m1838j240201k836273O85482M438778J515173k686558N83802O565556
10816H487451M629851k552939l760976P23972O61241m539692m851488J422509
$$ plain form
10875 99168 -3594514 -5401833 -3771282 -812640 1052255 1129105 -432721 -2414743 -2334345
10866 -2334345 514296 3186726 3052722 1493811 656928 -482650 -2989307 -4218324
10858 -4218324 -2060903 16275 -2243325 -6293741 -5843873 -143295 5385883 7072481
10850 7072481 6498929 6361109 7010207 7049902 4710412 -292465 -4688983 -4460732 -1293551
10841 -1293551 -1173920 -4120824 -2513138 5695748 10490727 4228204 -5351957 -6759081
10833 -6759081 -2655926 -3739637 -9577290 -9707766 -2030587 4066915 3539664 1503530
10825 1503530 1461692 221491 -2614782 -1929300 2509478 4024651 1338093 1921895 8487451
10816 8487451 13117302 10564363 6803387 7527359 8188600 3648908 -1202580 219929
10808B19929M238028k28348l437313k50399K953358R93477j523630j76728J329656
10799D118030o00223k355240m58295J731435O13076j059173J39828J882632Q64261
10790D876331r87263l85268J283422P50337j399200k066916m04848K078284M069006
10781G813885M496977K182441k155234n284737m806239j815751Q18595J406945
10773B656882J90438j183200p74798J356082K380175K95667k545497k364298K72476
10764B83927J168418r24199k218494L51340M325890M782836P11288l581088l373221
10755A526697J032093M471316K851713j988261m772916l342142l40511J215088
10747F53077J005303k4883q72201m9653K486971L125977j106434o049642m189699
$$ plain form
10808 219929 4457957 4229609 792296 541897 3495255 4488732 2965102 2788374 4118030
10799 4118030 3517807 1162567 704272 2435707 3048783 1989610 2129438 4012070 4876331
10790 4876331 3889068 3503800 4787222 5537559 4138359 2071443 1666595 3744879 7813885
10781 7813885 12310862 14493303 12338069 7053332 2247093 431342 1249937 2656882
10773 2656882 2847320 1664120 889322 2245404 4625579 4921246 2375749 11451 283927
10764 283927 1452345 528146 -1690348 -1339008 2986882 7769718 8481006 4899918 1526697
10755 1526697 2558790 7030106 9881819 7893558 3120642 -221500 -562011 653077
10747 653077 1658380 1633497 761296 711643 3198614 6324591 5218157 -831485 -5021184
10738e021184L961749R026224N763660m6613j505286m55082k031810n208345n293461
10729h10148j997906R14768J332533l50419l138417m560711j597566M131947O557902
10720D81983L884094J674645L370410M218848l7027m962490m590560j039452K04814
10711C205265m85652K22081J167783k47870j713652j94879J516258k08794k443922
10702H16618q49970K088128J854051M69006J777951K695710j349887o228812m693776
10693c420981Q64979J887977k240005m213087j572292J146739K231555M133352
10685a181763N202974Q71936o140195p289538j469976L103903K210892R67800
10677c723967L094459M442794J424395k277872k159566L72053J881319K049830
$$ plain form
10738 -5021184 -1059435 7966789 13730449 13683836 12178550 11723468 9691658 4483313 -810148
10729 -810148 -2808054 -1893286 -560753 -911172 -4049589 -8610300 -10207866 -6075919 481983
10720 481983 4366077 6040722 9411132 13629980 13592953 8630463 4039903 3000451 3205265
10711 3205265 2719613 2941694 4109477 3861607 2147955 1953076 3469334 3260540 816618
10702 816618 -33352 2054776 3908827 4377833 6155784 8851494 7501607 1272795 -3420981
10693 -3420981 -2556002 -668025 -2908030 -7121117 -8693409 -7546670 -5315115 -1181763
10685 -1181763 4021211 4893147 -1247048 -8536586 -10006562 -6902659 -4691767 -3723967
10677 -3723967 -629508 3813286 5237681 2959809 800243 1172296 3053615 5103445
10669E103445J452118p25262l568587l720714o98887J313581l76440k897530k353346
10660f471622Q77845L523625L472138J008144j806763k363746j34542K092406
10652A97485J583469o75746j787725q00094J428464L834699M325336Q04049m123767
10643D786170m012070J951740N680018J725438l720601k555855K099458J782920
10635G737218k571445k701358K163659L970089j16224l017498J73556M364671
10627A0002668K857402k890765o182811l828557J158791L473710Q72432l091224
10619B371646k597395K658401O053196L132811j724787j998662J420558K728711
10611A2044479J86358k977477m209558l128522J52522L686552L648336j80269
$$ plain form
10669 5103445 6555563 5830301 2261714 -1459000 -2157887 -844306 -1220746 -4118276 -6471622
10660 -6471622 -5593777 -2070152 1401986 2410130 603367 -1760379 -1894921 197485
10652 197485 1780954 1105208 -682517 -1482611 -54147 3780552 8105888 8909937 4786170
10643 4786170 774100 2725840 8405858 10131296 6410695 3854840 5954298 7737218
10635 7737218 5165773 2464415 4628074 8598163 8481939 5464441 5637997 10002668
10627 10002668 12860070 9969305 3786494 -42063 1116728 4590438 5462870 2371646
10619 2371646 -225749 2432652 8485848 11618659 9893872 7895210 9315768 12044479
10611 12044479 12230837 9253360 5043802 1915280 2067802 5754354 9402690 9222421
10603I222421k579046n70732J831652R52611k73206J269873K382187j81846k994333
10594I059581k223872n94459j272407j251981J981667M030385J447690j103775
10586A0072829N78982K264100J69343q42563K735678M169939j729079p365371
10578A0053858m742982L62401m93741k843772P39847M644812M37575n465209k017608
10569F75181N713025M569738l541047n448062L44643L209338K65446j192351N45304
10560E141215M3086k532024k213052m59790j530463j713473L624858P922537L395023
10551A1677917l666539l401933n0058k015092l870930K376407Q288466K957055
10543A2295293m336564O74488R603910N327992o084929o105294K148420J367084
$$ plain form
10603 9222421 6643375 6072643 7904295 8856906 8583700 9853573 12235760 12053914 9059581
10594 9059581 6835709 6241250 4968843 3716862 5698529 9728914 11176604 10072829
10586 10072829 10651811 12915911 13085254 12242691 14978369 19148308 17419229 10053858
10578 10053858 5310876 5673277 5179536 2335764 3075611 7720423 8157998 2692789 675181
10569 675181 6388206 10957944 7416897 1968835 2313478 5522816 5788262 4595911 5141215
10560 5141215 5184301 2652277 439225 -20565 -1551028 -3264501 360357 8282894 11677917
10551 11677917 8011378 4609445 4559387 2544295 -1326635 1049772 9338238 12295293
10543 12295293 7958729 8633217 18237127 23565119 17480190 11374896 13523316 14890400
10535A4890400n721571k466690P139734M680810n879925l708504Q780079Q736696
10527B6451029m354025p103824M522547Q938608k52739n321251p86379p48440
10519B1345526n613740k92237J0598385O256426q269935o697774Q765963R237140
10511C5329754n483489m936928J2304434J2781021q063471j5016168Q04799O558253
10503C4278205o014568m535079J5276460J5512107p299971q386405J6733448J6103254
10495G1667451j4390534r955991L6042883L9474550j4345208j0084277R2086224
10488A90495098J25506183m6862724k69138633k68957782m7337804J23553060
10482a92742602R0915391p325021r047674M1286203L1387795j5728063j3891199
$$ plain form
10535 14890400 9168829 6702139 13841873 18522683 12642758 8934254 17714333 26451029
10527 26451029 22097004 14993180 19515727 28454335 28201596 22880345 22093966 21345526
10519 21345526 15731786 15439549 26037934 32294360 24024425 17326651 26092614 35329754
10511 35329754 29846265 24909337 37213771 49994792 41931321 26915153 27719952 34278205
10503 34278205 28263637 23728558 39005018 54517125 47217154 38830749 55564197 71667451
10495 71667451 57276917 47320926 83363809 122838359 108493151 98408874 190495098
10488 190495098 316001281 269138557 -76 -268957858 -316295662 -192742602
10482 -192742602 -101827211 -109152232 -118199906 -76913703 -45525908 -61253971 -75145170
10475g5145170K2038306K0114741j1201842j1065523J5803006J6850865n917237
10468b8522854p292923J1228507R481634j0375902r780717J0662757J3493132
10461a1106366m617703r873667M119833Q947658k127657n166748N192965P093928
10453g537757m642578j0255332l975221j249574m730089m47963J0125508R669626
10445a3043380j322102l812956N037799Q094111Q52363k632471J611823J905025
10437c309788l793559m317432R81386P48764m788274l732670L275098L533903
10429a1402572k519693j515226O459692O646029l068589p868050k188826K834794
10421a2622441J653111J944476N938087N177931j380948l576228J095370L032130
$$ plain form
10475 -75145170 -53106864 -32992123 -44193965 -55259488 -39456482 -22605617 -28522854
10468 -28522854 -35815777 -24587270 -15105636 -25481538 -35262255 -24599498 -11106366
10461 -11106366 -15724069 -25597736 -21477903 -12530245 -14657902 -19824650 -14631685 -7537757
10453 -7537757 -12180335 -22435667 -26410888 -27660462 -32390551 -32838514 -22713006 -13043380
10445 -13043380 -14365482 -18178438 -13140639 -5046528 -4194165 -6826636 -5214813 -3309788
10437 -3309788 -7103347 -11420779 -10439393 -9690629 -14478903 -18211573 -14936475 -11402572
10429 -11402572 -13922265 -15437491 -8977799 -2331770 -5400359 -13268409 -15457235 -12622441
10421 -12622441 -10969330 -9024854 -3086767 2091164 710216 -2866012 -1770642 1261488
10413A261488j052583k879374M20041J178976l001810m555450r19470J039781
10405h508401j038301j215910J781363J998585r95170p34092K809466K404140
10397c498320k177515k964894J306345K751594j217313m076188k605387o49639
10389a3131317P00480M324632P761257N065486j537703l934988j746669j352616
10381c851438k512355N33467N590193M486711j695157l666224k02814R52147j589722
10372a955192j432993J426332J64834m294984l556457K100190L166755j768304
10364f149819l538877N53765K603759k87602j486415J062725J290348j303502
10356g255618K76999N346055M232878l645562o463895j8160M807342R03415m161598
$$ plain form
10413 1261488 208905 -2670469 -2250428 -1071452 -4073262 -8628712 -9548182 -8508401
10405 -8508401 -9546702 -10762612 -8981249 -6982664 -7977834 -8711926 -5902460 -3498320
10397 -3498320 -5675835 -8640729 -7334384 -4582790 -5800103 -9876291 -12481678 -13131317
10389 -13131317 -12430837 -8106205 -344948 4720538 3182835 -752153 -2498822 -3851438
10381 -3851438 -6363793 -5830326 -240133 4246578 2551421 -1114803 -1317617 -365470 -1955192
10372 -1955192 -3388185 -1961853 -1797019 -6092003 -9648460 -7548270 -4381515 -6149819
10364 -6149819 -9688696 -9134931 -6531172 -6818774 -8305189 -7242464 -5952116 -7255618
10356 -7255618 -6978619 -1632564 2600314 -1045248 -7509143 -7527303 -2719961 -1816546 -5978144
10347e978144l242816p58084r17620Q20895N974158O436463j030307o499723k760705
10338g955883K567291Q94198k846877n61479M307857L997008J00668r82927M89836
10329I692O26305K39921J233384O45446l364136n642142k198852J889551P82435
10320e778396k031702l59770L580793L420354m75500k686221j721785J7834J889926
10311d144467L979451L791385J07516l157075k449050l41944p29243k320483k046693
10302g310603o76348J04801J680138M259601L534885k392206p326396m898391
10294a3024519J578652L923017P71165k178878j421076J114929K721111K501395
10286d014204M03871k010345j324338L236449O835816M500896k076380o834748
$$ plain form
10347 -5978144 -9220960 -9979044 -10896664 -10075769 -4101611 2334852 1304545 -5195178 -7955883
10338 -7955883 -5388592 -4494394 -7341271 -7902750 -3594893 402115 502783 -480144 9692
10329 9692 635997 875918 2109302 2754748 -609388 -6251530 -8450382 -6560831 -5778396
10320 -5778396 -7810098 -8169868 -4589075 -1168721 -1644221 -4330442 -6052227 -6034393 -4144467
10311 -4144467 -165016 3626369 3733885 576810 -1872240 -2214184 -2943427 -5263910 -7310603
10302 -7310603 -7986951 -7882150 -6202012 -1942411 1592474 -799732 -8126128 -13024519
10294 -13024519 -11445867 -7522850 -6751685 -8930563 -10351639 -9236710 -6515599 -4014204
10286 -4014204 -3610333 -5620678 -6945016 -3708567 3127249 7628145 5551765 -1282983
10278a282983o725625l366146P94942M175800N137358K911406p66189l110383
10270b231820l024783j376002L53771R94331N83466M58188J054951P17724j005111
10261c475285j061287K156184M143288M96728m375035k637330L760715M701421
10253C709399k073370o623036k152930M770503N024420p902k947310j820617m082
10244b124925O88763N28148j004176l295562l141750K93563K765377J383884n48558
10235d455236L42489J292826j193734m093484k441697K009172L279209L74683
10227d885772k091587j487689M0027J42291p13527j019514l8566K085195M102000
10218c867142M269546K496074N71197m43502r54288o64397J207472L095395K280722
$$ plain form
10278 -1282983 -8008608 -11374754 -10579812 -6404012 -1266654 1644752 878563 -2231820
10270 -2231820 -5256603 -6632605 -6278834 -5284503 -4701037 -4242849 -3187898 -2470174 -3475285
10261 -3475285 -4536572 -2380388 1762900 2259628 -2115407 -4752737 -992022 3709399
10253 3709399 1636029 -4987007 -7139937 -2369434 2654986 2647084 -300226 -2120843 -2124925
10244 -2124925 -1436162 -908014 -1912190 -5207752 -8349502 -8055939 -5290562 -3906678 -4455236
10235 -4455236 -4112747 -2819921 -4013655 -8107139 -10548836 -8539664 -5260455 -4885772
10227 -4885772 -6977359 -8465048 -8425021 -8282730 -8996257 -10015771 -10054337 -7969142 -3867142
10218 -3867142 402404 2898478 3469675 3026173 2071885 1407488 2614960 5710355 7991077
10209G991077m85533j837120j664582k830197m441705k085906L505576N399432
10201C551042J151379k785529j343537J804081K031644J463887K786772K480488
10193A1140227k294446o173183l286347K408388L104094n39655j960390m25816
10185A972872p88654l260909k932041N34363J526312j770158l763815m5992O110845
10176b417177Q457609N121577o12862m249646l904614j842310j725538l269612
10168d442573k192730K608569N879094L608692m24074o76674J539163J442064
10160G341531o95796j236621o17439j742212l000823o41008L229440L016357o35825
10151E017604j684940P38231J107305k179457l850027j279151J208620N62597
$$ plain form
10209 7991077 7505544 5668424 4003842 1173645 -3268060 -5353966 -1848390 3551042
10201 3551042 4702421 1916892 573355 2377436 4409080 5872967 8659739 11140227
10193 11140227 8845781 2672598 -613749 1794639 4898733 4359078 2398688 1972872
10185 1972872 1184218 -2076691 -5008732 -4474369 -2948057 -4718215 -8482030 -8528022 -2417177
10176 -2417177 6040432 11162009 10549147 6299501 2394887 552577 -1172961 -4442573
10168 -4442573 -6635303 -4026734 1852360 5461052 5036978 4360304 5899467 7341531
10160 7341531 6645735 5409114 4791675 3049463 48640 -592368 2637072 5653429 5017604
10151 5017604 3332664 4070895 5178200 2998743 -851284 -2130435 -921815 -359218
10143c59218j40484J270428J506652j187186k292170J257922M497353J835902
10135F389199l617424m836053j654694O8826j817036l454356k009853O90259K227733
10126h013399K809270L266596L125922J899967K25133r60418j019795L49507K229206
10117C911989K394433k7958k606539k378712J91240K259810K732763K548873J432456
10108A0458355k036568o455923p242965k317690M186499O353159L384348k43164
10100F086051r47495K8105n71837l043007m211125j800589K069096L064632J61266
10091H35097k765411j985380J045379K000924R7638j170002j6737Q00336r21496
10082b079652k505662o08926K818961L077261j18843k432816j418503J043485
$$ plain form
10143 -359218 -499702 770726 2277378 1090192 -1201978 55944 4553297 6389199
10135 6389199 2771775 -2064278 -3718972 -3650146 -5467182 -8921538 -10931391 -10241132 -8013399
10126 -8013399 -5204129 -1937533 1188389 3088356 3313489 2353071 1333276 1682783 3911989
10117 3911989 6306422 6278464 3671925 1293213 1484453 3744263 6477026 9025899 10458355
10108 10458355 8421787 1965864 -5277101 -7594791 -3408292 2944867 6329215 6086051
10100 6086051 5138556 5166661 4594824 1551817 -2659308 -4459897 -2390801 673831 835097
10091 835097 -1930314 -3915694 -2870315 -869391 -771753 -1941755 -1958492 -1158156 -2079652
10082 -2079652 -4585314 -5194240 -2375279 701982 583139 -1849677 -3268180 -2224695
10074b224695K778979L407334K129822j768719n331720l999325J090739L259873
10066f57712J44311k454325k40614K204293n42364m655574k722413L718445N795861
10057E89908O43991m861138m567837k84772L241324M493166L801568R49541k674300
10048A331451l352685K92371M363531M049746n87499m907974m746139l96359L642268
10039c11289L121223r91626l502710k175291q75284k694365l784196O56783P237338
10030c319417Q197575L018093j326613j618743j914303m418407m911802o26357
10022f919974M127514M427148J509554q61846k021461k549138j330106J433047
10014b185262K267953l67389k451897p9761M308221N446587K470578j172284k905535
$$ plain form
10074 -2224695 554284 3961618 6091440 4322721 -1008999 -5008324 -3917585 -657712
10066 -657712 -513401 -2967726 -3208340 -1004047 -1546411 -6201985 -8924398 -5205953 589908
10057 589908 1233899 -3627239 -8195076 -8479848 -5238524 -745358 3056210 4005751 1331451
10048 1331451 -2021234 -1728863 2634668 6684414 6096915 1188941 -3557198 -3953557 -311289
10039 -311289 2809934 1818308 -1684402 -3859693 -4734977 -7429342 -11213538 -10556755 -3319417
10030 -3319417 4878158 7896251 6569638 4950895 3036592 -1381815 -6293617 -6919974
10022 -6919974 -2792460 1634688 3144242 2282396 260935 -2288203 -3618309 -2185262
10014 -2185262 82691 -284698 -2736595 -2816356 1491865 6938452 9409030 8236746 5331211
10005E331211k662174j136339N40602P86306m91028j397163r28438k47847j5878
9996b20748P21907J813477J459571k91746j105416p09874j521424l411382k758536
9987f024171R74212K964889N98524j848782k72683K323711J131137k163575k298597
9978d615335Q52528K456948N99585j332017m21584J685429J633034r35248k745957
9969b822617p96536L306125M276761O097m517112l572450R64067K768527R68960
9960E81822N8135N48749j740622n828616m472256L457979Q635417M787134j667785
9951D359957k160626J226474J379831j524703k102118N6527R04585l0000N1805
9942B161732P42556o96115l291817l459795j174105L35876P2711j94502K35099
$$ plain form
10005 5331211 2669037 1532698 2073300 2859606 2368578 971415 42977 -204870 -220748
9996 -220748 501159 2314636 3774207 3482461 2377045 1667171 145747 -3265635 -6024171
9987 -6024171 -5049959 -2085070 -1486546 -3335328 -3608011 -1284300 -153163 -2316738 -4615335
9978 -4615335 -3762807 -1305859 -706274 -2038291 -2459875 -774446 858588 -76660 -2822617
9969 -2822617 -3619153 -313028 3963733 3969830 -547282 -4119732 -3155665 -387138 581822
9960 581822 639957 1188706 -551916 -6380532 -10852788 -7394809 1240608 6027742 4359957
9951 4359957 2199331 3425805 4805636 3280933 1178815 1235342 2139927 2109927 2161732
9942 2161732 2904288 2208173 -1083644 -4543439 -5717544 -5381668 -5308957 -5503459 -5268360
9933e268360O11315R37539J471543J734216K043913L187844L294971l29389m940798
9924B742794m442790J96844Q64006l920768m939900K255756Q236156M439876k799916
9915B632058l451026j77548j291549m681044k460626L536349M822083J338743
9907B67440J35668J745388J074068m95800K499749O756753L743203m494264p065456
9898D166749k067072J314219m62455q02655K457449K347489l288863o442752k734169
9889e512060J357950O00472n52470K478003O018726N267415J854521n41891j320175
9880I650491q09001K25421j621461o918604p424990K692745J1655188K446172
9872I895961j8567111k4695687o428175J3665539J3661418J509573k589071K897449
$$ plain form
9933 -5268360 -4657045 -3719506 -2247963 -513747 1530166 4718010 8012981 7683592 2742794
9924 2742794 -1699996 -1503152 -639146 -4559914 -9499814 -7244058 992098 5431974 2632058
9915 2632058 -818968 -996516 -2288065 -6969109 -9429735 -5893386 -1071303 267440
9907 267440 403108 2148496 3222564 2726764 5226513 11983266 15726469 11232205 4166749
9898 4166749 2099677 3413896 2951441 2148786 4606235 6953724 3664861 -2777891 -5512060
9889 -5512060 -4154110 -3553638 -4106108 -1628105 4390621 9658036 11512557 10970666 9650491
9880 9650491 8841490 9066911 7445450 526846 -6898144 -4205399 7449789 9895961
9872 9895961 -8671150 -33366837 -39795012 -26129473 -12468055 -10958482 -13547553 -10650104
9864a0650104N236325J434118q89232p1362p63770j638049K061678O408225L356656
9855D484485m195226n162093K223669P699567M630754j988993m757635k689174
9847B45354P53743K114209k44272m147699m588682o14183K141381L21420j011751
9838e030480K638881O118526K959924k674041k481960J782106J680598l086365
9830A907189m730939j157852J516828N17083J2904J939235K735968J031747O0211
9821C832374O45886k92995k617610k131506J279318K223020j194580l973692k450104
9812d679889M21272Q28233l62118o47462K549M59725M23783j94999r86921l06439
9802e042266K035663K836132K82220j733646N46907L281597L24779o062581p723427
$$ plain form
9864 -10650104 -5413779 -3979661 -4868893 -4940255 -5704025 -7342074 -5280396 1127829 4484485
9855 4484485 289259 -4872834 -2649165 5050402 9681156 7692163 2934528 245354
9847 245354 999097 3113306 2869034 -1278665 -5867347 -6481530 -4340149 -4018729 -5030480
9838 -5030480 -2391599 3726927 6686851 4012810 1530850 3312956 4993554 1907189
9830 1907189 -2823750 -3981602 -2464774 -1947691 -1934787 4448 2740416 3772163 3832374
9821 3832374 4478260 4185265 1567655 -563851 715467 2938487 1743907 -2229785 -4679889
9812 -4679889 -4258617 -3430384 -3792502 -4439964 -4437415 -3977690 -3553907 -3748906 -4735827 -5042266
9802 -5042266 -3006603 -170471 111749 -1621897 -1074990 2206607 2531386 -3531195 -11254622
9793a1254622k786304K744075M960455N222842L717916r90207n457503l889589
9785g732937J504430K308040k155352l085837K480825N641364L05994o314472
9777g047945n272593M97113K474593l535j183476P36978K656789K988480K351945
9768a801651L88370k541626l227425k24793K542191J752542N89129L034536N907160
9759F418433L330361l287733o734763m404346q37039l6438r08366q77657N70670
9750f766878K679908M248687L461105j13360l633525l925575j686935m3158K0469
9741e759262k10484l96040j063464j181161P23335L484368M414422L021882R34925
9732C968521q89214k017887j075665J969752L408946N3797m855350m900143K57532
$$ plain form
9793 -11254622 -14040926 -11296851 -6336396 -1113554 2604362 1614155 -3843348 -7732937
9785 -7732937 -6228507 -3920467 -6075819 -9161656 -6680831 -1039467 -733473 -7047945
9777 -7047945 -12320538 -11823425 -9348832 -9352367 -10535843 -9798865 -7142076 -4153596 -1801651
9768 -1801651 -1413281 -3954907 -7182332 -7407125 -4864934 -3112392 -2523263 511273 6418433
9759 6418433 9748794 6461061 -273702 -4678048 -5515087 -5551525 -6459891 -7337548 -6766878
9750 -6766878 -4086970 161717 3622822 3509462 -124063 -4049638 -5736573 -5779731 -5759262
9741 -5759262 -5969746 -6365786 -7429250 -8610411 -7887076 -4402708 11714 3033596 3968521
9732 3968521 3079307 1061420 -14245 1955507 5364453 5418250 562900 -4337243 -4079711
9723d079711M020150K368455r64912j209380L76746r908j821366j665978K02411
9714b783493J68838k088592k298790J389324M429670K255633k297720k530979
9706c756109K157071M971087J599106l404591l465016L38154J434803j910190
9698b035685m122037j088922L613886M107449L83906k616072k373047j316259
9690e446781j930475k740643r74184K606191M152540K092764l79230K17878K504510
9681A02570K470718n8194j241446K1918l8410l202215n105160j893516L185242
9672e758493M921182M159533M506810M308919k75867o147142o216770j383866
9664a885694j02310m394607o049661l92148N601969M604874p609j499250r63175
$$ plain form
9723 -4079711 -59561 2308894 1343982 134602 511348 501440 -1319926 -2985904 -2783493
9714 -2783493 -2614655 -4703247 -7002037 -5612713 -1183043 1072590 -1225130 -3756109
9706 -3756109 -1599038 3372049 4971155 1566564 -1898452 -1560298 -125495 -2035685
9698 -2035685 -6157722 -7246644 -3632758 474691 858597 -1757475 -4130522 -5446781
9690 -5446781 -7377256 -10117899 -11092083 -8485892 -4333352 -2240588 -2619818 -2401940 102570
9681 102570 2573288 2515094 1273648 1295566 1257156 -1945059 -7050219 -8943735 -5758493
9672 -5758493 -837311 3322222 7829032 12137951 11862084 5714942 -501828 -1885694
9664 -1885694 -1988004 -6382611 -12432272 -12824420 -7222451 -2617577 -2625186 -4124436 -5087611
9655e087611k660050l823052R99254Q420700Q935637Q17664p093894p478868k532246
9646i502466J632808K785102K543325K588806L085357K922667J046971j245233
9638E857337r34667J857305K568119r36083l737570j124737K886222J145159m581095
9629B999990n328978J096913O067856K595144m888652p173904k148719L967306
9621b813044M708716k65079n594788n721795q98601K917524J875006l64914J214913
9612d942062M134099K087096l725992m862127J444596P308135N426671j204948
9604E665468n083656m368334k401939j069836L26402J880129K782299K805193
9596E35726J788038l50607j761455o8523K986394K511401k011723n036944l376171
$$ plain form
9655 -5087611 -7747661 -11570713 -10571459 -2150759 6784878 7602542 508648 -6970220 -9502466
9646 -9502466 -7869658 -5084556 -2541231 47575 3132932 6055599 7102570 5857337
9638 5857337 4922670 6779975 9348094 8412011 4674441 3549704 6435926 7581085 2999990
9629 2999990 -2328988 -1232075 4835781 7430925 2542273 -4631631 -6780350 -2813044
9621 -2813044 1895672 1630593 -3964195 -9685990 -10584591 -7667067 -5792061 -6156975 -4942062
9612 -4942062 -807963 1279133 -2446859 -7308986 -5864390 1443745 6870416 5665468
9604 5665468 581812 -3786522 -6188461 -7258297 -6931895 -5051766 -2269467 535726
9596 535726 2323764 1973157 211702 143179 3129573 5640974 3629251 -1407693 -4783864
9587d783864q64136j034372j052871J907210L951848R81384k708285m54687N206016
9578A148243N801091L86488l281624j453204O27523j170847k857412J52141M630597
9569C982996M268437o98647l928983j797724K267743K531248k065667o345308
9561a785905m430848K821296P438481L616207m196235o557404j741927K358492
9553b477843L61277k750465r4857N667347N930212p17460o022357l917511J229644
9544b792013J830377j728383k609123J276321L926799R26367l044518j058561
9536c272734N043132O820362J685761l545535l146990j01012L26348j036535n96919
9527B175878O29564o12941k808957j801963J444590J939467r06730k545277j230187
$$ plain form
9587 -4783864 -5648000 -6682372 -7735243 -5828033 -1876185 -894801 -3603086 -4057773 1148243
9578 1148243 6949334 7335822 4054198 2600994 3228517 2057670 -799742 -647601 3982996
9569 3982996 8251433 7552786 3623803 1826079 4093822 6625070 4559403 -1785905
9561 -1785905 -6216753 -3395457 4043024 7659231 3462996 -3094408 -4836335 -2477843
9553 -2477843 -2116566 -4867031 -4961888 705459 6635671 5918211 -104146 -4021657 -2792013
9544 -2792013 -961636 -2690019 -5299142 -4022821 -96022 830345 -2214173 -3272734
9536 -3272734 1770398 8590760 10276521 6730986 3583996 3482984 3809332 2772797 2175878
9527 2175878 2805442 2192501 -616456 -2418419 -973829 965638 58908 -2486369 -3716556
9518c716556o9629k60516R07858L528380L400797l75242k704276q91353O53732
9509D73195j590441l842182k050705M48939j009497l542901j538176L215865M468128
9500d967775K319093K404813N035953M081444k086664o726268m600627R63426
9492c576605M139444M084123K922524J151602j195626k552872k217018j585710
9484A169862q66561J493466M135209K790273k021106l316060J559678M618068
9476I562829j189684r195476p281256L631218R916350M564952m074209n907059
9468B7665k136205N25227Q15431J060690J32725l714515o531633l283266L088206
9459a0015675N012833J910810N33580L321854M749646J539123j596703p14868
$$ plain form
9518 -3716556 -3786185 -4046701 -3138843 389537 3790334 3415092 710816 -180537 473195
9509 473195 -1117246 -4959428 -7010133 -6561194 -7570691 -11113592 -12651768 -9435903 -4967775
9500 -4967775 -2648682 -243869 4792084 8873528 6786864 60596 -4540031 -3576605
9492 -3576605 562839 4646962 7569486 8721088 7525462 4972590 2755572 1169862
9484 1169862 303301 1796767 5931976 8722249 6701143 3385083 4944761 9562829
9476 9562829 8373145 -822331 -8103587 -4472369 5443981 10008933 5934724 27665
9468 27665 -2108540 -1583313 -767882 292808 425533 -3288982 -9820615 -13103881 -10015675
9459 -10015675 -5002842 -3092032 -2558452 763402 5513048 7052171 5455468 4740600
9451D740600O3133l796511p921069n065442K823876O665760L239339j537200k621308
9442c408822j725902j355279Q1567L559227N388746K590958j510788j910465N29143
9433B238385J050477j153122k182884k25748J715747R87191p01367n21917P66019
9424A972781l1860l553934o250539m381126J159862N090282L480969j323799l128171
9415f965535M45785M738204M021779r64827l976684j294241L771698N147606J080275
9406F004060m263028n684797k428809J590833K644528J120515k33605o23742j308380
9397c182425j948026m82328K456332K982964N8901j810218M82147K814554J45704
9388A517605m335283l240067L008605N961991J960536k625714k056606K24636
$$ plain form
9451 4740600 4803733 1007222 -6913847 -11979289 -9155413 -2489653 749686 -787514 -3408822
9442 -3408822 -5134724 -6490003 -6408436 -2849209 2539537 5130495 3619707 1709242 2238385
9433 2238385 3288862 2135740 -47144 -272892 1442855 2430046 1728679 1206762 1972781
9424 1972781 1940921 -1613013 -7863552 -12244678 -11084816 -5994534 -2513565 -3837364 -6965535
9415 -6965535 -6519750 -1781546 2240233 1275406 -2701278 -3995519 -223821 4923785 6004060
9406 6004060 1741032 -3943765 -6372574 -4781741 -2137213 -1016698 -1250303 -1874045 -3182425
9397 -3182425 -5130451 -5612779 -3156447 -173483 -114582 -1924800 -1442653 1371901 1517605
9388 1517605 -2817678 -6057745 -3049140 2912851 4873387 2247673 191067 415703
9380D15703j047573l170198l45027N378103O198022N83153m490648m243791k081985
9371b804241k255763k499473J417488P403552Q581862K385661n789018q687163
9363b247095m753229J161589L430769J194223j585324j253313J226323K129942
9355f96115M08521j046250p90J877132K060924J244062J681452K745678J467614
9346I742228k413532n107859l760177l97020J018944q8740q29081N51058K353587
9337A069408K141906p9749k432318l704982m009627l468076j677163J324790M491693
9328f344118O508500O591228M643649J525943q25672r09288J94321l17988k998170
9319H068405m778625l311651q41621q52935k277845j264966J573159J063565l651913
$$ plain form
9380 415703 -631870 -3802068 -4147095 1231008 7429030 8012183 3521535 -722256 -2804241
9371 -2804241 -5060004 -7559477 -6141989 1261563 9843425 12229086 6440068 -2247095
9363 -2247095 -7000324 -5838735 -2407966 -1213743 -2799067 -4052380 -2826057 -696115
9355 -696115 -287594 -1333844 -1334634 542498 2603422 3847484 5528936 8274614 9742228
9346 9742228 7328696 2220837 -1539340 -1936360 -917416 -1006156 -1835237 -1284179 1069408
9337 1069408 3211314 3131565 699247 -3005735 -7015362 -10483438 -12160601 -10835811 -6344118
9328 -6344118 164382 6755610 11399259 12925202 12099530 11190242 11384563 11066575 8068405
9319 8068405 3289780 -21871 -863492 -1716427 -3994272 -5259238 -3686079 -2622514 -6274427
9310f274427n768534m27137O964181P806753K536344j108827l57564o8616k744259
9301E57914m035419r69428K520581K471895J271884K305775L504340J748070q38116
9292H537496r73374n61150k477286l821203q11612K822935R84657l450935k213118
9283a963590M029172N546754o48786n643172l171282P79371r73452m822212l320198
9274a0187395K290351M961755L087509R27546N41085M80517O45368K027068L051489
9265G825293J764108O3719N76970J388641o34067l457026k823770K49392J142792
9256F096052o81764j906520j848130k237881j936242J071887L599948R90214l753968
9247f06404l193016J987996L095802k250137n831800k432715J899119P06489k284245
$$ plain form
9310 -6274427 -12042961 -12470098 -5505917 2300836 4837180 3728353 3370789 3302173 557914
9301 557914 -3477505 -4446933 -1926352 545543 1817427 4123202 7627542 9375612 8537496
9292 8537496 7564122 7002972 4525686 704483 -107129 2715806 3700463 249528 -1963590
9283 -1963590 2065582 7612336 6963550 1320378 -1850904 -1071533 -2044985 -6867197 -10187395
9274 -10187395 -7897044 -2935289 152220 1079766 1620851 2101368 2746736 4773804 7825293
9265 7825293 9589401 9653120 10230090 11618731 10984664 7527638 4703868 4953260 6096052
9256 6096052 5414288 3507768 1659638 -578243 -2514485 -1442598 2157350 3147564 -606404
9247 -606404 -3799420 -1811424 1284378 -965759 -6797559 -9230274 -7331155 -6624666 -8908911
9238h908911n04640M290899N973196M166013K748048J963227n02272l243382l015885
9229B966293r86328o09046j054915O72708K653681L40198m574208n133915k3852
9220e749384L676199J202157k719059j402402L837197O234974L397023n50006
9212G926699j998214k383729m211456n885673l709149J914372N815463M766404
9204B234717J795893J117938J419326j185559m906753l398534L647995P655634
9196H380657K737975n300038o916019j781347K532205K242334O71277N05283k25407
9187B846920k904277m766655l292476k65635J202014R43762P24043J028772R93001
9178c490531K99196l64559j01468J400953L051295K682629k23712k666750j366979
$$ plain form
9238 -8908911 -9413551 -5122652 850544 5016557 7764605 9727832 9225560 5982178 2966293
9229 2966293 1979965 1370919 316004 988712 3642393 3982591 -591617 -5725532 -5749384
9220 -5749384 -2073185 -871028 -3590087 -4992489 -1155292 5079682 8476705 7926699
9212 7926699 5928485 3544756 -666700 -6552373 -10261522 -8347150 -2531687 2234717
9204 2234717 4030610 5148548 6567874 5382315 475562 -2922972 725023 8380657
9196 8380657 11118632 5818594 -1097425 -2878772 -346567 1895767 2567044 3072327 2846920
9187 2846920 -57357 -4824012 -8116488 -8382123 -7180109 -6236347 -5512304 -4483532 -3490531
9178 -3490531 -3191335 -3555894 -3657362 -2256409 794886 3477515 3253803 587053 -779926
9169g79926K211257L006652o64156m181875k559353K765876N628730K972698j422235
9160F977668j897402J754294L857548K96627n529354o711887k094507K200945
9152a146068J549738j000669l36440K506159K507839q81290k923120j101756J629167
9143H03560K134680J167926M02342p09880k670206l530564j514832J901478L901816
9134A886320L851280K941329J764878L03713q22475j197138j915459l995354n922227
9125c105133m933166j015616K267082J969002l90951o54454K549154N802461N127703
9116G616082R91896k516953k930801j708880j150496j367380j361291j000955
9108c428778l92898R47852K646948K918745J309711J93989J280544K391117N60522
$$ plain form
9169 -779926 1431331 4437983 3773827 -408048 -2967401 -201525 5427205 8399903 6977668
9160 6977668 5080266 6834560 10692108 10988735 5459381 -1252506 -3347013 -1146068
9152 -1146068 403670 -596999 -933439 1572720 4080559 3199269 276149 -825607 803560
9143 803560 2938240 4106166 4508508 3798628 1128422 -2402142 -3916974 -2015496 1886320
9134 1886320 5737600 8678929 10443807 10747520 9925045 8727907 6812448 2817094 -3105133
9125 -3105133 -8038299 -9053915 -6786833 -4817831 -5208782 -5863236 -3314082 2488379 7616082
9116 7616082 8607978 6091025 3160224 1451344 300848 -1066532 -2427823 -3428778
9108 -3428778 -3821676 -2873824 -226876 2691869 4001580 4195569 5476113 7867230 8427752
9099H427752k991006m215961j917264J047172J994287R30981j117594l398989
9091a240622m627820l348638J86501M025138O355941O019535K271102l633350
9083F007787p546796o118126j209412K018228J323653q06780j340830j5854J631329
9074f056801K226102J368769R2445J1803Q33435M90937p23560N83913M631613
9065C458656N627695K38090n158812k868980L442508L457921l563705p376208
9057b742835k725273L496296M321564K180439J332207r4063l830372n076550l01978
9048c440565M751266L233197j599674k001776J431592J873817j320808k006354
9040I20695J504113L695360J462051j432139j533983o81633j289154k123332j516304
$$ plain form
9099 8427752 5436746 1220785 -696479 350693 2344980 3275961 2158367 -1240622
9091 -1240622 -5868442 -9217080 -9030579 -5005441 1350500 7370035 9641137 6007787
9083 6007787 -1539009 -7657135 -8866547 -6848319 -5524666 -6331446 -7672276 -7688130 -6056801
9074 -6056801 -3830699 -2461930 -2369485 -2357682 -1524247 -1033310 -1756870 -1172957 3458656
9065 3458656 9086351 9324441 4165629 1296649 4739157 8197078 4633373 -2742835
9057 -2742835 -5468108 -1971812 2349752 4530191 5862398 5768335 1937963 -3138587 -3440565
9048 -3440565 1310701 4543898 2944224 942448 2374040 4247857 2927049 920695
9040 920695 2424808 6120168 7582219 6150080 4616097 3934464 2645310 521978 -994326
9031i94326n60581o45135j036247p38025j29490L47340P72440P05774j2762J74452
9021b116560K312232M071412K529778j101001l281754l448427l152702j543575
9013e730597K579879N429143K051628m418725n132269J308632O084406L560013
9005E732110o66772L0556K629907R19263l213988l206351Q93921K825377M33650
8996F377673j918862j324183j76809r36819k283213k079151l65745J787343L464588
8987B544822L503198J669085L7074L13296O51272j267532l237587j560958J650052
8978D302722M97616m592844n813162P5468N490246K799155m134806n896393j406769
8969h678767J851004J81396j712444L02280L262134K835469K95241n13423L29750
$$ plain form
9031 -994326 -1554907 -2200042 -3236289 -3974314 -4103804 -3756464 -2984024 -2278250 -2291012 -2116560
9021 -2116560 195672 4267084 6796862 5695861 2414107 -1034320 -4187022 -5730597
9013 -5730597 -3150718 2278425 4330053 -88672 -5220941 -3912309 2172097 5732110
9005 5732110 5065338 5095894 7725801 8645064 5431076 2224725 3118646 5944023 6377673
8996 6377673 4458811 3134628 2957819 2021000 -262213 -2341364 -2707109 -919766 2544822
8987 2544822 6048020 7717105 7754179 8067475 8718747 7451215 4213628 2652670 4302722
8978 4302722 4800338 207494 -5605668 -5530200 -39954 2759201 -1375605 -7271998 -8678767
8969 -8678767 -6827763 -6646367 -8358811 -8056531 -4794397 -1958928 -1663687 -2177110 -1847360
8960a847360p0957j774242j923198K07794J952093J534405N87966J248890K808742
8951B724133K728806R0202l049355l704681j198708J769093J943148m99450k151592
8942a348404j173110J93102m01101j231496M71608K930574J773590k507572m048222
8933e341031k03348M005011L151238o99243j633136J168751L172107K111557O22427
8924F354333O70521K33094k245557l859436j157763L876411N471128J645680k884287
8915H104124k761821R40571K187707j574058n293508k924511L510587N511551
8907G700642n47471p879542q024075j843767K675668J730026o95575m74616J191359
8898f167351J923387K652452M382023M379533K24834m721139m880566n44308K450406
$$ plain form
8960 -1847360 -1918317 -3692559 -5615757 -5407963 -3455870 -1921465 -1333499 -84609 2724133
8951 2724133 5452939 5543141 2493786 -1210895 -2409603 -640510 1302638 803188 -1348404
8942 -1348404 -2521514 -2328412 -2729513 -3961009 -3489401 -558827 1214763 -1292809 -5341031
8933 -5341031 -5544379 -1539368 1611870 912627 -720509 448242 3620349 5731906 6354333
8924 6354333 7024854 7257948 5012391 1152955 -4808 3871603 9342731 10988411 8104124
8915 8104124 5342303 6282874 8470581 6896523 1603015 -1321496 2189091 7700642
8907 7700642 7153171 -726371 -8750446 -10594213 -7918545 -6188519 -6884094 -7358710 -6167351
8898 -6167351 -4243964 -1591512 2790511 7170044 7394878 2673739 -2206827 -2751135 -300729
8889c00729J248371n46747P84562L623423M463245L364763K471226J333377k139772
8880A4301719o702936p816095l707963J550055K827262K2528k519005j755833
8872c800268Q10057J783414L74205q68614J59415J743206M37563l356886m546984
8863g264892k76502M599890L222601k860909m621275J493665P378343M314812
8855E985733m440872q230963l442088L431032O069892M540730Q96047l974843
8847H34668o996360l562555M659021Q720752L892240l203811m306954j258808
8839a221807j194504m034661l225913K520446O632686M652504j51295k837756
8831A139700k699419j195312J018565K896399K931806J850744J622094J181364
$$ plain form
8889 -300729 947642 400895 1185457 4808880 9272125 12636888 15108114 16441491 14301719
8880 14301719 7598783 -217312 -3925275 -2375220 452042 474570 -2044435 -3800268
8872 -3800268 -2990211 -1206797 -832592 -1701206 -1541791 201415 638978 -2717908 -7264892
8863 -7264892 -7541394 -2941504 281097 -2579812 -7201087 -5707422 1670921 5985733
8855 5985733 1544861 -6686102 -10128190 -6697158 -627266 3913464 4809511 834668
8847 834668 -6161692 -9724247 -5065226 3655526 7547766 4343955 37001 -1221807
8839 -1221807 -2416311 -6450972 -9676885 -7156439 -523753 4128751 3977456 1139700
8831 1139700 -1559719 -2755031 -1736466 1159933 4091739 5942483 7564577 8745941
8823H745941k090814n963975m533847K124792N873630J736940m601069n299910
8815d008312j328318Q19231n27268j554579l49787J208451J853424J915354O43373
8806a328431k641674n292197l752478J116287N064554O012777M716402J453736
8798E348976l045274m789823o53121N132157M973476j167384n413597l641387
8790c255977m85286l44424o32483J825864M033118J969100k300245m302892l985906
8781g479131l241996n33758N344138R188612M818721m606638r283991n894570
8773a1688613q34598O09260Q97441L433260N874990M589165R70975j204126j360534
8764A287220j101190n81928L01986j18793k251913k827559K63325L277324J773030
$$ plain form
8823 8745941 6655127 691152 -3842695 -1717903 4155727 5892667 1291598 -4008312
8815 -4008312 -5336630 -4517399 -5044667 -6599246 -6949033 -5740582 -3887158 -1971804 -1328431
8806 -1328431 -3970105 -9262302 -13014780 -11898493 -6833939 -821162 3895240 5348976
8798 5348976 2303702 -2486121 -3139242 1992915 6966391 5799007 385410 -3255977
8790 -3255977 -3741263 -4085687 -4718170 -2892306 1140812 3109912 809667 -3493225 -7479131
8781 -7479131 -10721127 -11254885 -5910747 3277865 8096586 3489948 -5794043 -11688613
8773 -11688613 -12523211 -11913951 -11016510 -7583250 -1708260 2880905 3851880 2647754 1287220
8764 1287220 186030 -395898 -93912 -212705 -2464618 -5292177 -5028852 -1751528 21502
8755B1502j589462m43078M809772O557175J255614n030616n292190p94701K248944
8746A742960J496209n16006j811056k728423l095573j794676O50337K214181K416265
8737a425782K532062K529641P20198k616777l975649q63577M244671O100904K431429
8728I677120l622101o736981m647191j70436K147646J349643P08442K237736K868569
8719C812447q99465o118152n970922L45549N561405M440316Q56269P21570K481417
8710E230434Q67434k930750k742671J501175K623032j804616m458063J39870O006801
8701D432646M496293k281362n020365j495868J527765K20677j391057k74001K52996
8692D67724j988649k504502K052233O222894L156399l933624n603296J5884N059750
$$ plain form
8755 21502 -1567960 -2011038 2798734 9355909 10611523 5580907 288717 -505984 1742960
8746 1742960 3239169 2723163 912107 -1816316 -4911889 -6706565 -6056228 -3842047 -1425782
8737 -1425782 1106280 3635921 4356119 1739342 -2236307 -3099884 1144787 7245691 9677120
8728 9677120 6055019 -681962 -5329153 -5499589 -3351943 -2002300 -1293858 943878 3812447
8719 3812447 2912982 -3205170 -9176092 -8830543 -3269138 1171178 2027447 2749017 5230434
8710 5230434 6097868 3167118 424447 1925622 4548654 2744038 -1714025 -1574155 4432646
8701 4432646 8928939 6647577 1627212 131344 1659109 1879786 488729 214728 467724
8692 467724 -1520925 -4025427 -1973194 4249700 7406099 3472475 -2130821 -2114937 2944813
8683B944813L955011K30740p62799N41888J067889O72204M06116q84466l779439
8674D391957n110832k239968J678673J615177j503070k020152J707396M978711
8666C497892M022939Q35636j073478j556885j824883j106312J243024K747544
8658F785477P64219k786992l326894n5232K751256J490591k253131m111664k298262
8649c040632O20057Q49217k169798m529555j955487M446077Q323318N589146q7003
8640H045340k147539l9752Q92808j814600m008210j725273K567119L716027R30118
8631F416038k284286l198214j726351J061088L221949K332007j333667l672729
8623H15835k015865N48369L9150j591584Q0761L423895K608566k194291m184271
$$ plain form
8683 2944813 6899824 7130564 6367765 6909653 7977542 8649746 9055862 8171396 4391957
8674 4391957 -718875 -2958843 -1280170 335007 -1168063 -3188215 -1480819 3497892
8666 3497892 7520831 8356467 7282989 5726104 3901221 2794909 4037933 6785477
8658 6785477 7549696 4762704 1435810 1380578 4131834 5622425 3369294 -742370 -3040632
8649 -3040632 -2420575 -1571358 -3741156 -8270711 -10226198 -5780121 2543197 8132343 8045340
8640 8045340 5897801 5858049 6750857 4936257 928047 -797226 1769893 5485920 6416038
8631 6416038 4131752 933538 -792813 268275 3490224 5822231 4488564 815835
8623 815835 -1200030 -651661 -612511 -2204095 -2123334 1300561 3909127 1714836 -2469435
8614b469435j096201R67587j665482l461404O43141N625170M000519j944460m103435
8605c504000j508356k03853j629125o80970L850761O013464K670577j025303j52098
8596C831097K381990J476834j958619l518373k409428j236387j216380j793425
8588d442691k929311m047164k694661K052177O565578O633627L057646l0042j012328
8579C152831j486681k320730k709034k666463l104147l490047k246921N20269
8571a4350923L030968M347446M759206M093510J847345j250535l629739m432858
8563e585580l420840o31695K321147K604008J06111j147096J538585M930174M473097
8554E187911J275650k40402J18284j011716l075709j591107L327512N243443J082541
$$ plain form
8614 -2469435 -3565636 -2598049 -4263531 -7724935 -7081794 -1456624 2543895 599435 -3504000
8605 -3504000 -5012356 -5216209 -6845334 -7526304 -3675543 2337921 5008498 3983195 3831097
8596 3831097 6213087 7689921 5731302 2212929 -196499 -1432886 -2649266 -4442691
8588 -4442691 -7372002 -11419166 -14113827 -12061650 -5496072 1137555 4195201 4165159 3152831
8579 3152831 1666150 -654580 -3363614 -6030077 -9134224 -12624271 -14871192 -14350923
8571 -14350923 -11319955 -6972509 -2213303 1880207 3727552 2477017 -1152722 -5585580
8563 -5585580 -9006420 -9638115 -7316968 -4712960 -4606849 -5753945 -4215360 714814 5187911
8554 5187911 6463561 6223159 6341443 5329727 2254018 662911 3990423 9233866 10316407
8545A0316407l462543k457301J234187Q14766l795529o162320l036764J650930
8537d898167L083249J529141L28907O85984O99659j276269l944378m273847j167464
8528i233185K865065M497847L443198K080765J708678J329379K38230p18048j152128
8519E059801j901348k819087k360119n60757K95888m90150m57261J742769L439769
8510A949505J957672j080889k359189j387005N06336L057965N561058N296224
8502A3501677J637859j020757N78492K205799j709133p674372o919019O70365
8494A270911N305170K022844k257900p39691K486840M22800m613720n170347j053432
8485b326525J280908r9431n89347J811663L234517J325353q04551l23188J077831
$$ plain form
8545 10316407 6853864 4396563 5630750 6445516 2649987 -3512333 -6549097 -4898167
8537 -4898167 -1814918 -285777 43130 729114 1428773 152504 -3791874 -8065721 -9233185
8528 -9233185 -6368120 -1870273 1572925 3653690 5362368 6691747 6929977 6211929 5059801
8519 5059801 3158453 339366 -2020753 -2581510 -2285622 -2775772 -3233033 -1490264 1949505
8510 1949505 3907177 2826288 467099 -919906 -413570 2644395 8205453 13501677
8502 13501677 15139536 14118779 14697271 16903070 15193937 7519565 600546 1270911
8494 1270911 6576081 8598925 6341025 5601334 8088174 8510974 3897254 -1273093 -2326525
8485 -2326525 -1045617 -1145048 -1734395 77268 3311785 4637138 3832587 3509399 4587230
8476D587230J034770n5857j467504l435108m217453r58948M251343M780041q06579
8467C711935n119672k583317J892058R76288l161616k840243K221218M771834
8459a31515K117258l65009Q69643K128932J4201k482583j652349N11912L74261
8450A384751q33198M12106L407394M094162J183594k497226m088484l101775m57506
8441d96182K264536L212022J970357J85321q88491j862041k735762j444491K536039
8432B741308N461644L595611j392472m698839m630997l021002q70676K041118
8424g74305L921420K155964j831082l373095j249469N97172n17897k075950j160431
8415d307673O11787L13473r63587p949K725031L307518L57215k617401k090590
$$ plain form
8476 4587230 5622000 5566143 4098639 663531 -3553922 -4512870 -261527 4518514 3711935
8467 3711935 -1407737 -3991054 -2098996 -1122708 -4284324 -7124567 -4903349 -131515
8459 -131515 1985743 1620734 2490377 4619309 4633510 2150927 498578 1010490 1384751
8450 1384751 551553 963659 4371053 8465215 9648809 7151583 3063099 -38676 -496182
8441 -496182 1768354 4980376 6950733 7136054 6247563 4385522 1649760 205269 2741308
8432 2741308 8202952 11798563 10406091 5707252 1076255 -1944747 -2815423 -774305
8424 -774305 3147115 5303079 3471997 98902 -1150567 -553395 -1071292 -3147242 -4307673
8415 -4307673 -3695886 -3382413 -4346000 -4353949 -1628918 1678600 2035815 -581586 -2672176
8406b672176P04857J771716j24382k106076j432507Q53394J774183O79740l54443
8397i05694n5420M82800K89222J74202O83732O74669l85397r29163j57444K0419
8387a08074j390223j539554J699951M492326J512158n382298q641572n376632
8379a4733918m34971J968454L515659O022665O411332K095970l002314l339030
8371a496153J3471J434927n06741j877618n95511N70781m98262j239623J457854
8362b736875N724437O342843J304482n364792p850854m764328k74890J053724
8354f566253m92300j027846J048332K916881J891587l91155m33946K035366L946717
8345B927383L278559J258857J3101k01444o94612k113107l225674k217833O46621
$$ plain form
8406 -2672176 -1967319 -195603 -319985 -2426061 -3858568 -3005174 -1230991 -551251 -905694
8397 -905694 -961114 -478314 -189092 -14890 668842 1343511 958114 28951 -128493 -108074
8387 -108074 -1498297 -3037851 -1337900 3154426 4666584 -715714 -9357286 -14733918
8379 -14733918 -15168889 -13200435 -9684776 -3662111 2749221 4845191 1842877 -1496153
8371 -1496153 -1482682 -47755 -554496 -2432114 -3027625 -2456844 -2955106 -4194729 -2736875
8362 -2736875 2987562 9330405 10634887 5270095 -2580759 -7345087 -7619977 -6566253
8354 -6566253 -7058553 -8086399 -7038067 -4121186 -2229599 -2620754 -3054700 -1019334 2927383
8345 2927383 6205942 7464799 7477900 7276456 6581844 4468737 1243063 -974770 -328149
8336c28149K437839R51771j841325j949711R93953L102035K091031M38260O88634
8327F584338R69532j392643m311799l440030Q35690L415288J725547j094779j302353
8318A988791O09973J899774J745075J288223J118081P18707k25444j302971j892944
8309E947265j654857q99414n33888r06004r08540N20624K149631J528935j226251
8300D017501k728399o70627K717909L439132J006166j282638j273150p51290k121231
8291B353373m140116l346158O36965L762109K541948j471408l802807k406794
8283e872888R28030L543205M052800K130194j228488l224165j688831J596006
8275B35863K616084O25128j086812p45223p12142k568356l324873l6739M504755
$$ plain form
8336 -328149 2109690 3061461 1220136 -729575 264378 3366413 5457444 5895704 6584338
8327 6584338 7553870 6161227 1849428 -1590602 -754912 2660376 4385923 3291144 1988791
8318 1988791 2598764 4498538 6243613 7531836 8649917 9368624 9143180 7840209 5947265
8309 5947265 4292408 3392994 2859106 1953102 1044562 1565186 3714817 5243752 4017501
8300 4017501 1289102 618475 3336384 6775516 7781682 6499044 5225894 4474604 2353373
8291 2353373 -1786743 -5132901 -4495936 -733827 1808121 336713 -3466094 -5872888
8283 -5872888 -4944858 -1401653 2651147 4781341 3552853 328688 -1360143 235863
8275 235863 2851947 3477075 2390263 1645040 932898 -1635458 -4960331 -4997070 -492315
8266d92315M952741R94413k328971j627196J075207J998263K61607j825265j452741
8257A555743J783308M585332K762389k991107o149529k193650M468671N636385
8249I457542L32639m346873l551940l63226N90350K9830J122318L422036L805380
8240A0498056J396339j939331m534653n325258k928728K187573N754282L857618
8232H965898j168891k996789m6563K168199o64226m921335m270684Q55863L797682
8223A719154J260516k469201k384128M08472J757054J213655J500771K890312
8215E896605K788865P44495o57174o71139j716855m109459l893178R24658N560357
8206D867175M123579j908342n208674j982382L834708N971040K658737k497262
$$ plain form
8266 -492315 4460426 5454839 3125868 1498672 2573879 4572142 4833749 3008484 1555743
8257 1555743 3339051 7924383 10686772 7695665 1546136 -647514 3821157 9457542
8249 9457542 9790181 5443308 1891368 1528142 2118492 2148322 3270640 6692676 10498056
8240 10498056 11894395 9955064 5420411 95153 -2833575 -646002 5108280 8965898
8232 8965898 7797007 4800218 4753655 6921854 6257628 1336293 -2934391 -2078528 1719154
8223 1719154 2979670 510469 -1873659 -1465187 291867 1505522 3006293 5896605
8215 5896605 8685470 9429965 8772791 8101652 6384797 2275338 -1617840 -693182 4867175
8206 4867175 8990754 7082412 1873738 -108644 3726064 9697104 12355841 9858579
8198I858579m791883l077920n60091l98568j099496R51665M330500K903682m219689
8189C896779q540910l191075O183104Q518607K745291j881561k37434K306529
8181I799330j59327n175934o682233l429381J186818M044940L982216J504480
8173E070909r23789r22742L27502j38864j537336l28169K607391K013334k497581
8164C670655m221371j68894K967075n80533n455316l328902L483006N664376J660284
8155C690380q64539J691366L506010j61575m997153m671679l17797K203055J199608
8146A277676K59526J767076L621879K827559m49126l515480m413005l283467r99678
8137b907040J923908M256108L561020p14970m366115k297205L954655O640744
$$ plain form
8198 9858579 5066696 1988776 1428685 1030117 -69379 882286 5212786 8116468 3896779
8189 3896779 -4644131 -7835206 -1652102 6866505 9611796 7730235 7492801 9799330
8181 9799330 9640003 4464069 -2218164 -5647545 -4460727 -415787 3566429 5070909
8173 5070909 4147120 3224378 3551880 3413016 1875680 1547511 4154902 6168236 3670655
8164 3670655 -550716 -719610 2247465 1666932 -3788384 -7117286 -3634280 2030096 3690380
8155 3690380 2825841 4517207 8023217 7861642 2864489 -1807190 -2124987 78068 1277676
8146 1277676 1537202 3304278 6926157 9753716 9304590 5789110 1376105 -1907362 -2907040
8137 -2907040 -983132 3272976 6833996 6119026 1752911 -544294 3410361 10051105
8129A0051105J950092m316946m823345p43789J343056j17354p42416J182508K011971
8120E794882j98736k048889p44040J294895R88421k88080J25592J015965m81981
8111E458029l370648l745084p31261K217690K354152R51230M61607O22776o64124
8102C554367l414979m574822j746258L113289N270147K706794j433974k899592
8094E74972j519409n20417j358137j730649N88159L925402M357821O19486l930946
8085A006282m649742o16141M190188N165775K225044l94461M37669L045564L538754
8076A3948932P07417l044228m763712l643448j222562K05834m2354j04158J650333
8067C692054L153343Q93340l801357m885786k25749M302866L153196o34068q79682
$$ plain form
8129 10051105 12001197 7684251 2860906 2117117 3460173 3342819 2600403 3782911 5794882
8120 5794882 5596146 3547257 2803217 4098112 5086533 4798453 4924045 5940010 5458029
8111 5458029 2087381 -1657703 -2388964 -171274 2182878 3134108 3595715 4218491 3554367
8102 3554367 139388 -4435434 -6181692 -3068403 2201744 4908538 3474564 574972
8094 574972 -944437 -1464854 -2822991 -4553640 -3965481 -40079 4317742 4937228 1006282
8085 1006282 -3643460 -4259601 -69413 5096362 7321406 6926945 7364614 10410178 13948932
8076 13948932 14656349 11612121 6848409 3204961 1982399 2188233 2145879 2041721 3692054
8067 3692054 6845397 7738737 3937380 -948406 -1174155 3128711 6281907 5647839 4768157
8058D768157J557453J003020k783389m559551l295116l430398n346564l450707
8050a5537095L107143O450244J932600l524523j914855L346498L722536k56985
8042b674437p07037L834762O185728K515443k393583m010809m150851m749545
8034f150329k838861L090687P476684M898607p95770j471188L044231M790855
8026A2044916p1607n676635n482282j256164J004451K05186J27545K149567L250678
8017F295655J415943j381822k776434l050646l034787k054857R2654J759708K029727
8008g04859K108356K150373p4528m430165n907444j393091M020253L375909j396946
7999b252142k126250K602448N090275J025842l676270k776297N58362N4822l024167
$$ plain form
8058 4768157 6325610 7328630 4545241 -14310 -3309426 -6739824 -12086388 -15537095
8050 -15537095 -12429952 -5979708 -4047108 -7571631 -9486486 -6139988 -2417452 -2674437
8042 -2674437 -3381474 453288 6639016 9154459 6760876 2750067 -1400784 -6150329
8034 -6150329 -8989190 -5898503 1578181 6476788 5681018 4209830 7254061 12044916
8026 12044916 11973309 6296674 814392 -441772 562679 767865 895410 3044977 6295655
8017 6295655 7711598 6329776 3553342 502696 -2532091 -4586948 -4494294 -2734586 -704859
8008 -704859 1403497 3553870 3479342 -950823 -6858267 -8251358 -4231105 -855196 -2252142
7999 -2252142 -4378392 -1775944 3314331 4340173 663903 -2112394 -1554032 -1499210 -4523377
7990d523377k971120N1233Q39918j050085m37362L783907N536134R14611n282417
7981c138558o272568k294766J391674K596809L535104N216132N158449J699748
7973G892024k572480l710261j324122J288030J574352N27281M77898J558365J842616
7964G553703L17706k038737l921690m518062k743676J743935O104931N885600
7956H383710Q03740l731762l317384k42627P15381j86023J039803M310901M484177
7947A2259916n83404n744414n285336p99477J287346j401389m421971k856022
7939g544751K402516O175194N327084J647499j347583k455329k567013k072156
7931d34539p65664K81741m37979j812866q05178K714587M829033L107678L05728
$$ plain form
7990 -4523377 -7494497 -7443264 -6603346 -7653431 -8090793 -4306886 1229248 2143859 -3138558
7981 -3138558 -9411126 -11705892 -10314218 -7717409 -4182305 1033827 6192276 7892024
7973 7892024 5319544 1609283 285161 1573191 3147543 3674824 4152722 5711087 7553703
7964 7553703 7871409 5832672 1910982 -2607080 -5350756 -3606821 2498110 8383710
7956 8383710 9187450 5455688 2138304 1895677 2611058 2425035 3464838 7775739 12259916
7947 12259916 11676512 5932098 646762 -152715 1134631 -266758 -4688729 -7544751
7939 -7544751 -5142235 1032959 6360043 8007542 6659959 4204630 1637617 -434539
7931 -434539 -1200203 -918462 -1356441 -3169307 -3974485 -1259898 3569135 6676813 6982541
7922F982541r2957P90518j30591k268542k658068j366935q99919j000163Q15397
7913A71281L415921K270910k949365o152023l105455K169942K991066q52662l563414
7904e603799j510394K759288M586881K631812l61011j017287Q08230J705300r16104
7895C082916m520068l887839J488093N470156K976674k818080m440302k17192
7887b865642L534467J239589m355842n863245r47469M776917N005316L08061l499492
7878b667340k933193J52033K675799L823926L427682O10389l478071m806728j722359
7869d917862J649518J209751n69751J006389M242264L464999q36257k130796P57080
$$ plain form
7922 6982541 6889584 7680102 7549511 5280969 2622901 1255966 356047 -644116 171281
7913 171281 3587202 5858112 2908747 -3243276 -6348731 -4178789 -1187723 -2040385 -5603799
7904 -5603799 -7114193 -4354905 231976 2863788 2502777 1485490 2293720 3999020 3082916
7895 3082916 -1437152 -5324991 -3836898 1633258 4609932 1791852 -2648450 -2865642
7887 -2865642 668825 1908414 -2447428 -8310673 -9258142 -4481225 524091 832152 -2667340
7878 -2667340 -5600533 -5448500 -2772701 1051225 4478907 5089296 1611225 -3195503 -4917862
7869 -4917862 -3268344 -2058593 -2628344 -1621955 2620309 6085308 5249051 3118255 3875335
$$ [...]
##END NTUPLES=NMR SPECTRUM
##END=
